lucene-dev mailing list archives

Site index · List index
Message view « Date » · « Thread »
Top « Date » · « Thread »
From Apache Jenkins Server <jenk...@builds.apache.org>
Subject [JENKINS] Lucene-Solr-Tests-4.x-java7 - Build # 522 - Failure
Date Fri, 05 Oct 2012 15:52:42 GMT
Build: https://builds.apache.org/job/Lucene-Solr-Tests-4.x-java7/522/

1 tests failed.
REGRESSION:  org.apache.solr.cloud.BasicDistributedZkTest.testDistribSearch

Error Message:
Server at http://127.0.0.1:28582/solr/awholynewcollection_7 returned non ok status:500, message:Server Error

Stack Trace:
org.apache.solr.common.SolrException: Server at http://127.0.0.1:28582/solr/awholynewcollection_7 returned non ok status:500, message:Server Error
	at __randomizedtesting.SeedInfo.seed([135624066223C46A:92B0AA1E157CA456]:0)
	at org.apache.solr.client.solrj.impl.HttpSolrServer.request(HttpSolrServer.java:372)
	at org.apache.solr.client.solrj.impl.HttpSolrServer.request(HttpSolrServer.java:181)
	at org.apache.solr.client.solrj.request.QueryRequest.process(QueryRequest.java:90)
	at org.apache.solr.client.solrj.SolrServer.query(SolrServer.java:301)
	at org.apache.solr.cloud.BasicDistributedZkTest.testCollectionsAPI(BasicDistributedZkTest.java:418)
	at org.apache.solr.cloud.BasicDistributedZkTest.doTest(BasicDistributedZkTest.java:331)
	at org.apache.solr.BaseDistributedSearchTestCase.testDistribSearch(BaseDistributedSearchTestCase.java:695)
	at sun.reflect.NativeMethodAccessorImpl.invoke0(Native Method)
	at sun.reflect.NativeMethodAccessorImpl.invoke(NativeMethodAccessorImpl.java:57)
	at sun.reflect.DelegatingMethodAccessorImpl.invoke(DelegatingMethodAccessorImpl.java:43)
	at java.lang.reflect.Method.invoke(Method.java:601)
	at com.carrotsearch.randomizedtesting.RandomizedRunner.invoke(RandomizedRunner.java:1559)
	at com.carrotsearch.randomizedtesting.RandomizedRunner.access$600(RandomizedRunner.java:79)
	at com.carrotsearch.randomizedtesting.RandomizedRunner$6.evaluate(RandomizedRunner.java:737)
	at com.carrotsearch.randomizedtesting.RandomizedRunner$7.evaluate(RandomizedRunner.java:773)
	at com.carrotsearch.randomizedtesting.RandomizedRunner$8.evaluate(RandomizedRunner.java:787)
	at com.carrotsearch.randomizedtesting.rules.SystemPropertiesRestoreRule$1.evaluate(SystemPropertiesRestoreRule.java:53)
	at org.apache.lucene.util.TestRuleSetupTeardownChained$1.evaluate(TestRuleSetupTeardownChained.java:50)
	at org.apache.lucene.util.TestRuleFieldCacheSanity$1.evaluate(TestRuleFieldCacheSanity.java:51)
	at org.apache.lucene.util.AbstractBeforeAfterRule$1.evaluate(AbstractBeforeAfterRule.java:45)
	at com.carrotsearch.randomizedtesting.rules.SystemPropertiesInvariantRule$1.evaluate(SystemPropertiesInvariantRule.java:55)
	at org.apache.lucene.util.TestRuleThreadAndTestName$1.evaluate(TestRuleThreadAndTestName.java:48)
	at org.apache.lucene.util.TestRuleIgnoreAfterMaxFailures$1.evaluate(TestRuleIgnoreAfterMaxFailures.java:70)
	at org.apache.lucene.util.TestRuleMarkFailure$1.evaluate(TestRuleMarkFailure.java:48)
	at com.carrotsearch.randomizedtesting.rules.StatementAdapter.evaluate(StatementAdapter.java:36)
	at com.carrotsearch.randomizedtesting.ThreadLeakControl$StatementRunner.run(ThreadLeakControl.java:358)
	at com.carrotsearch.randomizedtesting.ThreadLeakControl.forkTimeoutingTask(ThreadLeakControl.java:782)
	at com.carrotsearch.randomizedtesting.ThreadLeakControl$3.evaluate(ThreadLeakControl.java:442)
	at com.carrotsearch.randomizedtesting.RandomizedRunner.runSingleTest(RandomizedRunner.java:746)
	at com.carrotsearch.randomizedtesting.RandomizedRunner$3.evaluate(RandomizedRunner.java:648)
	at com.carrotsearch.randomizedtesting.RandomizedRunner$4.evaluate(RandomizedRunner.java:682)
	at com.carrotsearch.randomizedtesting.RandomizedRunner$5.evaluate(RandomizedRunner.java:693)
	at com.carrotsearch.randomizedtesting.rules.StatementAdapter.evaluate(StatementAdapter.java:36)
	at com.carrotsearch.randomizedtesting.rules.SystemPropertiesRestoreRule$1.evaluate(SystemPropertiesRestoreRule.java:53)
	at org.apache.lucene.util.AbstractBeforeAfterRule$1.evaluate(AbstractBeforeAfterRule.java:45)
	at org.apache.lucene.util.TestRuleStoreClassName$1.evaluate(TestRuleStoreClassName.java:42)
	at com.carrotsearch.randomizedtesting.rules.SystemPropertiesInvariantRule$1.evaluate(SystemPropertiesInvariantRule.java:55)
	at com.carrotsearch.randomizedtesting.rules.NoShadowingOrOverridesOnMethodsRule$1.evaluate(NoShadowingOrOverridesOnMethodsRule.java:39)
	at com.carrotsearch.randomizedtesting.rules.NoShadowingOrOverridesOnMethodsRule$1.evaluate(NoShadowingOrOverridesOnMethodsRule.java:39)
	at com.carrotsearch.randomizedtesting.rules.StatementAdapter.evaluate(StatementAdapter.java:36)
	at org.apache.lucene.util.TestRuleAssertionsRequired$1.evaluate(TestRuleAssertionsRequired.java:43)
	at org.apache.lucene.util.TestRuleMarkFailure$1.evaluate(TestRuleMarkFailure.java:48)
	at org.apache.lucene.util.TestRuleIgnoreAfterMaxFailures$1.evaluate(TestRuleIgnoreAfterMaxFailures.java:70)
	at org.apache.lucene.util.TestRuleIgnoreTestSuites$1.evaluate(TestRuleIgnoreTestSuites.java:55)
	at com.carrotsearch.randomizedtesting.rules.StatementAdapter.evaluate(StatementAdapter.java:36)
	at com.carrotsearch.randomizedtesting.ThreadLeakControl$StatementRunner.run(ThreadLeakControl.java:358)
	at java.lang.Thread.run(Thread.java:722)




Build Log:
[...truncated 8836 lines...]
[junit4:junit4] Suite: org.apache.solr.cloud.BasicDistributedZkTest
[junit4:junit4]   2> 4 T1326 oas.SolrTestCaseJ4.setUp ###Starting testDistribSearch
[junit4:junit4]   2> Creating dataDir: /usr/home/hudson/hudson-slave/workspace/Lucene-Solr-Tests-4.x-java7/solr/build/solr-core/test/J1/./solrtest-BasicDistributedZkTest-1349451508878
[junit4:junit4]   2> 5 T1326 oasc.ZkTestServer.run STARTING ZK TEST SERVER
[junit4:junit4]   2> 7 T1327 oazs.ZooKeeperServer.setTickTime tickTime set to 1000
[junit4:junit4]   2> 8 T1327 oazs.NIOServerCnxn$Factory.<init> binding to port 0.0.0.0/0.0.0.0:0
[junit4:junit4]   2> 8 T1327 oazsp.FileTxnSnapLog.save Snapshotting: 0
[junit4:junit4]   2> 106 T1326 oasc.ZkTestServer.run start zk server on port:26318
[junit4:junit4]   2> 106 T1326 oaz.ZooKeeper.<init> Initiating client connection, connectString=127.0.0.1:26318 sessionTimeout=10000 watcher=org.apache.solr.common.cloud.ConnectionManager@5d43a65c
[junit4:junit4]   2> 107 T1332 oaz.ClientCnxn$SendThread.startConnect Opening socket connection to server /127.0.0.1:26318
[junit4:junit4]   2> 107 T1326 oascc.ConnectionManager.waitForConnected Waiting for client to connect to ZooKeeper
[junit4:junit4]   2> 108 T1332 oaz.ClientCnxn$SendThread.primeConnection Socket connection established to localhost/127.0.0.1:26318, initiating session
[junit4:junit4]   2> 108 T1328 oazs.NIOServerCnxn$Factory.run Accepted socket connection from /140.211.11.196:14410
[junit4:junit4]   2> 108 T1328 oazs.NIOServerCnxn.readConnectRequest Client attempting to establish new session at /140.211.11.196:14410
[junit4:junit4]   2> 109 T1330 oazsp.FileTxnLog.append Creating new log file: log.1
[junit4:junit4]   2> 112 T1330 oazs.NIOServerCnxn.finishSessionInit Established session 0x13a3193ec930000 with negotiated timeout 10000 for client /140.211.11.196:14410
[junit4:junit4]   2> 112 T1332 oaz.ClientCnxn$SendThread.readConnectResult Session establishment complete on server localhost/127.0.0.1:26318, sessionid = 0x13a3193ec930000, negotiated timeout = 10000
[junit4:junit4]   2> 112 T1333 oascc.ConnectionManager.process Watcher org.apache.solr.common.cloud.ConnectionManager@5d43a65c name:ZooKeeperConnection Watcher:127.0.0.1:26318 got event WatchedEvent state:SyncConnected type:None path:null path:null type:None
[junit4:junit4]   2> 112 T1326 oascc.ConnectionManager.waitForConnected Client is connected to ZooKeeper
[junit4:junit4]   2> 112 T1326 oascc.SolrZkClient.makePath makePath: /solr
[junit4:junit4]   2> 115 T1331 oazs.PrepRequestProcessor.pRequest Processed session termination for sessionid: 0x13a3193ec930000
[junit4:junit4]   2> 127 T1333 oaz.ClientCnxn$EventThread.run EventThread shut down
[junit4:junit4]   2> 127 T1326 oaz.ZooKeeper.close Session: 0x13a3193ec930000 closed
[junit4:junit4]   2> 127 T1328 oazs.NIOServerCnxn.closeSock Closed socket connection for client /140.211.11.196:14410 which had sessionid 0x13a3193ec930000
[junit4:junit4]   2> 128 T1326 oaz.ZooKeeper.<init> Initiating client connection, connectString=127.0.0.1:26318/solr sessionTimeout=10000 watcher=org.apache.solr.common.cloud.ConnectionManager@7f168ef3
[junit4:junit4]   2> 128 T1334 oaz.ClientCnxn$SendThread.startConnect Opening socket connection to server /127.0.0.1:26318
[junit4:junit4]   2> 128 T1326 oascc.ConnectionManager.waitForConnected Waiting for client to connect to ZooKeeper
[junit4:junit4]   2> 129 T1334 oaz.ClientCnxn$SendThread.primeConnection Socket connection established to localhost/127.0.0.1:26318, initiating session
[junit4:junit4]   2> 129 T1328 oazs.NIOServerCnxn$Factory.run Accepted socket connection from /140.211.11.196:53961
[junit4:junit4]   2> 129 T1328 oazs.NIOServerCnxn.readConnectRequest Client attempting to establish new session at /140.211.11.196:53961
[junit4:junit4]   2> 130 T1330 oazs.NIOServerCnxn.finishSessionInit Established session 0x13a3193ec930001 with negotiated timeout 10000 for client /140.211.11.196:53961
[junit4:junit4]   2> 130 T1334 oaz.ClientCnxn$SendThread.readConnectResult Session establishment complete on server localhost/127.0.0.1:26318, sessionid = 0x13a3193ec930001, negotiated timeout = 10000
[junit4:junit4]   2> 131 T1335 oascc.ConnectionManager.process Watcher org.apache.solr.common.cloud.ConnectionManager@7f168ef3 name:ZooKeeperConnection Watcher:127.0.0.1:26318/solr got event WatchedEvent state:SyncConnected type:None path:null path:null type:None
[junit4:junit4]   2> 131 T1326 oascc.ConnectionManager.waitForConnected Client is connected to ZooKeeper
[junit4:junit4]   2> 131 T1326 oascc.SolrZkClient.makePath makePath: /collections/collection1
[junit4:junit4]   2> 141 T1326 oascc.SolrZkClient.makePath makePath: /collections/collection1/shards
[junit4:junit4]   2> 143 T1326 oascc.SolrZkClient.makePath makePath: /collections/control_collection
[junit4:junit4]   2> 145 T1326 oascc.SolrZkClient.makePath makePath: /collections/control_collection/shards
[junit4:junit4]   2> 147 T1326 oasc.AbstractZkTestCase.putConfig put /usr/home/hudson/hudson-slave/workspace/Lucene-Solr-Tests-4.x-java7/solr/build/solr-core/test-files/solr/collection1/conf/solrconfig.xml to /configs/conf1/solrconfig.xml
[junit4:junit4]   2> 149 T1326 oascc.SolrZkClient.makePath makePath: /configs/conf1/solrconfig.xml
[junit4:junit4]   2> 159 T1326 oasc.AbstractZkTestCase.putConfig put /usr/home/hudson/hudson-slave/workspace/Lucene-Solr-Tests-4.x-java7/solr/build/solr-core/test-files/solr/collection1/conf/schema.xml to /configs/conf1/schema.xml
[junit4:junit4]   2> 160 T1326 oascc.SolrZkClient.makePath makePath: /configs/conf1/schema.xml
[junit4:junit4]   2> 265 T1326 oasc.AbstractZkTestCase.putConfig put /usr/home/hudson/hudson-slave/workspace/Lucene-Solr-Tests-4.x-java7/solr/build/solr-core/test-files/solr/collection1/conf/solrconfig.xml to /configs/conf1/solrconfig.xml
[junit4:junit4]   2> 266 T1326 oascc.SolrZkClient.makePath makePath: /configs/conf1/solrconfig.xml
[junit4:junit4]   2> 269 T1326 oasc.AbstractZkTestCase.putConfig put /usr/home/hudson/hudson-slave/workspace/Lucene-Solr-Tests-4.x-java7/solr/build/solr-core/test-files/solr/collection1/conf/stopwords.txt to /configs/conf1/stopwords.txt
[junit4:junit4]   2> 269 T1326 oascc.SolrZkClient.makePath makePath: /configs/conf1/stopwords.txt
[junit4:junit4]   2> 271 T1326 oasc.AbstractZkTestCase.putConfig put /usr/home/hudson/hudson-slave/workspace/Lucene-Solr-Tests-4.x-java7/solr/build/solr-core/test-files/solr/collection1/conf/protwords.txt to /configs/conf1/protwords.txt
[junit4:junit4]   2> 272 T1326 oascc.SolrZkClient.makePath makePath: /configs/conf1/protwords.txt
[junit4:junit4]   2> 280 T1326 oasc.AbstractZkTestCase.putConfig put /usr/home/hudson/hudson-slave/workspace/Lucene-Solr-Tests-4.x-java7/solr/build/solr-core/test-files/solr/collection1/conf/currency.xml to /configs/conf1/currency.xml
[junit4:junit4]   2> 281 T1326 oascc.SolrZkClient.makePath makePath: /configs/conf1/currency.xml
[junit4:junit4]   2> 282 T1326 oasc.AbstractZkTestCase.putConfig put /usr/home/hudson/hudson-slave/workspace/Lucene-Solr-Tests-4.x-java7/solr/build/solr-core/test-files/solr/collection1/conf/open-exchange-rates.json to /configs/conf1/open-exchange-rates.json
[junit4:junit4]   2> 283 T1326 oascc.SolrZkClient.makePath makePath: /configs/conf1/open-exchange-rates.json
[junit4:junit4]   2> 285 T1326 oasc.AbstractZkTestCase.putConfig put /usr/home/hudson/hudson-slave/workspace/Lucene-Solr-Tests-4.x-java7/solr/build/solr-core/test-files/solr/collection1/conf/mapping-ISOLatin1Accent.txt to /configs/conf1/mapping-ISOLatin1Accent.txt
[junit4:junit4]   2> 286 T1326 oascc.SolrZkClient.makePath makePath: /configs/conf1/mapping-ISOLatin1Accent.txt
[junit4:junit4]   2> 293 T1326 oasc.AbstractZkTestCase.putConfig put /usr/home/hudson/hudson-slave/workspace/Lucene-Solr-Tests-4.x-java7/solr/build/solr-core/test-files/solr/collection1/conf/old_synonyms.txt to /configs/conf1/old_synonyms.txt
[junit4:junit4]   2> 293 T1326 oascc.SolrZkClient.makePath makePath: /configs/conf1/old_synonyms.txt
[junit4:junit4]   2> 295 T1326 oasc.AbstractZkTestCase.putConfig put /usr/home/hudson/hudson-slave/workspace/Lucene-Solr-Tests-4.x-java7/solr/build/solr-core/test-files/solr/collection1/conf/synonyms.txt to /configs/conf1/synonyms.txt
[junit4:junit4]   2> 296 T1326 oascc.SolrZkClient.makePath makePath: /configs/conf1/synonyms.txt
[junit4:junit4]   2> 297 T1331 oazs.PrepRequestProcessor.pRequest Processed session termination for sessionid: 0x13a3193ec930001
[junit4:junit4]   2> 305 T1335 oaz.ClientCnxn$EventThread.run EventThread shut down
[junit4:junit4]   2> 305 T1326 oaz.ZooKeeper.close Session: 0x13a3193ec930001 closed
[junit4:junit4]   2> 306 T1328 oazs.NIOServerCnxn.closeSock Closed socket connection for client /140.211.11.196:53961 which had sessionid 0x13a3193ec930001
[junit4:junit4]   2> 308 T1326 oejs.Server.doStart jetty-8.1.2.v20120308
[junit4:junit4]   2> 311 T1326 oejs.AbstractConnector.doStart Started SocketConnector@0.0.0.0:10318
[junit4:junit4]   2> 311 T1326 oasc.SolrResourceLoader.locateSolrHome JNDI not configured for solr (NoInitialContextEx)
[junit4:junit4]   2> 312 T1326 oasc.SolrResourceLoader.locateSolrHome using system property solr.solr.home: /usr/home/hudson/hudson-slave/workspace/Lucene-Solr-Tests-4.x-java7/solr/build/solr-core/test-files/solr
[junit4:junit4]   2> 312 T1326 oasc.SolrResourceLoader.<init> new SolrResourceLoader for deduced Solr Home: '/usr/home/hudson/hudson-slave/workspace/Lucene-Solr-Tests-4.x-java7/solr/build/solr-core/test-files/solr/'
[junit4:junit4]   2> 325 T1326 oass.SolrDispatchFilter.init SolrDispatchFilter.init()
[junit4:junit4]   2> 326 T1326 oasc.SolrResourceLoader.locateSolrHome JNDI not configured for solr (NoInitialContextEx)
[junit4:junit4]   2> 326 T1326 oasc.SolrResourceLoader.locateSolrHome using system property solr.solr.home: /usr/home/hudson/hudson-slave/workspace/Lucene-Solr-Tests-4.x-java7/solr/build/solr-core/test-files/solr
[junit4:junit4]   2> 327 T1326 oasc.CoreContainer$Initializer.initialize looking for solr.xml: /usr/home/hudson/hudson-slave/workspace/Lucene-Solr-Tests-4.x-java7/solr/build/solr-core/test-files/solr/solr.xml
[junit4:junit4]   2> 327 T1326 oasc.CoreContainer.<init> New CoreContainer 448296627
[junit4:junit4]   2> 327 T1326 oasc.CoreContainer.load Loading CoreContainer using Solr Home: '/usr/home/hudson/hudson-slave/workspace/Lucene-Solr-Tests-4.x-java7/solr/build/solr-core/test-files/solr/'
[junit4:junit4]   2> 328 T1326 oasc.SolrResourceLoader.<init> new SolrResourceLoader for directory: '/usr/home/hudson/hudson-slave/workspace/Lucene-Solr-Tests-4.x-java7/solr/build/solr-core/test-files/solr/'
[junit4:junit4]   2> 350 T1326 oasc.CoreContainer.load Registering Log Listener
[junit4:junit4]   2> 365 T1326 oasc.CoreContainer.initZooKeeper Zookeeper client=127.0.0.1:26318/solr
[junit4:junit4]   2> 377 T1326 oaz.ZooKeeper.<init> Initiating client connection, connectString=127.0.0.1:26318/solr sessionTimeout=5000 watcher=org.apache.solr.common.cloud.ConnectionManager@4d729d10
[junit4:junit4]   2> 378 T1345 oaz.ClientCnxn$SendThread.startConnect Opening socket connection to server /127.0.0.1:26318
[junit4:junit4]   2> 378 T1326 oascc.ConnectionManager.waitForConnected Waiting for client to connect to ZooKeeper
[junit4:junit4]   2> 379 T1345 oaz.ClientCnxn$SendThread.primeConnection Socket connection established to localhost/127.0.0.1:26318, initiating session
[junit4:junit4]   2> 379 T1328 oazs.NIOServerCnxn$Factory.run Accepted socket connection from /140.211.11.196:47489
[junit4:junit4]   2> 380 T1328 oazs.NIOServerCnxn.readConnectRequest Client attempting to establish new session at /140.211.11.196:47489
[junit4:junit4]   2> 381 T1330 oazs.NIOServerCnxn.finishSessionInit Established session 0x13a3193ec930002 with negotiated timeout 5000 for client /140.211.11.196:47489
[junit4:junit4]   2> 381 T1345 oaz.ClientCnxn$SendThread.readConnectResult Session establishment complete on server localhost/127.0.0.1:26318, sessionid = 0x13a3193ec930002, negotiated timeout = 5000
[junit4:junit4]   2> 382 T1346 oascc.ConnectionManager.process Watcher org.apache.solr.common.cloud.ConnectionManager@4d729d10 name:ZooKeeperConnection Watcher:127.0.0.1:26318/solr got event WatchedEvent state:SyncConnected type:None path:null path:null type:None
[junit4:junit4]   2> 382 T1326 oascc.ConnectionManager.waitForConnected Client is connected to ZooKeeper
[junit4:junit4]   2> 383 T1331 oazs.PrepRequestProcessor.pRequest Got user-level KeeperException when processing sessionid:0x13a3193ec930002 type:create cxid:0x2 zxid:0xfffffffffffffffe txntype:unknown reqpath:n/a Error Path:/solr/overseer Error:KeeperErrorCode = NodeExists for /solr/overseer
[junit4:junit4]   2> 384 T1326 oascc.SolrZkClient.makePath makePath: /live_nodes
[junit4:junit4]   2> 386 T1326 oasc.ZkController.createEphemeralLiveNode Register node as live in ZooKeeper:/live_nodes/127.0.0.1:10318_solr
[junit4:junit4]   2> 386 T1331 oazs.PrepRequestProcessor.pRequest Got user-level KeeperException when processing sessionid:0x13a3193ec930002 type:delete cxid:0x7 zxid:0xfffffffffffffffe txntype:unknown reqpath:n/a Error Path:/solr/live_nodes/127.0.0.1:10318_solr Error:KeeperErrorCode = NoNode for /solr/live_nodes/127.0.0.1:10318_solr
[junit4:junit4]   2> 394 T1326 oascc.SolrZkClient.makePath makePath: /live_nodes/127.0.0.1:10318_solr
[junit4:junit4]   2> 396 T1326 oashc.HttpShardHandlerFactory.getParameter Setting socketTimeout to: 0
[junit4:junit4]   2> 396 T1326 oashc.HttpShardHandlerFactory.getParameter Setting urlScheme to: http://
[junit4:junit4]   2> 397 T1326 oashc.HttpShardHandlerFactory.getParameter Setting connTimeout to: 0
[junit4:junit4]   2> 397 T1326 oashc.HttpShardHandlerFactory.getParameter Setting maxConnectionsPerHost to: 20
[junit4:junit4]   2> 397 T1326 oashc.HttpShardHandlerFactory.getParameter Setting corePoolSize to: 0
[junit4:junit4]   2> 398 T1326 oashc.HttpShardHandlerFactory.getParameter Setting maximumPoolSize to: 2147483647
[junit4:junit4]   2> 398 T1326 oashc.HttpShardHandlerFactory.getParameter Setting maxThreadIdleTime to: 5
[junit4:junit4]   2> 398 T1326 oashc.HttpShardHandlerFactory.getParameter Setting sizeOfQueue to: -1
[junit4:junit4]   2> 399 T1326 oashc.HttpShardHandlerFactory.getParameter Setting fairnessPolicy to: false
[junit4:junit4]   2> 399 T1326 oascsi.HttpClientUtil.createClient Creating new http client, config:maxConnectionsPerHost=20&maxConnections=10000&socketTimeout=0&connTimeout=0&retry=false
[junit4:junit4]   2> 410 T1326 oascc.SolrZkClient.makePath makePath: /overseer_elect/election
[junit4:junit4]   2> 414 T1331 oazs.PrepRequestProcessor.pRequest Got user-level KeeperException when processing sessionid:0x13a3193ec930002 type:delete cxid:0x15 zxid:0xfffffffffffffffe txntype:unknown reqpath:n/a Error Path:/solr/overseer_elect/leader Error:KeeperErrorCode = NoNode for /solr/overseer_elect/leader
[junit4:junit4]   2> 429 T1326 oascc.SolrZkClient.makePath makePath: /overseer_elect/leader
[junit4:junit4]   2> 431 T1326 oasc.Overseer.start Overseer (id=88437654086156290-127.0.0.1:10318_solr-n_0000000000) starting
[junit4:junit4]   2> 431 T1331 oazs.PrepRequestProcessor.pRequest Got user-level KeeperException when processing sessionid:0x13a3193ec930002 type:create cxid:0x1a zxid:0xfffffffffffffffe txntype:unknown reqpath:n/a Error Path:/solr/overseer Error:KeeperErrorCode = NodeExists for /solr/overseer
[junit4:junit4]   2> 432 T1331 oazs.PrepRequestProcessor.pRequest Got user-level KeeperException when processing sessionid:0x13a3193ec930002 type:create cxid:0x1b zxid:0xfffffffffffffffe txntype:unknown reqpath:n/a Error Path:/solr/overseer Error:KeeperErrorCode = NodeExists for /solr/overseer
[junit4:junit4]   2> 434 T1331 oazs.PrepRequestProcessor.pRequest Got user-level KeeperException when processing sessionid:0x13a3193ec930002 type:create cxid:0x1c zxid:0xfffffffffffffffe txntype:unknown reqpath:n/a Error Path:/solr/overseer Error:KeeperErrorCode = NodeExists for /solr/overseer
[junit4:junit4]   2> 446 T1331 oazs.PrepRequestProcessor.pRequest Got user-level KeeperException when processing sessionid:0x13a3193ec930002 type:create cxid:0x1d zxid:0xfffffffffffffffe txntype:unknown reqpath:n/a Error Path:/solr/overseer Error:KeeperErrorCode = NodeExists for /solr/overseer
[junit4:junit4]   2> 447 T1348 oasc.OverseerCollectionProcessor.run Process current queue of collection creations
[junit4:junit4]   2> 448 T1326 oascc.SolrZkClient.makePath makePath: /clusterstate.json
[junit4:junit4]   2> 458 T1326 oascc.ZkStateReader.createClusterStateWatchersAndUpdate Updating cluster state from ZooKeeper... 
[junit4:junit4]   2> 467 T1326 oasc.CoreContainer.create Creating SolrCore 'collection1' using instanceDir: /usr/home/hudson/hudson-slave/workspace/Lucene-Solr-Tests-4.x-java7/solr/build/solr-core/test-files/solr/collection1
[junit4:junit4]   2> 468 T1326 oasc.ZkController.createCollectionZkNode Check for collection zkNode:control_collection
[junit4:junit4]   2> 469 T1347 oasc.Overseer$ClusterStateUpdater.run Starting to work on the main queue
[junit4:junit4]   2> 469 T1326 oasc.ZkController.createCollectionZkNode Collection zkNode exists
[junit4:junit4]   2> 469 T1326 oasc.ZkController.readConfigName Load collection config from:/collections/control_collection
[junit4:junit4]   2> 470 T1326 oasc.SolrResourceLoader.<init> new SolrResourceLoader for directory: '/usr/home/hudson/hudson-slave/workspace/Lucene-Solr-Tests-4.x-java7/solr/build/solr-core/test-files/solr/collection1/'
[junit4:junit4]   2> 471 T1326 oasc.SolrResourceLoader.replaceClassLoader Adding 'file:/usr/home/hudson/hudson-slave/workspace/Lucene-Solr-Tests-4.x-java7/solr/build/solr-core/test-files/solr/collection1/lib/README' to classloader
[junit4:junit4]   2> 472 T1326 oasc.SolrResourceLoader.replaceClassLoader Adding 'file:/usr/home/hudson/hudson-slave/workspace/Lucene-Solr-Tests-4.x-java7/solr/build/solr-core/test-files/solr/collection1/lib/classes/' to classloader
[junit4:junit4]   2> 530 T1326 oasc.SolrConfig.<init> Using Lucene MatchVersion: LUCENE_41
[junit4:junit4]   2> 594 T1326 oasc.SolrConfig.<init> Loaded SolrConfig: solrconfig.xml
[junit4:junit4]   2> 695 T1326 oass.IndexSchema.readSchema Reading Solr Schema
[junit4:junit4]   2> 701 T1326 oass.IndexSchema.readSchema Schema name=test
[junit4:junit4]   2> 1169 T1326 oass.OpenExchangeRatesOrgProvider.init Initialized with rates=open-exchange-rates.json, refreshInterval=1440.
[junit4:junit4]   2> 1179 T1326 oass.IndexSchema.readSchema default search field in schema is text
[junit4:junit4]   2> 1186 T1326 oass.IndexSchema.readSchema unique key field: id
[junit4:junit4]   2> 1197 T1326 oass.FileExchangeRateProvider.reload Reloading exchange rates from file currency.xml
[junit4:junit4]   2> 1202 T1326 oass.FileExchangeRateProvider.reload Reloading exchange rates from file currency.xml
[junit4:junit4]   2> 1206 T1326 oass.OpenExchangeRatesOrgProvider.reload Reloading exchange rates from open-exchange-rates.json
[junit4:junit4]   2> 1208 T1326 oass.OpenExchangeRatesOrgProvider.reload Reloading exchange rates from open-exchange-rates.json
[junit4:junit4]   2> 1209 T1326 oasc.SolrCore.<init> [collection1] Opening new SolrCore at /usr/home/hudson/hudson-slave/workspace/Lucene-Solr-Tests-4.x-java7/solr/build/solr-core/test-files/solr/collection1/, dataDir=./org.apache.solr.cloud.BasicDistributedZkTest-1349451508878/control/data/
[junit4:junit4]   2> 1209 T1326 oasc.JmxMonitoredMap.<init> JMX monitoring is enabled. Adding Solr mbeans to JMX Server: com.sun.jmx.mbeanserver.JmxMBeanServer@27abbcda
[junit4:junit4]   2> 1234 T1326 oasc.SolrCore.getNewIndexDir New index directory detected: old=null new=./org.apache.solr.cloud.BasicDistributedZkTest-1349451508878/control/data/index/
[junit4:junit4]   2> 1235 T1326 oasc.SolrCore.initIndex WARNING [collection1] Solr index directory './org.apache.solr.cloud.BasicDistributedZkTest-1349451508878/control/data/index' doesn't exist. Creating new index...
[junit4:junit4]   2> 1235 T1326 oasc.CachingDirectoryFactory.get return new directory for /usr/home/hudson/hudson-slave/workspace/Lucene-Solr-Tests-4.x-java7/solr/build/solr-core/test/J1/./org.apache.solr.cloud.BasicDistributedZkTest-1349451508878/control/data/index forceNew:false
[junit4:junit4]   2> 1253 T1326 oasc.SolrDeletionPolicy.onCommit SolrDeletionPolicy.onCommit: commits:num=1
[junit4:junit4]   2> 		commit{dir=/usr/home/hudson/hudson-slave/workspace/Lucene-Solr-Tests-4.x-java7/solr/build/solr-core/test/J1/org.apache.solr.cloud.BasicDistributedZkTest-1349451508878/control/data/index,segFN=segments_1,generation=1,filenames=[segments_1]
[junit4:junit4]   2> 1253 T1326 oasc.SolrDeletionPolicy.updateCommits newest commit = 1
[junit4:junit4]   2> 1254 T1326 oasc.SolrCore.initWriters created xml: solr.XMLResponseWriter
[junit4:junit4]   2> 1256 T1326 oasup.UpdateRequestProcessorChain.init inserting DistributedUpdateProcessorFactory into updateRequestProcessorChain "dedupe"
[junit4:junit4]   2> 1256 T1326 oasup.UpdateRequestProcessorChain.init inserting DistributedUpdateProcessorFactory into updateRequestProcessorChain "dedupe-allfields"
[junit4:junit4]   2> 1257 T1326 oasup.UpdateRequestProcessorChain.init inserting DistributedUpdateProcessorFactory into updateRequestProcessorChain "stored_sig"
[junit4:junit4]   2> 1257 T1326 oasup.UpdateRequestProcessorChain.init inserting DistributedUpdateProcessorFactory into updateRequestProcessorChain "uniq-fields"
[junit4:junit4]   2> 1258 T1326 oasup.UpdateRequestProcessorChain.init inserting DistributedUpdateProcessorFactory into updateRequestProcessorChain "distrib-dup-test-chain-implicit"
[junit4:junit4]   2> 1258 T1326 oasc.RequestHandlers.initHandlersFromConfig adding lazy requestHandler: solr.ReplicationHandler
[junit4:junit4]   2> 1259 T1326 oasc.RequestHandlers.initHandlersFromConfig created /replication: solr.ReplicationHandler
[junit4:junit4]   2> 1259 T1326 oasc.RequestHandlers.initHandlersFromConfig created standard: solr.StandardRequestHandler
[junit4:junit4]   2> 1260 T1326 oasc.RequestHandlers.initHandlersFromConfig created /get: solr.RealTimeGetHandler
[junit4:junit4]   2> 1260 T1326 oasc.RequestHandlers.initHandlersFromConfig created dismax: solr.SearchHandler
[junit4:junit4]   2> 1261 T1326 oasc.RequestHandlers.initHandlersFromConfig created mock: org.apache.solr.core.MockQuerySenderListenerReqHandler
[junit4:junit4]   2> 1261 T1326 oasc.RequestHandlers.initHandlersFromConfig created /admin/: org.apache.solr.handler.admin.AdminHandlers
[junit4:junit4]   2> 1262 T1326 oasc.RequestHandlers.initHandlersFromConfig created defaults: solr.StandardRequestHandler
[junit4:junit4]   2> 1262 T1326 oasc.RequestHandlers.initHandlersFromConfig adding lazy requestHandler: solr.StandardRequestHandler
[junit4:junit4]   2> 1263 T1326 oasc.RequestHandlers.initHandlersFromConfig created lazy: solr.StandardRequestHandler
[junit4:junit4]   2> 1263 T1326 oasc.RequestHandlers.initHandlersFromConfig created /update: solr.UpdateRequestHandler
[junit4:junit4]   2> 1264 T1326 oasc.RequestHandlers.initHandlersFromConfig created /terms: org.apache.solr.handler.component.SearchHandler
[junit4:junit4]   2> 1264 T1326 oasc.RequestHandlers.initHandlersFromConfig created spellCheckCompRH: org.apache.solr.handler.component.SearchHandler
[junit4:junit4]   2> 1265 T1326 oasc.RequestHandlers.initHandlersFromConfig created spellCheckCompRH_Direct: org.apache.solr.handler.component.SearchHandler
[junit4:junit4]   2> 1265 T1326 oasc.RequestHandlers.initHandlersFromConfig created spellCheckWithWordbreak: org.apache.solr.handler.component.SearchHandler
[junit4:junit4]   2> 1266 T1326 oasc.RequestHandlers.initHandlersFromConfig created spellCheckWithWordbreak_Direct: org.apache.solr.handler.component.SearchHandler
[junit4:junit4]   2> 1266 T1326 oasc.RequestHandlers.initHandlersFromConfig created spellCheckCompRH1: org.apache.solr.handler.component.SearchHandler
[junit4:junit4]   2> 1267 T1326 oasc.RequestHandlers.initHandlersFromConfig created tvrh: org.apache.solr.handler.component.SearchHandler
[junit4:junit4]   2> 1267 T1326 oasc.RequestHandlers.initHandlersFromConfig created /mlt: solr.MoreLikeThisHandler
[junit4:junit4]   2> 1268 T1326 oasc.RequestHandlers.initHandlersFromConfig created /debug/dump: solr.DumpRequestHandler
[junit4:junit4]   2> 1277 T1326 oashl.XMLLoader.init xsltCacheLifetimeSeconds=60
[junit4:junit4]   2> 1281 T1326 oasc.SolrCore.initDeprecatedSupport WARNING solrconfig.xml uses deprecated <admin/gettableFiles>, Please update your config to use the ShowFileRequestHandler.
[junit4:junit4]   2> 1282 T1326 oasc.SolrCore.initDeprecatedSupport WARNING adding ShowFileRequestHandler with hidden files: [SCHEMA.XML, OLD_SYNONYMS.TXT, STOPWORDS.TXT, PROTWORDS.TXT, OPEN-EXCHANGE-RATES.JSON, SYNONYMS.TXT, CURRENCY.XML, MAPPING-ISOLATIN1ACCENT.TXT]
[junit4:junit4]   2> 1286 T1326 oass.SolrIndexSearcher.<init> Opening Searcher@d5c3264 main
[junit4:junit4]   2> 1287 T1326 oasu.CommitTracker.<init> Hard AutoCommit: disabled
[junit4:junit4]   2> 1288 T1326 oasu.CommitTracker.<init> Soft AutoCommit: disabled
[junit4:junit4]   2> 1288 T1326 oashc.SpellCheckComponent.inform Initializing spell checkers
[junit4:junit4]   2> 1309 T1326 oass.DirectSolrSpellChecker.init init: {name=direct,classname=DirectSolrSpellChecker,field=lowerfilt,minQueryLength=3}
[junit4:junit4]   2> 1351 T1349 oasc.SolrCore.registerSearcher [collection1] Registered new searcher Searcher@d5c3264 main{StandardDirectoryReader(segments_1:1)}
[junit4:junit4]   2> 1355 T1331 oazs.PrepRequestProcessor.pRequest Got user-level KeeperException when processing sessionid:0x13a3193ec930002 type:create cxid:0x53 zxid:0xfffffffffffffffe txntype:unknown reqpath:n/a Error Path:/solr/overseer/queue Error:KeeperErrorCode = NoNode for /solr/overseer/queue
[junit4:junit4]   2> 1373 T1326 oasc.CoreContainer.register registering core: collection1
[junit4:junit4]   2> 1374 T1326 oasc.ZkController.register Register shard - core:collection1 address:http://127.0.0.1:10318/solr shardId:control_shard
[junit4:junit4]   2> 1381 T1326 oascsi.HttpClientUtil.createClient Creating new http client, config:maxConnections=10000&maxConnectionsPerHost=20&connTimeout=30000&socketTimeout=30000&retry=false
[junit4:junit4]   2> 1392 T1326 oascc.SolrZkClient.makePath makePath: /collections/control_collection/leader_elect/control_shard/election
[junit4:junit4]   2> 1411 T1331 oazs.PrepRequestProcessor.pRequest Got user-level KeeperException when processing sessionid:0x13a3193ec930002 type:delete cxid:0x62 zxid:0xfffffffffffffffe txntype:unknown reqpath:n/a Error Path:/solr/collections/control_collection/leaders Error:KeeperErrorCode = NoNode for /solr/collections/control_collection/leaders
[junit4:junit4]   2> 1412 T1326 oasc.ShardLeaderElectionContext.runLeaderProcess Running the leader process.
[junit4:junit4]   2> 1413 T1331 oazs.PrepRequestProcessor.pRequest Got user-level KeeperException when processing sessionid:0x13a3193ec930002 type:create cxid:0x63 zxid:0xfffffffffffffffe txntype:unknown reqpath:n/a Error Path:/solr/overseer Error:KeeperErrorCode = NodeExists for /solr/overseer
[junit4:junit4]   2> 1473 T1347 oascc.ZkStateReader.updateClusterState Updating cloud state from ZooKeeper... 
[junit4:junit4]   2> 1474 T1331 oazs.PrepRequestProcessor.pRequest Got user-level KeeperException when processing sessionid:0x13a3193ec930002 type:create cxid:0x6a zxid:0xfffffffffffffffe txntype:unknown reqpath:n/a Error Path:/solr/overseer/queue-work Error:KeeperErrorCode = NoNode for /solr/overseer/queue-work
[junit4:junit4]   2> 1523 T1346 oascc.ZkStateReader$2.process A cluster state change has occurred - updating...
[junit4:junit4]   2> 1934 T1326 oasc.ShardLeaderElectionContext.waitForReplicasToComeUp Enough replicas found to continue.
[junit4:junit4]   2> 1935 T1326 oasc.ShardLeaderElectionContext.runLeaderProcess I may be the new leader - try and sync
[junit4:junit4]   2> 1936 T1326 oasc.SyncStrategy.sync Sync replicas to http://127.0.0.1:10318/solr/collection1/
[junit4:junit4]   2> 1936 T1326 oasc.SyncStrategy.syncReplicas Sync Success - now sync replicas to me
[junit4:junit4]   2> 1937 T1326 oasc.SyncStrategy.syncToMe http://127.0.0.1:10318/solr/collection1/ has no replicas
[junit4:junit4]   2> 1937 T1326 oasc.ShardLeaderElectionContext.runLeaderProcess I am the new leader: http://127.0.0.1:10318/solr/collection1/
[junit4:junit4]   2> 1938 T1326 oascc.SolrZkClient.makePath makePath: /collections/control_collection/leaders/control_shard
[junit4:junit4]   2> 1942 T1331 oazs.PrepRequestProcessor.pRequest Got user-level KeeperException when processing sessionid:0x13a3193ec930002 type:create cxid:0x88 zxid:0xfffffffffffffffe txntype:unknown reqpath:n/a Error Path:/solr/overseer Error:KeeperErrorCode = NodeExists for /solr/overseer
[junit4:junit4]   2> 2035 T1347 oascc.ZkStateReader.updateClusterState Updating cloud state from ZooKeeper... 
[junit4:junit4]   2> 2054 T1346 oascc.ZkStateReader$2.process A cluster state change has occurred - updating...
[junit4:junit4]   2> 2117 T1326 oasc.ZkController.register We are http://127.0.0.1:10318/solr/collection1/ and leader is http://127.0.0.1:10318/solr/collection1/
[junit4:junit4]   2> 2117 T1326 oasc.ZkController.register No LogReplay needed for core=collection1 baseURL=http://127.0.0.1:10318/solr
[junit4:junit4]   2> 2118 T1326 oasc.ZkController.checkRecovery I am the leader, no recovery necessary
[junit4:junit4]   2> 2120 T1326 oascc.ZkStateReader.updateClusterState Updating cloud state from ZooKeeper... 
[junit4:junit4]   2> 2120 T1326 oass.SolrDispatchFilter.init user.dir=/usr/home/hudson/hudson-slave/workspace/Lucene-Solr-Tests-4.x-java7/solr/build/solr-core/test/J1
[junit4:junit4]   2> 2121 T1326 oass.SolrDispatchFilter.init SolrDispatchFilter.init() done
[junit4:junit4]   2> 2121 T1326 oascsi.HttpClientUtil.createClient Creating new http client, config:maxConnections=128&maxConnectionsPerHost=32&followRedirects=false
[junit4:junit4]   2> 2255 T1326 oejs.Server.doStart jetty-8.1.2.v20120308
[junit4:junit4]   2> 2258 T1326 oejs.AbstractConnector.doStart Started SocketConnector@0.0.0.0:36395
[junit4:junit4]   2> 2259 T1326 oasc.SolrResourceLoader.locateSolrHome JNDI not configured for solr (NoInitialContextEx)
[junit4:junit4]   2> 2259 T1326 oasc.SolrResourceLoader.locateSolrHome using system property solr.solr.home: /usr/home/hudson/hudson-slave/workspace/Lucene-Solr-Tests-4.x-java7/solr/build/solr-core/test/J1/./solrtest-jetty1-1349451511003
[junit4:junit4]   2> 2259 T1326 oasc.SolrResourceLoader.<init> new SolrResourceLoader for deduced Solr Home: '/usr/home/hudson/hudson-slave/workspace/Lucene-Solr-Tests-4.x-java7/solr/build/solr-core/test/J1/./solrtest-jetty1-1349451511003/'
[junit4:junit4]   2> 2290 T1326 oass.SolrDispatchFilter.init SolrDispatchFilter.init()
[junit4:junit4]   2> 2291 T1326 oasc.SolrResourceLoader.locateSolrHome JNDI not configured for solr (NoInitialContextEx)
[junit4:junit4]   2> 2291 T1326 oasc.SolrResourceLoader.locateSolrHome using system property solr.solr.home: /usr/home/hudson/hudson-slave/workspace/Lucene-Solr-Tests-4.x-java7/solr/build/solr-core/test/J1/./solrtest-jetty1-1349451511003
[junit4:junit4]   2> 2291 T1326 oasc.CoreContainer$Initializer.initialize looking for solr.xml: /usr/home/hudson/hudson-slave/workspace/Lucene-Solr-Tests-4.x-java7/solr/build/solr-core/test/J1/./solrtest-jetty1-1349451511003/solr.xml
[junit4:junit4]   2> 2291 T1326 oasc.CoreContainer.<init> New CoreContainer 123130253
[junit4:junit4]   2> 2292 T1326 oasc.CoreContainer.load Loading CoreContainer using Solr Home: '/usr/home/hudson/hudson-slave/workspace/Lucene-Solr-Tests-4.x-java7/solr/build/solr-core/test/J1/./solrtest-jetty1-1349451511003/'
[junit4:junit4]   2> 2292 T1326 oasc.SolrResourceLoader.<init> new SolrResourceLoader for directory: '/usr/home/hudson/hudson-slave/workspace/Lucene-Solr-Tests-4.x-java7/solr/build/solr-core/test/J1/./solrtest-jetty1-1349451511003/'
[junit4:junit4]   2> 2320 T1326 oasc.CoreContainer.load Registering Log Listener
[junit4:junit4]   2> 2335 T1326 oasc.CoreContainer.initZooKeeper Zookeeper client=127.0.0.1:26318/solr
[junit4:junit4]   2> 2336 T1326 oaz.ZooKeeper.<init> Initiating client connection, connectString=127.0.0.1:26318/solr sessionTimeout=5000 watcher=org.apache.solr.common.cloud.ConnectionManager@68e59f01
[junit4:junit4]   2> 2337 T1359 oaz.ClientCnxn$SendThread.startConnect Opening socket connection to server /127.0.0.1:26318
[junit4:junit4]   2> 2337 T1326 oascc.ConnectionManager.waitForConnected Waiting for client to connect to ZooKeeper
[junit4:junit4]   2> 2339 T1359 oaz.ClientCnxn$SendThread.primeConnection Socket connection established to localhost/127.0.0.1:26318, initiating session
[junit4:junit4]   2> 2339 T1328 oazs.NIOServerCnxn$Factory.run Accepted socket connection from /140.211.11.196:15538
[junit4:junit4]   2> 2339 T1328 oazs.NIOServerCnxn.readConnectRequest Client attempting to establish new session at /140.211.11.196:15538
[junit4:junit4]   2> 2345 T1330 oazs.NIOServerCnxn.finishSessionInit Established session 0x13a3193ec930003 with negotiated timeout 5000 for client /140.211.11.196:15538
[junit4:junit4]   2> 2345 T1359 oaz.ClientCnxn$SendThread.readConnectResult Session establishment complete on server localhost/127.0.0.1:26318, sessionid = 0x13a3193ec930003, negotiated timeout = 5000
[junit4:junit4]   2> 2345 T1360 oascc.ConnectionManager.process Watcher org.apache.solr.common.cloud.ConnectionManager@68e59f01 name:ZooKeeperConnection Watcher:127.0.0.1:26318/solr got event WatchedEvent state:SyncConnected type:None path:null path:null type:None
[junit4:junit4]   2> 2346 T1326 oascc.ConnectionManager.waitForConnected Client is connected to ZooKeeper
[junit4:junit4]   2> 2346 T1331 oazs.PrepRequestProcessor.pRequest Got user-level KeeperException when processing sessionid:0x13a3193ec930003 type:create cxid:0x1 zxid:0xfffffffffffffffe txntype:unknown reqpath:n/a Error Path:/solr/overseer Error:KeeperErrorCode = NodeExists for /solr/overseer
[junit4:junit4]   2> 2358 T1331 oazs.PrepRequestProcessor.pRequest Got user-level KeeperException when processing sessionid:0x13a3193ec930003 type:create cxid:0x2 zxid:0xfffffffffffffffe txntype:unknown reqpath:n/a Error Path:/solr/overseer Error:KeeperErrorCode = NodeExists for /solr/overseer
[junit4:junit4]   2> 2359 T1326 oasc.ZkController.createEphemeralLiveNode Register node as live in ZooKeeper:/live_nodes/127.0.0.1:36395_solr
[junit4:junit4]   2> 2360 T1331 oazs.PrepRequestProcessor.pRequest Got user-level KeeperException when processing sessionid:0x13a3193ec930003 type:delete cxid:0x4 zxid:0xfffffffffffffffe txntype:unknown reqpath:n/a Error Path:/solr/live_nodes/127.0.0.1:36395_solr Error:KeeperErrorCode = NoNode for /solr/live_nodes/127.0.0.1:36395_solr
[junit4:junit4]   2> 2366 T1326 oascc.SolrZkClient.makePath makePath: /live_nodes/127.0.0.1:36395_solr
[junit4:junit4]   2> 2368 T1346 oascc.ZkStateReader$3.process Updating live nodes
[junit4:junit4]   2> 2369 T1326 oashc.HttpShardHandlerFactory.getParameter Setting socketTimeout to: 0
[junit4:junit4]   2> 2369 T1326 oashc.HttpShardHandlerFactory.getParameter Setting urlScheme to: http://
[junit4:junit4]   2> 2370 T1326 oashc.HttpShardHandlerFactory.getParameter Setting connTimeout to: 0
[junit4:junit4]   2> 2370 T1326 oashc.HttpShardHandlerFactory.getParameter Setting maxConnectionsPerHost to: 20
[junit4:junit4]   2> 2370 T1326 oashc.HttpShardHandlerFactory.getParameter Setting corePoolSize to: 0
[junit4:junit4]   2> 2370 T1326 oashc.HttpShardHandlerFactory.getParameter Setting maximumPoolSize to: 2147483647
[junit4:junit4]   2> 2371 T1326 oashc.HttpShardHandlerFactory.getParameter Setting maxThreadIdleTime to: 5
[junit4:junit4]   2> 2371 T1326 oashc.HttpShardHandlerFactory.getParameter Setting sizeOfQueue to: -1
[junit4:junit4]   2> 2371 T1326 oashc.HttpShardHandlerFactory.getParameter Setting fairnessPolicy to: false
[junit4:junit4]   2> 2372 T1326 oascsi.HttpClientUtil.createClient Creating new http client, config:maxConnectionsPerHost=20&maxConnections=10000&socketTimeout=0&connTimeout=0&retry=false
[junit4:junit4]   2> 2385 T1326 oascc.ZkStateReader.createClusterStateWatchersAndUpdate Updating cluster state from ZooKeeper... 
[junit4:junit4]   2> 2391 T1326 oasc.CoreContainer.create Creating SolrCore 'collection1' using instanceDir: /usr/home/hudson/hudson-slave/workspace/Lucene-Solr-Tests-4.x-java7/solr/build/solr-core/test/J1/./solrtest-jetty1-1349451511003/collection1
[junit4:junit4]   2> 2392 T1326 oasc.ZkController.createCollectionZkNode Check for collection zkNode:collection1
[junit4:junit4]   2> 2393 T1326 oasc.ZkController.createCollectionZkNode Collection zkNode exists
[junit4:junit4]   2> 2393 T1326 oasc.ZkController.readConfigName Load collection config from:/collections/collection1
[junit4:junit4]   2> 2394 T1326 oasc.SolrResourceLoader.<init> new SolrResourceLoader for directory: '/usr/home/hudson/hudson-slave/workspace/Lucene-Solr-Tests-4.x-java7/solr/build/solr-core/test/J1/./solrtest-jetty1-1349451511003/collection1/'
[junit4:junit4]   2> 2395 T1326 oasc.SolrResourceLoader.replaceClassLoader Adding 'file:/usr/home/hudson/hudson-slave/workspace/Lucene-Solr-Tests-4.x-java7/solr/build/solr-core/test/J1/solrtest-jetty1-1349451511003/collection1/lib/classes/' to classloader
[junit4:junit4]   2> 2396 T1326 oasc.SolrResourceLoader.replaceClassLoader Adding 'file:/usr/home/hudson/hudson-slave/workspace/Lucene-Solr-Tests-4.x-java7/solr/build/solr-core/test/J1/solrtest-jetty1-1349451511003/collection1/lib/README' to classloader
[junit4:junit4]   2> 2469 T1326 oasc.SolrConfig.<init> Using Lucene MatchVersion: LUCENE_41
[junit4:junit4]   2> 2544 T1326 oasc.SolrConfig.<init> Loaded SolrConfig: solrconfig.xml
[junit4:junit4]   2> 2573 T1347 oascc.ZkStateReader.updateClusterState Updating cloud state from ZooKeeper... 
[junit4:junit4]   2> 2588 T1346 oascc.ZkStateReader$2.process A cluster state change has occurred - updating...
[junit4:junit4]   2> 2645 T1360 oascc.ZkStateReader$2.process A cluster state change has occurred - updating...
[junit4:junit4]   2> 2645 T1326 oass.IndexSchema.readSchema Reading Solr Schema
[junit4:junit4]   2> 2653 T1326 oass.IndexSchema.readSchema Schema name=test
[junit4:junit4]   2> 3129 T1326 oass.OpenExchangeRatesOrgProvider.init Initialized with rates=open-exchange-rates.json, refreshInterval=1440.
[junit4:junit4]   2> 3142 T1326 oass.IndexSchema.readSchema default search field in schema is text
[junit4:junit4]   2> 3147 T1326 oass.IndexSchema.readSchema unique key field: id
[junit4:junit4]   2> 3160 T1326 oass.FileExchangeRateProvider.reload Reloading exchange rates from file currency.xml
[junit4:junit4]   2> 3164 T1326 oass.FileExchangeRateProvider.reload Reloading exchange rates from file currency.xml
[junit4:junit4]   2> 3168 T1326 oass.OpenExchangeRatesOrgProvider.reload Reloading exchange rates from open-exchange-rates.json
[junit4:junit4]   2> 3169 T1326 oass.OpenExchangeRatesOrgProvider.reload Reloading exchange rates from open-exchange-rates.json
[junit4:junit4]   2> 3169 T1326 oasc.SolrCore.<init> [collection1] Opening new SolrCore at /usr/home/hudson/hudson-slave/workspace/Lucene-Solr-Tests-4.x-java7/solr/build/solr-core/test/J1/./solrtest-jetty1-1349451511003/collection1/, dataDir=./org.apache.solr.cloud.BasicDistributedZkTest-1349451508878/jetty1/
[junit4:junit4]   2> 3170 T1326 oasc.JmxMonitoredMap.<init> JMX monitoring is enabled. Adding Solr mbeans to JMX Server: com.sun.jmx.mbeanserver.JmxMBeanServer@27abbcda
[junit4:junit4]   2> 3171 T1326 oasc.SolrCore.getNewIndexDir New index directory detected: old=null new=./org.apache.solr.cloud.BasicDistributedZkTest-1349451508878/jetty1/index/
[junit4:junit4]   2> 3171 T1326 oasc.SolrCore.initIndex WARNING [collection1] Solr index directory './org.apache.solr.cloud.BasicDistributedZkTest-1349451508878/jetty1/index' doesn't exist. Creating new index...
[junit4:junit4]   2> 3172 T1326 oasc.CachingDirectoryFactory.get return new directory for /usr/home/hudson/hudson-slave/workspace/Lucene-Solr-Tests-4.x-java7/solr/build/solr-core/test/J1/./org.apache.solr.cloud.BasicDistributedZkTest-1349451508878/jetty1/index forceNew:false
[junit4:junit4]   2> 3183 T1326 oasc.SolrDeletionPolicy.onCommit SolrDeletionPolicy.onCommit: commits:num=1
[junit4:junit4]   2> 		commit{dir=/usr/home/hudson/hudson-slave/workspace/Lucene-Solr-Tests-4.x-java7/solr/build/solr-core/test/J1/org.apache.solr.cloud.BasicDistributedZkTest-1349451508878/jetty1/index,segFN=segments_1,generation=1,filenames=[segments_1]
[junit4:junit4]   2> 3183 T1326 oasc.SolrDeletionPolicy.updateCommits newest commit = 1
[junit4:junit4]   2> 3184 T1326 oasc.SolrCore.initWriters created xml: solr.XMLResponseWriter
[junit4:junit4]   2> 3186 T1326 oasup.UpdateRequestProcessorChain.init inserting DistributedUpdateProcessorFactory into updateRequestProcessorChain "dedupe"
[junit4:junit4]   2> 3186 T1326 oasup.UpdateRequestProcessorChain.init inserting DistributedUpdateProcessorFactory into updateRequestProcessorChain "dedupe-allfields"
[junit4:junit4]   2> 3187 T1326 oasup.UpdateRequestProcessorChain.init inserting DistributedUpdateProcessorFactory into updateRequestProcessorChain "stored_sig"
[junit4:junit4]   2> 3187 T1326 oasup.UpdateRequestProcessorChain.init inserting DistributedUpdateProcessorFactory into updateRequestProcessorChain "uniq-fields"
[junit4:junit4]   2> 3188 T1326 oasup.UpdateRequestProcessorChain.init inserting DistributedUpdateProcessorFactory into updateRequestProcessorChain "distrib-dup-test-chain-implicit"
[junit4:junit4]   2> 3188 T1326 oasc.RequestHandlers.initHandlersFromConfig adding lazy requestHandler: solr.ReplicationHandler
[junit4:junit4]   2> 3189 T1326 oasc.RequestHandlers.initHandlersFromConfig created /replication: solr.ReplicationHandler
[junit4:junit4]   2> 3189 T1326 oasc.RequestHandlers.initHandlersFromConfig created standard: solr.StandardRequestHandler
[junit4:junit4]   2> 3190 T1326 oasc.RequestHandlers.initHandlersFromConfig created /get: solr.RealTimeGetHandler
[junit4:junit4]   2> 3190 T1326 oasc.RequestHandlers.initHandlersFromConfig created dismax: solr.SearchHandler
[junit4:junit4]   2> 3191 T1326 oasc.RequestHandlers.initHandlersFromConfig created mock: org.apache.solr.core.MockQuerySenderListenerReqHandler
[junit4:junit4]   2> 3191 T1326 oasc.RequestHandlers.initHandlersFromConfig created /admin/: org.apache.solr.handler.admin.AdminHandlers
[junit4:junit4]   2> 3192 T1326 oasc.RequestHandlers.initHandlersFromConfig created defaults: solr.StandardRequestHandler
[junit4:junit4]   2> 3192 T1326 oasc.RequestHandlers.initHandlersFromConfig adding lazy requestHandler: solr.StandardRequestHandler
[junit4:junit4]   2> 3193 T1326 oasc.RequestHandlers.initHandlersFromConfig created lazy: solr.StandardRequestHandler
[junit4:junit4]   2> 3193 T1326 oasc.RequestHandlers.initHandlersFromConfig created /update: solr.UpdateRequestHandler
[junit4:junit4]   2> 3194 T1326 oasc.RequestHandlers.initHandlersFromConfig created /terms: org.apache.solr.handler.component.SearchHandler
[junit4:junit4]   2> 3194 T1326 oasc.RequestHandlers.initHandlersFromConfig created spellCheckCompRH: org.apache.solr.handler.component.SearchHandler
[junit4:junit4]   2> 3195 T1326 oasc.RequestHandlers.initHandlersFromConfig created spellCheckCompRH_Direct: org.apache.solr.handler.component.SearchHandler
[junit4:junit4]   2> 3195 T1326 oasc.RequestHandlers.initHandlersFromConfig created spellCheckWithWordbreak: org.apache.solr.handler.component.SearchHandler
[junit4:junit4]   2> 3196 T1326 oasc.RequestHandlers.initHandlersFromConfig created spellCheckWithWordbreak_Direct: org.apache.solr.handler.component.SearchHandler
[junit4:junit4]   2> 3196 T1326 oasc.RequestHandlers.initHandlersFromConfig created spellCheckCompRH1: org.apache.solr.handler.component.SearchHandler
[junit4:junit4]   2> 3197 T1326 oasc.RequestHandlers.initHandlersFromConfig created tvrh: org.apache.solr.handler.component.SearchHandler
[junit4:junit4]   2> 3198 T1326 oasc.RequestHandlers.initHandlersFromConfig created /mlt: solr.MoreLikeThisHandler
[junit4:junit4]   2> 3198 T1326 oasc.RequestHandlers.initHandlersFromConfig created /debug/dump: solr.DumpRequestHandler
[junit4:junit4]   2> 3207 T1326 oashl.XMLLoader.init xsltCacheLifetimeSeconds=60
[junit4:junit4]   2> 3210 T1326 oasc.SolrCore.initDeprecatedSupport WARNING solrconfig.xml uses deprecated <admin/gettableFiles>, Please update your config to use the ShowFileRequestHandler.
[junit4:junit4]   2> 3212 T1326 oasc.SolrCore.initDeprecatedSupport WARNING adding ShowFileRequestHandler with hidden files: [SCHEMA.XML, OLD_SYNONYMS.TXT, STOPWORDS.TXT, PROTWORDS.TXT, OPEN-EXCHANGE-RATES.JSON, SYNONYMS.TXT, CURRENCY.XML, MAPPING-ISOLATIN1ACCENT.TXT]
[junit4:junit4]   2> 3215 T1326 oass.SolrIndexSearcher.<init> Opening Searcher@7b3b46e5 main
[junit4:junit4]   2> 3216 T1326 oasu.CommitTracker.<init> Hard AutoCommit: disabled
[junit4:junit4]   2> 3216 T1326 oasu.CommitTracker.<init> Soft AutoCommit: disabled
[junit4:junit4]   2> 3217 T1326 oashc.SpellCheckComponent.inform Initializing spell checkers
[junit4:junit4]   2> 3223 T1326 oass.DirectSolrSpellChecker.init init: {name=direct,classname=DirectSolrSpellChecker,field=lowerfilt,minQueryLength=3}
[junit4:junit4]   2> 3276 T1361 oasc.SolrCore.registerSearcher [collection1] Registered new searcher Searcher@7b3b46e5 main{StandardDirectoryReader(segments_1:1)}
[junit4:junit4]   2> 3594 T1347 oascc.ZkStateReader.updateClusterState Updating cloud state from ZooKeeper... 
[junit4:junit4]   2> 3611 T1346 oascc.ZkStateReader$2.process A cluster state change has occurred - updating...
[junit4:junit4]   2> 3611 T1360 oascc.ZkStateReader$2.process A cluster state change has occurred - updating...
[junit4:junit4]   2> 3783 T1326 oasc.CoreContainer.register registering core: collection1
[junit4:junit4]   2> 3783 T1326 oasc.ZkController.register Register shard - core:collection1 address:http://127.0.0.1:36395/solr shardId:shard1
[junit4:junit4]   2> 3784 T1326 oascc.SolrZkClient.makePath makePath: /collections/collection1/leader_elect/shard1/election
[junit4:junit4]   2> 3801 T1331 oazs.PrepRequestProcessor.pRequest Got user-level KeeperException when processing sessionid:0x13a3193ec930003 type:delete cxid:0x43 zxid:0xfffffffffffffffe txntype:unknown reqpath:n/a Error Path:/solr/collections/collection1/leaders Error:KeeperErrorCode = NoNode for /solr/collections/collection1/leaders
[junit4:junit4]   2> 3802 T1326 oasc.ShardLeaderElectionContext.runLeaderProcess Running the leader process.
[junit4:junit4]   2> 3802 T1331 oazs.PrepRequestProcessor.pRequest Got user-level KeeperException when processing sessionid:0x13a3193ec930003 type:create cxid:0x44 zxid:0xfffffffffffffffe txntype:unknown reqpath:n/a Error Path:/solr/overseer Error:KeeperErrorCode = NodeExists for /solr/overseer
[junit4:junit4]   2> 3812 T1326 oasc.ShardLeaderElectionContext.waitForReplicasToComeUp Enough replicas found to continue.
[junit4:junit4]   2> 3812 T1326 oasc.ShardLeaderElectionContext.runLeaderProcess I may be the new leader - try and sync
[junit4:junit4]   2> 3813 T1326 oasc.SyncStrategy.sync Sync replicas to http://127.0.0.1:36395/solr/collection1/
[junit4:junit4]   2> 3813 T1326 oasc.SyncStrategy.syncReplicas Sync Success - now sync replicas to me
[junit4:junit4]   2> 3813 T1326 oasc.SyncStrategy.syncToMe http://127.0.0.1:36395/solr/collection1/ has no replicas
[junit4:junit4]   2> 3814 T1326 oasc.ShardLeaderElectionContext.runLeaderProcess I am the new leader: http://127.0.0.1:36395/solr/collection1/
[junit4:junit4]   2> 3814 T1326 oascc.SolrZkClient.makePath makePath: /collections/collection1/leaders/shard1
[junit4:junit4]   2> 3817 T1331 oazs.PrepRequestProcessor.pRequest Got user-level KeeperException when processing sessionid:0x13a3193ec930003 type:create cxid:0x4e zxid:0xfffffffffffffffe txntype:unknown reqpath:n/a Error Path:/solr/overseer Error:KeeperErrorCode = NodeExists for /solr/overseer
[junit4:junit4]   2> 4115 T1347 oascc.ZkStateReader.updateClusterState Updating cloud state from ZooKeeper... 
[junit4:junit4]   2> 4141 T1346 oascc.ZkStateReader$2.process A cluster state change has occurred - updating...
[junit4:junit4]   2> 4141 T1360 oascc.ZkStateReader$2.process A cluster state change has occurred - updating...
[junit4:junit4]   2> 4186 T1326 oasc.ZkController.register We are http://127.0.0.1:36395/solr/collection1/ and leader is http://127.0.0.1:36395/solr/collection1/
[junit4:junit4]   2> 4186 T1326 oasc.ZkController.register No LogReplay needed for core=collection1 baseURL=http://127.0.0.1:36395/solr
[junit4:junit4]   2> 4187 T1326 oasc.ZkController.checkRecovery I am the leader, no recovery necessary
[junit4:junit4]   2> 4189 T1326 oascc.ZkStateReader.updateClusterState Updating cloud state from ZooKeeper... 
[junit4:junit4]   2> 4190 T1326 oass.SolrDispatchFilter.init user.dir=/usr/home/hudson/hudson-slave/workspace/Lucene-Solr-Tests-4.x-java7/solr/build/solr-core/test/J1
[junit4:junit4]   2> 4190 T1326 oass.SolrDispatchFilter.init SolrDispatchFilter.init() done
[junit4:junit4]   2> 4191 T1326 oascsi.HttpClientUtil.createClient Creating new http client, config:maxConnections=128&maxConnectionsPerHost=32&followRedirects=false
[junit4:junit4]   2> 4392 T1326 oejs.Server.doStart jetty-8.1.2.v20120308
[junit4:junit4]   2> 4396 T1326 oejs.AbstractConnector.doStart Started SocketConnector@0.0.0.0:28212
[junit4:junit4]   2> 4396 T1326 oasc.SolrResourceLoader.locateSolrHome JNDI not configured for solr (NoInitialContextEx)
[junit4:junit4]   2> 4397 T1326 oasc.SolrResourceLoader.locateSolrHome using system property solr.solr.home: /usr/home/hudson/hudson-slave/workspace/Lucene-Solr-Tests-4.x-java7/solr/build/solr-core/test/J1/./solrtest-jetty2-1349451513080
[junit4:junit4]   2> 4397 T1326 oasc.SolrResourceLoader.<init> new SolrResourceLoader for deduced Solr Home: '/usr/home/hudson/hudson-slave/workspace/Lucene-Solr-Tests-4.x-java7/solr/build/solr-core/test/J1/./solrtest-jetty2-1349451513080/'
[junit4:junit4]   2> 4439 T1326 oass.SolrDispatchFilter.init SolrDispatchFilter.init()
[junit4:junit4]   2> 4440 T1326 oasc.SolrResourceLoader.locateSolrHome JNDI not configured for solr (NoInitialContextEx)
[junit4:junit4]   2> 4441 T1326 oasc.SolrResourceLoader.locateSolrHome using system property solr.solr.home: /usr/home/hudson/hudson-slave/workspace/Lucene-Solr-Tests-4.x-java7/solr/build/solr-core/test/J1/./solrtest-jetty2-1349451513080
[junit4:junit4]   2> 4441 T1326 oasc.CoreContainer$Initializer.initialize looking for solr.xml: /usr/home/hudson/hudson-slave/workspace/Lucene-Solr-Tests-4.x-java7/solr/build/solr-core/test/J1/./solrtest-jetty2-1349451513080/solr.xml
[junit4:junit4]   2> 4442 T1326 oasc.CoreContainer.<init> New CoreContainer 1798396161
[junit4:junit4]   2> 4442 T1326 oasc.CoreContainer.load Loading CoreContainer using Solr Home: '/usr/home/hudson/hudson-slave/workspace/Lucene-Solr-Tests-4.x-java7/solr/build/solr-core/test/J1/./solrtest-jetty2-1349451513080/'
[junit4:junit4]   2> 4443 T1326 oasc.SolrResourceLoader.<init> new SolrResourceLoader for directory: '/usr/home/hudson/hudson-slave/workspace/Lucene-Solr-Tests-4.x-java7/solr/build/solr-core/test/J1/./solrtest-jetty2-1349451513080/'
[junit4:junit4]   2> 4476 T1326 oasc.CoreContainer.load Registering Log Listener
[junit4:junit4]   2> 4495 T1326 oasc.CoreContainer.initZooKeeper Zookeeper client=127.0.0.1:26318/solr
[junit4:junit4]   2> 4495 T1326 oaz.ZooKeeper.<init> Initiating client connection, connectString=127.0.0.1:26318/solr sessionTimeout=5000 watcher=org.apache.solr.common.cloud.ConnectionManager@16639631
[junit4:junit4]   2> 4496 T1371 oaz.ClientCnxn$SendThread.startConnect Opening socket connection to server /127.0.0.1:26318
[junit4:junit4]   2> 4496 T1326 oascc.ConnectionManager.waitForConnected Waiting for client to connect to ZooKeeper
[junit4:junit4]   2> 4498 T1371 oaz.ClientCnxn$SendThread.primeConnection Socket connection established to localhost/127.0.0.1:26318, initiating session
[junit4:junit4]   2> 4498 T1328 oazs.NIOServerCnxn$Factory.run Accepted socket connection from /140.211.11.196:34404
[junit4:junit4]   2> 4498 T1328 oazs.NIOServerCnxn.readConnectRequest Client attempting to establish new session at /140.211.11.196:34404
[junit4:junit4]   2> 4501 T1330 oazs.NIOServerCnxn.finishSessionInit Established session 0x13a3193ec930004 with negotiated timeout 5000 for client /140.211.11.196:34404
[junit4:junit4]   2> 4501 T1371 oaz.ClientCnxn$SendThread.readConnectResult Session establishment complete on server localhost/127.0.0.1:26318, sessionid = 0x13a3193ec930004, negotiated timeout = 5000
[junit4:junit4]   2> 4501 T1372 oascc.ConnectionManager.process Watcher org.apache.solr.common.cloud.ConnectionManager@16639631 name:ZooKeeperConnection Watcher:127.0.0.1:26318/solr got event WatchedEvent state:SyncConnected type:None path:null path:null type:None
[junit4:junit4]   2> 4501 T1326 oascc.ConnectionManager.waitForConnected Client is connected to ZooKeeper
[junit4:junit4]   2> 4502 T1331 oazs.PrepRequestProcessor.pRequest Got user-level KeeperException when processing sessionid:0x13a3193ec930004 type:create cxid:0x1 zxid:0xfffffffffffffffe txntype:unknown reqpath:n/a Error Path:/solr/overseer Error:KeeperErrorCode = NodeExists for /solr/overseer
[junit4:junit4]   2> 4503 T1331 oazs.PrepRequestProcessor.pRequest Got user-level KeeperException when processing sessionid:0x13a3193ec930004 type:create cxid:0x2 zxid:0xfffffffffffffffe txntype:unknown reqpath:n/a Error Path:/solr/overseer Error:KeeperErrorCode = NodeExists for /solr/overseer
[junit4:junit4]   2> 4505 T1326 oasc.ZkController.createEphemeralLiveNode Register node as live in ZooKeeper:/live_nodes/127.0.0.1:28212_solr
[junit4:junit4]   2> 4505 T1331 oazs.PrepRequestProcessor.pRequest Got user-level KeeperException when processing sessionid:0x13a3193ec930004 type:delete cxid:0x4 zxid:0xfffffffffffffffe txntype:unknown reqpath:n/a Error Path:/solr/live_nodes/127.0.0.1:28212_solr Error:KeeperErrorCode = NoNode for /solr/live_nodes/127.0.0.1:28212_solr
[junit4:junit4]   2> 4507 T1326 oascc.SolrZkClient.makePath makePath: /live_nodes/127.0.0.1:28212_solr
[junit4:junit4]   2> 4516 T1346 oascc.ZkStateReader$3.process Updating live nodes
[junit4:junit4]   2> 4516 T1360 oascc.ZkStateReader$3.process Updating live nodes
[junit4:junit4]   2> 4516 T1326 oashc.HttpShardHandlerFactory.getParameter Setting socketTimeout to: 0
[junit4:junit4]   2> 4517 T1326 oashc.HttpShardHandlerFactory.getParameter Setting urlScheme to: http://
[junit4:junit4]   2> 4518 T1326 oashc.HttpShardHandlerFactory.getParameter Setting connTimeout to: 0
[junit4:junit4]   2> 4518 T1326 oashc.HttpShardHandlerFactory.getParameter Setting maxConnectionsPerHost to: 20
[junit4:junit4]   2> 4519 T1326 oashc.HttpShardHandlerFactory.getParameter Setting corePoolSize to: 0
[junit4:junit4]   2> 4519 T1326 oashc.HttpShardHandlerFactory.getParameter Setting maximumPoolSize to: 2147483647
[junit4:junit4]   2> 4519 T1326 oashc.HttpShardHandlerFactory.getParameter Setting maxThreadIdleTime to: 5
[junit4:junit4]   2> 4520 T1326 oashc.HttpShardHandlerFactory.getParameter Setting sizeOfQueue to: -1
[junit4:junit4]   2> 4520 T1326 oashc.HttpShardHandlerFactory.getParameter Setting fairnessPolicy to: false
[junit4:junit4]   2> 4521 T1326 oascsi.HttpClientUtil.createClient Creating new http client, config:maxConnectionsPerHost=20&maxConnections=10000&socketTimeout=0&connTimeout=0&retry=false
[junit4:junit4]   2> 4538 T1326 oascc.ZkStateReader.createClusterStateWatchersAndUpdate Updating cluster state from ZooKeeper... 
[junit4:junit4]   2> 4545 T1326 oasc.CoreContainer.create Creating SolrCore 'collection1' using instanceDir: /usr/home/hudson/hudson-slave/workspace/Lucene-Solr-Tests-4.x-java7/solr/build/solr-core/test/J1/./solrtest-jetty2-1349451513080/collection1
[junit4:junit4]   2> 4546 T1326 oasc.ZkController.createCollectionZkNode Check for collection zkNode:collection1
[junit4:junit4]   2> 4546 T1326 oasc.ZkController.createCollectionZkNode Collection zkNode exists
[junit4:junit4]   2> 4547 T1326 oasc.ZkController.readConfigName Load collection config from:/collections/collection1
[junit4:junit4]   2> 4548 T1326 oasc.SolrResourceLoader.<init> new SolrResourceLoader for directory: '/usr/home/hudson/hudson-slave/workspace/Lucene-Solr-Tests-4.x-java7/solr/build/solr-core/test/J1/./solrtest-jetty2-1349451513080/collection1/'
[junit4:junit4]   2> 4549 T1326 oasc.SolrResourceLoader.replaceClassLoader Adding 'file:/usr/home/hudson/hudson-slave/workspace/Lucene-Solr-Tests-4.x-java7/solr/build/solr-core/test/J1/solrtest-jetty2-1349451513080/collection1/lib/README' to classloader
[junit4:junit4]   2> 4550 T1326 oasc.SolrResourceLoader.replaceClassLoader Adding 'file:/usr/home/hudson/hudson-slave/workspace/Lucene-Solr-Tests-4.x-java7/solr/build/solr-core/test/J1/solrtest-jetty2-1349451513080/collection1/lib/classes/' to classloader
[junit4:junit4]   2> 4602 T1326 oasc.SolrConfig.<init> Using Lucene MatchVersion: LUCENE_41
[junit4:junit4]   2> 4653 T1347 oascc.ZkStateReader.updateClusterState Updating cloud state from ZooKeeper... 
[junit4:junit4]   2> 4657 T1346 oascc.ZkStateReader$2.process A cluster state change has occurred - updating...
[junit4:junit4]   2> 4657 T1360 oascc.ZkStateReader$2.process A cluster state change has occurred - updating...
[junit4:junit4]   2> 4657 T1372 oascc.ZkStateReader$2.process A cluster state change has occurred - updating...
[junit4:junit4]   2> 4673 T1326 oasc.SolrConfig.<init> Loaded SolrConfig: solrconfig.xml
[junit4:junit4]   2> 4774 T1326 oass.IndexSchema.readSchema Reading Solr Schema
[junit4:junit4]   2> 4780 T1326 oass.IndexSchema.readSchema Schema name=test
[junit4:junit4]   2> 5219 T1326 oass.OpenExchangeRatesOrgProvider.init Initialized with rates=open-exchange-rates.json, refreshInterval=1440.
[junit4:junit4]   2> 5228 T1326 oass.IndexSchema.readSchema default search field in schema is text
[junit4:junit4]   2> 5231 T1326 oass.IndexSchema.readSchema unique key field: id
[junit4:junit4]   2> 5241 T1326 oass.FileExchangeRateProvider.reload Reloading exchange rates from file currency.xml
[junit4:junit4]   2> 5245 T1326 oass.FileExchangeRateProvider.reload Reloading exchange rates from file currency.xml
[junit4:junit4]   2> 5249 T1326 oass.OpenExchangeRatesOrgProvider.reload Reloading exchange rates from open-exchange-rates.json
[junit4:junit4]   2> 5250 T1326 oass.OpenExchangeRatesOrgProvider.reload Reloading exchange rates from open-exchange-rates.json
[junit4:junit4]   2> 5251 T1326 oasc.SolrCore.<init> [collection1] Opening new SolrCore at /usr/home/hudson/hudson-slave/workspace/Lucene-Solr-Tests-4.x-java7/solr/build/solr-core/test/J1/./solrtest-jetty2-1349451513080/collection1/, dataDir=./org.apache.solr.cloud.BasicDistributedZkTest-1349451508878/jetty2/
[junit4:junit4]   2> 5251 T1326 oasc.JmxMonitoredMap.<init> JMX monitoring is enabled. Adding Solr mbeans to JMX Server: com.sun.jmx.mbeanserver.JmxMBeanServer@27abbcda
[junit4:junit4]   2> 5252 T1326 oasc.SolrCore.getNewIndexDir New index directory detected: old=null new=./org.apache.solr.cloud.BasicDistributedZkTest-1349451508878/jetty2/index/
[junit4:junit4]   2> 5253 T1326 oasc.SolrCore.initIndex WARNING [collection1] Solr index directory './org.apache.solr.cloud.BasicDistributedZkTest-1349451508878/jetty2/index' doesn't exist. Creating new index...
[junit4:junit4]   2> 5254 T1326 oasc.CachingDirectoryFactory.get return new directory for /usr/home/hudson/hudson-slave/workspace/Lucene-Solr-Tests-4.x-java7/solr/build/solr-core/test/J1/./org.apache.solr.cloud.BasicDistributedZkTest-1349451508878/jetty2/index forceNew:false
[junit4:junit4]   2> 5285 T1326 oasc.SolrDeletionPolicy.onCommit SolrDeletionPolicy.onCommit: commits:num=1
[junit4:junit4]   2> 		commit{dir=/usr/home/hudson/hudson-slave/workspace/Lucene-Solr-Tests-4.x-java7/solr/build/solr-core/test/J1/org.apache.solr.cloud.BasicDistributedZkTest-1349451508878/jetty2/index,segFN=segments_1,generation=1,filenames=[segments_1]
[junit4:junit4]   2> 5285 T1326 oasc.SolrDeletionPolicy.updateCommits newest commit = 1
[junit4:junit4]   2> 5286 T1326 oasc.SolrCore.initWriters created xml: solr.XMLResponseWriter
[junit4:junit4]   2> 5288 T1326 oasup.UpdateRequestProcessorChain.init inserting DistributedUpdateProcessorFactory into updateRequestProcessorChain "dedupe"
[junit4:junit4]   2> 5288 T1326 oasup.UpdateRequestProcessorChain.init inserting DistributedUpdateProcessorFactory into updateRequestProcessorChain "dedupe-allfields"
[junit4:junit4]   2> 5289 T1326 oasup.UpdateRequestProcessorChain.init inserting DistributedUpdateProcessorFactory into updateRequestProcessorChain "stored_sig"
[junit4:junit4]   2> 5289 T1326 oasup.UpdateRequestProcessorChain.init inserting DistributedUpdateProcessorFactory into updateRequestProcessorChain "uniq-fields"
[junit4:junit4]   2> 5290 T1326 oasup.UpdateRequestProcessorChain.init inserting DistributedUpdateProcessorFactory into updateRequestProcessorChain "distrib-dup-test-chain-implicit"
[junit4:junit4]   2> 5290 T1326 oasc.RequestHandlers.initHandlersFromConfig adding lazy requestHandler: solr.ReplicationHandler
[junit4:junit4]   2> 5291 T1326 oasc.RequestHandlers.initHandlersFromConfig created /replication: solr.ReplicationHandler
[junit4:junit4]   2> 5291 T1326 oasc.RequestHandlers.initHandlersFromConfig created standard: solr.StandardRequestHandler
[junit4:junit4]   2> 5292 T1326 oasc.RequestHandlers.initHandlersFromConfig created /get: solr.RealTimeGetHandler
[junit4:junit4]   2> 5292 T1326 oasc.RequestHandlers.initHandlersFromConfig created dismax: solr.SearchHandler
[junit4:junit4]   2> 5293 T1326 oasc.RequestHandlers.initHandlersFromConfig created mock: org.apache.solr.core.MockQuerySenderListenerReqHandler
[junit4:junit4]   2> 5293 T1326 oasc.RequestHandlers.initHandlersFromConfig created /admin/: org.apache.solr.handler.admin.AdminHandlers
[junit4:junit4]   2> 5294 T1326 oasc.RequestHandlers.initHandlersFromConfig created defaults: solr.StandardRequestHandler
[junit4:junit4]   2> 5294 T1326 oasc.RequestHandlers.initHandlersFromConfig adding lazy requestHandler: solr.StandardRequestHandler
[junit4:junit4]   2> 5295 T1326 oasc.RequestHandlers.initHandlersFromConfig created lazy: solr.StandardRequestHandler
[junit4:junit4]   2> 5295 T1326 oasc.RequestHandlers.initHandlersFromConfig created /update: solr.UpdateRequestHandler
[junit4:junit4]   2> 5296 T1326 oasc.RequestHandlers.initHandlersFromConfig created /terms: org.apache.solr.handler.component.SearchHandler
[junit4:junit4]   2> 5296 T1326 oasc.RequestHandlers.initHandlersFromConfig created spellCheckCompRH: org.apache.solr.handler.component.SearchHandler
[junit4:junit4]   2> 5297 T1326 oasc.RequestHandlers.initHandlersFromConfig created spellCheckCompRH_Direct: org.apache.solr.handler.component.SearchHandler
[junit4:junit4]   2> 5297 T1326 oasc.RequestHandlers.initHandlersFromConfig created spellCheckWithWordbreak: org.apache.solr.handler.component.SearchHandler
[junit4:junit4]   2> 5298 T1326 oasc.RequestHandlers.initHandlersFromConfig created spellCheckWithWordbreak_Direct: org.apache.solr.handler.component.SearchHandler
[junit4:junit4]   2> 5298 T1326 oasc.RequestHandlers.initHandlersFromConfig created spellCheckCompRH1: org.apache.solr.handler.component.SearchHandler
[junit4:junit4]   2> 5299 T1326 oasc.RequestHandlers.initHandlersFromConfig created tvrh: org.apache.solr.handler.component.SearchHandler
[junit4:junit4]   2> 5299 T1326 oasc.RequestHandlers.initHandlersFromConfig created /mlt: solr.MoreLikeThisHandler
[junit4:junit4]   2> 5300 T1326 oasc.RequestHandlers.initHandlersFromConfig created /debug/dump: solr.DumpRequestHandler
[junit4:junit4]   2> 5309 T1326 oashl.XMLLoader.init xsltCacheLifetimeSeconds=60
[junit4:junit4]   2> 5312 T1326 oasc.SolrCore.initDeprecatedSupport WARNING solrconfig.xml uses deprecated <admin/gettableFiles>, Please update your config to use the ShowFileRequestHandler.
[junit4:junit4]   2> 5314 T1326 oasc.SolrCore.initDeprecatedSupport WARNING adding ShowFileRequestHandler with hidden files: [SCHEMA.XML, OLD_SYNONYMS.TXT, STOPWORDS.TXT, PROTWORDS.TXT, OPEN-EXCHANGE-RATES.JSON, SYNONYMS.TXT, CURRENCY.XML, MAPPING-ISOLATIN1ACCENT.TXT]
[junit4:junit4]   2> 5317 T1326 oass.SolrIndexSearcher.<init> Opening Searcher@7d951a1d main
[junit4:junit4]   2> 5318 T1326 oasu.CommitTracker.<init> Hard AutoCommit: disabled
[junit4:junit4]   2> 5318 T1326 oasu.CommitTracker.<init> Soft AutoCommit: disabled
[junit4:junit4]   2> 5319 T1326 oashc.SpellCheckComponent.inform Initializing spell checkers
[junit4:junit4]   2> 5325 T1326 oass.DirectSolrSpellChecker.init init: {name=direct,classname=DirectSolrSpellChecker,field=lowerfilt,minQueryLength=3}
[junit4:junit4]   2> 5376 T1373 oasc.SolrCore.registerSearcher [collection1] Registered new searcher Searcher@7d951a1d main{StandardDirectoryReader(segments_1:1)}
[junit4:junit4]   2> 5670 T1347 oascc.ZkStateReader.updateClusterState Updating cloud state from ZooKeeper... 
[junit4:junit4]   2> 5683 T1360 oascc.ZkStateReader$2.process A cluster state change has occurred - updating...
[junit4:junit4]   2> 5683 T1372 oascc.ZkStateReader$2.process A cluster state change has occurred - updating...
[junit4:junit4]   2> 5683 T1346 oascc.ZkStateReader$2.process A cluster state change has occurred - updating...
[junit4:junit4]   2> 5882 T1326 oasc.CoreContainer.register registering core: collection1
[junit4:junit4]   2> 5882 T1326 oasc.ZkController.register Register shard - core:collection1 address:http://127.0.0.1:28212/solr shardId:shard2
[junit4:junit4]   2> 5883 T1326 oascc.SolrZkClient.makePath makePath: /collections/collection1/leader_elect/shard2/election
[junit4:junit4]   2> 5897 T1331 oazs.PrepRequestProcessor.pRequest Got user-level KeeperException when processing sessionid:0x13a3193ec930004 type:delete cxid:0x42 zxid:0xfffffffffffffffe txntype:unknown reqpath:n/a Error Path:/solr/collections/collection1/leaders/shard2 Error:KeeperErrorCode = NoNode for /solr/collections/collection1/leaders/shard2
[junit4:junit4]   2> 5898 T1326 oasc.ShardLeaderElectionContext.runLeaderProcess Running the leader process.
[junit4:junit4]   2> 5899 T1331 oazs.PrepRequestProcessor.pRequest Got user-level KeeperException when processing sessionid:0x13a3193ec930004 type:create cxid:0x43 zxid:0xfffffffffffffffe txntype:unknown reqpath:n/a Error Path:/solr/overseer Error:KeeperErrorCode = NodeExists for /solr/overseer
[junit4:junit4]   2> 5900 T1326 oasc.ShardLeaderElectionContext.waitForReplicasToComeUp Enough replicas found to continue.
[junit4:junit4]   2> 5901 T1326 oasc.ShardLeaderElectionContext.runLeaderProcess I may be the new leader - try and sync
[junit4:junit4]   2> 5901 T1326 oasc.SyncStrategy.sync Sync replicas to http://127.0.0.1:28212/solr/collection1/
[junit4:junit4]   2> 5902 T1326 oasc.SyncStrategy.syncReplicas Sync Success - now sync replicas to me
[junit4:junit4]   2> 5903 T1326 oasc.SyncStrategy.syncToMe http://127.0.0.1:28212/solr/collection1/ has no replicas
[junit4:junit4]   2> 5904 T1326 oasc.ShardLeaderElectionContext.runLeaderProcess I am the new leader: http://127.0.0.1:28212/solr/collection1/
[junit4:junit4]   2> 5904 T1326 oascc.SolrZkClient.makePath makePath: /collections/collection1/leaders/shard2
[junit4:junit4]   2> 5908 T1331 oazs.PrepRequestProcessor.pRequest Got user-level KeeperException when processing sessionid:0x13a3193ec930004 type:create cxid:0x4c zxid:0xfffffffffffffffe txntype:unknown reqpath:n/a Error Path:/solr/overseer Error:KeeperErrorCode = NodeExists for /solr/overseer
[junit4:junit4]   2> 6187 T1347 oascc.ZkStateReader.updateClusterState Updating cloud state from ZooKeeper... 
[junit4:junit4]   2> 6203 T1360 oascc.ZkStateReader$2.process A cluster state change has occurred - updating...
[junit4:junit4]   2> 6203 T1372 oascc.ZkStateReader$2.process A cluster state change has occurred - updating...
[junit4:junit4]   2> 6203 T1346 oascc.ZkStateReader$2.process A cluster state change has occurred - updating...
[junit4:junit4]   2> 6216 T1326 oasc.ZkController.register We are http://127.0.0.1:28212/solr/collection1/ and leader is http://127.0.0.1:28212/solr/collection1/
[junit4:junit4]   2> 6216 T1326 oasc.ZkController.register No LogReplay needed for core=collection1 baseURL=http://127.0.0.1:28212/solr
[junit4:junit4]   2> 6217 T1326 oasc.ZkController.checkRecovery I am the leader, no recovery necessary
[junit4:junit4]   2> 6219 T1326 oascc.ZkStateReader.updateClusterState Updating cloud state from ZooKeeper... 
[junit4:junit4]   2> 6220 T1326 oass.SolrDispatchFilter.init user.dir=/usr/home/hudson/hudson-slave/workspace/Lucene-Solr-Tests-4.x-java7/solr/build/solr-core/test/J1
[junit4:junit4]   2> 6220 T1326 oass.SolrDispatchFilter.init SolrDispatchFilter.init() done
[junit4:junit4]   2> 6221 T1326 oascsi.HttpClientUtil.createClient Creating new http client, config:maxConnections=128&maxConnectionsPerHost=32&followRedirects=false
[junit4:junit4]   2> 6354 T1326 oejs.Server.doStart jetty-8.1.2.v20120308
[junit4:junit4]   2> 6357 T1326 oejs.AbstractConnector.doStart Started SocketConnector@0.0.0.0:28582
[junit4:junit4]   2> 6358 T1326 oasc.SolrResourceLoader.locateSolrHome JNDI not configured for solr (NoInitialContextEx)
[junit4:junit4]   2> 6358 T1326 oasc.SolrResourceLoader.locateSolrHome using system property solr.solr.home: /usr/home/hudson/hudson-slave/workspace/Lucene-Solr-Tests-4.x-java7/solr/build/solr-core/test/J1/./solrtest-jetty3-1349451515105
[junit4:junit4]   2> 6358 T1326 oasc.SolrResourceLoader.<init> new SolrResourceLoader for deduced Solr Home: '/usr/home/hudson/hudson-slave/workspace/Lucene-Solr-Tests-4.x-java7/solr/build/solr-core/test/J1/./solrtest-jetty3-1349451515105/'
[junit4:junit4]   2> 6387 T1326 oass.SolrDispatchFilter.init SolrDispatchFilter.init()
[junit4:junit4]   2> 6388 T1326 oasc.SolrResourceLoader.locateSolrHome JNDI not configured for solr (NoInitialContextEx)
[junit4:junit4]   2> 6388 T1326 oasc.SolrResourceLoader.locateSolrHome using system property solr.solr.home: /usr/home/hudson/hudson-slave/workspace/Lucene-Solr-Tests-4.x-java7/solr/build/solr-core/test/J1/./solrtest-jetty3-1349451515105
[junit4:junit4]   2> 6388 T1326 oasc.CoreContainer$Initializer.initialize looking for solr.xml: /usr/home/hudson/hudson-slave/workspace/Lucene-Solr-Tests-4.x-java7/solr/build/solr-core/test/J1/./solrtest-jetty3-1349451515105/solr.xml
[junit4:junit4]   2> 6389 T1326 oasc.CoreContainer.<init> New CoreContainer 1915210008
[junit4:junit4]   2> 6389 T1326 oasc.CoreContainer.load Loading CoreContainer using Solr Home: '/usr/home/hudson/hudson-slave/workspace/Lucene-Solr-Tests-4.x-java7/solr/build/solr-core/test/J1/./solrtest-jetty3-1349451515105/'
[junit4:junit4]   2> 6389 T1326 oasc.SolrResourceLoader.<init> new SolrResourceLoader for directory: '/usr/home/hudson/hudson-slave/workspace/Lucene-Solr-Tests-4.x-java7/solr/build/solr-core/test/J1/./solrtest-jetty3-1349451515105/'
[junit4:junit4]   2> 6412 T1326 oasc.CoreContainer.load Registering Log Listener
[junit4:junit4]   2> 6423 T1326 oasc.CoreContainer.initZooKeeper Zookeeper client=127.0.0.1:26318/solr
[junit4:junit4]   2> 6424 T1326 oaz.ZooKeeper.<init> Initiating client connection, connectString=127.0.0.1:26318/solr sessionTimeout=5000 watcher=org.apache.solr.common.cloud.ConnectionManager@41ecc5ef
[junit4:junit4]   2> 6425 T1383 oaz.ClientCnxn$SendThread.startConnect Opening socket connection to server /127.0.0.1:26318
[junit4:junit4]   2> 6425 T1326 oascc.ConnectionManager.waitForConnected Waiting for client to connect to ZooKeeper
[junit4:junit4]   2> 6426 T1383 oaz.ClientCnxn$SendThread.primeConnection Socket connection established to localhost/127.0.0.1:26318, initiating session
[junit4:junit4]   2> 6426 T1328 oazs.NIOServerCnxn$Factory.run Accepted socket connection from /140.211.11.196:36704
[junit4:junit4]   2> 6427 T1328 oazs.NIOServerCnxn.readConnectRequest Client attempting to establish new session at /140.211.11.196:36704
[junit4:junit4]   2> 6429 T1330 oazs.NIOServerCnxn.finishSessionInit Established session 0x13a3193ec930005 with negotiated timeout 5000 for client /140.211.11.196:36704
[junit4:junit4]   2> 6429 T1383 oaz.ClientCnxn$SendThread.readConnectResult Session establishment complete on server localhost/127.0.0.1:26318, sessionid = 0x13a3193ec930005, negotiated timeout = 5000
[junit4:junit4]   2> 6430 T1384 oascc.ConnectionManager.process Watcher org.apache.solr.common.cloud.ConnectionManager@41ecc5ef name:ZooKeeperConnection Watcher:127.0.0.1:26318/solr got event WatchedEvent state:SyncConnected type:None path:null path:null type:None
[junit4:junit4]   2> 6430 T1326 oascc.ConnectionManager.waitForConnected Client is connected to ZooKeeper
[junit4:junit4]   2> 6430 T1331 oazs.PrepRequestProcessor.pRequest Got user-level KeeperException when processing sessionid:0x13a3193ec930005 type:create cxid:0x1 zxid:0xfffffffffffffffe txntype:unknown reqpath:n/a Error Path:/solr/overseer Error:KeeperErrorCode = NodeExists for /solr/overseer
[junit4:junit4]   2> 6444 T1331 oazs.PrepRequestProcessor.pRequest Got user-level KeeperException when processing sessionid:0x13a3193ec930005 type:create cxid:0x2 zxid:0xfffffffffffffffe txntype:unknown reqpath:n/a Error Path:/solr/overseer Error:KeeperErrorCode = NodeExists for /solr/overseer
[junit4:junit4]   2> 6446 T1326 oasc.ZkController.createEphemeralLiveNode Register node as live in ZooKeeper:/live_nodes/127.0.0.1:28582_solr
[junit4:junit4]   2> 6446 T1331 oazs.PrepRequestProcessor.pRequest Got user-level KeeperException when processing sessionid:0x13a3193ec930005 type:delete cxid:0x4 zxid:0xfffffffffffffffe txntype:unknown reqpath:n/a Error Path:/solr/live_nodes/127.0.0.1:28582_solr Error:KeeperErrorCode = NoNode for /solr/live_nodes/127.0.0.1:28582_solr
[junit4:junit4]   2> 6448 T1326 oascc.SolrZkClient.makePath makePath: /live_nodes/127.0.0.1:28582_solr
[junit4:junit4]   2> 6456 T1360 oascc.ZkStateReader$3.process Updating live nodes
[junit4:junit4]   2> 6456 T1372 oascc.ZkStateReader$3.process Updating live nodes
[junit4:junit4]   2> 6456 T1346 oascc.ZkStateReader$3.process Updating live nodes
[junit4:junit4]   2> 6457 T1326 oashc.HttpShardHandlerFactory.getParameter Setting socketTimeout to: 0
[junit4:junit4]   2> 6457 T1326 oashc.HttpShardHandlerFactory.getParameter Setting urlScheme to: http://
[junit4:junit4]   2> 6458 T1326 oashc.HttpShardHandlerFactory.getParameter Setting connTimeout to: 0
[junit4:junit4]   2> 6458 T1326 oashc.HttpShardHandlerFactory.getParameter Setting maxConnectionsPerHost to: 20
[junit4:junit4]   2> 6459 T1326 oashc.HttpShardHandlerFactory.getParameter Setting corePoolSize to: 0
[junit4:junit4]   2> 6459 T1326 oashc.HttpShardHandlerFactory.getParameter Setting maximumPoolSize to: 2147483647
[junit4:junit4]   2> 6460 T1326 oashc.HttpShardHandlerFactory.getParameter Setting maxThreadIdleTime to: 5
[junit4:junit4]   2> 6460 T1326 oashc.HttpShardHandlerFactory.getParameter Setting sizeOfQueue to: -1
[junit4:junit4]   2> 6461 T1326 oashc.HttpShardHandlerFactory.getParameter Setting fairnessPolicy to: false
[junit4:junit4]   2> 6461 T1326 oascsi.HttpClientUtil.createClient Creating new http client, config:maxConnectionsPerHost=20&maxConnections=10000&socketTimeout=0&connTimeout=0&retry=false
[junit4:junit4]   2> 6478 T1326 oascc.ZkStateReader.createClusterStateWatchersAndUpdate Updating cluster state from ZooKeeper... 
[junit4:junit4]   2> 6484 T1326 oasc.CoreContainer.create Creating SolrCore 'collection1' using instanceDir: /usr/home/hudson/hudson-slave/workspace/Lucene-Solr-Tests-4.x-java7/solr/build/solr-core/test/J1/./solrtest-jetty3-1349451515105/collection1
[junit4:junit4]   2> 6485 T1326 oasc.ZkController.createCollectionZkNode Check for collection zkNode:collection1
[junit4:junit4]   2> 6485 T1326 oasc.ZkController.createCollectionZkNode Collection zkNode exists
[junit4:junit4]   2> 6486 T1326 oasc.ZkController.readConfigName Load collection config from:/collections/collection1
[junit4:junit4]   2> 6487 T1326 oasc.SolrResourceLoader.<init> new SolrResourceLoader for directory: '/usr/home/hudson/hudson-slave/workspace/Lucene-Solr-Tests-4.x-java7/solr/build/solr-core/test/J1/./solrtest-jetty3-1349451515105/collection1/'
[junit4:junit4]   2> 6488 T1326 oasc.SolrResourceLoader.replaceClassLoader Adding 'file:/usr/home/hudson/hudson-slave/workspace/Lucene-Solr-Tests-4.x-java7/solr/build/solr-core/test/J1/solrtest-jetty3-1349451515105/collection1/lib/README' to classloader
[junit4:junit4]   2> 6489 T1326 oasc.SolrResourceLoader.replaceClassLoader Adding 'file:/usr/home/hudson/hudson-slave/workspace/Lucene-Solr-Tests-4.x-java7/solr/build/solr-core/test/J1/solrtest-jetty3-1349451515105/collection1/lib/classes/' to classloader
[junit4:junit4]   2> 6541 T1326 oasc.SolrConfig.<init> Using Lucene MatchVersion: LUCENE_41
[junit4:junit4]   2> 6619 T1326 oasc.SolrConfig.<init> Loaded SolrConfig: solrconfig.xml
[junit4:junit4]   2> 6721 T1347 oascc.ZkStateReader.updateClusterState Updating cloud state from ZooKeeper... 
[junit4:junit4]   2> 6721 T1326 oass.IndexSchema.readSchema Reading Solr Schema
[junit4:junit4]   2> 6726 T1326 oass.IndexSchema.readSchema Schema name=test
[junit4:junit4]   2> 6778 T1360 oascc.ZkStateReader$2.process A cluster state change has occurred - updating...
[junit4:junit4]   2> 6778 T1372 oascc.ZkStateReader$2.process A cluster state change has occurred - updating...
[junit4:junit4]   2> 6778 T1346 oascc.ZkStateReader$2.process A cluster state change has occurred - updating...
[junit4:junit4]   2> 6778 T1384 oascc.ZkStateReader$2.process A cluster state change has occurred - updating...
[junit4:junit4]   2> 7158 T1326 oass.OpenExchangeRatesOrgProvider.init Initialized with rates=open-exchange-rates.json, refreshInterval=1440.
[junit4:junit4]   2> 7167 T1326 oass.IndexSchema.readSchema default search field in schema is text
[junit4:junit4]   2> 7170 T1326 oass.IndexSchema.readSchema unique key field: id
[junit4:junit4]   2> 7179 T1326 oass.FileExchangeRateProvider.reload Reloading exchange rates from file currency.xml
[junit4:junit4]   2> 7183 T1326 oass.FileExchangeRateProvider.reload Reloading exchange rates from file currency.xml
[junit4:junit4]   2> 7187 T1326 oass.OpenExchangeRatesOrgProvider.reload Reloading exchange rates from open-exchange-rates.json
[junit4:junit4]   2> 7188 T1326 oass.OpenExchangeRatesOrgProvider.reload Reloading exchange rates from open-exchange-rates.json
[junit4:junit4]   2> 7189 T1326 oasc.SolrCore.<init> [collection1] Opening new SolrCore at /usr/home/hudson/hudson-slave/workspace/Lucene-Solr-Tests-4.x-java7/solr/build/solr-core/test/J1/./solrtest-jetty3-1349451515105/collection1/, dataDir=./org.apache.solr.cloud.BasicDistributedZkTest-1349451508878/jetty3/
[junit4:junit4]   2> 7189 T1326 oasc.JmxMonitoredMap.<init> JMX monitoring is enabled. Adding Solr mbeans to JMX Server: com.sun.jmx.mbeanserver.JmxMBeanServer@27abbcda
[junit4:junit4]   2> 7190 T1326 oasc.SolrCore.getNewIndexDir New index directory detected: old=null new=./org.apache.solr.cloud.BasicDistributedZkTest-1349451508878/jetty3/index/
[junit4:junit4]   2> 7191 T1326 oasc.SolrCore.initIndex WARNING [collection1] Solr index directory './org.apache.solr.cloud.BasicDistributedZkTest-1349451508878/jetty3/index' doesn't exist. Creating new index...
[junit4:junit4]   2> 7191 T1326 oasc.CachingDirectoryFactory.get return new directory for /usr/home/hudson/hudson-slave/workspace/Lucene-Solr-Tests-4.x-java7/solr/build/solr-core/test/J1/./org.apache.solr.cloud.BasicDistributedZkTest-1349451508878/jetty3/index forceNew:false
[junit4:junit4]   2> 7202 T1326 oasc.SolrDeletionPolicy.onCommit SolrDeletionPolicy.onCommit: commits:num=1
[junit4:junit4]   2> 		commit{dir=/usr/home/hudson/hudson-slave/workspace/Lucene-Solr-Tests-4.x-java7/solr/build/solr-core/test/J1/org.apache.solr.cloud.BasicDistributedZkTest-1349451508878/jetty3/index,segFN=segments_1,generation=1,filenames=[segments_1]
[junit4:junit4]   2> 7203 T1326 oasc.SolrDeletionPolicy.updateCommits newest commit = 1
[junit4:junit4]   2> 7204 T1326 oasc.SolrCore.initWriters created xml: solr.XMLResponseWriter
[junit4:junit4]   2> 7206 T1326 oasup.UpdateRequestProcessorChain.init inserting DistributedUpdateProcessorFactory into updateRequestProcessorChain "dedupe"
[junit4:junit4]   2> 7206 T1326 oasup.UpdateRequestProcessorChain.init inserting DistributedUpdateProcessorFactory into updateRequestProcessorChain "dedupe-allfields"
[junit4:junit4]   2> 7207 T1326 oasup.UpdateRequestProcessorChain.init inserting DistributedUpdateProcessorFactory into updateRequestProcessorChain "stored_sig"
[junit4:junit4]   2> 7207 T1326 oasup.UpdateRequestProcessorChain.init inserting DistributedUpdateProcessorFactory into updateRequestProcessorChain "uniq-fields"
[junit4:junit4]   2> 7208 T1326 oasup.UpdateRequestProcessorChain.init inserting DistributedUpdateProcessorFactory into updateRequestProcessorChain "distrib-dup-test-chain-implicit"
[junit4:junit4]   2> 7208 T1326 oasc.RequestHandlers.initHandlersFromConfig adding lazy requestHandler: solr.ReplicationHandler
[junit4:junit4]   2> 7208 T1326 oasc.RequestHandlers.initHandlersFromConfig created /replication: solr.ReplicationHandler
[junit4:junit4]   2> 7209 T1326 oasc.RequestHandlers.initHandlersFromConfig created standard: solr.StandardRequestHandler
[junit4:junit4]   2> 7209 T1326 oasc.RequestHandlers.initHandlersFromConfig created /get: solr.RealTimeGetHandler
[junit4:junit4]   2> 7210 T1326 oasc.RequestHandlers.initHandlersFromConfig created dismax: solr.SearchHandler
[junit4:junit4]   2> 7211 T1326 oasc.RequestHandlers.initHandlersFromConfig created mock: org.apache.solr.core.MockQuerySenderListenerReqHandler
[junit4:junit4]   2> 7211 T1326 oasc.RequestHandlers.initHandlersFromConfig created /admin/: org.apache.solr.handler.admin.AdminHandlers
[junit4:junit4]   2> 7212 T1326 oasc.RequestHandlers.initHandlersFromConfig created defaults: solr.StandardRequestHandler
[junit4:junit4]   2> 7212 T1326 oasc.RequestHandlers.initHandlersFromConfig adding lazy requestHandler: solr.StandardRequestHandler
[junit4:junit4]   2> 7212 T1326 oasc.RequestHandlers.initHandlersFromConfig created lazy: solr.StandardRequestHandler
[junit4:junit4]   2> 7213 T1326 oasc.RequestHandlers.initHandlersFromConfig created /update: solr.UpdateRequestHandler
[junit4:junit4]   2> 7213 T1326 oasc.RequestHandlers.initHandlersFromConfig created /terms: org.apache.solr.handler.component.SearchHandler
[junit4:junit4]   2> 7214 T1326 oasc.RequestHandlers.initHandlersFromConfig created spellCheckCompRH: org.apache.solr.handler.component.SearchHandler
[junit4:junit4]   2> 7215 T1326 oasc.RequestHandlers.initHandlersFromConfig created spellCheckCompRH_Direct: org.apache.solr.handler.component.SearchHandler
[junit4:junit4]   2> 7215 T1326 oasc.RequestHandlers.initHandlersFromConfig created spellCheckWithWordbreak: org.apache.solr.handler.component.SearchHandler
[junit4:junit4]   2> 7216 T1326 oasc.RequestHandlers.initHandlersFromConfig created spellCheckWithWordbreak_Direct: org.apache.solr.handler.component.SearchHandler
[junit4:junit4]   2> 7216 T1326 oasc.RequestHandlers.initHandlersFromConfig created spellCheckCompRH1: org.apache.solr.handler.component.SearchHandler
[junit4:junit4]   2> 7217 T1326 oasc.RequestHandlers.initHandlersFromConfig created tvrh: org.apache.solr.handler.component.SearchHandler
[junit4:junit4]   2> 7217 T1326 oasc.RequestHandlers.initHandlersFromConfig created /mlt: solr.MoreLikeThisHandler
[junit4:junit4]   2> 7218 T1326 oasc.RequestHandlers.initHandlersFromConfig created /debug/dump: solr.DumpRequestHandler
[junit4:junit4]   2> 7227 T1326 oashl.XMLLoader.init xsltCacheLifetimeSeconds=60
[junit4:junit4]   2> 7230 T1326 oasc.SolrCore.initDeprecatedSupport WARNING solrconfig.xml uses deprecated <admin/gettableFiles>, Please update your config to use the ShowFileRequestHandler.
[junit4:junit4]   2> 7231 T1326 oasc.SolrCore.initDeprecatedSupport WARNING adding ShowFileRequestHandler with hidden files: [SCHEMA.XML, OLD_SYNONYMS.TXT, STOPWORDS.TXT, PROTWORDS.TXT, OPEN-EXCHANGE-RATES.JSON, SYNONYMS.TXT, CURRENCY.XML, MAPPING-ISOLATIN1ACCENT.TXT]
[junit4:junit4]   2> 7234 T1326 oass.SolrIndexSearcher.<init> Opening Searcher@63ed0160 main
[junit4:junit4]   2> 7235 T1326 oasu.CommitTracker.<init> Hard AutoCommit: disabled
[junit4:junit4]   2> 7236 T1326 oasu.CommitTracker.<init> Soft AutoCommit: disabled
[junit4:junit4]   2> 7236 T1326 oashc.SpellCheckComponent.inform Initializing spell checkers
[junit4:junit4]   2> 7242 T1326 oass.DirectSolrSpellChecker.init init: {name=direct,classname=DirectSolrSpellChecker,field=lowerfilt,minQueryLength=3}
[junit4:junit4]   2> 7298 T1385 oasc.SolrCore.registerSearcher [collection1] Registered new searcher Searcher@63ed0160 main{StandardDirectoryReader(segments_1:1)}
[junit4:junit4]   2> 7797 T1347 oascc.ZkStateReader.updateClusterState Updating cloud state from ZooKeeper... 
[junit4:junit4]   2> 7815 T1372 oascc.ZkStateReader$2.process A cluster state change has occurred - updating...
[junit4:junit4]   2> 7815 T1384 oascc.ZkStateReader$2.process A cluster state change has occurred - updating...
[junit4:junit4]   2> 7815 T1346 oascc.ZkStateReader$2.process A cluster state change has occurred - updating...
[junit4:junit4]   2> 7815 T1360 oascc.ZkStateReader$2.process A cluster state change has occurred - updating...
[junit4:junit4]   2> 8305 T1326 oasc.CoreContainer.register registering core: collection1
[junit4:junit4]   2> 8305 T1326 oasc.ZkController.register Register shard - core:collection1 address:http://127.0.0.1:28582/solr shardId:shard1
[junit4:junit4]   2> 8308 T1326 oasc.ZkController.register We are http://127.0.0.1:28582/solr/collection1/ and leader is http://127.0.0.1:36395/solr/collection1/
[junit4:junit4]   2> 8308 T1326 oasc.ZkController.register No LogReplay needed for core=collection1 baseURL=http://127.0.0.1:28582/solr
[junit4:junit4]   2> 8308 T1326 oasc.ZkController.checkRecovery Core needs to recover:collection1
[junit4:junit4]   2> 8308 T1326 oasu.DefaultSolrCoreState.doRecovery Running recovery - first canceling any ongoing recovery
[junit4:junit4]   2> ASYNC  NEW_CORE C63 name=collection1 org.apache.solr.core.SolrCore@a06c6e url=http://127.0.0.1:28582/solr/collection1 node=127.0.0.1:28582_solr
[junit4:junit4]   2> 8314 T1386 C63 P28582 oasc.RecoveryStrategy.run Starting recovery process.  core=collection1 recoveringAfterStartup=true
[junit4:junit4]   2> 8314 T1326 oascc.ZkStateReader.updateClusterState Updating cloud state from ZooKeeper... 
[junit4:junit4]   2> 8314 T1386 C63 P28582 oasc.RecoveryStrategy.doRecovery ###### startupVersions=[]
[junit4:junit4]   2> 8315 T1326 oass.SolrDispatchFilter.init user.dir=/usr/home/hudson/hudson-slave/workspace/Lucene-Solr-Tests-4.x-java7/solr/build/solr-core/test/J1
[junit4:junit4]   2> 8315 T1326 oass.SolrDispatchFilter.init SolrDispatchFilter.init() done
[junit4:junit4]   2> 8315 T1326 oascsi.HttpClientUtil.createClient Creating new http client, config:maxConnections=128&maxConnectionsPerHost=32&followRedirects=false
[junit4:junit4]   2> 8318 T1386 C63 P28582 oasc.RecoveryStrategy.doRecovery Attempting to PeerSync from http://127.0.0.1:36395/solr/collection1/ core=collection1 - recoveringAfterStartup=true
[junit4:junit4]   2> 8319 T1347 oascc.ZkStateReader.updateClusterState Updating cloud state from ZooKeeper... 
[junit4:junit4]   2> 8325 T1386 C63 P28582 oascsi.HttpClientUtil.createClient Creating new http client, config:maxConnectionsPerHost=20&maxConnections=10000&connTimeout=30000&socketTimeout=30000&retry=false
[junit4:junit4]   2> 8329 T1326 oaz.ZooKeeper.<init> Initiating client connection, connectString=127.0.0.1:26318/solr sessionTimeout=10000 watcher=org.apache.solr.common.cloud.ConnectionManager@3b75bd17
[junit4:junit4]   2> 8330 T1387 oaz.ClientCnxn$SendThread.startConnect Opening socket connection to server /127.0.0.1:26318
[junit4:junit4]   2> 8330 T1326 oascc.ConnectionManager.waitForConnected Waiting for client to connect to ZooKeeper
[junit4:junit4]   2> 8331 T1387 oaz.ClientCnxn$SendThread.primeConnection Socket connection established to localhost/127.0.0.1:26318, initiating session
[junit4:junit4]   2> 8331 T1328 oazs.NIOServerCnxn$Factory.run Accepted socket connection from /140.211.11.196:31211
[junit4:junit4]   2> 8331 T1384 oascc.ZkStateReader$2.process A cluster state change has occurred - updating...
[junit4:junit4]   2> 8331 T1360 oascc.ZkStateReader$2.process A cluster state change has occurred - updating...
[junit4:junit4]   2> 8331 T1328 oazs.NIOServerCnxn.readConnectRequest Client attempting to establish new session at /140.211.11.196:31211
[junit4:junit4]   2> 8331 T1372 oascc.ZkStateReader$2.process A cluster state change has occurred - updating...
[junit4:junit4]   2> 8331 T1346 oascc.ZkStateReader$2.process A cluster state change has occurred - updating...
[junit4:junit4]   2> 8332 T1330 oazs.NIOServerCnxn.finishSessionInit Established session 0x13a3193ec930006 with negotiated timeout 10000 for client /140.211.11.196:31211
[junit4:junit4]   2> 8332 T1387 oaz.ClientCnxn$SendThread.readConnectResult Session establishment complete on server localhost/127.0.0.1:26318, sessionid = 0x13a3193ec930006, negotiated timeout = 10000
[junit4:junit4]   2> 8332 T1388 oascc.ConnectionManager.process Watcher org.apache.solr.common.cloud.ConnectionManager@3b75bd17 name:ZooKeeperConnection Watcher:127.0.0.1:26318/solr got event WatchedEvent state:SyncConnected type:None path:null path:null type:None
[junit4:junit4]   2> 8333 T1326 oascc.ConnectionManager.waitForConnected Client is connected to ZooKeeper
[junit4:junit4]   2> 8333 T1326 oascc.ZkStateReader.createClusterStateWatchersAndUpdate Updating cluster state from ZooKeeper... 
[junit4:junit4]   2> 8336 T1326 oasc.ChaosMonkey.monkeyLog monkey: init - expire sessions:true cause connection loss:true
[junit4:junit4]   2>  C63_STATE=coll:collection1 core:collection1 props:{shard=shard1, roles=null, state=recovering, core=collection1, collection=collection1, node_name=127.0.0.1:28582_solr, base_url=http://127.0.0.1:28582/solr}
[junit4:junit4]   2> 8336 T1386 C63 P28582 oasu.PeerSync.sync PeerSync: core=collection1 url=http://127.0.0.1:28582/solr START replicas=[http://127.0.0.1:36395/solr/collection1/] nUpdates=100
[junit4:junit4]   2> 8336 T1326 oascsi.HttpClientUtil.createClient Creating new http client, config:
[junit4:junit4]   2> 8337 T1386 C63 P28582 oasu.PeerSync.sync WARNING no frame of reference to tell of we've missed updates
[junit4:junit4]   2> 8338 T1386 C63 P28582 oasc.RecoveryStrategy.doRecovery PeerSync Recovery was not successful - trying replication. core=collection1
[junit4:junit4]   2> 8338 T1386 C63 P28582 oasc.RecoveryStrategy.doRecovery Starting Replication Recovery. core=collection1
[junit4:junit4]   2> 8338 T1386 C63 P28582 oascsi.HttpClientUtil.createClient Creating new http client, config:maxConnections=128&maxConnectionsPerHost=32&followRedirects=false
[junit4:junit4]   2> ASYNC  NEW_CORE C64 name=collection1 org.apache.solr.core.SolrCore@3c68076d url=http://127.0.0.1:36395/solr/collection1 node=127.0.0.1:36395_solr
[junit4:junit4]   2> 8345 T1352 C64 P36395 REQ /get {distrib=false&qt=/get&wt=javabin&version=2&getVersions=100} status=0 QTime=1 
[junit4:junit4]   2> 8346 T1326 oascc.ZkStateReader.updateClusterState Updating cloud state from ZooKeeper... 
[junit4:junit4]   2> 8347 T1326 oasc.AbstractDistribZkTestBase.waitForRecoveriesToFinish Wait for recoveries to finish - collection: collection1 failOnTimeout:true timeout (sec):1800
[junit4:junit4]   2> 8348 T1326 oascc.ZkStateReader.updateClusterState Updating cloud state from ZooKeeper... 
[junit4:junit4]   2> 9349 T1326 oascc.ZkStateReader.updateClusterState Updating cloud state from ZooKeeper... 
[junit4:junit4]   2> 10351 T1326 oascc.ZkStateReader.updateClusterState Updating cloud state from ZooKeeper... 
[junit4:junit4]   2> 10353 T1386 C63 P28582 oasc.RecoveryStrategy.doRecovery Begin buffering updates. core=collection1
[junit4:junit4]   2> 10353 T1386 C63 P28582 oasu.UpdateLog.bufferUpdates Starting to buffer updates. FSUpdateLog{state=ACTIVE, tlog=null}
[junit4:junit4]   2> 10353 T1386 C63 P28582 oasc.RecoveryStrategy.replicate Attempting to replicate from http://127.0.0.1:36395/solr/collection1/. core=collection1
[junit4:junit4]   2> 10353 T1386 C63 P28582 oascsi.HttpClientUtil.createClient Creating new http client, config:maxConnections=128&maxConnectionsPerHost=32&followRedirects=false
[junit4:junit4]   2> 10381 T1354 C64 P36395 oascsi.HttpClientUtil.createClient Creating new http client, config:maxConnections=500&maxConnectionsPerHost=16
[junit4:junit4]   2> 10395 T1354 C64 P36395 oasu.DirectUpdateHandler2.commit start commit{flags=0,_version_=0,optimize=false,openSearcher=true,waitSearcher=true,expungeDeletes=false,softCommit=false}
[junit4:junit4]   2> 10400 T1354 C64 P36395 oasc.SolrDeletionPolicy.onInit SolrDeletionPolicy.onInit: commits:num=1
[junit4:junit4]   2> 		commit{dir=/usr/home/hudson/hudson-slave/workspace/Lucene-Solr-Tests-4.x-java7/solr/build/solr-core/test/J1/org.apache.solr.cloud.BasicDistributedZkTest-1349451508878/jetty1/index,segFN=segments_1,generation=1,filenames=[segments_1]
[junit4:junit4]   2> 10400 T1354 C64 P36395 oasc.SolrDeletionPolicy.updateCommits newest commit = 1
[junit4:junit4]   2> 10402 T1354 C64 P36395 oass.SolrIndexSearcher.<init> Opening Searcher@4b887f99 main
[junit4:junit4]   2> 10402 T1354 C64 P36395 oasu.DirectUpdateHandler2.commit end_commit_flush
[junit4:junit4]   2> 10404 T1361 oasc.SolrCore.registerSearcher [collection1] Registered new searcher Searcher@4b887f99 main{StandardDirectoryReader(segments_1:1)}
[junit4:junit4]   2> 10404 T1354 C64 P36395 /update {waitSearcher=true&commit=true&commit_end_point=true&wt=javabin&softCommit=false&version=2} {commit=} 0 36
[junit4:junit4]   2> 10405 T1386 C63 P28582 oash.ReplicationHandler.inform Commits will be reserved for  10000
[junit4:junit4]   2> 10406 T1386 C63 P28582 oash.SnapPuller.<init>  No value set for 'pollInterval'. Timer Task not started.
[junit4:junit4]   2> 10408 T1355 C64 P36395 oash.ReplicationHandler.inform Commits will be reserved for  10000
[junit4:junit4]   2> 10409 T1355 C64 P36395 REQ /replication {command=indexversion&wt=javabin&qt=/replication&version=2} status=0 QTime=2 
[junit4:junit4]   2> 10413 T1386 C63 P28582 oasc.SolrDeletionPolicy.onInit SolrDeletionPolicy.onInit: commits:num=1
[junit4:junit4]   2> 		commit{dir=/usr/home/hudson/hudson-slave/workspace/Lucene-Solr-Tests-4.x-java7/solr/build/solr-core/test/J1/org.apache.solr.cloud.BasicDistributedZkTest-1349451508878/jetty3/index,segFN=segments_1,generation=1,filenames=[segments_1]
[junit4:junit4]   2> 10414 T1386 C63 P28582 oasc.SolrDeletionPolicy.updateCommits newest commit = 1
[junit4:junit4]   2> 10414 T1386 C63 P28582 oasu.DirectUpdateHandler2.commit start commit{flags=0,_version_=0,optimize=false,openSearcher=true,waitSearcher=true,expungeDeletes=false,softCommit=false}
[junit4:junit4]   2> 10442 T1386 C63 P28582 oasc.SolrDeletionPolicy.onCommit SolrDeletionPolicy.onCommit: commits:num=2
[junit4:junit4]   2> 		commit{dir=/usr/home/hudson/hudson-slave/workspace/Lucene-Solr-Tests-4.x-java7/solr/build/solr-core/test/J1/org.apache.solr.cloud.BasicDistributedZkTest-1349451508878/jetty3/index,segFN=segments_1,generation=1,filenames=[segments_1]
[junit4:junit4]   2> 		commit{dir=/usr/home/hudson/hudson-slave/workspace/Lucene-Solr-Tests-4.x-java7/solr/build/solr-core/test/J1/org.apache.solr.cloud.BasicDistributedZkTest-1349451508878/jetty3/index,segFN=segments_2,generation=2,filenames=[segments_2]
[junit4:junit4]   2> 10443 T1386 C63 P28582 oasc.SolrDeletionPolicy.updateCommits newest commit = 2
[junit4:junit4]   2> 10446 T1386 C63 P28582 oass.SolrIndexSearcher.<init> Opening Searcher@41ec3132 main
[junit4:junit4]   2> 10446 T1386 C63 P28582 oasu.DirectUpdateHandler2.commit end_commit_flush
[junit4:junit4]   2> 10448 T1385 oasc.SolrCore.registerSearcher [collection1] Registered new searcher Searcher@41ec3132 main{StandardDirectoryReader(segments_2:2)}
[junit4:junit4]   2> 10448 T1386 C63 P28582 oasc.RecoveryStrategy.replay No replay needed. core=collection1
[junit4:junit4]   2> 10448 T1386 C63 P28582 oasc.RecoveryStrategy.doRecovery Replication Recovery was successful - registering as Active. core=collection1
[junit4:junit4]   2> 10450 T1386 C63 P28582 oasc.RecoveryStrategy.doRecovery Finished recovery process. core=collection1
[junit4:junit4]   2> 10840 T1347 oascc.ZkStateReader.updateClusterState Updating cloud state from ZooKeeper... 
[junit4:junit4]   2> 10853 T1346 oascc.ZkStateReader$2.process A cluster state change has occurred - updating...
[junit4:junit4]   2> 10853 T1372 oascc.ZkStateReader$2.process A cluster state change has occurred - updating...
[junit4:junit4]   2> 10854 T1388 oascc.ZkStateReader$2.process A cluster state change has occurred - updating...
[junit4:junit4]   2> 10853 T1384 oascc.ZkStateReader$2.process A cluster state change has occurred - updating...
[junit4:junit4]   2> 10853 T1360 oascc.ZkStateReader$2.process A cluster state change has occurred - updating...
[junit4:junit4]   2> 11353 T1326 oascc.ZkStateReader.updateClusterState Updating cloud state from ZooKeeper... 
[junit4:junit4]   2> ASYNC  NEW_CORE C65 name=collection1 org.apache.solr.core.SolrCore@15e16c95 url=http://127.0.0.1:10318/solr/collection1 node=127.0.0.1:10318_solr
[junit4:junit4]   2> 11373 T1338 C65 P10318 oasc.SolrDeletionPolicy.onInit SolrDeletionPolicy.onInit: commits:num=1
[junit4:junit4]   2> 		commit{dir=/usr/home/hudson/hudson-slave/workspace/Lucene-Solr-Tests-4.x-java7/solr/build/solr-core/test/J1/org.apache.solr.cloud.BasicDistributedZkTest-1349451508878/control/data/index,segFN=segments_1,generation=1,filenames=[segments_1]
[junit4:junit4]   2> 11374 T1338 C65 P10318 oasc.SolrDeletionPolicy.updateCommits newest commit = 1
[junit4:junit4]   2> 11376 T1338 C65 P10318 oass.SolrIndexSearcher.<init> Opening Searcher@46e6e0d5 realtime
[junit4:junit4]   2> 11376 T1338 C65 P10318 /update {wt=javabin&version=2} {deleteByQuery=*:* (-1415002477290323968)} 0 12
[junit4:junit4]   2> 11377 T1326 oaz.ZooKeeper.<init> Initiating client connection, connectString=127.0.0.1:26318/solr sessionTimeout=10000 watcher=org.apache.solr.common.cloud.ConnectionManager@5fb2e450
[junit4:junit4]   2> 11378 T1390 oaz.ClientCnxn$SendThread.startConnect Opening socket connection to server /127.0.0.1:26318
[junit4:junit4]   2> 11378 T1326 oascc.ConnectionManager.waitForConnected Waiting for client to connect to ZooKeeper
[junit4:junit4]   2> 11379 T1390 oaz.ClientCnxn$SendThread.primeConnection Socket connection established to localhost/127.0.0.1:26318, initiating session
[junit4:junit4]   2> 11379 T1328 oazs.NIOServerCnxn$Factory.run Accepted socket connection from /140.211.11.196:53611
[junit4:junit4]   2> 11380 T1328 oazs.NIOServerCnxn.readConnectRequest Client attempting to establish new session at /140.211.11.196:53611
[junit4:junit4]   2> 11381 T1330 oazs.NIOServerCnxn.finishSessionInit Established session 0x13a3193ec930007 with negotiated timeout 10000 for client /140.211.11.196:53611
[junit4:junit4]   2> 11381 T1390 oaz.ClientCnxn$SendThread.readConnectResult Session establishment complete on server localhost/127.0.0.1:26318, sessionid = 0x13a3193ec930007, negotiated timeout = 10000
[junit4:junit4]   2> 11382 T1391 oascc.ConnectionManager.process Watcher org.apache.solr.common.cloud.ConnectionManager@5fb2e450 name:ZooKeeperConnection Watcher:127.0.0.1:26318/solr got event WatchedEvent state:SyncConnected type:None path:null path:null type:None
[junit4:junit4]   2> 11382 T1326 oascc.ConnectionManager.waitForConnected Client is connected to ZooKeeper
[junit4:junit4]   2> 11383 T1326 oascc.ZkStateReader.createClusterStateWatchersAndUpdate Updating cluster state from ZooKeeper... 
[junit4:junit4]   2> 11396 T1356 C64 P36395 oass.SolrIndexSearcher.<init> Opening Searcher@149349cd realtime
[junit4:junit4]   2>  C63_STATE=coll:collection1 core:collection1 props:{shard=shard1, roles=null, state=active, core=collection1, collection=collection1, node_name=127.0.0.1:28582_solr, base_url=http://127.0.0.1:28582/solr}
[junit4:junit4]   2> 11427 T1376 C63 P28582 oass.SolrIndexSearcher.<init> Opening Searcher@637424af realtime
[junit4:junit4]   2> 11428 T1376 C63 P28582 REQ /update {update.distrib=FROMLEADER&_version_=-1415002477316538368&update.from=http://127.0.0.1:36395/solr/collection1/&wt=javabin&version=2} status=0 QTime=3 
[junit4:junit4]   2> ASYNC  NEW_CORE C66 name=collection1 org.apache.solr.core.SolrCore@8ac4069 url=http://127.0.0.1:28212/solr/collection1 node=127.0.0.1:28212_solr
[junit4:junit4]   2> 11431 T1364 C66 P28212 oasc.SolrDeletionPolicy.onInit SolrDeletionPolicy.onInit: commits:num=1
[junit4:junit4]   2> 		commit{dir=/usr/home/hudson/hudson-slave/workspace/Lucene-Solr-Tests-4.x-java7/solr/build/solr-core/test/J1/org.apache.solr.cloud.BasicDistributedZkTest-1349451508878/jetty2/index,segFN=segments_1,generation=1,filenames=[segments_1]
[junit4:junit4]   2> 11432 T1364 C66 P28212 oasc.SolrDeletionPolicy.updateCommits newest commit = 1
[junit4:junit4]   2> 11435 T1364 C66 P28212 oass.SolrIndexSearcher.<init> Opening Searcher@61e8505 realtime
[junit4:junit4]   2> 11435 T1364 C66 P28212 REQ /update {update.distrib=TOLEADER&wt=javabin&version=2} status=0 QTime=9 
[junit4:junit4]   2> 11436 T1356 C64 P36395 /update {wt=javabin&version=2} {deleteByQuery=*:* (-1415002477316538368)} 0 50
[junit4:junit4]   2> 11450 T1338 C65 P10318 /update {wt=javabin&version=2} {add=[1 (1415002477365821440)]} 0 10
[junit4:junit4]   2> 11477 T1376 C63 P28582 REQ /update {distrib.from=http://127.0.0.1:36395/solr/collection1/&update.distrib=FROMLEADER&wt=javabin&version=2} status=0 QTime=5 
[junit4:junit4]   2> 11478 T1357 C64 P36395 REQ /update {distrib.from=http://127.0.0.1:28212/solr/collection1/&update.distrib=TOLEADER&wt=javabin&version=2} status=0 QTime=13 
[junit4:junit4]   2> 11478 T1365 C66 P28212 /update {wt=javabin&version=2} {add=[1]} 0 25
[junit4:junit4]   2> 11484 T1338 C65 P10318 /update {wt=javabin&version=2} {add=[2 (1415002477407764480)]} 0 3
[junit4:junit4]   2> 11490 T1365 C66 P28212 /update {wt=javabin&version=2} {add=[2 (1415002477413007360)]} 0 4
[junit4:junit4]   2> 11495 T1338 C65 P10318 /update {wt=javabin&version=2} {add=[3 (1415002477420347392)]} 0 2
[junit4:junit4]   2> 11500 T1365 C66 P28212 /update {wt=javabin&version=2} {add=[3 (1415002477425590272)]} 0 2
[junit4:junit4]   2> 11505 T1338 C65 P10318 /update {wt=javabin&version=2} {add=[4 (1415002477430833152)]} 0 2
[junit4:junit4]   2> 11518 T1376 C63 P28582 REQ /update {distrib.from=http://127.0.0.1:36395/solr/collection1/&update.distrib=FROMLEADER&wt=javabin&version=2} status=0 QTime=2 
[junit4:junit4]   2> 11519 T1357 C64 P36395 REQ /update {distrib.from=http://127.0.0.1:28212/solr/collection1/&update.distrib=TOLEADER&wt=javabin&version=2} status=0 QTime=8 
[junit4:junit4]   2> 11520 T1365 C66 P28212 /update {wt=javabin&version=2} {add=[4]} 0 12
[junit4:junit4]   2> 11525 T1338 C65 P10318 /update {wt=javabin&version=2} {add=[5 (1415002477451804672)]} 0 2
[junit4:junit4]   2> 11534 T1364 C66 P28212 REQ /update {distrib.from=http://127.0.0.1:36395/solr/collection1/&update.distrib=TOLEADER&wt=javabin&version=2} status=0 QTime=4 
[junit4:junit4]   2> 11535 T1356 C64 P36395 /update {wt=javabin&version=2} {add=[5]} 0 7
[junit4:junit4]   2> 11540 T1338 C65 P10318 /update {wt=javabin&version=2} {add=[6 (1415002477467533312)]} 0 2
[junit4:junit4]   2> 11548 T1364 C66 P28212 REQ /update {distrib.from=http://127.0.0.1:36395/solr/collection1/&update.distrib=TOLEADER&wt=javabin&version=2} status=0 QTime=3 
[junit4:junit4]   2> 11549 T1356 C64 P36395 /update {wt=javabin&version=2} {add=[6]} 0 6
[junit4:junit4]   2> 11554 T1338 C65 P10318 /update {wt=javabin&version=2} {add=[7 (1415002477482213376)]} 0 2
[junit4:junit4]   2> 11562 T1364 C66 P28212 REQ /update {distrib.from=http://127.0.0.1:36395/solr/collection1/&update.distrib=TOLEADER&wt=javabin&version=2} status=0 QTime=3 
[junit4:junit4]   2> 11563 T1356 C64 P36395 /update {wt=javabin&version=2} {add=[7]} 0 6
[junit4:junit4]   2> 11568 T1338 C65 P10318 /update {wt=javabin&version=2} {add=[8 (1415002477496893440)]} 0 2
[junit4:junit4]   2> 11585 T1376 C63 P28582 REQ /update {distrib.from=http://127.0.0.1:36395/solr/collection1/&update.distrib=FROMLEADER&wt=javabin&version=2} status=0 QTime=3 
[junit4:junit4]   2> 11586 T1357 C64 P36395 REQ /update {distrib.from=http://127.0.0.1:28212/solr/collection1/&update.distrib=TOLEADER&wt=javabin&version=2} status=0 QTime=10 
[junit4:junit4]   2> 11587 T1365 C66 P28212 /update {wt=javabin&version=2} {add=[8]} 0 16
[junit4:junit4]   2> 11592 T1338 C65 P10318 /update {wt=javabin&version=2} {add=[9 (1415002477522059264)]} 0 2
[junit4:junit4]   2> 11601 T1364 C66 P28212 REQ /update {distrib.from=http://127.0.0.1:36395/solr/collection1/&update.distrib=TOLEADER&wt=javabin&version=2} status=0 QTime=3 
[junit4:junit4]   2> 11601 T1356 C64 P36395 /update {wt=javabin&version=2} {add=[9]} 0 6
[junit4:junit4]   2> 11670 T1338 C65 P10318 /update {wt=javabin&version=2} {add=[10 (1415002477536739328)]} 0 66
[junit4:junit4]   2> 11684 T1376 C63 P28582 REQ /update {distrib.from=http://127.0.0.1:36395/solr/collection1/&update.distrib=FROMLEADER&wt=javabin&version=2} status=0 QTime=2 
[junit4:junit4]   2> 11685 T1357 C64 P36395 REQ /update {distrib.from=http://127.0.0.1:28212/solr/collection1/&update.distrib=TOLEADER&wt=javabin&version=2} status=0 QTime=8 
[junit4:junit4]   2> 11686 T1365 C66 P28212 /update {wt=javabin&version=2} {add=[10]} 0 12
[junit4:junit4]   2> 11694 T1338 C65 P10318 /update {wt=javabin&version=2} {add=[11 (1415002477625868288)]} 0 5
[junit4:junit4]   2> 11707 T1376 C63 P28582 REQ /update {distrib.from=http://127.0.0.1:36395/solr/collection1/&update.distrib=FROMLEADER&wt=javabin&version=2} status=0 QTime=2 
[junit4:junit4]   2> 11708 T1357 C64 P36395 REQ /update {distrib.from=http://127.0.0.1:28212/solr/collection1/&update.distrib=TOLEADER&wt=javabin&version=2} status=0 QTime=8 
[junit4:junit4]   2> 11709 T1365 C66 P28212 /update {wt=javabin&version=2} {add=[11]} 0 12
[junit4:junit4]   2> 11714 T1338 C65 P10318 /update {wt=javabin&version=2} {add=[12 (1415002477649985536)]} 0 2
[junit4:junit4]   2> 11724 T1376 C63 P28582 REQ /update {distrib.from=http://127.0.0.1:36395/solr/collection1/&update.distrib=FROMLEADER&wt=javabin&version=2} status=0 QTime=2 
[junit4:junit4]   2> 11725 T1356 C64 P36395 /update {wt=javabin&version=2} {add=[12 (1415002477655228416)]} 0 8
[junit4:junit4]   2> 11731 T1338 C65 P10318 /update {wt=javabin&version=2} {add=[13 (1415002477666762752)]} 0 3
[junit4:junit4]   2> 11741 T1376 C63 P28582 REQ /update {distrib.from=http://127.0.0.1:36395/solr/collection1/&update.distrib=FROMLEADER&wt=javabin&version=2} status=0 QTime=2 
[junit4:junit4]   2> 11741 T1356 C64 P36395 /update {wt=javabin&version=2} {add=[13 (1415002477672005632)]} 0 8
[junit4:junit4]   2> 11746 T1338 C65 P10318 /update {wt=javabin&version=2} {add=[14 (1415002477683539968)]} 0 2
[junit4:junit4]   2> 11755 T1376 C63 P28582 REQ /update {distrib.from=http://127.0.0.1:36395/solr/collection1/&update.distrib=FROMLEADER&wt=javabin&version=2} status=0 QTime=2 
[junit4:junit4]   2> 11756 T1356 C64 P36395 /update {wt=javabin&version=2} {add=[14 (1415002477688782848)]} 0 7
[junit4:junit4]   2> 11762 T1338 C65 P10318 /update {wt=javabin&version=2} {add=[15 (1415002477700317184)]} 0 2
[junit4:junit4]   2> 11775 T1376 C63 P28582 REQ /update {distrib.from=http://127.0.0.1:36395/solr/collection1/&update.distrib=FROMLEADER&wt=javabin&version=2} status=0 QTime=2 
[junit4:junit4]   2> 11776 T1357 C64 P36395 REQ /update {distrib.from=http://127.0.0.1:28212/solr/collection1/&update.distrib=TOLEADER&wt=javabin&version=2} status=0 QTime=8 
[junit4:junit4]   2> 11777 T1365 C66 P28212 /update {wt=javabin&version=2} {add=[15]} 0 12
[junit4:junit4]   2> 11782 T1338 C65 P10318 /update {wt=javabin&version=2} {add=[16 (1415002477721288704)]} 0 2
[junit4:junit4]   2> 11869 T1376 C63 P28582 REQ /update {distrib.from=http://127.0.0.1:36395/solr/collection1/&update.distrib=FROMLEADER&wt=javabin&version=2} status=0 QTime=49 
[junit4:junit4]   2> 11870 T1356 C64 P36395 /update {wt=javabin&version=2} {add=[16 (1415002477725483008)]} 0 86
[junit4:junit4]   2> 11879 T1338 C65 P10318 /update {wt=javabin&version=2} {add=[17 (1415002477820903424)]} 0 5
[junit4:junit4]   2> 11886 T1365 C66 P28212 /update {wt=javabin&version=2} {add=[17 (1415002477830340608)]} 0 3
[junit4:junit4]   2> 11892 T1338 C65 P10318 /update {wt=javabin&version=2} {add=[100 (1415002477837680640)]} 0 2
[junit4:junit4]   2> 11903 T1376 C63 P28582 REQ /update {distrib.from=http://127.0.0.1:36395/solr/collection1/&update.distrib=FROMLEADER&wt=javabin&version=2} status=0 QTime=4 
[junit4:junit4]   2> 11904 T1356 C64 P36395 /update {wt=javabin&version=2} {add=[100 (1415002477840826368)]} 0 10
[junit4:junit4]   2> 11909 T1338 C65 P10318 /update {wt=javabin&version=2} {add=[101 (1415002477854457856)]} 0 2
[junit4:junit4]   2> 11918 T1376 C63 P28582 REQ /update {distrib.from=http://127.0.0.1:36395/solr/collection1/&update.distrib=FROMLEADER&wt=javabin&version=2} status=0 QTime=2 
[junit4:junit4]   2> 11919 T1356 C64 P36395 /update {wt=javabin&version=2} {add=[101 (1415002477859700736)]} 0 7
[junit4:junit4]   2> 11970 T1338 C65 P10318 /update {wt=javabin&version=2} {add=[102 (1415002477871235072)]} 0 48
[junit4:junit4]   2> 11984 T1376 C63 P28582 REQ /update {distrib.from=http://127.0.0.1:36395/solr/collection1/&update.distrib=FROMLEADER&wt=javabin&version=2} status=0 QTime=3 
[junit4:junit4]   2> 11985 T1357 C64 P36395 REQ /update {distrib.from=http://127.0.0.1:28212/solr/collection1/&update.distrib=TOLEADER&wt=javabin&version=2} status=0 QTime=9 
[junit4:junit4]   2> 11986 T1365 C66 P28212 /update {wt=javabin&version=2} {add=[102]} 0 13
[junit4:junit4]   2> 11993 T1338 C65 P10318 /update {wt=javabin&version=2} {add=[103 (1415002477940441088)]} 0 4
[junit4:junit4]   2> 11998 T1365 C66 P28212 /update {wt=javabin&version=2} {add=[103 (1415002477947781120)]} 0 2
[junit4:junit4]   2> 12003 T1338 C65 P10318 /update {wt=javabin&version=2} {add=[104 (1415002477953024000)]} 0 2
[junit4:junit4]   2> 12011 T1364 C66 P28212 REQ /update {distrib.from=http://127.0.0.1:36395/solr/collection1/&update.distrib=TOLEADER&wt=javabin&version=2} status=0 QTime=2 
[junit4:junit4]   2> 12012 T1356 C64 P36395 /update {wt=javabin&version=2} {add=[104]} 0 6
[junit4:junit4]   2> 12017 T1338 C65 P10318 /update {wt=javabin&version=2} {add=[105 (1415002477968752640)]} 0 2
[junit4:junit4]   2> 12069 T1364 C66 P28212 REQ /update {distrib.from=http://127.0.0.1:36395/solr/collection1/&update.distrib=TOLEADER&wt=javabin&version=2} status=0 QTime=47 
[junit4:junit4]   2> 12070 T1356 C64 P36395 /update {wt=javabin&version=2} {add=[105]} 0 50
[junit4:junit4]   2> 12078 T1338 C65 P10318 /update {wt=javabin&version=2} {add=[106 (1415002478029570048)]} 0 5
[junit4:junit4]   2> 12089 T1364 C66 P28212 REQ /update {distrib.from=http://127.0.0.1:36395/solr/collection1/&update.distrib=TOLEADER&wt=javabin&version=2} status=0 QTime=5 
[junit4:junit4]   2> 12090 T1356 C64 P36395 /update {wt=javabin&version=2} {add=[106]} 0 9
[junit4:junit4]   2> 12095 T1338 C65 P10318 /update {wt=javabin&version=2} {add=[107 (1415002478049492992)]} 0 2
[junit4:junit4]   2> 12108 T1376 C63 P28582 REQ /update {distrib.from=http://127.0.0.1:36395/solr/collection1/&update.distrib=FROMLEADER&wt=javabin&version=2} status=0 QTime=2 
[junit4:junit4]   2> 12109 T1357 C64 P36395 REQ /update {distrib.from=http://127.0.0.1:28212/solr/collection1/&update.distrib=TOLEADER&wt=javabin&version=2} status=0 QTime=8 
[junit4:junit4]   2> 12110 T1365 C66 P28212 /update {wt=javabin&version=2} {add=[107]} 0 12
[junit4:junit4]   2> 12115 T1338 C65 P10318 /update {wt=javabin&version=2} {add=[108 (1415002478070464512)]} 0 2
[junit4:junit4]   2> 12126 T1376 C63 P28582 REQ /update {distrib.from=http://127.0.0.1:36395/solr/collection1/&update.distrib=FROMLEADER&wt=javabin&version=2} status=0 QTime=2 
[junit4:junit4]   2> 12127 T1357 C64 P36395 REQ /update {distrib.from=http://127.0.0.1:28212/solr/collection1/&update.distrib=TOLEADER&wt=javabin&version=2} status=0 QTime=6 
[junit4:junit4]   2> 12127 T1365 C66 P28212 /update {wt=javabin&version=2} {add=[108]} 0 10
[junit4:junit4]   2> 12132 T1338 C65 P10318 /update {wt=javabin&version=2} {add=[109 (1415002478088290304)]} 0 2
[junit4:junit4]   2> 12144 T1376 C63 P28582 REQ /update {distrib.from=http://127.0.0.1:36395/solr/collection1/&update.distrib=FROMLEADER&wt=javabin&version=2} status=0 QTime=2 
[junit4:junit4]   2> 12145 T1357 C64 P36395 REQ /update {distrib.from=http://127.0.0.1:28212/solr/collection1/&update.distrib=TOLEADER&wt=javabin&version=2} status=0 QTime=6 
[junit4:junit4]   2> 12145 T1365 C66 P28212 /update {wt=javabin&version=2} {add=[109]} 0 10
[junit4:junit4]   2> 12150 T1338 C65 P10318 /update {wt=javabin&version=2} {add=[110 (1415002478107164672)]} 0 2
[junit4:junit4]   2> 12164 T1376 C63 P28582 REQ /update {distrib.from=http://127.0.0.1:36395/solr/collection1/&update.distrib=FROMLEADER&wt=javabin&version=2} status=0 QTime=3 
[junit4:junit4]   2> 12165 T1357 C64 P36395 REQ /update {distrib.from=http://127.0.0.1:28212/solr/collection1/&update.distrib=TOLEADER&wt=javabin&version=2} status=0 QTime=9 
[junit4:junit4]   2> 12166 T1365 C66 P28212 /update {wt=javabin&version=2} {add=[110]} 0 13
[junit4:junit4]   2> 12171 T1338 C65 P10318 /update {wt=javabin&version=2} {add=[111 (1415002478130233344)]} 0 2
[junit4:junit4]   2> 12184 T1376 C63 P28582 REQ /update {distrib.from=http://127.0.0.1:36395/solr/collection1/&update.distrib=FROMLEADER&wt=javabin&version=2} status=0 QTime=3 
[junit4:junit4]   2> 12184 T1357 C64 P36395 REQ /update {distrib.from=http://127.0.0.1:28212/solr/collection1/&update.distrib=TOLEADER&wt=javabin&version=2} status=0 QTime=7 
[junit4:junit4]   2> 12185 T1365 C66 P28212 /update {wt=javabin&version=2} {add=[111]} 0 11
[junit4:junit4]   2> 12221 T1338 C65 P10318 /update {wt=javabin&version=2} {add=[112 (1415002478149107712)]} 0 33
[junit4:junit4]   2> 12226 T1365 C66 P28212 /update {wt=javabin&version=2} {add=[112 (1415002478187905024)]} 0 2
[junit4:junit4]   2> 12233 T1338 C65 P10318 /update {wt=javabin&version=2} {add=[113 (1415002478192099328)]} 0 4
[junit4:junit4]   2> 12243 T1376 C63 P28582 REQ /update {distrib.from=http://127.0.0.1:36395/solr/collection1/&update.distrib=FROMLEADER&wt=javabin&version=2} status=0 QTime=2 
[junit4:junit4]   2> 12244 T1356 C64 P36395 /update {wt=javabin&version=2} {add=[113 (1415002478199439360)]} 0 8
[junit4:junit4]   2> 12249 T1338 C65 P10318 /update {wt=javabin&version=2} {add=[114 (1415002478210973696)]} 0 2
[junit4:junit4]   2> 12314 T1376 C63 P28582 REQ /update {distrib.from=http://127.0.0.1:36395/solr/collection1/&update.distrib=FROMLEADER&wt=javabin&version=2} status=0 QTime=29 
[junit4:junit4]   2> 12315 T1356 C64 P36395 /update {wt=javabin&version=2} {add=[114 (1415002478216216576)]} 0 63
[junit4:junit4]   2> 12320 T1338 C65 P10318 /update {wt=javabin&version=2} {add=[115 (1415002478285422592)]} 0 2
[junit4:junit4]   2> 12325 T1365 C66 P28212 /update {wt=javabin&version=2} {add=[115 (1415002478290665472)]} 0 2
[junit4:junit4]   2> 12330 T1338 C65 P10318 /update {wt=javabin&version=2} {add=[116 (1415002478295908352)]} 0 2
[junit4:junit4]   2> 12335 T1365 C66 P28212 /update {wt=javabin&version=2} {add=[116 (1415002478301151232)]} 0 2
[junit4:junit4]   2> 12340 T1338 C65 P10318 /update {wt=javabin&version=2} {add=[117 (1415002478306394112)]} 0 2
[junit4:junit4]   2> 12345 T1365 C66 P28212 /update {wt=javabin&version=2} {add=[117 (1415002478311636992)]} 0 2
[junit4:junit4]   2> 12350 T1338 C65 P10318 /update {wt=javabin&version=2} {add=[118 (1415002478316879872)]} 0 2
[junit4:junit4]   2> 12362 T1376 C63 P28582 REQ /update {distrib.from=http://127.0.0.1:36395/solr/collection1/&update.distrib=FROMLEADER&wt=javabin&version=2} status=0 QTime=3 
[junit4:junit4]   2> 12363 T1356 C64 P36395 /update {wt=javabin&version=2} {add=[118 (1415002478322122752)]} 0 10
[junit4:junit4]   2> 12368 T1338 C65 P10318 /update {wt=javabin&version=2} {add=[119 (1415002478335754240)]} 0 2
[junit4:junit4]   2> 12373 T1365 C66 P28212 /update {wt=javabin&version=2} {add=[119 (1415002478340997120)]} 0 2
[junit4:junit4]   2> 12378 T1338 C65 P10318 /update {wt=javabin&version=2} {add=[120 (1415002478346240000)]} 0 2
[junit4:junit4]   2> 12383 T1365 C66 P28212 /update {wt=javabin&version=2} {add=[120 (1415002478351482880)]} 0 2
[junit4:junit4]   2> 12388 T1338 C65 P10318 /update {wt=javabin&version=2} {add=[121 (1415002478356725760)]} 0 2
[junit4:junit4]   2> 12393 T1365 C66 P28212 /update {wt=javabin&version=2} {add=[121 (1415002478361968640)]} 0 2
[junit4:junit4]   2> 12428 T1338 C65 P10318 /update {wt=javabin&version=2} {add=[122 (1415002478367211520)]} 0 32
[junit4:junit4]   2> 12438 T1376 C63 P28582 REQ /update {distrib.from=http://127.0.0.1:36395/solr/collection1/&update.distrib=FROMLEADER&wt=javabin&version=2} status=0 QTime=2 
[junit4:junit4]   2> 12438 T1356 C64 P36395 /update {wt=javabin&version=2} {add=[122 (1415002478404960256)]} 0 7
[junit4:junit4]   2> 12445 T1338 C65 P10318 /update {wt=javabin&version=2} {add=[123 (1415002478414397440)]} 0 4
[junit4:junit4]   2> 12453 T1376 C63 P28582 REQ /update {distrib.from=http://127.0.0.1:36395/solr/collection1/&update.distrib=FROMLEADER&wt=javabin&version=2} status=0 QTime=2 
[junit4:junit4]   2> 12453 T1356 C64 P36395 /update {wt=javabin&version=2} {add=[123 (1415002478420688896)]} 0 6
[junit4:junit4]   2> 12459 T1338 C65 P10318 /update {wt=javabin&version=2} {add=[124 (1415002478431174656)]} 0 2
[junit4:junit4]   2> 12469 T1376 C63 P28582 REQ /update {distrib.from=http://127.0.0.1:36395/solr/collection1/&update.distrib=FROMLEADER&wt=javabin&version=2} status=0 QTime=2 
[junit4:junit4]   2> 12470 T1356 C64 P36395 /update {wt=javabin&version=2} {add=[124 (1415002478436417536)]} 0 8
[junit4:junit4]   2> 12475 T1338 C65 P10318 /update {wt=javabin&version=2} {add=[125 (1415002478447951872)]} 0 2
[junit4:junit4]   2> 12484 T1376 C63 P28582 REQ /update {distrib.from=http://127.0.0.1:36395/solr/collection1/&update.distrib=FROMLEADER&wt=javabin&version=2} status=0 QTime=2 
[junit4:junit4]   2> 12484 T1356 C64 P36395 /update {wt=javabin&version=2} {add=[125 (1415002478453194752)]} 0 6
[junit4:junit4]   2> 12489 T1338 C65 P10318 /update {wt=javabin&version=2} {add=[126 (1415002478462631936)]} 0 2
[junit4:junit4]   2> 12497 T1364 C66 P28212 REQ /update {distrib.from=http://127.0.0.1:36395/solr/collection1/&update.distrib=TOLEADER&wt=javabin&version=2} status=0 QTime=2 
[junit4:junit4]   2> 12497 T1356 C64 P36395 /update {wt=javabin&version=2} {add=[126]} 0 5
[junit4:junit4]   2> 12503 T1338 C65 P10318 /update {wt=javabin&version=2} {add=[127 (1415002478477312000)]} 0 2
[junit4:junit4]   2> 12536 T1365 C66 P28212 /update {wt=javabin&version=2} {add=[127 (1415002478482554880)]} 0 30
[junit4:junit4]   2> 12542 T1338 C65 P10318 /update {wt=javabin&version=2} {add=[128 (1415002478518206464)]} 0 2
[junit4:junit4]   2> 12551 T1364 C66 P28212 REQ /update {distrib.from=http://127.0.0.1:36395/solr/collection1/&update.distrib=TOLEADER&wt=javabin&version=2} status=0 QTime=3 
[junit4:junit4]   2> 12552 T1356 C64 P36395 /update {wt=javabin&version=2} {add=[128]} 0 7
[junit4:junit4]   2> 12557 T1338 C65 P10318 /update {wt=javabin&version=2} {add=[129 (1415002478533935104)]} 0 2
[junit4:junit4]   2> 12567 T1376 C63 P28582 REQ /update {distrib.from=http://127.0.0.1:36395/solr/collection1/&update.distrib=FROMLEADER&wt=javabin&version=2} status=0 QTime=2 
[junit4:junit4]   2> 12568 T1356 C64 P36395 /update {wt=javabin&version=2} {add=[129 (1415002478539177984)]} 0 8
[junit4:junit4]   2> 12574 T1338 C65 P10318 /update {wt=javabin&version=2} {add=[130 (1415002478551760896)]} 0 2
[junit4:junit4]   2> 12582 T1364 C66 P28212 REQ /update {distrib.from=http://127.0.0.1:36395/solr/collection1/&update.distrib=TOLEADER&wt=javabin&version=2} status=0 QTime=2 
[junit4:junit4]   2> 12583 T1356 C64 P36395 /update {wt=javabin&version=2} {add=[130]} 0 6
[junit4:junit4]   2> 12588 T1338 C65 P10318 /update {wt=javabin&version=2} {add=[131 (1415002478566440960)]} 0 2
[junit4:junit4]   2> 12595 T1364 C66 P28212 REQ /update {distrib.from=http://127.0.0.1:36395/solr/collection1/&update.distrib=TOLEADER&wt=javabin&version=2} status=0 QTime=1 
[junit4:junit4]   2> 12596 T1356 C64 P36395 /update {wt=javabin&version=2} {add=[131]} 0 5
[junit4:junit4]   2> 12629 T1338 C65 P10318 /update {wt=javabin&version=2} {add=[132 (1415002478580072448)]} 0 30
[junit4:junit4]   2> 12638 T1376 C63 P28582 REQ /update {distrib.from=http://127.0.0.1:36395/solr/collection1/&update.distrib=FROMLEADER&wt=javabin&version=2} status=0 QTime=2 
[junit4:junit4]   2> 12639 T1356 C64 P36395 /update {wt=javabin&version=2} {add=[132 (1415002478614675456)]} 0 7
[junit4:junit4]   2> 12645 T1338 C65 P10318 /update {wt=javabin&version=2} {add=[133 (1415002478625161216)]} 0 3
[junit4:junit4]   2> 12657 T1376 C63 P28582 REQ /update {distrib.from=http://127.0.0.1:36395/solr/collection1/&update.distrib=FROMLEADER&wt=javabin&version=2} status=0 QTime=2 
[junit4:junit4]   2> 12658 T1357 C64 P36395 REQ /update {distrib.from=http://127.0.0.1:28212/solr/collection1/&update.distrib=TOLEADER&wt=javabin&version=2} status=0 QTime=6 
[junit4:junit4]   2> 12658 T1365 C66 P28212 /update {wt=javabin&version=2} {add=[133]} 0 10
[junit4:junit4]   2> 12664 T1338 C65 P10318 /update {wt=javabin&version=2} {add=[134 (1415002478646132736)]} 0 3
[junit4:junit4]   2> 12670 T1365 C66 P28212 /update {wt=javabin&version=2} {add=[134 (1415002478653472768)]} 0 2
[junit4:junit4]   2> 12676 T1338 C65 P10318 /update {wt=javabin&version=2} {add=[135 (1415002478658715648)]} 0 2
[junit4:junit4]   2> 12685 T1376 C63 P28582 REQ /update {distrib.from=http://127.0.0.1:36395/solr/collection1/&update.distrib=FROMLEADER&wt=javabin&version=2} status=0 QTime=2 
[junit4:junit4]   2> 12686 T1356 C64 P36395 /update {wt=javabin&version=2} {add=[135 (1415002478663958528)]} 0 7
[junit4:junit4]   2> 12691 T1338 C65 P10318 /update {wt=javabin&version=2} {add=[136 (1415002478674444288)]} 0 2
[junit4:junit4]   2> 12699 T1364 C66 P28212 REQ /update {distrib.from=http://127.0.0.1:36395/solr/collection1/&update.distrib=TOLEADER&wt=javabin&version=2} status=0 QTime=2 
[junit4:junit4]   2> 12700 T1356 C64 P36395 /update {wt=javabin&version=2} {add=[136]} 0 6
[junit4:junit4]   2> 12704 T1338 C65 P10318 /update {wt=javabin&version=2} {add=[137 (1415002478688075776)]} 0 2
[junit4:junit4]   2> 12709 T1365 C66 P28212 /update {wt=javabin&version=2} {add=[137 (1415002478693318656)]} 0 2
[junit4:junit4]   2> 12714 T1338 C65 P10318 /update {wt=javabin&version=2} {add=[138 (1415002478698561536)]} 0 2
[junit4:junit4]   2> 12776 T1376 C63 P28582 REQ /update {distrib.from=http://127.0.0.1:36395/solr/collection1/&update.distrib=FROMLEADER&wt=javabin&version=2} status=0 QTime=31 
[junit4:junit4]   2> 12777 T1356 C64 P36395 /update {wt=javabin&version=2} {add=[138 (1415002478704852992)]} 0 60
[junit4:junit4]   2> 12782 T1338 C65 P10318 /update {wt=javabin&version=2} {add=[139 (1415002478769864704)]} 0 2
[junit4:junit4]   2> 12790 T1364 C66 P28212 REQ /update {distrib.from=http://127.0.0.1:36395/solr/collection1/&update.distrib=TOLEADER&wt=javabin&version=2} status=0 QTime=2 
[junit4:junit4]   2> 12790 T1356 C64 P36395 /update {wt=javabin&version=2} {add=[139]} 0 5
[junit4:junit4]   2> 12795 T1338 C65 P10318 /update {wt=javabin&version=2} {add=[140 (1415002478783496192)]} 0 2
[junit4:junit4]   2> 12803 T1364 C66 P28212 REQ /update {distrib.from=http://127.0.0.1:36395/solr/collection1/&update.distrib=TOLEADER&wt=javabin&version=2} status=0 QTime=2 
[junit4:junit4]   2> 12803 T1356 C64 P36395 /update {wt=javabin&version=2} {add=[140]} 0 5
[junit4:junit4]   2> 12808 T1338 C65 P10318 /update {wt=javabin&version=2} {add=[141 (1415002478797127680)]} 0 2
[junit4:junit4]   2> 12813 T1365 C66 P28212 /update {wt=javabin&version=2} {add=[141 (1415002478802370560)]} 0 2
[junit4:junit4]   2> 12845 T1338 C65 P10318 /update {wt=javabin&version=2} {add=[142 (1415002478807613440)]} 0 29
[junit4:junit4]   2> 12868 T1365 C66 P28212 /update {wt=javabin&version=2} {add=[142 (1415002478841167872)]} 0 20
[junit4:junit4]   2> 12875 T1338 C65 P10318 /update {wt=javabin&version=2} {add=[143 (1415002478865285120)]} 0 4
[junit4:junit4]   2> 12881 T1365 C66 P28212 /update {wt=javabin&version=2} {add=[143 (1415002478872625152)]} 0 3
[junit4:junit4]   2> 12886 T1338 C65 P10318 /update {wt=javabin&version=2} {add=[144 (1415002478878916608)]} 0 2
[junit4:junit4]   2> 12891 T1365 C66 P28212 /update {wt=javabin&version=2} {add=[144 (1415002478884159488)]} 0 2
[junit4:junit4]   2> 12896 T1338 C65 P10318 /update {wt=javabin&version=2} {add=[145 (1415002478889402368)]} 0 2
[junit4:junit4]   2> 12904 T1364 C66 P28212 REQ /update {distrib.from=http://127.0.0.1:36395/solr/collection1/&update.distrib=TOLEADER&wt=javabin&version=2} status=0 QTime=2 
[junit4:junit4]   2> 12904 T1356 C64 P36395 /update {wt=javabin&version=2} {add=[145]} 0 5
[junit4:junit4]   2> 12909 T1338 C65 P10318 /update {wt=javabin&version=2} {add=[146 (1415002478903033856)]} 0 2
[junit4:junit4]   2> 12928 T1376 C63 P28582 REQ /update {distrib.from=http://127.0.0.1:36395/solr/collection1/&update.distrib=FROMLEADER&wt=javabin&version=2} status=0 QTime=4 
[junit4:junit4]   2> 12929 T1357 C64 P36395 REQ /update {distrib.from=http://127.0.0.1:28212/solr/collection1/&update.distrib=TOLEADER&wt=javabin&version=2} status=0 QTime=10 
[junit4:junit4]   2> 12930 T1365 C66 P28212 /update {wt=javabin&version=2} {add=[146]} 0 13
[junit4:junit4]   2> 12935 T1338 C65 P10318 /update {wt=javabin&version=2} {add=[147 (1415002478930296832)]} 0 2
[junit4:junit4]   2> 12940 T1365 C66 P28212 /update {wt=javabin&version=2} {add=[147 (1415002478935539712)]} 0 2
[junit4:junit4]   2> 12945 T1338 C65 P10318 /update {wt=javabin&version=2} {add=[148 (1415002478940782592)]} 0 2
[junit4:junit4]   2> 12956 T1376 C63 P28582 REQ /update {distrib.from=http://127.0.0.1:36395/solr/collection1/&update.distrib=FROMLEADER&wt=javabin&version=2} status=0 QTime=1 
[junit4:junit4]   2> 12957 T1357 C64 P36395 REQ /update {distrib.from=http://127.0.0.1:28212/solr/collection1/&update.distrib=TOLEADER&wt=javabin&version=2} status=0 QTime=6 
[junit4:junit4]   2> 12958 T1365 C66 P28212 /update {wt=javabin&version=2} {add=[148]} 0 10
[junit4:junit4]   2> 12962 T1338 C65 P10318 /update {wt=javabin&version=2} {add=[149 (1415002478958608384)]} 0 2
[junit4:junit4]   2> 12967 T1365 C66 P28212 /update {wt=javabin&version=2} {add=[149 (1415002478963851264)]} 0 2
[junit4:junit4]   2> 12969 T1338 C65 P10318 oasu.DirectUpdateHandler2.commit start commit{flags=0,_version_=0,optimize=false,openSearcher=true,waitSearcher=true,expungeDeletes=false,softCommit=false}
[junit4:junit4]   2> 13452 T1338 C65 P10318 oasc.SolrDeletionPolicy.onCommit SolrDeletionPolicy.onCommit: commits:num=2
[junit4:junit4]   2> 		commit{dir=/usr/home/hudson/hudson-slave/workspace/Lucene-Solr-Tests-4.x-java7/solr/build/solr-core/test/J1/org.apache.solr.cloud.BasicDistributedZkTest-1349451508878/control/data/index,segFN=segments_1,generation=1,filenames=[segments_1]
[junit4:junit4]   2> 		commit{dir=/usr/home/hudson/hudson-slave/workspace/Lucene-Solr-Tests-4.x-java7/solr/build/solr-core/test/J1/org.apache.solr.cloud.BasicDistributedZkTest-1349451508878/control/data/index,segFN=segments_2,generation=2,filenames=[_5_nrm.cfe, _5_Memory_0.ram, _0_MockSep_0.pos, _4_MockSep_0.tib, _3_MockVariableIntBlock_0.frq, _4_MockSep_0.skp, _3.fdt, _4_MockVariableIntBlock_0.tii, _3_MockSep_0.frq, _0_Pulsing40_0.frq, _2_MockSep_0.doc, _6_MockSep_0.doc, _5_MockSep_0.skp, _4_MockSep_0.doc, _5_MockVariableIntBlock_0.tii, _5_Pulsing40_0.tip, _6_MockSep_0.frq, _6_MockVariableIntBlock_0.tii, _5_Pulsing40_0.tim, _1_MockSep_0.pyl, _1_MockSep_0.skp, _6_MockVariableIntBlock_0.tib, _0_Pulsing40_0.tim, _1_MockSep_0.tib, _1_MockVariableIntBlock_0.tii, _0_Memory_0.ram, _4_MockVariableIntBlock_0.doc, _2.fdt, _3_Pulsing40_0.tip, _5_MockSep_0.doc, _2.fdx, _3_Pulsing40_0.tim, _1_MockSep_0.tii, _1_MockVariableIntBlock_0.tib, _1.fdx, _4_MockVariableIntBlock_0.tib, _5_nrm.cfs, _4_MockSep_0.pyl, _1.fdt, _3_MockSep_0.pos, _0_MockVariableIntBlock_0.frq, _3.si, _6.fdt, _2_MockVariableIntBlock_0.skp, _4_MockSep_0.tii, _6_Memory_0.ram, _1_MockVariableIntBlock_0.skp, _2.si, _3_Pulsing40_0.frq, _2_Pulsing40_0.tim, _2_MockVariableIntBlock_0.pyl, _6_MockSep_0.pyl, _0_MockVariableIntBlock_0.doc, _6.fdx, _2_Pulsing40_0.tip, _2_MockSep_0.skp, _1_MockVariableIntBlock_0.pyl, _3.fnm, _5_MockSep_0.tii, _2_MockVariableIntBlock_0.doc, _3_MockSep_0.pyl, _3_MockVariableIntBlock_0.tii, _4_Pulsing40_0.prx, _0_MockVariableIntBlock_0.pyl, _1_Memory_0.ram, _2_nrm.cfe, _5_Pulsing40_0.frq, _6_MockSep_0.pos, _1_MockVariableIntBlock_0.doc, _0_Pulsing40_0.tip, _0_MockVariableIntBlock_0.pos, _2_nrm.cfs, _2_MockVariableIntBlock_0.tii, _1_MockSep_0.pos, _5_MockVariableIntBlock_0.tib, _2_MockVariableIntBlock_0.tib, _1_MockVariableIntBlock_0.pos, _4_MockVariableIntBlock_0.frq, _6_MockSep_0.skp, _5_MockVariableIntBlock_0.frq, _2.fnm, _3.fdx, _4_Pulsing40_0.tip, _2_MockSep_0.pyl, _4_Pulsing40_0.tim, _5_Pulsing40_0.prx, _5_MockSep_0.tib, _1.si, _3_MockVariableIntBlock_0.pyl, _6.si, _6.fnm, _3_MockSep_0.skp, _3_MockVariableIntBlock_0.pos, _3_nrm.cfe, _3_MockSep_0.doc, _5.fdt, _5_MockSep_0.pos, _1_Pulsing40_0.tip, _6_Pulsing40_0.frq, _5_MockVariableIntBlock_0.pyl, _1_Pulsing40_0.tim, _4_nrm.cfe, _4.fnm, _0_MockVariableIntBlock_0.skp, _0_Pulsing40_0.prx, _1.fnm, _4.fdx, _1_Pulsing40_0.frq, _0_MockSep_0.skp, _3_MockSep_0.tib, _6_Pulsing40_0.tim, _1_Pulsing40_0.prx, _6_Pulsing40_0.tip, _6_MockVariableIntBlock_0.frq, _6_MockVariableIntBlock_0.doc, _2_Pulsing40_0.prx, _6_MockSep_0.tii, _2_MockVariableIntBlock_0.pos, _1_MockSep_0.doc, _6_MockSep_0.tib, _5_MockVariableIntBlock_0.pos, _0.fnm, _4_MockSep_0.pos, _3_MockVariableIntBlock_0.doc, _5_MockSep_0.frq, _2_MockSep_0.tii, _2_MockSep_0.tib, _3_MockSep_0.tii, _2_Pulsing40_0.frq, _5.si, _3_nrm.cfs, _4_MockVariableIntBlock_0.pyl, _6_Pulsing40_0.prx, _4_Memory_0.ram, _4_nrm.cfs, _3_MockVariableIntBlock_0.tib, _2_MockSep_0.pos, _5_MockSep_0.pyl, _1_MockSep_0.frq, _5_MockVariableIntBlock_0.doc, _6_MockVariableIntBlock_0.pyl, _2_MockVariableIntBlock_0.frq, _6_nrm.cfs, _4_MockVariableIntBlock_0.skp, _0_MockVariableIntBlock_0.tib, _5_MockVariableIntBlock_0.skp, _6_MockVariableIntBlock_0.pos, _4_MockVariableIntBlock_0.pos, _2_Memory_0.ram, _0_MockSep_0.doc, _0.si, _3_Memory_0.ram, _0_MockVariableIntBlock_0.tii, _1_nrm.cfs, _5.fnm, _6_nrm.cfe, _2_MockSep_0.frq, _4.si, _4.fdt, _0_nrm.cfs, _6_MockVariableIntBlock_0.skp, _1_nrm.cfe, _0_MockSep_0.tib, _1_MockVariableIntBlock_0.frq, _4_Pulsing40_0.frq, _3_Pulsing40_0.prx, _0_nrm.cfe, _5.fdx, _4_MockSep_0.frq, segments_2, _0_MockSep_0.frq, _0.fdx, _0_MockSep_0.tii, _0_MockSep_0.pyl, _3_MockVariableIntBlock_0.skp, _0.fdt]
[junit4:junit4]   2> 13453 T1338 C65 P10318 oasc.SolrDeletionPolicy.updateCommits newest commit = 2
[junit4:junit4]   2> 13461 T1338 C65 P10318 oass.SolrIndexSearcher.<init> Opening Searcher@64200495 main
[junit4:junit4]   2> 13462 T1338 C65 P10318 oasu.DirectUpdateHandler2.commit end_commit_flush
[junit4:junit4]   2> 13464 T1349 oasc.SolrCore.registerSearcher [collection1] Registered new searcher Searcher@64200495 main{StandardDirectoryReader(segments_2:15:nrt _0(4.1):C10 _1(4.1):C10 _2(4.1):C10 _3(4.1):C10 _4(4.1):C10 _5(4.1):C10 _6(4.1):C7)}
[junit4:junit4]   2> 13465 T1338 C65 P10318 /update {waitSearcher=true&wt=javabin&commit=true&softCommit=false&version=2} {commit=} 0 496
[junit4:junit4]   2> 13468 T1356 C64 P36395 oasu.DirectUpdateHandler2.commit start commit{flags=0,_version_=0,optimize=false,openSearcher=true,waitSearcher=true,expungeDeletes=false,softCommit=false}
[junit4:junit4]   2> 13737 T1356 C64 P36395 oasc.SolrDeletionPolicy.onCommit SolrDeletionPolicy.onCommit: commits:num=2
[junit4:junit4]   2> 		commit{dir=/usr/home/hudson/hudson-slave/workspace/Lucene-Solr-Tests-4.x-java7/solr/build/solr-core/test/J1/org.apache.solr.cloud.BasicDistributedZkTest-1349451508878/jetty1/index,segFN=segments_1,generation=1,filenames=[segments_1]
[junit4:junit4]   2> 		commit{dir=/usr/home/hudson/hudson-slave/workspace/Lucene-Solr-Tests-4.x-java7/solr/build/solr-core/test/J1/org.apache.solr.cloud.BasicDistributedZkTest-1349451508878/jetty1/index,segFN=segments_2,generation=2,filenames=[_0_MockSep_0.pos, _3_MockVariableIntBlock_0.frq, _3.fdt, _3_MockSep_0.frq, _0_Pulsing40_0.frq, _2_MockSep_0.doc, _1_MockSep_0.pyl, _1_MockSep_0.skp, _0_Pulsing40_0.tim, _1_MockVariableIntBlock_0.tii, _1_MockSep_0.tib, _0_Memory_0.ram, _2.fdt, _3_Pulsing40_0.tip, _2.fdx, _3_Pulsing40_0.tim, _1_MockVariableIntBlock_0.tib, _1_MockSep_0.tii, _1.fdx, _1.fdt, _3_MockSep_0.pos, _0_MockVariableIntBlock_0.frq, _3.si, _2_MockVariableIntBlock_0.skp, _1_MockVariableIntBlock_0.skp, _2.si, _3_Pulsing40_0.frq, _2_Pulsing40_0.tim, _2_MockVariableIntBlock_0.pyl, _0_MockVariableIntBlock_0.doc, _2_Pulsing40_0.tip, _2_MockSep_0.skp, _1_MockVariableIntBlock_0.pyl, _3.fnm, _2_MockVariableIntBlock_0.doc, _3_MockSep_0.pyl, _3_MockVariableIntBlock_0.tii, _0_MockVariableIntBlock_0.pyl, _1_Memory_0.ram, _2_nrm.cfe, _1_MockVariableIntBlock_0.doc, _0_Pulsing40_0.tip, _0_MockVariableIntBlock_0.pos, _2_nrm.cfs, _2_MockVariableIntBlock_0.tii, _1_MockSep_0.pos, _2_MockVariableIntBlock_0.tib, _1_MockVariableIntBlock_0.pos, _2.fnm, _3.fdx, _2_MockSep_0.pyl, _1.si, _3_MockVariableIntBlock_0.pyl, _3_MockSep_0.skp, _3_MockVariableIntBlock_0.pos, _3_nrm.cfe, _3_MockSep_0.doc, _1_Pulsing40_0.tip, _1_Pulsing40_0.tim, _0_MockVariableIntBlock_0.skp, _0_Pulsing40_0.prx, _1.fnm, _1_Pulsing40_0.frq, _0_MockSep_0.skp, _3_MockSep_0.tib, _1_Pulsing40_0.prx, _2_Pulsing40_0.prx, _2_MockVariableIntBlock_0.pos, _1_MockSep_0.doc, _0.fnm, _3_MockVariableIntBlock_0.doc, _2_MockSep_0.tii, _2_MockSep_0.tib, _3_MockSep_0.tii, _2_Pulsing40_0.frq, _3_nrm.cfs, _3_MockVariableIntBlock_0.tib, _2_MockSep_0.pos, _1_MockSep_0.frq, _2_MockVariableIntBlock_0.frq, _0_MockVariableIntBlock_0.tib, _2_Memory_0.ram, _0_MockSep_0.doc, _0.si, _3_Memory_0.ram, _0_MockVariableIntBlock_0.tii, _1_nrm.cfs, _2_MockSep_0.frq, _0_nrm.cfs, _1_nrm.cfe, _0_MockSep_0.tib, _1_MockVariableIntBlock_0.frq, _3_Pulsing40_0.prx, _0_nrm.cfe, segments_2, _0_MockSep_0.frq, _0.fdx, _0_MockSep_0.tii, _0_MockSep_0.pyl, _3_MockVariableIntBlock_0.skp, _0.fdt]
[junit4:junit4]   2> 13738 T1356 C64 P36395 oasc.SolrDeletionPolicy.updateCommits newest commit = 2
[junit4:junit4]   2> 13745 T1356 C64 P36395 oass.SolrIndexSearcher.<init> Opening Searcher@52759620 main
[junit4:junit4]   2> 13746 T1356 C64 P36395 oasu.DirectUpdateHandler2.commit end_commit_flush
[junit4:junit4]   2> 13749 T1361 oasc.SolrCore.registerSearcher [collection1] Registered new searcher Searcher@52759620 main{StandardDirectoryReader(segments_2:9:nrt _0(4.1):C10 _1(4.1):C10 _2(4.1):C10 _3(4.1):C2)}
[junit4:junit4]   2> 13750 T1356 C64 P36395 oasu.SolrCmdDistributor.distribCommit Distrib commit to:[StdNode: http://127.0.0.1:28582/solr/collection1/, StdNode: http://127.0.0.1:28212/solr/collection1/]
[junit4:junit4]   2> 13752 T1364 C66 P28212 oasu.DirectUpdateHandler2.commit start commit{flags=0,_version_=0,optimize=false,openSearcher=true,waitSearcher=true,expungeDeletes=false,softCommit=false}
[junit4:junit4]   2> 13752 T1376 C63 P28582 oasu.DirectUpdateHandler2.commit start commit{flags=0,_version_=0,optimize=false,openSearcher=true,waitSearcher=true,expungeDeletes=false,softCommit=false}
[junit4:junit4]   2> 14093 T1364 C66 P28212 oasc.SolrDeletionPolicy.onCommit SolrDeletionPolicy.onCommit: commits:num=2
[junit4:junit4]   2> 		commit{dir=/usr/home/hudson/hudson-slave/workspace/Lucene-Solr-Tests-4.x-java7/solr/build/solr-core/test/J1/org.apache.solr.cloud.BasicDistributedZkTest-1349451508878/jetty2/index,segFN=segments_1,generation=1,filenames=[segments_1]
[junit4:junit4]   2> 		commit{dir=/usr/home/hudson/hudson-slave/workspace/Lucene-Solr-Tests-4.x-java7/solr/build/solr-core/test/J1/org.apache.solr.cloud.BasicDistributedZkTest-1349451508878/jetty2/index,segFN=segments_2,generation=2,filenames=[_0_MockSep_0.pos, _3_MockVariableIntBlock_0.frq, _3.fdt, _3_MockSep_0.frq, _0_Pulsing40_0.frq, _2_MockSep_0.doc, _1_MockSep_0.pyl, _1_MockSep_0.skp, _0_Pulsing40_0.tim, _1_MockVariableIntBlock_0.tii, _1_MockSep_0.tib, _0_Memory_0.ram, _2.fdt, _3_Pulsing40_0.tip, _2.fdx, _3_Pulsing40_0.tim, _1_MockVariableIntBlock_0.tib, _1_MockSep_0.tii, _1.fdx, _1.fdt, _3_MockSep_0.pos, _0_MockVariableIntBlock_0.frq, _3.si, _2_MockVariableIntBlock_0.skp, _1_MockVariableIntBlock_0.skp, _2.si, _3_Pulsing40_0.frq, _2_Pulsing40_0.tim, _2_MockVariableIntBlock_0.pyl, _0_MockVariableIntBlock_0.doc, _2_Pulsing40_0.tip, _2_MockSep_0.skp, _1_MockVariableIntBlock_0.pyl, _3.fnm, _2_MockVariableIntBlock_0.doc, _3_MockSep_0.pyl, _3_MockVariableIntBlock_0.tii, _0_MockVariableIntBlock_0.pyl, _1_Memory_0.ram, _2_nrm.cfe, _1_MockVariableIntBlock_0.doc, _0_MockVariableIntBlock_0.pos, _0_Pulsing40_0.tip, _2_nrm.cfs, _2_MockVariableIntBlock_0.tii, _1_MockSep_0.pos, _2_MockVariableIntBlock_0.tib, _1_MockVariableIntBlock_0.pos, _2.fnm, _3.fdx, _2_MockSep_0.pyl, _1.si, _3_MockVariableIntBlock_0.pyl, _3_MockSep_0.skp, _3_MockVariableIntBlock_0.pos, _3_nrm.cfe, _3_MockSep_0.doc, _1_Pulsing40_0.tip, _1_Pulsing40_0.tim, _0_MockVariableIntBlock_0.skp, _0_Pulsing40_0.prx, _1.fnm, _1_Pulsing40_0.frq, _0_MockSep_0.skp, _3_MockSep_0.tib, _1_Pulsing40_0.prx, _2_Pulsing40_0.prx, _2_MockVariableIntBlock_0.pos, _1_MockSep_0.doc, _0.fnm, _3_MockVariableIntBlock_0.doc, _2_MockSep_0.tii, _2_MockSep_0.tib, _3_MockSep_0.tii, _2_Pulsing40_0.frq, _3_nrm.cfs, _3_MockVariableIntBlock_0.tib, _2_MockSep_0.pos, _1_MockSep_0.frq, _2_MockVariableIntBlock_0.frq, _0_MockVariableIntBlock_0.tib, _2_Memory_0.ram, _0_MockSep_0.doc, _0.si, _3_Memory_0.ram, _0_MockVariableIntBlock_0.tii, _1_nrm.cfs, _2_MockSep_0.frq, _0_nrm.cfs, _1_nrm.cfe, _0_MockSep_0.tib, _1_MockVariableIntBlock_0.frq, _3_Pulsing40_0.prx, _0_nrm.cfe, segments_2, _0_MockSep_0.frq, _0.fdx, _0_MockSep_0.tii, _0_MockSep_0.pyl, _3_MockVariableIntBlock_0.skp, _0.fdt]
[junit4:junit4]   2> 14094 T1376 C63 P28582 oasc.SolrDeletionPolicy.onCommit SolrDeletionPolicy.onCommit: commits:num=2
[junit4:junit4]   2> 		commit{dir=/usr/home/hudson/hudson-slave/workspace/Lucene-Solr-Tests-4.x-java7/solr/build/solr-core/test/J1/org.apache.solr.cloud.BasicDistributedZkTest-1349451508878/jetty3/index,segFN=segments_2,generation=2,filenames=[segments_2]
[junit4:junit4]   2> 		commit{dir=/usr/home/hudson/hudson-slave/workspace/Lucene-Solr-Tests-4.x-java7/solr/build/solr-core/test/J1/org.apache.solr.cloud.BasicDistributedZkTest-1349451508878/jetty3/index,segFN=segments_3,generation=3,filenames=[_0_MockSep_0.pos, _3_MockVariableIntBlock_0.frq, _3.fdt, _3_MockSep_0.frq, _0_Pulsing40_0.frq, _2_MockSep_0.doc, _1_MockSep_0.pyl, _1_MockSep_0.skp, _0_Pulsing40_0.tim, _1_MockVariableIntBlock_0.tii, _1_MockSep_0.tib, _0_Memory_0.ram, _2.fdt, _3_Pulsing40_0.tip, _2.fdx, _3_Pulsing40_0.tim, _1_MockVariableIntBlock_0.tib, _1_MockSep_0.tii, _1.fdx, _1.fdt, _3_MockSep_0.pos, _0_MockVariableIntBlock_0.frq, _3.si, _2_MockVariableIntBlock_0.skp, _1_MockVariableIntBlock_0.skp, _2.si, _3_Pulsing40_0.frq, _2_Pulsing40_0.tim, _2_MockVariableIntBlock_0.pyl, _0_MockVariableIntBlock_0.doc, _2_Pulsing40_0.tip, _2_MockSep_0.skp, _1_MockVariableIntBlock_0.pyl, _3.fnm, _2_MockVariableIntBlock_0.doc, _3_MockSep_0.pyl, _3_MockVariableIntBlock_0.tii, _0_MockVariableIntBlock_0.pyl, _1_Memory_0.ram, _2_nrm.cfe, _1_MockVariableIntBlock_0.doc, _0_Pulsing40_0.tip, _0_MockVariableIntBlock_0.pos, _2_nrm.cfs, _2_MockVariableIntBlock_0.tii, _1_MockSep_0.pos, _2_MockVariableIntBlock_0.tib, _1_MockVariableIntBlock_0.pos, _2.fnm, _3.fdx, _2_MockSep_0.pyl, _1.si, _3_MockVariableIntBlock_0.pyl, _3_MockSep_0.skp, _3_MockVariableIntBlock_0.pos, _3_nrm.cfe, _3_MockSep_0.doc, _1_Pulsing40_0.tip, _1_Pulsing40_0.tim, _0_MockVariableIntBlock_0.skp, _0_Pulsing40_0.prx, _1.fnm, _1_Pulsing40_0.frq, _0_MockSep_0.skp, _3_MockSep_0.tib, _1_Pulsing40_0.prx, _2_Pulsing40_0.prx, _2_MockVariableIntBlock_0.pos, _1_MockSep_0.doc, _0.fnm, _3_MockVariableIntBlock_0.doc, _2_MockSep_0.tii, _2_MockSep_0.tib, _3_MockSep_0.tii, _2_Pulsing40_0.frq, _3_nrm.cfs, _3_MockVariableIntBlock_0.tib, _2_MockSep_0.pos, _1_MockSep_0.frq, _2_MockVariableIntBlock_0.frq, _0_MockVariableIntBlock_0.tib, _2_Memory_0.ram, _0_MockSep_0.doc, _0.si, _3_Memory_0.ram, _0_MockVariableIntBlock_0.tii, _1_nrm.cfs, _2_MockSep_0.frq, _0_nrm.cfs, _1_nrm.cfe, _0_MockSep_0.tib, _1_MockVariableIntBlock_0.frq, _3_Pulsing40_0.prx, _0_nrm.cfe, _0_MockSep_0.frq, _0.fdx, _0_MockSep_0.tii, _0_MockSep_0.pyl, _3_MockVariableIntBlock_0.skp, _0.fdt, segments_3]
[junit4:junit4]   2> 14094 T1364 C66 P28212 oasc.SolrDeletionPolicy.updateCommits newest commit = 2
[junit4:junit4]   2> 14095 T1376 C63 P28582 oasc.SolrDeletionPolicy.updateCommits newest commit = 3
[junit4:junit4]   2> 14104 T1376 C63 P28582 oass.SolrIndexSearcher.<init> Opening Searcher@10cc604e main
[junit4:junit4]   2> 14104 T1364 C66 P28212 oass.SolrIndexSearcher.<init> Opening Searcher@77c2b837 main
[junit4:junit4]   2> 14105 T1364 C66 P28212 oasu.DirectUpdateHandler2.commit end_commit_flush
[junit4:junit4]   2> 14105 T1376 C63 P28582 oasu.DirectUpdateHandler2.commit end_commit_flush
[junit4:junit4]   2> 14105 T1373 oasc.JmxMonitoredMap.put WARNING Failed to register info bean: searcher javax.management.InstanceNotFoundException: solr/collection1:type=searcher,id=org.apache.solr.search.SolrIndexSearcher
[junit4:junit4]   2> 	at com.sun.jmx.interceptor.DefaultMBeanServerInterceptor.getMBean(DefaultMBeanServerInterceptor.java:1095)
[junit4:junit4]   2> 	at com.sun.jmx.interceptor.DefaultMBeanServerInterceptor.exclusiveUnregisterMBean(DefaultMBeanServerInterceptor.java:427)
[junit4:junit4]   2> 	at com.sun.jmx.interceptor.DefaultMBeanServerInterceptor.unregisterMBean(DefaultMBeanServerInterceptor.java:415)
[junit4:junit4]   2> 	at com.sun.jmx.mbeanserver.JmxMBeanServer.unregisterMBean(JmxMBeanServer.java:536)
[junit4:junit4]   2> 	at org.apache.solr.core.JmxMonitoredMap.put(JmxMonitoredMap.java:138)
[junit4:junit4]   2> 	at org.apache.solr.core.JmxMonitoredMap.put(JmxMonitoredMap.java:51)
[junit4:junit4]   2> 	at org.apache.solr.search.SolrIndexSearcher.register(SolrIndexSearcher.java:242)
[junit4:junit4]   2> 	at org.apache.solr.core.SolrCore.registerSearcher(SolrCore.java:1691)
[junit4:junit4]   2> 	at org.apache.solr.core.SolrCore.access$000(SolrCore.java:124)
[junit4:junit4]   2> 	at org.apache.solr.core.SolrCore$7.call(SolrCore.java:1568)
[junit4:junit4]   2> 	at java.util.concurrent.FutureTask$Sync.innerRun(FutureTask.java:334)
[junit4:junit4]   2> 	at java.util.concurrent.FutureTask.run(FutureTask.java:166)
[junit4:junit4]   2> 	at java.util.concurrent.ThreadPoolExecutor.runWorker(ThreadPoolExecutor.java:1110)
[junit4:junit4]   2> 	at java.util.concurrent.ThreadPoolExecutor$Worker.run(ThreadPoolExecutor.java:603)
[junit4:junit4]   2> 	at java.lang.Thread.run(Thread.java:722)
[junit4:junit4]   2> 
[junit4:junit4]   2> 14106 T1385 oasc.SolrCore.registerSearcher [collection1] Registered new searcher Searcher@10cc604e main{StandardDirectoryReader(segments_3:10:nrt _0(4.1):C10 _1(4.1):C10 _2(4.1):C10 _3(4.1):C2)}
[junit4:junit4]   2> 14106 T1376 C63 P28582 /update {waitSearcher=true&commit=true&commit_end_point=true&expungeDeletes=false&wt=javabin&softCommit=false&version=2} {commit=} 0 354
[junit4:junit4]   2> 14107 T1373 oasc.SolrCore.registerSearcher [collection1] Registered new searcher Searcher@77c2b837 main{StandardDirectoryReader(segments_2:9:nrt _0(4.1):C10 _1(4.1):C10 _2(4.1):C10 _3(4.1):C5)}
[junit4:junit4]   2> 14108 T1364 C66 P28212 /update {waitSearcher=true&commit=true&commit_end_point=true&expungeDeletes=false&wt=javabin&softCommit=false&version=2} {commit=} 0 356
[junit4:junit4]   2> 14108 T1356 C64 P36395 /update {waitSearcher=true&wt=javabin&commit=true&softCommit=false&version=2} {commit=} 0 640
[junit4:junit4]   2> 14114 T1338 C65 P10318 REQ /select {distrib=false&sort=n_ti1+desc&wt=javabin&q=*:*&version=2} hits=67 status=0 QTime=3 
[junit4:junit4]   2> 14124 T1366 C66 P28212 REQ /select {sort=n_ti1+desc&distrib=false&wt=javabin&rows=10&version=2&fl=id&shard.url=127.0.0.1:28212/solr/collection1/&NOW=1349451522992&start=0&q=*:*&isShard=true&fsv=true} hits=35 status=0 QTime=2 
[junit4:junit4]   2> 14124 T1358 C64 P36395 REQ /select {sort=n_ti1+desc&distrib=false&wt=javabin&rows=10&version=2&fl=id&shard.url=127.0.0.1:36395/solr/collection1/|127.0.0.1:28582/solr/collection1/&NOW=1349451522992&start=0&q=*:*&isShard=true&fsv=true} hits=32 status=0 QTime=2 
[junit4:junit4]   2> 14130 T1366 C66 P28212 REQ /select {shard.url=127.0.0.1:28212/solr/collection1/&NOW=1349451522992&q=*:*&ids=134,128,115,137,119&distrib=false&isShard=true&wt=javabin&version=2} status=0 QTime=2 
[junit4:junit4]   2> 14131 T1358 C64 P36395 REQ /select {shard.url=127.0.0.1:36395/solr/collection1/|127.0.0.1:28582/solr/collection1/&NOW=1349451522992&q=*:*&ids=1,122,124,102,12&distrib=false&isShard=true&wt=javabin&version=2} status=0 QTime=2 
[junit4:junit4]   2> 14132 T1377 C63 P28582 REQ /select {sort=n_ti1+desc&wt=javabin&q=*:*&version=2} hits=67 status=0 QTime=14 
[junit4:junit4]   2> 14136 T1338 C65 P10318 REQ /select {distrib=false&sort=n_ti1+asc&wt=javabin&q=*:*&version=2} hits=67 status=0 QTime=0 
[junit4:junit4]   2> 14145 T1367 C66 P28212 REQ /select {sort=n_ti1+asc&distrib=false&wt=javabin&rows=10&version=2&fl=id&shard.url=127.0.0.1:28212/solr/collection1/&NOW=1349451523015&start=0&q=*:*&isShard=true&fsv=true} hits=35 status=0 QTime=0 
[junit4:junit4]   2> 14146 T1378 C63 P28582 REQ /select {sort=n_ti1+asc&distrib=false&wt=javabin&rows=10&version=2&fl=id&shard.url=127.0.0.1:36395/solr/collection1/|127.0.0.1:28582/solr/collection1/&NOW=1349451523015&start=0&q=*:*&isShard=true&fsv=true} hits=32 status=0 QTime=1 
[junit4:junit4]   2> 14151 T1378 C63 P28582 REQ /select {shard.url=127.0.0.1:36395/solr/collection1/|127.0.0.1:28582/solr/collection1/&NOW=1349451523015&q=*:*&ids=132,10,110&distrib=false&isShard=true&wt=javabin&version=2} status=0 QTime=1 
[junit4:junit4]   2> 14152 T1367 C66 P28212 REQ /select {shard.url=127.0.0.1:28212/solr/collection1/&NOW=1349451523015&q=*:*&ids=127,121,139,17,9,130,141&distrib=false&isShard=true&wt=javabin&version=2} status=0 QTime=2 
[junit4:junit4]   2> 14155 T1365 C66 P28212 REQ /select {sort=n_ti1+asc&wt=javabin&q=*:*&version=2} hits=67 status=0 QTime=14 
[junit4:junit4]   2> 14160 T1338 C65 P10318 REQ /select {distrib=false&sort=n_f1+desc&wt=javabin&q=*:*&version=2} hits=67 status=0 QTime=2 
[junit4:junit4]   2> 14162 T1326 oascsi.HttpClientUtil.createClient Creating new http client, config:
[junit4:junit4]   2> 14173 T1326 oaz.ZooKeeper.<init> Initiating client connection, connectString=127.0.0.1:26318/solr sessionTimeout=10000 watcher=org.apache.solr.common.cloud.ConnectionManager@68243809
[junit4:junit4]   2> 14174 T1399 oaz.ClientCnxn$SendThread.startConnect Opening socket connection to server /127.0.0.1:26318
[junit4:junit4]   2> 14174 T1326 oascc.ConnectionManager.waitForConnected Waiting for client to connect to ZooKeeper
[junit4:junit4]   2> 14175 T1399 oaz.ClientCnxn$SendThread.primeConnection Socket connection established to localhost/127.0.0.1:26318, initiating session
[junit4:junit4]   2> 14175 T1328 oazs.NIOServerCnxn$Factory.run Accepted socket connection from /140.211.11.196:65519
[junit4:junit4]   2> 14176 T1328 oazs.NIOServerCnxn.readConnectRequest Client attempting to establish new session at /140.211.11.196:65519
[junit4:junit4]   2> 14178 T1330 oazs.NIOServerCnxn.finishSessionInit Established session 0x13a3193ec930008 with negotiated timeout 10000 for client /140.211.11.196:65519
[junit4:junit4]   2> 14178 T1399 oaz.ClientCnxn$SendThread.readConnectResult Session establishment complete on server localhost/127.0.0.1:26318, sessionid = 0x13a3193ec930008, negotiated timeout = 10000
[junit4:junit4]   2> 14178 T1400 oascc.ConnectionManager.process Watcher org.apache.solr.common.cloud.ConnectionManager@68243809 name:ZooKeeperConnection Watcher:127.0.0.1:26318/solr got event WatchedEvent state:SyncConnected type:None path:null path:null type:None
[junit4:junit4]   2> 14179 T1326 oascc.ConnectionManager.waitForConnected Client is connected to ZooKeeper
[junit4:junit4]   2> 14179 T1326 oascc.ZkStateReader.createClusterStateWatchersAndUpdate Updating cluster state from ZooKeeper... 
[junit4:junit4]   2> 14191 T1358 C64 P36395 REQ /select {sort=n_f1+desc&distrib=false&wt=javabin&rows=10&version=2&fl=id&shard.url=127.0.0.1:36395/solr/collection1/|127.0.0.1:28582/solr/collection1/&NOW=1349451523061&start=0&q=*:*&isShard=true&fsv=true} hits=32 status=0 QTime=1 
[junit4:junit4]   2> 14191 T1366 C66 P28212 REQ /select {sort=n_f1+desc&distrib=false&wt=javabin&rows=10&version=2&fl=id&shard.url=127.0.0.1:28212/solr/collection1/&NOW=1349451523061&start=0&q=*:*&isShard=true&fsv=true} hits=35 status=0 QTime=1 
[junit4:junit4]   2> 14196 T1358 C64 P36395 REQ /select {shard.url=127.0.0.1:36395/solr/collection1/|127.0.0.1:28582/solr/collection1/&NOW=1349451523061&q=*:*&ids=114,122,129,14,100&distrib=false&isShard=true&wt=javabin&version=2} status=0 QTime=1 
[junit4:junit4]   2> 14197 T1366 C66 P28212 REQ /select {shard.url=127.0.0.1:28212/solr/collection1/&NOW=1349451523061&q=*:*&ids=112,105,9,131,119&distrib=false&isShard=true&wt=javabin&version=2} status=0 QTime=2 
[junit4:junit4]   2> 14199 T1379 C63 P28582 REQ /select {sort=n_f1+desc&wt=javabin&q=*:*&version=2} hits=67 status=0 QTime=12 
[junit4:junit4]   2> 14203 T1338 C65 P10318 REQ /select {distrib=false&sort=n_f1+asc&wt=javabin&q=*:*&version=2} hits=67 status=0 QTime=1 
[junit4:junit4]   2> 14211 T1380 C63 P28582 REQ /select {sort=n_f1+asc&distrib=false&wt=javabin&rows=10&version=2&fl=id&shard.url=127.0.0.1:36395/solr/collection1/|127.0.0.1:28582/solr/collection1/&NOW=1349451523081&start=0&q=*:*&isShard=true&fsv=true} hits=32 status=0 QTime=2 
[junit4:junit4]   2> 14211 T1366 C66 P28212 REQ /select {sort=n_f1+asc&distrib=false&wt=javabin&rows=10&version=2&fl=id&shard.url=127.0.0.1:28212/solr/collection1/&NOW=1349451523081&start=0&q=*:*&isShard=true&fsv=true} hits=35 status=0 QTime=1 
[junit4:junit4]   2> 14217 T1380 C63 P28582 REQ /select {shard.url=127.0.0.1:36395/solr/collection1/|127.0.0.1:28582/solr/collection1/&NOW=1349451523081&q=*:*&ids=135,146,133,148,108,123&distrib=false&isShard=true&wt=javabin&version=2} status=0 QTime=2 
[junit4:junit4]   2> 14217 T1366 C66 P28212 REQ /select {shard.url=127.0.0.1:28212/solr/collection1/&NOW=1349451523081&q=*:*&ids=144,6,17,103&distrib=false&isShard=true&wt=javabin&version=2} status=0 QTime=2 
[junit4:junit4]   2> 14220 T1377 C63 P28582 REQ /select {sort=n_f1+asc&wt=javabin&q=*:*&version=2} hits=67 status=0 QTime=13 
[junit4:junit4]   2> 14224 T1338 C65 P10318 REQ /select {distrib=false&sort=n_tf1+desc&wt=javabin&q=*:*&version=2} hits=67 status=0 QTime=1 
[junit4:junit4]   2> 14231 T1353 C64 P36395 REQ /select {sort=n_tf1+desc&distrib=false&collection=collection1&wt=javabin&rows=10&version=2&NOW=1349451523102&shard.url=127.0.0.1:36395/solr/collection1/|127.0.0.1:28582/solr/collection1/&fl=id&start=0&q=*:*&isShard=true&fsv=true} hits=32 status=0 QTime=1 
[junit4:junit4]   2> 14232 T1367 C66 P28212 REQ /select {sort=n_tf1+desc&distrib=false&collection=collection1&wt=javabin&rows=10&version=2&NOW=1349451523102&shard.url=127.0.0.1:28212/solr/collection1/&fl=id&start=0&q=*:*&isShard=true&fsv=true} hits=35 status=0 QTime=1 
[junit4:junit4]   2> 14237 T1353 C64 P36395 REQ /select {shard.url=127.0.0.1:36395/solr/collection1/|127.0.0.1:28582/solr/collection1/&NOW=1349451523102&q=*:*&ids=114,148,102,101&distrib=false&collection=collection1&isShard=true&wt=javabin&version=2} status=0 QTime=1 
[junit4:junit4]   2> 14238 T1367 C66 P28212 REQ /select {shard.url=127.0.0.1:28212/solr/collection1/&NOW=1349451523102&q=*:*&ids=117,127,7,137,104,130&distrib=false&collection=collection1&isShard=true&wt=javabin&version=2} status=0 QTime=2 
[junit4:junit4]   2> 14241 T1365 C66 P28212 REQ /select {collection=collection1&sort=n_tf1+desc&wt=javabin&q=*:*&version=2} hits=67 status=0 QTime=13 
[junit4:junit4]   2> 14245 T1338 C65 P10318 REQ /select {distrib=false&sort=n_tf1+asc&wt=javabin&q=*:*&version=2} hits=67 status=0 QTime=1 
[junit4:junit4]   2> 14266 T1367 C66 P28212 REQ /select {sort=n_tf1+asc&distrib=false&collection=collection1&wt=javabin&rows=10&version=2&fl=id&shard.url=127.0.0.1:28212/solr/collection1/&NOW=1349451523136&start=0&q=*:*&isShard=true&fsv=true} hits=35 status=0 QTime=1 
[junit4:junit4]   2> 14266 T1378 C63 P28582 REQ /select {sort=n_tf1+asc&distrib=false&collection=collection1&wt=javabin&rows=10&version=2&NOW=1349451523136&shard.url=127.0.0.1:36395/solr/collection1/|127.0.0.1:28582/solr/collection1/&fl=id&start=0&q=*:*&isShard=true&fsv=true} hits=32 status=0 QTime=1 
[junit4:junit4]   2> 14271 T1378 C63 P28582 REQ /select {shard.url=127.0.0.1:36395/solr/collection1/|127.0.0.1:28582/solr/collection1/&NOW=1349451523136&q=*:*&ids=10,109,4,15&distrib=false&collection=collection1&isShard=true&wt=javabin&version=2} status=0 QTime=1 
[junit4:junit4]   2> 14272 T1367 C66 P28212 REQ /select {shard.url=127.0.0.1:28212/solr/collection1/&NOW=1349451523136&q=*:*&ids=143,144,145,115,121,17&distrib=false&collection=collection1&isShard=true&wt=javabin&version=2} status=0 QTime=2 
[junit4:junit4]   2> 14275 T1368 C66 P28212 REQ /select {collection=collection1&sort=n_tf1+asc&wt=javabin&q=*:*&version=2} hits=67 status=0 QTime=13 
[junit4:junit4]   2> 14281 T1338 C65 P10318 REQ /select {distrib=false&sort=n_d1+desc&wt=javabin&q=*:*&version=2} hits=67 status=0 QTime=2 
[junit4:junit4]   2> 14290 T1369 C66 P28212 REQ /select {sort=n_d1+desc&distrib=false&collection=collection1&wt=javabin&rows=10&version=2&NOW=1349451523159&shard.url=127.0.0.1:28212/solr/collection1/&fl=id&start=0&q=*:*&isShard=true&fsv=true} hits=35 status=0 QTime=1 
[junit4:junit4]   2> 14290 T1403 C64 P36395 REQ /select {sort=n_d1+desc&distrib=false&collection=collection1&wt=javabin&rows=10&version=2&NOW=1349451523159&shard.url=127.0.0.1:36395/solr/collection1/|127.0.0.1:28582/solr/collection1/&fl=id&start=0&q=*:*&isShard=true&fsv=true} hits=32 status=0 QTime=1 
[junit4:junit4]   2> 14295 T1403 C64 P36395 REQ /select {shard.url=127.0.0.1:36395/solr/collection1/|127.0.0.1:28582/solr/collection1/&NOW=1349451523159&q=*:*&ids=135,114,16,101&distrib=false&collection=collection1&isShard=true&wt=javabin&version=2} status=0 QTime=1 
[junit4:junit4]   2> 14296 T1369 C66 P28212 REQ /select {shard.url=127.0.0.1:28212/solr/collection1/&NOW=1349451523159&q=*:*&ids=143,116,136,106,17,103&distrib=false&collection=collection1&isShard=true&wt=javabin&version=2} status=0 QTime=2 
[junit4:junit4]   2> 14298 T1354 C64 P36395 REQ /select {collection=collection1&sort=n_d1+desc&wt=javabin&q=*:*&version=2} hits=67 status=0 QTime=13 
[junit4:junit4]   2> 14303 T1338 C65 P10318 REQ /select {distrib=false&sort=n_d1+asc&wt=javabin&q=*:*&version=2} hits=67 status=0 QTime=1 
[junit4:junit4]   2> 14311 T1367 C66 P28212 REQ /select {sort=n_d1+asc&distrib=false&collection=collection1&wt=javabin&rows=10&version=2&fl=id&shard.url=127.0.0.1:28212/solr/collection1/&NOW=1349451523181&start=0&q=*:*&isShard=true&fsv=true} hits=35 status=0 QTime=1 
[junit4:junit4]   2> 14311 T1378 C63 P28582 REQ /select {sort=n_d1+asc&distrib=false&collection=collection1&wt=javabin&rows=10&version=2&fl=id&shard.url=127.0.0.1:36395/solr/collection1/|127.0.0.1:28582/solr/collection1/&NOW=1349451523181&start=0&q=*:*&isShard=true&fsv=true} hits=32 status=0 QTime=1 
[junit4:junit4]   2> 14317 T1378 C63 P28582 REQ /select {shard.url=127.0.0.1:36395/solr/collection1/|127.0.0.1:28582/solr/collection1/&NOW=1349451523181&q=*:*&ids=125,10,146,133,110&distrib=false&collection=collection1&isShard=true&wt=javabin&version=2} status=0 QTime=2 
[junit4:junit4]   2> 14317 T1367 C66 P28212 REQ /select {shard.url=127.0.0.1:28212/solr/collection1/&NOW=1349451523181&q=*:*&ids=2,145,121,105,130&distrib=false&collection=collection1&isShard=true&wt=javabin&version=2} status=0 QTime=2 
[junit4:junit4]   2> 14320 T1368 C66 P28212 REQ /select {collection=collection1&sort=n_d1+asc&wt=javabin&q=*:*&version=2} hits=67 status=0 QTime=13 
[junit4:junit4]   2> 14325 T1338 C65 P10318 REQ /select {distrib=false&sort=n_td1+desc&wt=javabin&q=*:*&version=2} hits=67 status=0 QTime=2 
[junit4:junit4]   2> 14334 T1358 C64 P36395 REQ /select {sort=n_td1+desc&distrib=false&wt=javabin&rows=10&version=2&fl=id&shard.url=127.0.0.1:36395/solr/collection1/|127.0.0.1:28582/solr/collection1/&NOW=1349451523203&start=0&q=*:*&isShard=true&fsv=true} hits=32 status=0 QTime=2 
[junit4:junit4]   2> 14334 T1366 C66 P28212 REQ /select {sort=n_td1+desc&distrib=false&wt=javabin&rows=10&version=2&fl=id&shard.url=127.0.0.1:28212/solr/collection1/&NOW=1349451523203&start=0&q=*:*&isShard=true&fsv=true} hits=35 status=0 QTime=2 
[junit4:junit4]   2> 14339 T1358 C64 P36395 REQ /select {shard.url=127.0.0.1:36395/solr/collection1/|127.0.0.1:28582/solr/collection1/&NOW=1349451523203&q=*:*&ids=132,109,13,100&distrib=false&isShard=true&wt=javabin&version=2} status=0 QTime=2 
[junit4:junit4]   2> 14339 T1366 C66 P28212 REQ /select {shard.url=127.0.0.1:28212/solr/collection1/&NOW=1349451523203&q=*:*&ids=2,126,139,137,131,119&distrib=false&isShard=true&wt=javabin&version=2} status=0 QTime=2 
[junit4:junit4]   2> 14342 T1377 C63 P28582 REQ /select {sort=n_td1+desc&wt=javabin&q=*:*&version=2} hits=67 status=0 QTime=13 
[junit4:junit4]   2> 14347 T1338 C65 P10318 REQ /select {distrib=false&sort=n_td1+asc&wt=javabin&q=*:*&version=2} hits=67 status=0 QTime=1 
[junit4:junit4]   2> 14355 T1403 C64 P36395 REQ /select {sort=n_td1+asc&distrib=false&wt=javabin&rows=10&version=2&fl=id&shard.url=127.0.0.1:36395/solr/collection1/|127.0.0.1:28582/solr/collection1/&NOW=1349451523225&start=0&q=*:*&isShard=true&fsv=true} hits=32 status=0 QTime=1 
[junit4:junit4]   2> 14355 T1369 C66 P28212 REQ /select {sort=n_td1+asc&distrib=false&wt=javabin&rows=10&version=2&fl=id&shard.url=127.0.0.1:28212/solr/collection1/&NOW=1349451523225&start=0&q=*:*&isShard=true&fsv=true} hits=35 status=0 QTime=1 
[junit4:junit4]   2> 14360 T1369 C66 P28212 REQ /select {shard.url=127.0.0.1:28212/solr/collection1/&NOW=1349451523225&q=*:*&ids=116,144,147,142&distrib=false&isShard=true&wt=javabin&version=2} status=0 QTime=1 
[junit4:junit4]   2> 14361 T1403 C64 P36395 REQ /select {shard.url=127.0.0.1:36395/solr/collection1/|127.0.0.1:28582/solr/collection1/&NOW=1349451523225&q=*:*&ids=146,108,124,102,14,12&distrib=false&isShard=true&wt=javabin&version=2} status=0 QTime=2 
[junit4:junit4]   2> 14363 T1356 C64 P36395 REQ /select {sort=n_td1+asc&wt=javabin&q=*:*&version=2} hits=67 status=0 QTime=12 
[junit4:junit4]   2> 14369 T1338 C65 P10318 REQ /select {distrib=false&sort=n_l1+desc&wt=javabin&q=*:*&version=2} hits=67 status=0 QTime=2 
[junit4:junit4]   2> 14376 T1381 C63 P28582 REQ /select {sort=n_l1+desc&distrib=false&collection=collection1&wt=javabin&rows=10&version=2&NOW=1349451523247&shard.url=127.0.0.1:36395/solr/collection1/|127.0.0.1:28582/solr/collection1/&fl=id&start=0&q=*:*&isShard=true&fsv=true} hits=32 status=0 QTime=1 
[junit4:junit4]   2> 14377 T1369 C66 P28212 REQ /select {sort=n_l1+desc&distrib=false&collection=collection1&wt=javabin&rows=10&version=2&fl=id&shard.url=127.0.0.1:28212/solr/collection1/&NOW=1349451523247&start=0&q=*:*&isShard=true&fsv=true} hits=35 status=0 QTime=1 
[junit4:junit4]   2> 14382 T1381 C63 P28582 REQ /select {shard.url=127.0.0.1:36395/solr/collection1/|127.0.0.1:28582/solr/collection1/&NOW=1349451523247&q=*:*&ids=133,108,4,107,16&distrib=false&collection=collection1&isShard=true&wt=javabin&version=2} status=0 QTime=2 
[junit4:junit4]   2> 14382 T1369 C66 P28212 REQ /select {shard.url=127.0.0.1:28212/solr/collection1/&NOW=1349451523247&q=*:*&ids=143,116,117,115,112&distrib=false&collection=collection1&isShard=true&wt=javabin&version=2} status=0 QTime=2 
[junit4:junit4]   2> 14385 T1356 C64 P36395 REQ /select {collection=collection1&sort=n_l1+desc&wt=javabin&q=*:*&version=2} hits=67 status=0 QTime=12 
[junit4:junit4]   2> 14390 T1338 C65 P10318 REQ /select {distrib=false&sort=n_l1+asc&wt=javabin&q=*:*&version=2} hits=67 status=0 QTime=1 
[junit4:junit4]   2> 14398 T1369 C66 P28212 REQ /select {sort=n_l1+asc&distrib=false&wt=javabin&rows=10&version=2&fl=id&shard.url=127.0.0.1:28212/solr/collection1/&NOW=1349451523268&start=0&q=*:*&isShard=true&fsv=true} hits=35 status=0 QTime=1 
[junit4:junit4]   2> 14398 T1381 C63 P28582 REQ /select {sort=n_l1+asc&distrib=false&wt=javabin&rows=10&version=2&fl=id&shard.url=127.0.0.1:36395/solr/collection1/|127.0.0.1:28582/solr/collection1/&NOW=1349451523268&start=0&q=*:*&isShard=true&fsv=true} hits=32 status=0 QTime=1 
[junit4:junit4]   2> 14402 T1381 C63 P28582 REQ /select {shard.url=127.0.0.1:36395/solr/collection1/|127.0.0.1:28582/solr/collection1/&NOW=1349451523268&q=*:*&ids=125,114,124,12&distrib=false&isShard=true&wt=javabin&version=2} status=0 QTime=1 
[junit4:junit4]   2> 14403 T1369 C66 P28212 REQ /select {shard.url=127.0.0.1:28212/solr/collection1/&NOW=1349451523268&q=*:*&ids=128,136,5,106,105,131&distrib=false&isShard=true&wt=javabin&version=2} status=0 QTime=2 
[junit4:junit4]   2> 14404 T1356 C64 P36395 REQ /select {sort=n_l1+asc&wt=javabin&q=*:*&version=2} hits=67 status=0 QTime=10 
[junit4:junit4]   2> 14410 T1338 C65 P10318 REQ /select {distrib=false&sort=n_tl1+desc&wt=javabin&q=*:*&version=2} hits=67 status=0 QTime=2 
[junit4:junit4]   2> 14419 T1403 C64 P36395 REQ /select {sort=n_tl1+desc&distrib=false&wt=javabin&rows=10&version=2&fl=id&shard.url=127.0.0.1:36395/solr/collection1/|127.0.0.1:28582/solr/collection1/&NOW=1349451523288&start=0&q=*:*&isShard=true&fsv=true} hits=32 status=0 QTime=2 
[junit4:junit4]   2> 14419 T1369 C66 P28212 REQ /select {sort=n_tl1+desc&distrib=false&wt=javabin&rows=10&version=2&fl=id&shard.url=127.0.0.1:28212/solr/collection1/&NOW=1349451523288&start=0&q=*:*&isShard=true&fsv=true} hits=35 status=0 QTime=2 
[junit4:junit4]   2> 14423 T1369 C66 P28212 REQ /select {shard.url=127.0.0.1:28212/solr/collection1/&NOW=1349451523288&q=*:*&ids=117,115,17&distrib=false&isShard=true&wt=javabin&version=2} status=0 QTime=1 
[junit4:junit4]   2> 14424 T1403 C64 P36395 REQ /select {shard.url=127.0.0.1:36395/solr/collection1/|127.0.0.1:28582/solr/collection1/&NOW=1349451523288&q=*:*&ids=135,146,122,148,107,4,11&distrib=false&isShard=true&wt=javabin&version=2} status=0 QTime=2 
[junit4:junit4]   2> 14429 T1356 C64 P36395 REQ /select {sort=n_tl1+desc&wt=javabin&q=*:*&version=2} hits=67 status=0 QTime=15 
[junit4:junit4]   2> 14434 T1338 C65 P10318 REQ /select {distrib=false&sort=n_tl1+asc&wt=javabin&q=*:*&version=2} hits=67 status=0 QTime=1 
[junit4:junit4]   2> 14440 T1367 C66 P28212 REQ /select {sort=n_tl1+asc&distrib=false&collection=collection1&wt=javabin&rows=10&version=2&fl=id&shard.url=127.0.0.1:28212/solr/collection1/&NOW=1349451523311&start=0&q=*:*&isShard=true&fsv=true} hits=35 status=0 QTime=0 
[junit4:junit4]   2> 14440 T1353 C64 P36395 REQ /select {sort=n_tl1+asc&distrib=false&collection=collection1&wt=javabin&rows=10&version=2&fl=id&shard.url=127.0.0.1:36395/solr/collection1/|127.0.0.1:28582/solr/collection1/&NOW=1349451523311&start=0&q=*:*&isShard=true&fsv=true} hits=32 status=0 QTime=1 
[junit4:junit4]   2> 14445 T1353 C64 P36395 REQ /select {shard.url=127.0.0.1:36395/solr/collection1/|127.0.0.1:28582/solr/collection1/&NOW=1349451523311&q=*:*&ids=109,108,110,124&distrib=false&collection=collection1&isShard=true&wt=javabin&version=2} status=0 QTime=1 
[junit4:junit4]   2> 14446 T1367 C66 P28212 REQ /select {shard.url=127.0.0.1:28212/solr/collection1/&NOW=1349451523311&q=*:*&ids=134,126,144,149,137,103&distrib=false&collection=collection1&isShard=true&wt=javabin&version=2} status=0 QTime=2 
[junit4:junit4]   2> 14448 T1368 C66 P28212 REQ /select {collection=collection1&sort=n_tl1+asc&wt=javabin&q=*:*&version=2} hits=67 status=0 QTime=11 
[junit4:junit4]   2> 14452 T1338 C65 P10318 REQ /select {distrib=false&sort=n_dt1+desc&wt=javabin&q=*:*&version=2} hits=67 status=0 QTime=1 
[junit4:junit4]   2> 14460 T1358 C64 P36395 REQ /select {sort=n_dt1+desc&distrib=false&wt=javabin&rows=10&version=2&fl=id&shard.url=127.0.0.1:36395/solr/collection1/|127.0.0.1:28582/solr/collection1/&NOW=1349451523330&start=0&q=*:*&isShard=true&fsv=true} hits=32 status=0 QTime=1 
[junit4:junit4]   2> 14460 T1366 C66 P28212 REQ /select {sort=n_dt1+desc&distrib=false&wt=javabin&rows=10&version=2&fl=id&shard.url=127.0.0.1:28212/solr/collection1/&NOW=1349451523330&start=0&q=*:*&isShard=true&fsv=true} hits=35 status=0 QTime=1 
[junit4:junit4]   2> 14465 T1358 C64 P36395 REQ /select {shard.url=127.0.0.1:36395/solr/collection1/|127.0.0.1:28582/solr/collection1/&NOW=1349451523330&q=*:*&ids=132,1,4,8&distrib=false&isShard=true&wt=javabin&version=2} status=0 QTime=1 
[junit4:junit4]   2> 14466 T1366 C66 P28212 REQ /select {shard.url=127.0.0.1:28212/solr/collection1/&NOW=1349451523330&q=*:*&ids=3,145,112,139,120,9&distrib=false&isShard=true&wt=javabin&version=2} status=0 QTime=2 
[junit4:junit4]   2> 14468 T1377 C63 P28582 REQ /select {sort=n_dt1+desc&wt=javabin&q=*:*&version=2} hits=67 status=0 QTime=12 
[junit4:junit4]   2> 14473 T1338 C65 P10318 REQ /select {distrib=false&sort=n_dt1+asc&wt=javabin&q=*:*&version=2} hits=67 status=0 QTime=1 
[junit4:junit4]   2> 14479 T1358 C64 P36395 REQ /select {sort=n_dt1+asc&distrib=false&collection=collection1&wt=javabin&rows=10&version=2&NOW=1349451523350&shard.url=127.0.0.1:36395/solr/collection1/|127.0.0.1:28582/solr/collection1/&fl=id&start=0&q=*:*&isShard=true&fsv=true} hits=32 status=0 QTime=1 
[junit4:junit4]   2> 14480 T1366 C66 P28212 REQ /select {sort=n_dt1+asc&distrib=false&collection=collection1&wt=javabin&rows=10&version=2&NOW=1349451523350&shard.url=127.0.0.1:28212/solr/collection1/&fl=id&start=0&q=*:*&isShard=true&fsv=true} hits=35 status=0 QTime=1 
[junit4:junit4]   2> 14484 T1358 C64 P36395 REQ /select {shard.url=127.0.0.1:36395/solr/collection1/|127.0.0.1:28582/solr/collection1/&NOW=1349451523350&q=*:*&ids=10,108,15,11&distrib=false&collection=collection1&isShard=true&wt=javabin&version=2} status=0 QTime=1 
[junit4:junit4]   2> 14485 T1366 C66 P28212 REQ /select {shard.url=127.0.0.1:28212/solr/collection1/&NOW=1349451523350&q=*:*&ids=144,115,17,105,104,140&distrib=false&collection=collection1&isShard=true&wt=javabin&version=2} status=0 QTime=2 
[junit4:junit4]   2> 14487 T1377 C63 P28582 REQ /select {collection=collection1&sort=n_dt1+asc&wt=javabin&q=*:*&version=2} hits=67 status=0 QTime=11 
[junit4:junit4]   2> 14491 T1338 C65 P10318 REQ /select {distrib=false&sort=n_tdt1+desc&wt=javabin&q=*:*&version=2} hits=67 status=0 QTime=1 
[junit4:junit4]   2> 14499 T1367 C66 P28212 REQ /select {sort=n_tdt1+desc&distrib=false&wt=javabin&rows=10&version=2&fl=id&shard.url=127.0.0.1:28212/solr/collection1/&NOW=1349451523369&start=0&q=*:*&isShard=true&fsv=true} hits=35 status=0 QTime=1 
[junit4:junit4]   2> 14499 T1378 C63 P28582 REQ /select {sort=n_tdt1+desc&distrib=false&wt=javabin&rows=10&version=2&fl=id&shard.url=127.0.0.1:36395/solr/collection1/|127.0.0.1:28582/solr/collection1/&NOW=1349451523369&start=0&q=*:*&isShard=true&fsv=true} hits=32 status=0 QTime=1 
[junit4:junit4]   2> 14502 T1367 C66 P28212 REQ /select {shard.url=127.0.0.1:28212/solr/collection1/&NOW=1349451523369&q=*:*&ids=126,149,5,137,106&distrib=false&isShard=true&wt=javabin&version=2} status=0 QTime=1 
[junit4:junit4]   2> 14508 T1378 C63 P28582 REQ /select {shard.url=127.0.0.1:36395/solr/collection1/|127.0.0.1:28582/solr/collection1/&NOW=1349451523369&q=*:*&ids=125,148,123,101,12&distrib=false&isShard=true&wt=javabin&version=2} status=0 QTime=5 
[junit4:junit4]   2> 14510 T1365 C66 P28212 REQ /select {sort=n_tdt1+desc&wt=javabin&q=*:*&version=2} hits=67 status=0 QTime=15 
[junit4:junit4]   2> 14514 T1338 C65 P10318 REQ /select {distrib=false&sort=n_tdt1+asc&wt=javabin&q=*:*&version=2} hits=67 status=0 QTime=1 
[junit4:junit4]   2> 14518 T1369 C66 P28212 REQ /select {sort=n_tdt1+asc&distrib=false&collection=collection1&wt=javabin&rows=10&version=2&fl=id&shard.url=127.0.0.1:28212/solr/collection1/&NOW=1349451523390&start=0&q=*:*&isShard=true&fsv=true} hits=35 status=0 QTime=0 
[junit4:junit4]   2> 14519 T1381 C63 P28582 REQ /select {sort=n_tdt1+asc&distrib=false&collection=collection1&wt=javabin&rows=10&version=2&fl=id&shard.url=127.0.0.1:36395/solr/collection1/|127.0.0.1:28582/solr/collection1/&NOW=1349451523390&start=0&q=*:*&isShard=true&fsv=true} hits=32 status=0 QTime=1 
[junit4:junit4]   2> 14523 T1381 C63 P28582 REQ /select {shard.url=127.0.0.1:36395/solr/collection1/|127.0.0.1:28582/solr/collection1/&NOW=1349451523390&q=*:*&ids=122,8,129,13&distrib=false&collection=collection1&isShard=true&wt=javabin&version=2} status=0 QTime=1 
[junit4:junit4]   2> 14524 T1369 C66 P28212 REQ /select {shard.url=127.0.0.1:28212/solr/collection1/&NOW=1349451523390&q=*:*&ids=144,112,121,139,136,142&distrib=false&collection=collection1&isShard=true&wt=javabin&version=2} status=0 QTime=2 
[junit4:junit4]   2> 14526 T1356 C64 P36395 REQ /select {collection=collection1&sort=n_tdt1+asc&wt=javabin&q=*:*&version=2} hits=67 status=0 QTime=10 
[junit4:junit4]   2> 14530 T1338 C65 P10318 REQ /select {distrib=false&sort=a_si+desc&wt=javabin&q=*:*&version=2} hits=67 status=0 QTime=1 
[junit4:junit4]   2> 14538 T1380 C63 P28582 REQ /select {sort=a_si+desc&distrib=false&collection=collection1&wt=javabin&rows=10&version=2&NOW=1349451523408&shard.url=127.0.0.1:36395/solr/collection1/|127.0.0.1:28582/solr/collection1/&fl=id&start=0&q=*:*&isShard=true&fsv=true} hits=32 status=0 QTime=1 
[junit4:junit4]   2> 14538 T1366 C66 P28212 REQ /select {sort=a_si+desc&distrib=false&collection=collection1&wt=javabin&rows=10&version=2&fl=id&shard.url=127.0.0.1:28212/solr/collection1/&NOW=1349451523408&start=0&q=*:*&isShard=true&fsv=true} hits=35 status=0 QTime=1 
[junit4:junit4]   2> 14543 T1366 C66 P28212 REQ /select {shard.url=127.0.0.1:28212/solr/collection1/&NOW=1349451523408&q=*:*&ids=3,2,7,5,9&distrib=false&collection=collection1&isShard=true&wt=javabin&version=2} status=0 QTime=1 
[junit4:junit4]   2> 14544 T1380 C63 P28582 REQ /select {shard.url=127.0.0.1:36395/solr/collection1/|127.0.0.1:28582/solr/collection1/&NOW=1349451523408&q=*:*&ids=10,1,8,13,12&distrib=false&collection=collection1&isShard=true&wt=javabin&version=2} status=0 QTime=2 
[junit4:junit4]   2> 14546 T1379 C63 P28582 REQ /select {collection=collection1&sort=a_si+desc&wt=javabin&q=*:*&version=2} hits=67 status=0 QTime=12 
[junit4:junit4]   2> 14551 T1338 C65 P10318 REQ /select {distrib=false&sort=a_si+asc&wt=javabin&q=*:*&version=2} hits=67 status=0 QTime=1 
[junit4:junit4]   2> 14559 T1369 C66 P28212 REQ /select {sort=a_si+asc&distrib=false&collection=collection1&wt=javabin&rows=10&version=2&fl=id&shard.url=127.0.0.1:28212/solr/collection1/&NOW=1349451523429&start=0&q=*:*&isShard=true&fsv=true} hits=35 status=0 QTime=1 
[junit4:junit4]   2> 14559 T1403 C64 P36395 REQ /select {sort=a_si+asc&distrib=false&collection=collection1&wt=javabin&rows=10&version=2&fl=id&shard.url=127.0.0.1:36395/solr/collection1/|127.0.0.1:28582/solr/collection1/&NOW=1349451523429&start=0&q=*:*&isShard=true&fsv=true} hits=32 status=0 QTime=1 
[junit4:junit4]   2> 14564 T1369 C66 P28212 REQ /select {shard.url=127.0.0.1:28212/solr/collection1/&NOW=1349451523429&q=*:*&ids=3,2,7,6,9&distrib=false&collection=collection1&isShard=true&wt=javabin&version=2} status=0 QTime=1 
[junit4:junit4]   2> 14565 T1403 C64 P36395 REQ /select {shard.url=127.0.0.1:36395/solr/collection1/|127.0.0.1:28582/solr/collection1/&NOW=1349451523429&q=*:*&ids=1,4,13,11,12&distrib=false&collection=collection1&isShard=true&wt=javabin&version=2} status=0 QTime=1 
[junit4:junit4]   2> 14568 T1356 C64 P36395 REQ /select {collection=collection1&sort=a_si+asc&wt=javabin&q=*:*&version=2} hits=67 status=0 QTime=13 
[junit4:junit4]   2> 14572 T1338 C65 P10318 REQ /select {sort=a_si+desc&fl=*,score&q=*:*&distrib=false&wt=javabin&version=2} hits=67 status=0 QTime=1 
[junit4:junit4]   2> 14579 T1366 C66 P28212 REQ /select {sort=a_si+desc&distrib=false&wt=javabin&rows=10&version=2&fl=id,score&shard.url=127.0.0.1:28212/solr/collection1/&NOW=1349451523450&start=0&q=*:*&isShard=true&fsv=true} hits=35 status=0 QTime=0 
[junit4:junit4]   2> 14580 T1380 C63 P28582 REQ /select {sort=a_si+desc&distrib=false&wt=javabin&rows=10&version=2&fl=id,score&shard.url=127.0.0.1:36395/solr/collection1/|127.0.0.1:28582/solr/collection1/&NOW=1349451523450&start=0&q=*:*&isShard=true&fsv=true} hits=32 status=0 QTime=1 
[junit4:junit4]   2> 14584 T1366 C66 P28212 REQ /select {fl=*,score&shard.url=127.0.0.1:28212/solr/collection1/&NOW=1349451523450&q=*:*&ids=3,2,7,5,9&distrib=false&isShard=true&wt=javabin&version=2} status=0 QTime=1 
[junit4:junit4]   2> 14585 T1380 C63 P28582 REQ /select {fl=*,score&shard.url=127.0.0.1:36395/solr/collection1/|127.0.0.1:28582/solr/collection1/&NOW=1349451523450&q=*:*&ids=10,1,8,13,12&distrib=false&isShard=true&wt=javabin&version=2} status=0 QTime=2 
[junit4:junit4]   2> 14587 T1379 C63 P28582 REQ /select {sort=a_si+desc&fl=*,score&wt=javabin&q=*:*&version=2} hits=67 status=0 QTime=11 
[junit4:junit4]   2> 14591 T1338 C65 P10318 REQ /select {sort=n_tl1+asc&fl=*,score&q=*:*&distrib=false&wt=javabin&version=2} hits=67 status=0 QTime=1 
[junit4:junit4]   2> 14599 T1367 C66 P28212 REQ /select {sort=n_tl1+asc&distrib=false&collection=collection1&wt=javabin&rows=10&version=2&fl=id,score&shard.url=127.0.0.1:28212/solr/collection1/&NOW=1349451523469&start=0&q=*:*&isShard=true&fsv=true} hits=35 status=0 QTime=1 
[junit4:junit4]   2> 14599 T1378 C63 P28582 REQ /select {sort=n_tl1+asc&distrib=false&collection=collection1&wt=javabin&rows=10&version=2&fl=id,score&shard.url=127.0.0.1:36395/solr/collection1/|127.0.0.1:28582/solr/collection1/&NOW=1349451523469&start=0&q=*:*&isShard=true&fsv=true} hits=32 status=0 QTime=1 
[junit4:junit4]   2> 14605 T1378 C63 P28582 REQ /select {fl=*,score&shard.url=127.0.0.1:36395/solr/collection1/|127.0.0.1:28582/solr/collection1/&NOW=1349451523469&q=*:*&ids=109,108,110,124&distrib=false&collection=collection1&isShard=true&wt=javabin&version=2} status=0 QTime=2 
[junit4:junit4]   2> 14605 T1367 C66 P28212 REQ /select {fl=*,score&shard.url=127.0.0.1:28212/solr/collection1/&NOW=1349451523469&q=*:*&ids=134,126,144,149,137,103&distrib=false&collection=collection1&isShard=true&wt=javabin&version=2} status=0 QTime=2 
[junit4:junit4]   2> 14607 T1365 C66 P28212 REQ /select {sort=n_tl1+asc&fl=*,score&q=*:*&collection=collection1&wt=javabin&version=2} hits=67 status=0 QTime=12 
[junit4:junit4]   2> 14611 T1338 C65 P10318 REQ /select {distrib=false&sort=n_tl1+desc&wt=javabin&q=*:*&version=2} hits=67 status=0 QTime=0 
[junit4:junit4]   2> 14620 T1367 C66 P28212 REQ /select {sort=n_tl1+desc&distrib=false&collection=collection1&wt=javabin&rows=10&version=2&fl=id&shard.url=127.0.0.1:28212/solr/collection1/&NOW=1349451523490&start=0&q=*:*&isShard=true&fsv=true} hits=35 status=0 QTime=1 
[junit4:junit4]   2> 14620 T1378 C63 P28582 REQ /select {sort=n_tl1+desc&distrib=false&collection=collection1&wt=javabin&rows=10&version=2&fl=id&shard.url=127.0.0.1:36395/solr/collection1/|127.0.0.1:28582/solr/collection1/&NOW=1349451523490&start=0&q=*:*&isShard=true&fsv=true} hits=32 status=0 QTime=1 
[junit4:junit4]   2> 14625 T1367 C66 P28212 REQ /select {shard.url=127.0.0.1:28212/solr/collection1/&NOW=1349451523490&q=*:*&ids=117,115,17&distrib=false&collection=collection1&isShard=true&wt=javabin&version=2} status=0 QTime=1 
[junit4:junit4]   2> 14627 T1378 C63 P28582 REQ /select {shard.url=127.0.0.1:36395/solr/collection1/|127.0.0.1:28582/solr/collection1/&NOW=1349451523490&q=*:*&ids=135,146,122,148,107,4,11&distrib=false&collection=collection1&isShard=true&wt=javabin&version=2} status=0 QTime=3 
[junit4:junit4]   2> 14629 T1368 C66 P28212 REQ /select {collection=collection1&sort=n_tl1+desc&wt=javabin&q=*:*&version=2} hits=67 status=0 QTime=13 
[junit4:junit4]   2> 14664 T1338 C65 P10318 REQ /select {distrib=false&wt=javabin&q={!func}a_si&version=2} hits=67 status=0 QTime=31 
[junit4:junit4]   2> 14673 T1367 C66 P28212 REQ /select {distrib=false&collection=collection1&wt=javabin&rows=10&version=2&fl=id,score&shard.url=127.0.0.1:28212/solr/collection1/&NOW=1349451523543&start=0&q={!func}a_si&isShard=true&fsv=true} hits=35 status=0 QTime=1 
[junit4:junit4]   2> 14673 T1353 C64 P36395 REQ /select {distrib=false&collection=collection1&wt=javabin&rows=10&version=2&fl=id,score&shard.url=127.0.0.1:36395/solr/collection1/|127.0.0.1:28582/solr/collection1/&NOW=1349451523543&start=0&q={!func}a_si&isShard=true&fsv=true} hits=32 status=0 QTime=1 
[junit4:junit4]   2> 14678 T1367 C66 P28212 REQ /select {shard.url=127.0.0.1:28212/solr/collection1/&NOW=1349451523543&q={!func}a_si&ids=3,2,7,5,9&distrib=false&collection=collection1&isShard=true&wt=javabin&version=2} status=0 QTime=1 
[junit4:junit4]   2> 14679 T1353 C64 P36395 REQ /select {shard.url=127.0.0.1:36395/solr/collection1/|127.0.0.1:28582/solr/collection1/&NOW=1349451523543&q={!func}a_si&ids=10,1,8,13,12&distrib=false&collection=collection1&isShard=true&wt=javabin&version=2} status=0 QTime=2 
[junit4:junit4]   2> 14682 T1365 C66 P28212 REQ /select {collection=collection1&wt=javabin&q={!func}a_si&version=2} hits=67 status=0 QTime=13 
[junit4:junit4]   2> 14685 T1338 C65 P10318 REQ /select {distrib=false&fl=*,score&wt=javabin&q={!func}a_si&version=2} hits=67 status=0 QTime=0 
[junit4:junit4]   2> 14692 T1367 C66 P28212 REQ /select {distrib=false&collection=collection1&wt=javabin&rows=10&version=2&fl=id,score&shard.url=127.0.0.1:28212/solr/collection1/&NOW=1349451523564&start=0&q={!func}a_si&isShard=true&fsv=true} hits=35 status=0 QTime=0 
[junit4:junit4]   2> 14692 T1353 C64 P36395 REQ /select {distrib=false&collection=collection1&wt=javabin&rows=10&version=2&fl=id,score&shard.url=127.0.0.1:36395/solr/collection1/|127.0.0.1:28582/solr/collection1/&NOW=1349451523564&start=0&q={!func}a_si&isShard=true&fsv=true} hits=32 status=0 QTime=0 
[junit4:junit4]   2> 14697 T1367 C66 P28212 REQ /select {fl=*,score&shard.url=127.0.0.1:28212/solr/collection1/&NOW=1349451523564&q={!func}a_si&ids=3,2,7,5,9&distrib=false&collection=collection1&isShard=true&wt=javabin&version=2} status=0 QTime=1 
[junit4:junit4]   2> 14698 T1353 C64 P36395 REQ /select {fl=*,score&shard.url=127.0.0.1:36395/solr/collection1/|127.0.0.1:28582/solr/collection1/&NOW=1349451523564&q={!func}a_si&ids=10,1,8,13,12&distrib=false&collection=collection1&isShard=true&wt=javabin&version=2} status=0 QTime=2 
[junit4:junit4]   2> 14700 T1365 C66 P28212 REQ /select {collection=collection1&fl=*,score&wt=javabin&q={!func}a_si&version=2} hits=67 status=0 QTime=10 
[junit4:junit4]   2> 14705 T1338 C65 P10318 REQ /select {distrib=false&wt=javabin&q=quick&version=2} hits=2 status=0 QTime=1 
[junit4:junit4]   2> 14713 T1369 C66 P28212 REQ /select {distrib=false&collection=collection1&wt=javabin&rows=10&version=2&fl=id,score&shard.url=127.0.0.1:28212/solr/collection1/&NOW=1349451523583&start=0&q=quick&isShard=true&fsv=true} hits=1 status=0 QTime=1 
[junit4:junit4]   2> 14713 T1381 C63 P28582 REQ /select {distrib=false&collection=collection1&wt=javabin&rows=10&version=2&fl=id,score&shard.url=127.0.0.1:36395/solr/collection1/|127.0.0.1:28582/solr/collection1/&NOW=1349451523583&start=0&q=quick&isShard=true&fsv=true} hits=1 status=0 QTime=1 
[junit4:junit4]   2> 14716 T1369 C66 P28212 REQ /select {shard.url=127.0.0.1:28212/solr/collection1/&NOW=1349451523583&q=quick&ids=5&distrib=false&collection=collection1&isShard=true&wt=javabin&version=2} status=0 QTime=0 
[junit4:junit4]   2> 14716 T1381 C63 P28582 REQ /select {shard.url=127.0.0.1:36395/solr/collection1/|127.0.0.1:28582/solr/collection1/&NOW=1349451523583&q=quick&ids=4&distrib=false&collection=collection1&isShard=true&wt=javabin&version=2} status=0 QTime=0 
[junit4:junit4]   2> 14717 T1354 C64 P36395 REQ /select {collection=collection1&wt=javabin&q=quick&version=2} hits=2 status=0 QTime=8 
[junit4:junit4]   2> 14721 T1338 C65 P10318 REQ /select {fl=id&start=0&q=all&distrib=false&wt=javabin&version=2} hits=2 status=0 QTime=1 
[junit4:junit4]   2> 14727 T1369 C66 P28212 REQ /select {fl=id,score&shard.url=127.0.0.1:28212/solr/collection1/&NOW=1349451523598&start=0&q=all&distrib=false&isShard=true&wt=javabin&fsv=true&rows=10&version=2} hits=0 status=0 QTime=0 
[junit4:junit4]   2> 14727 T1381 C63 P28582 REQ /select {fl=id,score&shard.url=127.0.0.1:36395/solr/collection1/|127.0.0.1:28582/solr/collection1/&NOW=1349451523598&start=0&q=all&distrib=false&isShard=true&wt=javabin&fsv=true&rows=10&version=2} hits=2 status=0 QTime=0 
[junit4:junit4]   2> 14731 T1381 C63 P28582 REQ /select {fl=id&shard.url=127.0.0.1:36395/solr/collection1/|127.0.0.1:28582/solr/collection1/&NOW=1349451523598&start=0&q=all&ids=1,8&distrib=false&isShard=true&wt=javabin&version=2} status=0 QTime=1 
[junit4:junit4]   2> 14731 T1356 C64 P36395 REQ /select {fl=id&wt=javabin&start=0&q=all&version=2} hits=2 status=0 QTime=7 
[junit4:junit4]   2> 14734 T1338 C65 P10318 REQ /select {fl=foofoofoo&start=0&q=all&distrib=false&wt=javabin&version=2} hits=2 status=0 QTime=0 
[junit4:junit4]   2> 14740 T1367 C66 P28212 REQ /select {distrib=false&collection=collection1&wt=javabin&rows=10&version=2&fl=id,score&shard.url=127.0.0.1:28212/solr/collection1/&NOW=1349451523611&start=0&q=all&isShard=true&fsv=true} hits=0 status=0 QTime=0 
[junit4:junit4]   2> 14740 T1378 C63 P28582 REQ /select {distrib=false&collection=collection1&wt=javabin&rows=10&version=2&fl=id,score&shard.url=127.0.0.1:36395/solr/collection1/|127.0.0.1:28582/solr/collection1/&NOW=1349451523611&start=0&q=all&isShard=true&fsv=true} hits=2 status=0 QTime=0 
[junit4:junit4]   2> 14745 T1378 C63 P28582 REQ /select {fl=foofoofoo&fl=id&shard.url=127.0.0.1:36395/solr/collection1/|127.0.0.1:28582/solr/collection1/&NOW=1349451523611&start=0&q=all&ids=1,8&distrib=false&collection=collection1&isShard=true&wt=javabin&version=2} status=0 QTime=1 
[junit4:junit4]   2> 14746 T1368 C66 P28212 REQ /select {fl=foofoofoo&start=0&q=all&collection=collection1&wt=javabin&version=2} hits=2 status=0 QTime=9 
[junit4:junit4]   2> 14749 T1338 C65 P10318 REQ /select {fl=id&start=100&q=all&distrib=false&wt=javabin&version=2} hits=2 status=0 QTime=0 
[junit4:junit4]   2> 14756 T1367 C66 P28212 REQ /select {fl=id,score&shard.url=127.0.0.1:28212/solr/collection1/&NOW=1349451523626&start=0&q=all&distrib=false&isShard=true&wt=javabin&fsv=true&rows=110&version=2} hits=0 status=0 QTime=1 
[junit4:junit4]   2> 14756 T1353 C64 P36395 REQ /select {fl=id,score&shard.url=127.0.0.1:36395/solr/collection1/|127.0.0.1:28582/solr/collection1/&NOW=1349451523626&start=0&q=all&distrib=false&isShard=true&wt=javabin&fsv=true&rows=110&version=2} hits=2 status=0 QTime=1 
[junit4:junit4]   2> 14757 T1365 C66 P28212 REQ /select {fl=id&wt=javabin&start=100&q=all&version=2} hits=2 status=0 QTime=5 
[junit4:junit4]   2> 14761 T1338 C65 P10318 REQ /select {distrib=false&fl=*,score&wt=javabin&q=quick&version=2} hits=2 status=0 QTime=1 
[junit4:junit4]   2> 14767 T1381 C63 P28582 REQ /select {fl=id,score&shard.url=127.0.0.1:36395/solr/collection1/|127.0.0.1:28582/solr/collection1/&NOW=1349451523638&start=0&q=quick&distrib=false&isShard=true&wt=javabin&fsv=true&rows=10&version=2} hits=1 status=0 QTime=0 
[junit4:junit4]   2> 14767 T1369 C66 P28212 REQ /select {fl=id,score&shard.url=127.0.0.1:28212/solr/collection1/&NOW=1349451523638&start=0&q=quick&distrib=false&isShard=true&wt=javabin&fsv=true&rows=10&version=2} hits=1 status=0 QTime=0 
[junit4:junit4]   2> 14771 T1381 C63 P28582 REQ /select {fl=*,score&shard.url=127.0.0.1:36395/solr/collection1/|127.0.0.1:28582/solr/collection1/&NOW=1349451523638&q=quick&ids=4&distrib=false&isShard=true&wt=javabin&version=2} status=0 QTime=1 
[junit4:junit4]   2> 14771 T1369 C66 P28212 REQ /select {fl=*,score&shard.url=127.0.0.1:28212/solr/collection1/&NOW=1349451523638&q=quick&ids=5&distrib=false&isShard=true&wt=javabin&version=2} status=0 QTime=1 
[junit4:junit4]   2> 14772 T1356 C64 P36395 REQ /select {fl=

[...truncated too long message...]

st.java:90)
[junit4:junit4]    > 	at org.apache.solr.client.solrj.SolrServer.query(SolrServer.java:301)
[junit4:junit4]    > 	at org.apache.solr.cloud.BasicDistributedZkTest.testCollectionsAPI(BasicDistributedZkTest.java:418)
[junit4:junit4]    > 	at org.apache.solr.cloud.BasicDistributedZkTest.doTest(BasicDistributedZkTest.java:331)
[junit4:junit4]    > 	at org.apache.solr.BaseDistributedSearchTestCase.testDistribSearch(BaseDistributedSearchTestCase.java:695)
[junit4:junit4]    > 	at sun.reflect.NativeMethodAccessorImpl.invoke0(Native Method)
[junit4:junit4]    > 	at sun.reflect.NativeMethodAccessorImpl.invoke(NativeMethodAccessorImpl.java:57)
[junit4:junit4]    > 	at sun.reflect.DelegatingMethodAccessorImpl.invoke(DelegatingMethodAccessorImpl.java:43)
[junit4:junit4]    > 	at java.lang.reflect.Method.invoke(Method.java:601)
[junit4:junit4]    > 	at com.carrotsearch.randomizedtesting.RandomizedRunner.invoke(RandomizedRunner.java:1559)
[junit4:junit4]    > 	at com.carrotsearch.randomizedtesting.RandomizedRunner.access$600(RandomizedRunner.java:79)
[junit4:junit4]    > 	at com.carrotsearch.randomizedtesting.RandomizedRunner$6.evaluate(RandomizedRunner.java:737)
[junit4:junit4]    > 	at com.carrotsearch.randomizedtesting.RandomizedRunner$7.evaluate(RandomizedRunner.java:773)
[junit4:junit4]    > 	at com.carrotsearch.randomizedtesting.RandomizedRunner$8.evaluate(RandomizedRunner.java:787)
[junit4:junit4]    > 	at com.carrotsearch.randomizedtesting.rules.SystemPropertiesRestoreRule$1.evaluate(SystemPropertiesRestoreRule.java:53)
[junit4:junit4]    > 	at org.apache.lucene.util.TestRuleSetupTeardownChained$1.evaluate(TestRuleSetupTeardownChained.java:50)
[junit4:junit4]    > 	at org.apache.lucene.util.TestRuleFieldCacheSanity$1.evaluate(TestRuleFieldCacheSanity.java:51)
[junit4:junit4]    > 	at org.apache.lucene.util.AbstractBeforeAfterRule$1.evaluate(AbstractBeforeAfterRule.java:45)
[junit4:junit4]    > 	at com.carrotsearch.randomizedtesting.rules.SystemPropertiesInvariantRule$1.evaluate(SystemPropertiesInvariantRule.java:55)
[junit4:junit4]    > 	at org.apache.lucene.util.TestRuleThreadAndTestName$1.evaluate(TestRuleThreadAndTestName.java:48)
[junit4:junit4]    > 	at org.apache.lucene.util.TestRuleIgnoreAfterMaxFailures$1.evaluate(TestRuleIgnoreAfterMaxFailures.java:70)
[junit4:junit4]    > 	at org.apache.lucene.util.TestRuleMarkFailure$1.evaluate(TestRuleMarkFailure.java:48)
[junit4:junit4]    > 	at com.carrotsearch.randomizedtesting.rules.StatementAdapter.evaluate(StatementAdapter.java:36)
[junit4:junit4]    > 	at com.carrotsearch.randomizedtesting.ThreadLeakControl$StatementRunner.run(ThreadLeakControl.java:358)
[junit4:junit4]    > 	at com.carrotsearch.randomizedtesting.ThreadLeakControl.forkTimeoutingTask(ThreadLeakControl.java:782)
[junit4:junit4]    > 	at com.carrotsearch.randomizedtesting.ThreadLeakControl$3.evaluate(ThreadLeakControl.java:442)
[junit4:junit4]    > 	at com.carrotsearch.randomizedtesting.RandomizedRunner.runSingleTest(RandomizedRunner.java:746)
[junit4:junit4]    > 	at com.carrotsearch.randomizedtesting.RandomizedRunner$3.evaluate(RandomizedRunner.java:648)
[junit4:junit4]    > 	at com.carrotsearch.randomizedtesting.RandomizedRunner$4.evaluate(RandomizedRunner.java:682)
[junit4:junit4]    > 	at com.carrotsearch.randomizedtesting.RandomizedRunner$5.evaluate(RandomizedRunner.java:693)
[junit4:junit4]    > 	at com.carrotsearch.randomizedtesting.rules.StatementAdapter.evaluate(StatementAdapter.java:36)
[junit4:junit4]    > 	at com.carrotsearch.randomizedtesting.rules.SystemPropertiesRestoreRule$1.evaluate(SystemPropertiesRestoreRule.java:53)
[junit4:junit4]    > 	at org.apache.lucene.util.AbstractBeforeAfterRule$1.evaluate(AbstractBeforeAfterRule.java:45)
[junit4:junit4]    > 	at org.apache.lucene.util.TestRuleStoreClassName$1.evaluate(TestRuleStoreClassName.java:42)
[junit4:junit4]    > 	at com.carrotsearch.randomizedtesting.rules.SystemPropertiesInvariantRule$1.evaluate(SystemPropertiesInvariantRule.java:55)
[junit4:junit4]    > 	at com.carrotsearch.randomizedtesting.rules.NoShadowingOrOverridesOnMethodsRule$1.evaluate(NoShadowingOrOverridesOnMethodsRule.java:39)
[junit4:junit4]    > 	at com.carrotsearch.randomizedtesting.rules.NoShadowingOrOverridesOnMethodsRule$1.evaluate(NoShadowingOrOverridesOnMethodsRule.java:39)
[junit4:junit4]    > 	at com.carrotsearch.randomizedtesting.rules.StatementAdapter.evaluate(StatementAdapter.java:36)
[junit4:junit4]    > 	at org.apache.lucene.util.TestRuleAssertionsRequired$1.evaluate(TestRuleAssertionsRequired.java:43)
[junit4:junit4]    > 	at org.apache.lucene.util.TestRuleMarkFailure$1.evaluate(TestRuleMarkFailure.java:48)
[junit4:junit4]    > 	at org.apache.lucene.util.TestRuleIgnoreAfterMaxFailures$1.evaluate(TestRuleIgnoreAfterMaxFailures.java:70)
[junit4:junit4]    > 	at org.apache.lucene.util.TestRuleIgnoreTestSuites$1.evaluate(TestRuleIgnoreTestSuites.java:55)
[junit4:junit4]    > 	at com.carrotsearch.randomizedtesting.rules.StatementAdapter.evaluate(StatementAdapter.java:36)
[junit4:junit4]    > 	at com.carrotsearch.randomizedtesting.ThreadLeakControl$StatementRunner.run(ThreadLeakControl.java:358)
[junit4:junit4]    > 	at java.lang.Thread.run(Thread.java:722)
[junit4:junit4]   2> 611162 T1326 oas.SolrTestCaseJ4.deleteCore ###deleteCore
[junit4:junit4]   2> NOTE: test params are: codec=Lucene40: {n_f1=PostingsFormat(name=MockSep), foo_b=Pulsing40(freqCutoff=3 minBlockSize=4 maxBlockSize=85), cat=PostingsFormat(name=Memory doPackFST= true), foo_d=MockVariableIntBlock(baseBlockSize=37), foo_f=Pulsing40(freqCutoff=3 minBlockSize=4 maxBlockSize=85), n_tl1=PostingsFormat(name=MockSep), n_d1=PostingsFormat(name=Memory doPackFST= true), rnd_b=MockVariableIntBlock(baseBlockSize=37), intDefault=PostingsFormat(name=Memory doPackFST= true), n_td1=PostingsFormat(name=MockSep), timestamp=PostingsFormat(name=Memory doPackFST= true), id=MockVariableIntBlock(baseBlockSize=37), range_facet_sl=Pulsing40(freqCutoff=3 minBlockSize=4 maxBlockSize=85), range_facet_si=PostingsFormat(name=MockSep), oddField_s=Pulsing40(freqCutoff=3 minBlockSize=4 maxBlockSize=85), sequence_i=Pulsing40(freqCutoff=3 minBlockSize=4 maxBlockSize=85), name=MockVariableIntBlock(baseBlockSize=37), foo_i=PostingsFormat(name=MockSep), regex_dup_B_s=PostingsFormat(name=Memory doPackFST= true), multiDefault=PostingsFormat(name=MockSep), n_tf1=PostingsFormat(name=Memory doPackFST= true), n_dt1=PostingsFormat(name=MockSep), genre_s=Pulsing40(freqCutoff=3 minBlockSize=4 maxBlockSize=85), author_t=PostingsFormat(name=MockSep), n_ti1=MockVariableIntBlock(baseBlockSize=37), range_facet_l=PostingsFormat(name=Memory doPackFST= true), text=Pulsing40(freqCutoff=3 minBlockSize=4 maxBlockSize=85), _version_=PostingsFormat(name=Memory doPackFST= true), val_i=MockVariableIntBlock(baseBlockSize=37), SubjectTerms_mfacet=PostingsFormat(name=Memory doPackFST= true), series_t=PostingsFormat(name=MockSep), a_t=PostingsFormat(name=Memory doPackFST= true), n_tdt1=PostingsFormat(name=Memory doPackFST= true), regex_dup_A_s=Pulsing40(freqCutoff=3 minBlockSize=4 maxBlockSize=85), price=Pulsing40(freqCutoff=3 minBlockSize=4 maxBlockSize=85), other_tl1=PostingsFormat(name=Memory doPackFST= true), n_l1=PostingsFormat(name=Memory doPackFST= true), a_si=PostingsFormat(name=MockSep), inStock=Pulsing40(freqCutoff=3 minBlockSize=4 maxBlockSize=85)}, sim=RandomSimilarityProvider(queryNorm=false,coord=no): {}, locale=pt, timezone=America/Tegucigalpa
[junit4:junit4]   2> NOTE: FreeBSD 9.0-RELEASE amd64/Oracle Corporation 1.7.0_06 (64-bit)/cpus=16,threads=1,free=100498368,total=278921216
[junit4:junit4]   2> NOTE: All tests run in this JVM: [TestQuerySenderListener, DisMaxRequestHandlerTest, FieldMutatingUpdateProcessorTest, TestArbitraryIndexDir, TestSolrCoreProperties, SolrCoreTest, OutputWriterTest, SignatureUpdateProcessorFactoryTest, PolyFieldTest, FileUtilsTest, TestUpdate, TestStressRecovery, TestDFRSimilarityFactory, IndexReaderFactoryTest, IndexSchemaRuntimeFieldTest, DirectUpdateHandlerTest, ZkSolrClientTest, TestValueSourceCache, StatsComponentTest, SolrInfoMBeanTest, DocumentBuilderTest, TestUtils, TestDocSet, DebugComponentTest, OpenExchangeRatesOrgProviderTest, TestFoldingMultitermQuery, ShowFileRequestHandlerTest, RAMDirectoryFactoryTest, SuggesterTSTTest, TestStressLucene, PathHierarchyTokenizerFactoryTest, TestSurroundQueryParser, EchoParamsTest, StandardRequestHandlerTest, TestReplicationHandler, OverseerTest, TermVectorComponentDistributedTest, TestPropInject, ReturnFieldsTest, DOMUtilTest, LeaderElectionTest, BasicFunctionalityTest, URLClassifyProcessorTest, TestSolrXMLSerializer, TestBM25SimilarityFactory, PingRequestHandlerTest, TestQueryUtils, TestMergePolicyConfig, DocumentAnalysisRequestHandlerTest, MultiTermTest, PrimitiveFieldTypeTest, TestSort, TestSolrDeletionPolicy1, TestHashPartitioner, BadIndexSchemaTest, TestWriterPerf, SolrIndexConfigTest, BasicDistributedZkTest]
[junit4:junit4] Completed on J1 in 611.43s, 1 test, 1 error <<< FAILURES!

[...truncated 209 lines...]
BUILD FAILED
/usr/home/hudson/hudson-slave/workspace/Lucene-Solr-Tests-4.x-java7/build.xml:38: The following error occurred while executing this line:
/usr/home/hudson/hudson-slave/workspace/Lucene-Solr-Tests-4.x-java7/solr/build.xml:180: The following error occurred while executing this line:
/usr/home/hudson/hudson-slave/workspace/Lucene-Solr-Tests-4.x-java7/lucene/module-build.xml:61: The following error occurred while executing this line:
/usr/home/hudson/hudson-slave/workspace/Lucene-Solr-Tests-4.x-java7/lucene/common-build.xml:1143: The following error occurred while executing this line:
/usr/home/hudson/hudson-slave/workspace/Lucene-Solr-Tests-4.x-java7/lucene/common-build.xml:816: There were test failures: 231 suites, 959 tests, 1 error, 21 ignored (3 assumptions)

Total time: 35 minutes 0 seconds
Build step 'Invoke Ant' marked build as failure
Recording test results
Email was triggered for: Failure
Sending email for trigger: Failure



Mime
View raw message