lucene-dev mailing list archives

Site index · List index
Message view « Date » · « Thread »
Top « Date » · « Thread »
From buil...@flonkings.com
Subject [JENKINS] Lucene-trunk-Linux-Java6-64-test-only - Build # 9062 - Failure!
Date Fri, 05 Oct 2012 10:30:48 GMT
Build: builds.flonkings.com/job/Lucene-trunk-Linux-Java6-64-test-only/9062/

1 tests failed.
REGRESSION:  org.apache.lucene.index.TestIndexWriterReader.testDuringAddIndexes

Error Message:
openDeleted=[_18.cfs, _19.cfs] expected:<0> but was:<2>

Stack Trace:
java.lang.AssertionError: openDeleted=[_18.cfs, _19.cfs] expected:<0> but was:<2>
	at __randomizedtesting.SeedInfo.seed([E321CF180DB4BE1A:11F8A10B6A1DA88C]:0)
	at org.junit.Assert.fail(Assert.java:93)
	at org.junit.Assert.failNotEquals(Assert.java:647)
	at org.junit.Assert.assertEquals(Assert.java:128)
	at org.junit.Assert.assertEquals(Assert.java:472)
	at org.apache.lucene.index.TestIndexWriterReader.testDuringAddIndexes(TestIndexWriterReader.java:782)
	at sun.reflect.NativeMethodAccessorImpl.invoke0(Native Method)
	at sun.reflect.NativeMethodAccessorImpl.invoke(NativeMethodAccessorImpl.java:39)
	at sun.reflect.DelegatingMethodAccessorImpl.invoke(DelegatingMethodAccessorImpl.java:25)
	at java.lang.reflect.Method.invoke(Method.java:597)
	at com.carrotsearch.randomizedtesting.RandomizedRunner.invoke(RandomizedRunner.java:1559)
	at com.carrotsearch.randomizedtesting.RandomizedRunner.access$600(RandomizedRunner.java:79)
	at com.carrotsearch.randomizedtesting.RandomizedRunner$6.evaluate(RandomizedRunner.java:737)
	at com.carrotsearch.randomizedtesting.RandomizedRunner$7.evaluate(RandomizedRunner.java:773)
	at com.carrotsearch.randomizedtesting.RandomizedRunner$8.evaluate(RandomizedRunner.java:787)
	at org.apache.lucene.util.TestRuleSetupTeardownChained$1.evaluate(TestRuleSetupTeardownChained.java:50)
	at org.apache.lucene.util.TestRuleFieldCacheSanity$1.evaluate(TestRuleFieldCacheSanity.java:51)
	at org.apache.lucene.util.AbstractBeforeAfterRule$1.evaluate(AbstractBeforeAfterRule.java:45)
	at com.carrotsearch.randomizedtesting.rules.SystemPropertiesInvariantRule$1.evaluate(SystemPropertiesInvariantRule.java:55)
	at org.apache.lucene.util.TestRuleThreadAndTestName$1.evaluate(TestRuleThreadAndTestName.java:48)
	at org.apache.lucene.util.TestRuleIgnoreAfterMaxFailures$1.evaluate(TestRuleIgnoreAfterMaxFailures.java:70)
	at org.apache.lucene.util.TestRuleMarkFailure$1.evaluate(TestRuleMarkFailure.java:48)
	at com.carrotsearch.randomizedtesting.rules.StatementAdapter.evaluate(StatementAdapter.java:36)
	at com.carrotsearch.randomizedtesting.ThreadLeakControl$StatementRunner.run(ThreadLeakControl.java:358)
	at com.carrotsearch.randomizedtesting.ThreadLeakControl.forkTimeoutingTask(ThreadLeakControl.java:782)
	at com.carrotsearch.randomizedtesting.ThreadLeakControl$3.evaluate(ThreadLeakControl.java:442)
	at com.carrotsearch.randomizedtesting.RandomizedRunner.runSingleTest(RandomizedRunner.java:746)
	at com.carrotsearch.randomizedtesting.RandomizedRunner$3.evaluate(RandomizedRunner.java:648)
	at com.carrotsearch.randomizedtesting.RandomizedRunner$4.evaluate(RandomizedRunner.java:682)
	at com.carrotsearch.randomizedtesting.RandomizedRunner$5.evaluate(RandomizedRunner.java:693)
	at org.apache.lucene.util.AbstractBeforeAfterRule$1.evaluate(AbstractBeforeAfterRule.java:45)
	at org.apache.lucene.util.TestRuleStoreClassName$1.evaluate(TestRuleStoreClassName.java:42)
	at com.carrotsearch.randomizedtesting.rules.SystemPropertiesInvariantRule$1.evaluate(SystemPropertiesInvariantRule.java:55)
	at com.carrotsearch.randomizedtesting.rules.NoShadowingOrOverridesOnMethodsRule$1.evaluate(NoShadowingOrOverridesOnMethodsRule.java:39)
	at com.carrotsearch.randomizedtesting.rules.NoShadowingOrOverridesOnMethodsRule$1.evaluate(NoShadowingOrOverridesOnMethodsRule.java:39)
	at com.carrotsearch.randomizedtesting.rules.StatementAdapter.evaluate(StatementAdapter.java:36)
	at org.apache.lucene.util.TestRuleAssertionsRequired$1.evaluate(TestRuleAssertionsRequired.java:43)
	at org.apache.lucene.util.TestRuleMarkFailure$1.evaluate(TestRuleMarkFailure.java:48)
	at org.apache.lucene.util.TestRuleIgnoreAfterMaxFailures$1.evaluate(TestRuleIgnoreAfterMaxFailures.java:70)
	at org.apache.lucene.util.TestRuleIgnoreTestSuites$1.evaluate(TestRuleIgnoreTestSuites.java:55)
	at com.carrotsearch.randomizedtesting.rules.StatementAdapter.evaluate(StatementAdapter.java:36)
	at com.carrotsearch.randomizedtesting.ThreadLeakControl$StatementRunner.run(ThreadLeakControl.java:358)
	at java.lang.Thread.run(Thread.java:662)




Build Log:
[...truncated 14 lines...]
ERROR: Failed to update http://svn.apache.org/repos/asf/lucene/dev/nightly
org.tmatesoft.svn.core.SVNException: svn: Target path '/lucene/dev/nightly' does not exist
svn: REPORT of /repos/asf/!svn/vcc/default: 500 Internal Server Error (http://svn.apache.org)
	at org.tmatesoft.svn.core.internal.wc.SVNErrorManager.error(SVNErrorManager.java:64)
	at org.tmatesoft.svn.core.internal.wc.SVNErrorManager.error(SVNErrorManager.java:51)
	at org.tmatesoft.svn.core.internal.io.dav.DAVRepository.runReport(DAVRepository.java:1284)
	at org.tmatesoft.svn.core.internal.io.dav.DAVRepository.update(DAVRepository.java:830)
	at org.tmatesoft.svn.core.wc.SVNUpdateClient.update(SVNUpdateClient.java:564)
	at org.tmatesoft.svn.core.wc.SVNUpdateClient.doUpdate(SVNUpdateClient.java:401)
	at hudson.scm.subversion.UpdateUpdater$TaskImpl.perform(UpdateUpdater.java:136)
	at hudson.scm.subversion.WorkspaceUpdater$UpdateTask.delegateTo(WorkspaceUpdater.java:136)
	at hudson.scm.SubversionSCM$CheckOutTask.perform(SubversionSCM.java:788)
	at hudson.scm.SubversionSCM$CheckOutTask.invoke(SubversionSCM.java:769)
	at hudson.scm.SubversionSCM$CheckOutTask.invoke(SubversionSCM.java:753)
	at hudson.FilePath.act(FilePath.java:842)
	at hudson.FilePath.act(FilePath.java:824)
	at hudson.scm.SubversionSCM.checkout(SubversionSCM.java:743)
	at hudson.scm.SubversionSCM.checkout(SubversionSCM.java:685)
	at hudson.model.AbstractProject.checkout(AbstractProject.java:1249)
	at hudson.model.AbstractBuild$AbstractBuildExecution.defaultCheckout(AbstractBuild.java:589)
	at jenkins.scm.SCMCheckoutStrategy.checkout(SCMCheckoutStrategy.java:88)
	at hudson.model.AbstractBuild$AbstractBuildExecution.run(AbstractBuild.java:494)
	at hudson.model.Run.execute(Run.java:1488)
	at hudson.model.FreeStyleBuild.run(FreeStyleBuild.java:46)
	at hudson.model.ResourceController.execute(ResourceController.java:88)
	at hudson.model.Executor.run(Executor.java:236)
Caused by: org.tmatesoft.svn.core.SVNErrorMessage: svn: Target path '/lucene/dev/nightly' does not exist
	at org.tmatesoft.svn.core.SVNErrorMessage.create(SVNErrorMessage.java:200)
	at org.tmatesoft.svn.core.SVNErrorMessage.create(SVNErrorMessage.java:146)
	at org.tmatesoft.svn.core.SVNErrorMessage.create(SVNErrorMessage.java:89)
	at org.tmatesoft.svn.core.internal.io.dav.handlers.DAVErrorHandler.endElement(DAVErrorHandler.java:72)
	at org.tmatesoft.svn.core.internal.io.dav.handlers.BasicDAVHandler.endElement(BasicDAVHandler.java:99)
	at com.sun.org.apache.xerces.internal.parsers.AbstractSAXParser.endElement(AbstractSAXParser.java:606)
	at com.sun.org.apache.xerces.internal.impl.XMLDocumentFragmentScannerImpl.scanEndElement(XMLDocumentFragmentScannerImpl.java:1741)
	at com.sun.org.apache.xerces.internal.impl.XMLDocumentFragmentScannerImpl$FragmentContentDriver.next(XMLDocumentFragmentScannerImpl.java:2898)
	at com.sun.org.apache.xerces.internal.impl.XMLDocumentScannerImpl.next(XMLDocumentScannerImpl.java:607)
	at com.sun.org.apache.xerces.internal.impl.XMLNSDocumentScannerImpl.next(XMLNSDocumentScannerImpl.java:116)
	at com.sun.org.apache.xerces.internal.impl.XMLDocumentFragmentScannerImpl.scanDocument(XMLDocumentFragmentScannerImpl.java:488)
	at com.sun.org.apache.xerces.internal.parsers.XML11Configuration.parse(XML11Configuration.java:835)
	at com.sun.org.apache.xerces.internal.parsers.XML11Configuration.parse(XML11Configuration.java:764)
	at com.sun.org.apache.xerces.internal.parsers.XMLParser.parse(XMLParser.java:123)
	at com.sun.org.apache.xerces.internal.parsers.AbstractSAXParser.parse(AbstractSAXParser.java:1210)
	at com.sun.org.apache.xerces.internal.jaxp.SAXParserImpl$JAXPSAXParser.parse(SAXParserImpl.java:568)
	at org.tmatesoft.svn.core.internal.io.dav.http.HTTPConnection.readData(HTTPConnection.java:776)
	at org.tmatesoft.svn.core.internal.io.dav.http.HTTPConnection.readData(HTTPConnection.java:741)
	at org.tmatesoft.svn.core.internal.io.dav.http.HTTPConnection.readError(HTTPConnection.java:222)
	at org.tmatesoft.svn.core.internal.io.dav.http.HTTPRequest.readError(HTTPRequest.java:290)
	at org.tmatesoft.svn.core.internal.io.dav.http.HTTPRequest.dispatch(HTTPRequest.java:213)
	at org.tmatesoft.svn.core.internal.io.dav.http.HTTPConnection._request(HTTPConnection.java:379)
	at org.tmatesoft.svn.core.internal.io.dav.http.HTTPConnection.request(HTTPConnection.java:292)
	at org.tmatesoft.svn.core.internal.io.dav.http.HTTPConnection.request(HTTPConnection.java:283)
	at org.tmatesoft.svn.core.internal.io.dav.http.HTTPConnection.request(HTTPConnection.java:271)
	at org.tmatesoft.svn.core.internal.io.dav.DAVConnection.doReport(DAVConnection.java:283)
	at org.tmatesoft.svn.core.internal.io.dav.DAVRepository.runReport(DAVRepository.java:1282)
	... 20 more
Caused by: org.tmatesoft.svn.core.SVNErrorMessage: svn: REPORT of /repos/asf/!svn/vcc/default: 500 Internal Server Error (http://svn.apache.org)
	at org.tmatesoft.svn.core.SVNErrorMessage.create(SVNErrorMessage.java:200)
	at org.tmatesoft.svn.core.SVNErrorMessage.create(SVNErrorMessage.java:181)
	at org.tmatesoft.svn.core.SVNErrorMessage.create(SVNErrorMessage.java:133)
	at org.tmatesoft.svn.core.internal.io.dav.http.HTTPRequest.createDefaultErrorMessage(HTTPRequest.java:444)
	at org.tmatesoft.svn.core.internal.io.dav.http.HTTPRequest.readError(HTTPRequest.java:288)
	... 27 more
no change for http://svn.apache.org/repos/asf/lucene/dev/trunk since the previous build
no change for http://svn.apache.org/repos/asf/lucene/dev/nightly since the previous build
No emails were triggered.
[EnvInject] - Executing scripts and injecting environment variables after the SCM step.
[EnvInject] - Injecting as environment variables the properties content 
NO_JAVADOCS=yes
TEST_JVM_ARGS=-XX:+UseG1GC

[EnvInject] - Variables injected successfully.
[lucene] $ /var/lib/jenkins/tools/Ant/Ant_1.8.3/bin/ant -file build.xml -Dtests.jvms=8 clean-jars clean test-core
Buildfile: /var/lib/jenkins/workspace/Lucene-trunk-Linux-Java6-64-test-only/checkout/lucene/build.xml

clean-jars:

clean:

test-core:

-clover.disable:

-clover.load:

-clover.classpath:

-clover.setup:

clover:

ivy-availability-check:

ivy-fail:

ivy-configure:
[ivy:configure] :: Ivy 2.2.0 - 20100923230623 :: http://ant.apache.org/ivy/ ::
[ivy:configure] :: loading settings :: file = /var/lib/jenkins/workspace/Lucene-trunk-Linux-Java6-64-test-only/checkout/lucene/ivy-settings.xml

resolve:

init:

compile-core:
    [mkdir] Created dir: /var/lib/jenkins/workspace/Lucene-trunk-Linux-Java6-64-test-only/checkout/lucene/build/core/classes/java
    [javac] Compiling 604 source files to /var/lib/jenkins/workspace/Lucene-trunk-Linux-Java6-64-test-only/checkout/lucene/build/core/classes/java
     [copy] Copying 2 files to /var/lib/jenkins/workspace/Lucene-trunk-Linux-Java6-64-test-only/checkout/lucene/build/core/classes/java

compile-test-framework:

ivy-availability-check:

ivy-fail:

ivy-configure:
[ivy:configure] :: loading settings :: file = /var/lib/jenkins/workspace/Lucene-trunk-Linux-Java6-64-test-only/checkout/lucene/ivy-settings.xml

resolve:

init:

compile-lucene-core:

ivy-availability-check:

ivy-fail:

ivy-configure:
[ivy:configure] :: loading settings :: file = /var/lib/jenkins/workspace/Lucene-trunk-Linux-Java6-64-test-only/checkout/lucene/ivy-settings.xml

resolve:

init:

-clover.disable:

-clover.load:

-clover.classpath:

-clover.setup:

clover:

compile-core:

compile-codecs:
     [echo] Building codecs...

ivy-availability-check:

ivy-fail:

ivy-configure:
[ivy:configure] :: loading settings :: file = /var/lib/jenkins/workspace/Lucene-trunk-Linux-Java6-64-test-only/checkout/lucene/ivy-settings.xml

resolve:

common.init:

compile-lucene-core:

init:

-clover.disable:

-clover.load:

-clover.classpath:

-clover.setup:

clover:

compile-core:
    [mkdir] Created dir: /var/lib/jenkins/workspace/Lucene-trunk-Linux-Java6-64-test-only/checkout/lucene/build/codecs/classes/java
    [javac] Compiling 66 source files to /var/lib/jenkins/workspace/Lucene-trunk-Linux-Java6-64-test-only/checkout/lucene/build/codecs/classes/java
     [copy] Copying 2 files to /var/lib/jenkins/workspace/Lucene-trunk-Linux-Java6-64-test-only/checkout/lucene/build/codecs/classes/java

-clover.disable:

-clover.load:

-clover.classpath:

-clover.setup:

clover:

common.compile-core:
    [mkdir] Created dir: /var/lib/jenkins/workspace/Lucene-trunk-Linux-Java6-64-test-only/checkout/lucene/build/test-framework/classes/java
    [javac] Compiling 92 source files to /var/lib/jenkins/workspace/Lucene-trunk-Linux-Java6-64-test-only/checkout/lucene/build/test-framework/classes/java
     [copy] Copying 3 files to /var/lib/jenkins/workspace/Lucene-trunk-Linux-Java6-64-test-only/checkout/lucene/build/test-framework/classes/java

compile-core:

compile-test:
    [mkdir] Created dir: /var/lib/jenkins/workspace/Lucene-trunk-Linux-Java6-64-test-only/checkout/lucene/build/core/classes/test
    [javac] Compiling 322 source files to /var/lib/jenkins/workspace/Lucene-trunk-Linux-Java6-64-test-only/checkout/lucene/build/core/classes/test
    [javac] Note: Some input files use or override a deprecated API.
    [javac] Note: Recompile with -Xlint:deprecation for details.
     [copy] Copying 29 files to /var/lib/jenkins/workspace/Lucene-trunk-Linux-Java6-64-test-only/checkout/lucene/build/core/classes/test

install-junit4-taskdef:

validate:

test:
    [mkdir] Created dir: /var/lib/jenkins/workspace/Lucene-trunk-Linux-Java6-64-test-only/checkout/lucene/build/core/test
[junit4:junit4] <JUnit4> says cześć! Master seed: E321CF180DB4BE1A
[junit4:junit4] Executing 309 suites with 8 JVMs.
[junit4:junit4] 
[junit4:junit4] Suite: org.apache.lucene.store.TestLock
[junit4:junit4] Completed on J1 in 1.13s, 1 test
[junit4:junit4] 
[junit4:junit4] Suite: org.apache.lucene.util.TestBytesRef
[junit4:junit4] Completed on J0 in 1.33s, 5 tests
[junit4:junit4] 
[junit4:junit4] Suite: org.apache.lucene.store.TestDirectory
[junit4:junit4] IGNOR/A 0.15s J7 | TestDirectory.testThreadSafety
[junit4:junit4]    > Assumption #1: 'nightly' test group is disabled (@Nightly)
[junit4:junit4] Completed on J7 in 1.59s, 8 tests, 1 skipped
[junit4:junit4] 
[junit4:junit4] Suite: org.apache.lucene.index.TestCheckIndex
[junit4:junit4] Completed on J4 in 2.89s, 3 tests
[junit4:junit4] 
[junit4:junit4] Suite: org.apache.lucene.search.TestFieldValueFilter
[junit4:junit4] Completed on J0 in 1.98s, 2 tests
[junit4:junit4] 
[junit4:junit4] Suite: org.apache.lucene.search.TestConstantScoreQuery
[junit4:junit4] Completed on J1 in 2.28s, 3 tests
[junit4:junit4] 
[junit4:junit4] Suite: org.apache.lucene.search.TestTopDocsCollector
[junit4:junit4] Completed on J0 in 0.94s, 8 tests
[junit4:junit4] 
[junit4:junit4] Suite: org.apache.lucene.search.TestRegexpQuery
[junit4:junit4] Completed on J7 in 2.49s, 7 tests
[junit4:junit4] 
[junit4:junit4] Suite: org.apache.lucene.util.TestVersion
[junit4:junit4] Completed on J0 in 0.22s, 2 tests
[junit4:junit4] 
[junit4:junit4] Suite: org.apache.lucene.index.TestNRTThreads
[junit4:junit4] Completed on J2 in 6.13s, 1 test
[junit4:junit4] 
[junit4:junit4] Suite: org.apache.lucene.codecs.lucene40.values.TestDocValues
[junit4:junit4] Completed on J6 in 6.94s, 14 tests
[junit4:junit4] 
[junit4:junit4] Suite: org.apache.lucene.index.TestDocValuesTypeCompatibility
[junit4:junit4] Completed on J4 in 5.25s, 5 tests
[junit4:junit4] 
[junit4:junit4] Suite: org.apache.lucene.search.TestPrefixFilter
[junit4:junit4] Completed on J4 in 1.73s, 1 test
[junit4:junit4] 
[junit4:junit4] Suite: org.apache.lucene.index.TestBagOfPostings
[junit4:junit4] Completed on J3 in 9.49s, 1 test
[junit4:junit4] 
[junit4:junit4] Suite: org.apache.lucene.index.TestForceMergeForever
[junit4:junit4] Completed on J5 in 9.14s, 1 test
[junit4:junit4] 
[junit4:junit4] Suite: org.apache.lucene.index.TestIndexWriterOnJRECrash
[junit4:junit4] IGNOR/A 0.10s J5 | TestIndexWriterOnJRECrash.testNRTThreads
[junit4:junit4]    > Assumption #1: 'nightly' test group is disabled (@Nightly)
[junit4:junit4] Completed on J5 in 0.55s, 1 test, 1 skipped
[junit4:junit4] 
[junit4:junit4] Suite: org.apache.lucene.index.TestRandomStoredFields
[junit4:junit4] Completed on J2 in 4.83s, 1 test
[junit4:junit4] 
[junit4:junit4] Suite: org.apache.lucene.index.TestTransactions
[junit4:junit4] Completed on J4 in 1.60s, 1 test
[junit4:junit4] 
[junit4:junit4] Suite: org.apache.lucene.search.payloads.TestPayloadTermQuery
[junit4:junit4] Completed on J7 in 8.31s, 6 tests
[junit4:junit4] 
[junit4:junit4] Suite: org.apache.lucene.search.spans.TestNearSpansOrdered
[junit4:junit4] Completed on J2 in 1.93s, 10 tests
[junit4:junit4] 
[junit4:junit4] Suite: org.apache.lucene.index.TestCrashCausesCorruptIndex
[junit4:junit4] Completed on J3 in 3.78s, 1 test
[junit4:junit4] 
[junit4:junit4] Suite: org.apache.lucene.util.TestSmallFloat
[junit4:junit4] Completed on J7 in 1.64s, 2 tests
[junit4:junit4] 
[junit4:junit4] Suite: org.apache.lucene.search.TestSimpleExplanations
[junit4:junit4] Completed on J1 in 12.62s, 69 tests
[junit4:junit4] 
[junit4:junit4] Suite: org.apache.lucene.util.TestWeakIdentityMap
[junit4:junit4] Completed on J4 in 4.80s, 2 tests
[junit4:junit4] 
[junit4:junit4] Suite: org.apache.lucene.index.TestStressIndexing
[junit4:junit4] Completed on J7 in 2.28s, 1 test
[junit4:junit4] 
[junit4:junit4] Suite: org.apache.lucene.search.TestBooleanScorer
[junit4:junit4] Completed on J7 in 0.54s, 3 tests
[junit4:junit4] 
[junit4:junit4] Suite: org.apache.lucene.search.TestDocBoost
[junit4:junit4] Completed on J7 in 0.41s, 1 test
[junit4:junit4] 
[junit4:junit4] Suite: org.apache.lucene.search.TestDocValuesScoring
[junit4:junit4] Completed on J4 in 1.01s, 1 test
[junit4:junit4] 
[junit4:junit4] Suite: org.apache.lucene.util.TestUnicodeUtil
[junit4:junit4] Completed on J1 in 1.51s, 4 tests
[junit4:junit4] 
[junit4:junit4] Suite: org.apache.lucene.search.TestTermScorer
[junit4:junit4] Completed on J7 in 0.44s, 3 tests
[junit4:junit4] 
[junit4:junit4] Suite: org.apache.lucene.search.TestFilteredQuery
[junit4:junit4] Completed on J2 in 5.21s, 11 tests
[junit4:junit4] 
[junit4:junit4] Suite: org.apache.lucene.index.TestIndexFileDeleter
[junit4:junit4] Completed on J1 in 0.86s, 1 test
[junit4:junit4] 
[junit4:junit4] Suite: org.apache.lucene.util.junitcompat.TestExceptionInBeforeClassHooks
[junit4:junit4] Completed on J2 in 0.80s, 3 tests
[junit4:junit4] 
[junit4:junit4] Suite: org.apache.lucene.search.TestPositiveScoresOnlyCollector
[junit4:junit4] Completed on J2 in 0.21s, 1 test
[junit4:junit4] 
[junit4:junit4] Suite: org.apache.lucene.index.TestIndexWriterWithThreads
[junit4:junit4] Completed on J0 in 14.68s, 12 tests
[junit4:junit4] 
[junit4:junit4] Suite: org.apache.lucene.index.TestParallelAtomicReader
[junit4:junit4] Completed on J7 in 1.38s, 6 tests
[junit4:junit4] 
[junit4:junit4] Suite: org.apache.lucene.search.TestPhrasePrefixQuery
[junit4:junit4] Completed on J2 in 0.52s, 1 test
[junit4:junit4] 
[junit4:junit4] Suite: org.apache.lucene.util.TestNamedSPILoader
[junit4:junit4] Completed on J2 in 0.24s, 3 tests
[junit4:junit4] 
[junit4:junit4] Suite: org.apache.lucene.index.TestMultiFields
[junit4:junit4] Completed on J1 in 2.12s, 3 tests
[junit4:junit4] 
[junit4:junit4] Suite: org.apache.lucene.index.TestDirectoryReaderReopen
[junit4:junit4] Completed on J6 in 14.75s, 5 tests
[junit4:junit4] 
[junit4:junit4] Suite: org.apache.lucene.search.MultiCollectorTest
[junit4:junit4] Completed on J6 in 0.26s, 3 tests
[junit4:junit4] 
[junit4:junit4] Suite: org.apache.lucene.search.TestDisjunctionMaxQuery
[junit4:junit4] Completed on J4 in 4.92s, 10 tests
[junit4:junit4] 
[junit4:junit4] Suite: org.apache.lucene.index.TestReaderClosed
[junit4:junit4] Completed on J6 in 0.33s, 2 tests
[junit4:junit4] 
[junit4:junit4] Suite: org.apache.lucene.util.TestNumericUtils
[junit4:junit4] Completed on J2 in 2.95s, 12 tests
[junit4:junit4] 
[junit4:junit4] Suite: org.apache.lucene.search.TestAutomatonQueryUnicode
[junit4:junit4] Completed on J2 in 0.58s, 1 test
[junit4:junit4] 
[junit4:junit4] Suite: org.apache.lucene.index.TestParallelCompositeReader
[junit4:junit4] Completed on J1 in 3.04s, 8 tests
[junit4:junit4] 
[junit4:junit4] Suite: org.apache.lucene.util.junitcompat.TestSameRandomnessLocalePassedOrNot
[junit4:junit4] Completed on J2 in 0.29s, 1 test
[junit4:junit4] 
[junit4:junit4] Suite: org.apache.lucene.index.TestSameTokenSamePosition
[junit4:junit4] Completed on J2 in 0.31s, 2 tests
[junit4:junit4] 
[junit4:junit4] Suite: org.apache.lucene.search.TestDocIdSet
[junit4:junit4] Completed on J2 in 0.27s, 3 tests
[junit4:junit4] 
[junit4:junit4] Suite: org.apache.lucene.index.TestOmitPositions
[junit4:junit4] Completed on J0 in 5.78s, 4 tests
[junit4:junit4] 
[junit4:junit4] Suite: org.apache.lucene.index.TestSegmentTermEnum
[junit4:junit4] Completed on J0 in 0.36s, 2 tests
[junit4:junit4] 
[junit4:junit4] Suite: org.apache.lucene.index.TestConsistentFieldNumbers
[junit4:junit4] Completed on J7 in 6.24s, 4 tests
[junit4:junit4] 
[junit4:junit4] Suite: org.apache.lucene.store.TestRAMDirectory
[junit4:junit4] Completed on J4 in 4.46s, 4 tests
[junit4:junit4] 
[junit4:junit4] Suite: org.apache.lucene.util.automaton.TestSpecialOperations
[junit4:junit4] Completed on J6 in 4.50s, 2 tests
[junit4:junit4] 
[junit4:junit4] Suite: org.apache.lucene.index.TestIndexInput
[junit4:junit4] Completed on J2 in 3.37s, 3 tests
[junit4:junit4] 
[junit4:junit4] Suite: org.apache.lucene.index.TestTermVectorsReader
[junit4:junit4] Completed on J6 in 1.71s, 6 tests
[junit4:junit4] 
[junit4:junit4] Suite: org.apache.lucene.search.TestPrefixInBooleanQuery
[junit4:junit4] Completed on J1 in 5.94s, 4 tests
[junit4:junit4] 
[junit4:junit4] Suite: org.apache.lucene.search.TestRegexpRandom2
[junit4:junit4] Completed on J5 in 21.65s, 1 test
[junit4:junit4] 
[junit4:junit4] Suite: org.apache.lucene.index.TestSegmentReader
[junit4:junit4] Completed on J7 in 7.00s, 6 tests
[junit4:junit4] 
[junit4:junit4] Suite: org.apache.lucene.index.TestDocumentsWriterDeleteQueue
[junit4:junit4] Completed on J1 in 3.59s, 5 tests
[junit4:junit4] 
[junit4:junit4] Suite: org.apache.lucene.TestMergeSchedulerExternal
[junit4:junit4] Completed on J1 in 3.71s, 2 tests
[junit4:junit4] 
[junit4:junit4] Suite: org.apache.lucene.index.TestTermsEnum2
[junit4:junit4] Completed on J5 in 4.85s, 4 tests
[junit4:junit4] 
[junit4:junit4] Suite: org.apache.lucene.analysis.tokenattributes.TestCharTermAttributeImpl
[junit4:junit4] Completed on J7 in 6.06s, 12 tests
[junit4:junit4] 
[junit4:junit4] Suite: org.apache.lucene.util.TestVersionComparator
[junit4:junit4] Completed on J7 in 0.09s, 1 test
[junit4:junit4] 
[junit4:junit4] Suite: org.apache.lucene.search.TestNumericRangeQuery32
[junit4:junit4] Completed on J3 in 25.58s, 27 tests
[junit4:junit4] 
[junit4:junit4] Suite: org.apache.lucene.util.automaton.TestDeterminism
[junit4:junit4] Completed on J5 in 2.73s, 2 tests
[junit4:junit4] 
[junit4:junit4] Suite: org.apache.lucene.search.TestDateFilter
[junit4:junit4] Completed on J5 in 0.44s, 2 tests
[junit4:junit4] 
[junit4:junit4] Suite: org.apache.lucene.search.TestNRTManager
[junit4:junit4] Completed on J0 in 16.31s, 3 tests
[junit4:junit4] 
[junit4:junit4] Suite: org.apache.lucene.document.TestBinaryDocument
[junit4:junit4] Completed on J0 in 0.20s, 2 tests
[junit4:junit4] 
[junit4:junit4] Suite: org.apache.lucene.index.TestSegmentTermDocs
[junit4:junit4] Completed on J6 in 13.66s, 5 tests
[junit4:junit4] 
[junit4:junit4] Suite: org.apache.lucene.analysis.TestCachingTokenFilter
[junit4:junit4] Completed on J0 in 0.24s, 1 test
[junit4:junit4] 
[junit4:junit4] Suite: org.apache.lucene.util.TestVirtualMethod
[junit4:junit4] Completed on J6 in 0.16s, 2 tests
[junit4:junit4] 
[junit4:junit4] Suite: org.apache.lucene.search.TestTimeLimitingCollector
[junit4:junit4] Completed on J2 in 14.62s, 6 tests
[junit4:junit4] 
[junit4:junit4] Suite: org.apache.lucene.util.TestMaxFailuresRule
[junit4:junit4] Completed on J7 in 3.66s, 1 test
[junit4:junit4] 
[junit4:junit4] Suite: org.apache.lucene.util.automaton.TestBasicOperations
[junit4:junit4] Completed on J6 in 1.12s, 8 tests
[junit4:junit4] 
[junit4:junit4] Suite: org.apache.lucene.util.TestArrayUtil
[junit4:junit4] Completed on J4 in 19.65s, 11 tests
[junit4:junit4] 
[junit4:junit4] Suite: org.apache.lucene.index.TestPayloadsOnVectors
[junit4:junit4] Completed on J4 in 0.41s, 3 tests
[junit4:junit4] 
[junit4:junit4] Suite: org.apache.lucene.index.TestPostingsOffsets
[junit4:junit4] Completed on J3 in 7.41s, 11 tests
[junit4:junit4] 
[junit4:junit4] Suite: org.apache.lucene.util.junitcompat.TestFailIfDirectoryNotClosed
[junit4:junit4] Completed on J4 in 0.28s, 1 test
[junit4:junit4] 
[junit4:junit4] Suite: org.apache.lucene.util.junitcompat.TestFailIfUnreferencedFiles
[junit4:junit4] Completed on J3 in 0.32s, 1 test
[junit4:junit4] 
[junit4:junit4] Suite: org.apache.lucene.index.TestIndexWriterConfig
[junit4:junit4] Completed on J4 in 0.64s, 9 tests
[junit4:junit4] 
[junit4:junit4] Suite: org.apache.lucene.index.TestIndexWriterOnDiskFull
[junit4:junit4] Completed on J6 in 5.01s, 4 tests
[junit4:junit4] 
[junit4:junit4] Suite: org.apache.lucene.util.automaton.TestDeterminizeLexicon
[junit4:junit4] Completed on J7 in 6.11s, 1 test
[junit4:junit4] 
[junit4:junit4] Suite: org.apache.lucene.index.TestThreadedForceMerge
[junit4:junit4] Completed on J5 in 8.26s, 1 test
[junit4:junit4] 
[junit4:junit4] Suite: org.apache.lucene.util.junitcompat.TestSeedFromUncaught
[junit4:junit4] Completed on J6 in 0.32s, 1 test
[junit4:junit4] 
[junit4:junit4] Suite: org.apache.lucene.search.TestAutomatonQuery
[junit4:junit4] Completed on J3 in 1.49s, 6 tests
[junit4:junit4] 
[junit4:junit4] Suite: org.apache.lucene.index.TestRollback
[junit4:junit4] Completed on J3 in 0.25s, 1 test
[junit4:junit4] 
[junit4:junit4] Suite: org.apache.lucene.util.TestPriorityQueue
[junit4:junit4] Completed on J3 in 0.45s, 4 tests
[junit4:junit4] 
[junit4:junit4] Suite: org.apache.lucene.search.spans.TestFieldMaskingSpanQuery
[junit4:junit4] IGNOR/A 0.02s J7 | TestFieldMaskingSpanQuery.testSpans2
[junit4:junit4]    > Assumption #1: Broken scoring: LUCENE-3723
[junit4:junit4] IGNOR/A 0.11s J7 | TestFieldMaskingSpanQuery.testSimple2
[junit4:junit4]    > Assumption #1: Broken scoring: LUCENE-3723
[junit4:junit4] Completed on J7 in 2.28s, 11 tests, 2 skipped
[junit4:junit4] 
[junit4:junit4] Suite: org.apache.lucene.index.TestDocValuesIndexing
[junit4:junit4] Completed on J2 in 12.17s, 16 tests
[junit4:junit4] 
[junit4:junit4] Suite: org.apache.lucene.index.TestMaxTermFrequency
[junit4:junit4] Completed on J7 in 3.90s, 1 test
[junit4:junit4] 
[junit4:junit4] Suite: org.apache.lucene.search.TestConjunctions
[junit4:junit4] Completed on J2 in 0.17s, 1 test
[junit4:junit4] 
[junit4:junit4] Suite: org.apache.lucene.util.TestCharsRef
[junit4:junit4] Completed on J2 in 0.65s, 8 tests
[junit4:junit4] 
[junit4:junit4] Suite: org.apache.lucene.document.TestField
[junit4:junit4] Completed on J2 in 0.78s, 24 tests
[junit4:junit4] 
[junit4:junit4] Suite: org.apache.lucene.index.TestStressNRT
[junit4:junit4] Completed on J4 in 9.87s, 1 test
[junit4:junit4] 
[junit4:junit4] Suite: org.apache.lucene.index.Test2BTerms
[junit4:junit4] Completed on J4 in 0.11s, 1 test, 1 skipped
[junit4:junit4] 
[junit4:junit4] Suite: org.apache.lucene.search.TestNot
[junit4:junit4] Completed on J4 in 0.15s, 1 test
[junit4:junit4] 
[junit4:junit4] Suite: org.apache.lucene.util.TestRamUsageEstimatorOnWildAnimals
[junit4:junit4] Completed on J7 in 3.17s, 1 test
[junit4:junit4] 
[junit4:junit4] Suite: org.apache.lucene.index.TestFieldsReader
[junit4:junit4] Completed on J1 in 20.79s, 4 tests
[junit4:junit4] 
[junit4:junit4] Suite: org.apache.lucene.document.TestDateTools
[junit4:junit4] Completed on J4 in 0.24s, 5 tests
[junit4:junit4] 
[junit4:junit4] Suite: org.apache.lucene.index.TestSizeBoundedForceMerge
[junit4:junit4] Completed on J4 in 0.87s, 11 tests
[junit4:junit4] 
[junit4:junit4] Suite: org.apache.lucene.TestExternalCodecs
[junit4:junit4] Completed on J1 in 1.27s, 1 test
[junit4:junit4] 
[junit4:junit4] Suite: org.apache.lucene.util.junitcompat.TestJUnitRuleOrder
[junit4:junit4] Completed on J1 in 0.16s, 1 test
[junit4:junit4] 
[junit4:junit4] Suite: org.apache.lucene.util.TestBitUtil
[junit4:junit4] Completed on J1 in 0.09s, 2 tests
[junit4:junit4] 
[junit4:junit4] Suite: org.apache.lucene.search.spans.TestSpansAdvanced
[junit4:junit4] Completed on J4 in 0.50s, 1 test
[junit4:junit4] 
[junit4:junit4] Suite: org.apache.lucene.TestDemo
[junit4:junit4] Completed on J4 in 0.22s, 1 test
[junit4:junit4] 
[junit4:junit4] Suite: org.apache.lucene.index.TestConcurrentMergeScheduler
[junit4:junit4] Completed on J0 in 18.00s, 4 tests
[junit4:junit4] 
[junit4:junit4] Suite: org.apache.lucene.index.TestForTooMuchCloning
[junit4:junit4] Completed on J4 in 1.61s, 1 test
[junit4:junit4] 
[junit4:junit4] Suite: org.apache.lucene.index.TestRollingUpdates
[junit4:junit4] Completed on J2 in 5.92s, 2 tests
[junit4:junit4] 
[junit4:junit4] Suite: org.apache.lucene.TestSearchForDuplicates
[junit4:junit4] Completed on J0 in 2.71s, 1 test
[junit4:junit4] 
[junit4:junit4] Suite: org.apache.lucene.util.TestPagedBytes
[junit4:junit4] Completed on J5 in 17.52s, 3 tests
[junit4:junit4] 
[junit4:junit4] Suite: org.apache.lucene.util.TestSentinelIntSet
[junit4:junit4] Completed on J5 in 1.06s, 2 tests
[junit4:junit4] 
[junit4:junit4] Suite: org.apache.lucene.util.automaton.TestUTF32ToUTF8
[junit4:junit4] Completed on J0 in 8.84s, 5 tests
[junit4:junit4] 
[junit4:junit4] Suite: org.apache.lucene.util.TestFilterIterator
[junit4:junit4] Completed on J0 in 0.22s, 8 tests
[junit4:junit4] 
[junit4:junit4] Suite: org.apache.lucene.util.junitcompat.TestSystemPropertiesInvariantRule
[junit4:junit4] Completed on J0 in 0.72s, 5 tests
[junit4:junit4] 
[junit4:junit4] Suite: org.apache.lucene.index.TestDuelingCodecs
[junit4:junit4] Completed on J6 in 25.17s, 1 test
[junit4:junit4] 
[junit4:junit4] Suite: org.apache.lucene.index.TestParallelReaderEmptyIndex
[junit4:junit4] Completed on J6 in 0.33s, 2 tests
[junit4:junit4] 
[junit4:junit4] Suite: org.apache.lucene.util.automaton.TestMinimize
[junit4:junit4] Completed on J3 in 24.80s, 3 tests
[junit4:junit4] 
[junit4:junit4] Suite: org.apache.lucene.index.TestStressAdvance
[junit4:junit4] Completed on J5 in 10.71s, 1 test
[junit4:junit4] 
[junit4:junit4] Suite: org.apache.lucene.util.junitcompat.TestLeaveFilesIfTestFails
[junit4:junit4] Completed on J5 in 0.25s, 1 test
[junit4:junit4] 
[junit4:junit4] Suite: org.apache.lucene.search.spans.TestPayloadSpans
[junit4:junit4] Completed on J0 in 9.28s, 10 tests
[junit4:junit4] 
[junit4:junit4] Suite: org.apache.lucene.codecs.lucene40.TestBitVector
[junit4:junit4] Completed on J6 in 9.83s, 9 tests
[junit4:junit4] 
[junit4:junit4] Suite: org.apache.lucene.index.TestNorms
[junit4:junit4] Completed on J2 in 23.14s, 3 tests
[junit4:junit4] 
[junit4:junit4] Suite: org.apache.lucene.codecs.lucene40.TestLucene40PostingsFormat
[junit4:junit4] Completed on J0 in 4.24s, 7 tests
[junit4:junit4] 
[junit4:junit4] Suite: org.apache.lucene.util.TestRecyclingByteBlockAllocator
[junit4:junit4] Completed on J0 in 0.19s, 3 tests
[junit4:junit4] 
[junit4:junit4] Suite: org.apache.lucene.util.packed.TestPackedInts
[junit4:junit4] Completed on J1 in 27.10s, 16 tests
[junit4:junit4] 
[junit4:junit4] Suite: org.apache.lucene.index.TestIsCurrent
[junit4:junit4] Completed on J0 in 0.17s, 2 tests
[junit4:junit4] 
[junit4:junit4] Suite: org.apache.lucene.index.TestIndexWriterUnicode
[junit4:junit4] Completed on J5 in 9.88s, 5 tests
[junit4:junit4] 
[junit4:junit4] Suite: org.apache.lucene.search.spans.TestSpanExplanations
[junit4:junit4] Completed on J1 in 2.68s, 31 tests
[junit4:junit4] 
[junit4:junit4] Suite: org.apache.lucene.index.TestSumDocFreq
[junit4:junit4] Completed on J5 in 2.11s, 1 test
[junit4:junit4] 
[junit4:junit4] Suite: org.apache.lucene.index.TestCodecs
[junit4:junit4] Completed on J1 in 2.71s, 3 tests
[junit4:junit4] 
[junit4:junit4] Suite: org.apache.lucene.util.TestRamUsageEstimator
[junit4:junit4] Completed on J1 in 0.17s, 3 tests
[junit4:junit4] 
[junit4:junit4] Suite: org.apache.lucene.search.TestShardSearching
[junit4:junit4] Completed on J2 in 6.80s, 1 test
[junit4:junit4] 
[junit4:junit4] Suite: org.apache.lucene.index.TestTypePromotion
[junit4:junit4] Completed on J6 in 11.78s, 5 tests
[junit4:junit4] 
[junit4:junit4] Suite: org.apache.lucene.search.TestBoolean2
[junit4:junit4] Completed on J7 in 39.02s, 11 tests
[junit4:junit4] 
[junit4:junit4] Suite: org.apache.lucene.index.TestCrash
[junit4:junit4] Completed on J5 in 6.98s, 5 tests
[junit4:junit4] 
[junit4:junit4] Suite: org.apache.lucene.index.TestIndexWriterDelete
[junit4:junit4] IGNOR/A 0.21s J3 | TestIndexWriterDelete.testApplyDeletesOnFlush
[junit4:junit4]    > Assumption #1: 'nightly' test group is disabled (@Nightly)
[junit4:junit4] Completed on J3 in 27.27s, 20 tests, 1 skipped
[junit4:junit4] 
[junit4:junit4] Suite: org.apache.lucene.util.junitcompat.TestSetupTeardownChaining
[junit4:junit4] Completed on J3 in 0.32s, 2 tests
[junit4:junit4] 
[junit4:junit4] Suite: org.apache.lucene.index.TestDocCount
[junit4:junit4] Completed on J3 in 0.48s, 1 test
[junit4:junit4] 
[junit4:junit4] Suite: org.apache.lucene.index.TestIndexWriterCommit
[junit4:junit4] Completed on J1 in 11.08s, 12 tests
[junit4:junit4] 
[junit4:junit4] Suite: org.apache.lucene.index.TestMixedCodecs
[junit4:junit4] Completed on J3 in 2.93s, 1 test
[junit4:junit4] 
[junit4:junit4] Suite: org.apache.lucene.index.Test2BPostings
[junit4:junit4] IGNOR/A 0.01s J3 | Test2BPostings.test
[junit4:junit4]    > Assumption #1: 'nightly' test group is disabled (@Nightly)
[junit4:junit4] Completed on J3 in 0.10s, 1 test, 1 skipped
[junit4:junit4] 
[junit4:junit4] Suite: org.apache.lucene.search.TestElevationComparator
[junit4:junit4] Completed on J3 in 0.29s, 1 test
[junit4:junit4] 
[junit4:junit4] Suite: org.apache.lucene.analysis.TestNumericTokenStream
[junit4:junit4] Completed on J3 in 0.26s, 4 tests
[junit4:junit4] 
[junit4:junit4] Suite: org.apache.lucene.search.TestSearcherManager
[junit4:junit4] Completed on J2 in 18.62s, 6 tests
[junit4:junit4] 
[junit4:junit4] Suite: org.apache.lucene.index.TestIndexWriterForceMerge
[junit4:junit4] Completed on J3 in 5.66s, 4 tests
[junit4:junit4] 
[junit4:junit4] Suite: org.apache.lucene.index.TestByteSlices
[junit4:junit4] Completed on J1 in 8.67s, 1 test
[junit4:junit4] 
[junit4:junit4] Suite: org.apache.lucene.util.fst.TestFSTs
[junit4:junit4] IGNOR/A 0.13s J4 | TestFSTs.testBigSet
[junit4:junit4]    > Assumption #1: 'nightly' test group is disabled (@Nightly)
[junit4:junit4] Completed on J4 in 50.92s, 17 tests, 1 skipped
[junit4:junit4] 
[junit4:junit4] Suite: org.apache.lucene.search.similarities.TestSimilarityBase
[junit4:junit4] Completed on J3 in 2.99s, 29 tests
[junit4:junit4] 
[junit4:junit4] Suite: org.apache.lucene.search.spans.TestBasics
[junit4:junit4] Completed on J7 in 18.30s, 24 tests
[junit4:junit4] 
[junit4:junit4] Suite: org.apache.lucene.index.TestAtomicUpdate
[junit4:junit4] Completed on J4 in 6.66s, 1 test
[junit4:junit4] 
[junit4:junit4] Suite: org.apache.lucene.index.TestDeletionPolicy
[junit4:junit4] Completed on J2 in 8.19s, 6 tests
[junit4:junit4] 
[junit4:junit4] Suite: org.apache.lucene.analysis.TestLookaheadTokenFilter
[junit4:junit4] Completed on J6 in 29.20s, 2 tests
[junit4:junit4] 
[junit4:junit4] Suite: org.apache.lucene.search.TestNumericRangeQuery64
[junit4:junit4] Completed on J5 in 28.40s, 34 tests
[junit4:junit4] 
[junit4:junit4] Suite: org.apache.lucene.index.TestAddIndexes
[junit4:junit4] Completed on J1 in 14.37s, 20 tests
[junit4:junit4] 
[junit4:junit4] Suite: org.apache.lucene.index.TestNRTReaderWithThreads
[junit4:junit4] Completed on J6 in 2.48s, 1 test
[junit4:junit4] 
[junit4:junit4] Suite: org.apache.lucene.search.payloads.TestPayloadExplanations
[junit4:junit4] Completed on J6 in 2.05s, 5 tests
[junit4:junit4] 
[junit4:junit4] Suite: org.apache.lucene.TestAssertions
[junit4:junit4] Completed on J6 in 0.10s, 1 test
[junit4:junit4] 
[junit4:junit4] Suite: org.apache.lucene.index.TestCompoundFile
[junit4:junit4] Completed on J5 in 4.71s, 18 tests
[junit4:junit4] 
[junit4:junit4] Suite: org.apache.lucene.index.TestDoc
[junit4:junit4] Completed on J6 in 0.84s, 1 test
[junit4:junit4] 
[junit4:junit4] Suite: org.apache.lucene.index.TestIndexWriterExceptions
[junit4:junit4] Completed on J0 in 45.98s, 25 tests
[junit4:junit4] 
[junit4:junit4] Suite: org.apache.lucene.index.TestStressIndexing2
[junit4:junit4] Completed on J5 in 2.64s, 3 tests
[junit4:junit4] 
[junit4:junit4] Suite: org.apache.lucene.store.TestByteArrayDataInput
[junit4:junit4] Completed on J5 in 0.09s, 1 test
[junit4:junit4] 
[junit4:junit4] Suite: org.apache.lucene.codecs.perfield.TestPerFieldPostingsFormat2
[junit4:junit4] Completed on J5 in 2.73s, 5 tests
[junit4:junit4] 
[junit4:junit4] Suite: org.apache.lucene.index.TestTermsEnum
[junit4:junit4] Completed on J7 in 22.90s, 7 tests
[junit4:junit4] 
[junit4:junit4] Suite: org.apache.lucene.index.TestIndexWriterMerging
[junit4:junit4] Completed on J2 in 22.78s, 6 tests
[junit4:junit4] 
[junit4:junit4] Suite: org.apache.lucene.codecs.lucene40.TestLucene40PostingsReader
[junit4:junit4] Completed on J6 in 13.31s, 1 test
[junit4:junit4] 
[junit4:junit4] Suite: org.apache.lucene.util.TestOpenBitSet
[junit4:junit4] Completed on J0 in 11.24s, 4 tests
[junit4:junit4] 
[junit4:junit4] Suite: org.apache.lucene.index.TestNeverDelete
[junit4:junit4] Completed on J2 in 3.34s, 1 test
[junit4:junit4] 
[junit4:junit4] Suite: org.apache.lucene.analysis.TestGraphTokenizers
[junit4:junit4] Completed on J3 in 36.21s, 21 tests
[junit4:junit4] 
[junit4:junit4] Suite: org.apache.lucene.index.TestIndexWriterMergePolicy
[junit4:junit4] Completed on J7 in 11.85s, 7 tests
[junit4:junit4] 
[junit4:junit4] Suite: org.apache.lucene.store.TestMultiMMap
[junit4:junit4] Completed on J1 in 26.90s, 11 tests
[junit4:junit4] 
[junit4:junit4] Suite: org.apache.lucene.index.TestCustomNorms
[junit4:junit4] Completed on J3 in 3.17s, 3 tests
[junit4:junit4] 
[junit4:junit4] Suite: org.apache.lucene.index.TestFlushByRamOrCountsPolicy
[junit4:junit4] Completed on J6 in 11.03s, 5 tests
[junit4:junit4] 
[junit4:junit4] Suite: org.apache.lucene.index.TestIndexWriterReader
[junit4:junit4]   2> NOTE: reproduce with: ant test  -Dtestcase=TestIndexWriterReader -Dtests.method=testDuringAddIndexes -Dtests.seed=E321CF180DB4BE1A -Dtests.slow=true -Dtests.locale=pt_BR -Dtests.timezone=Pacific/Rarotonga -Dtests.file.encoding=UTF-8
[junit4:junit4] FAILURE 2.47s J5 | TestIndexWriterReader.testDuringAddIndexes <<<
[junit4:junit4]    > Throwable #1: java.lang.AssertionError: openDeleted=[_18.cfs, _19.cfs] expected:<0> but was:<2>
[junit4:junit4]    > 	at __randomizedtesting.SeedInfo.seed([E321CF180DB4BE1A:11F8A10B6A1DA88C]:0)
[junit4:junit4]    > 	at org.junit.Assert.fail(Assert.java:93)
[junit4:junit4]    > 	at org.junit.Assert.failNotEquals(Assert.java:647)
[junit4:junit4]    > 	at org.junit.Assert.assertEquals(Assert.java:128)
[junit4:junit4]    > 	at org.junit.Assert.assertEquals(Assert.java:472)
[junit4:junit4]    > 	at org.apache.lucene.index.TestIndexWriterReader.testDuringAddIndexes(TestIndexWriterReader.java:782)
[junit4:junit4]    > 	at sun.reflect.NativeMethodAccessorImpl.invoke0(Native Method)
[junit4:junit4]    > 	at sun.reflect.NativeMethodAccessorImpl.invoke(NativeMethodAccessorImpl.java:39)
[junit4:junit4]    > 	at sun.reflect.DelegatingMethodAccessorImpl.invoke(DelegatingMethodAccessorImpl.java:25)
[junit4:junit4]    > 	at java.lang.reflect.Method.invoke(Method.java:597)
[junit4:junit4]    > 	at com.carrotsearch.randomizedtesting.RandomizedRunner.invoke(RandomizedRunner.java:1559)
[junit4:junit4]    > 	at com.carrotsearch.randomizedtesting.RandomizedRunner.access$600(RandomizedRunner.java:79)
[junit4:junit4]    > 	at com.carrotsearch.randomizedtesting.RandomizedRunner$6.evaluate(RandomizedRunner.java:737)
[junit4:junit4]    > 	at com.carrotsearch.randomizedtesting.RandomizedRunner$7.evaluate(RandomizedRunner.java:773)
[junit4:junit4]    > 	at com.carrotsearch.randomizedtesting.RandomizedRunner$8.evaluate(RandomizedRunner.java:787)
[junit4:junit4]    > 	at org.apache.lucene.util.TestRuleSetupTeardownChained$1.evaluate(TestRuleSetupTeardownChained.java:50)
[junit4:junit4]    > 	at org.apache.lucene.util.TestRuleFieldCacheSanity$1.evaluate(TestRuleFieldCacheSanity.java:51)
[junit4:junit4]    > 	at org.apache.lucene.util.AbstractBeforeAfterRule$1.evaluate(AbstractBeforeAfterRule.java:45)
[junit4:junit4]    > 	at com.carrotsearch.randomizedtesting.rules.SystemPropertiesInvariantRule$1.evaluate(SystemPropertiesInvariantRule.java:55)
[junit4:junit4]    > 	at org.apache.lucene.util.TestRuleThreadAndTestName$1.evaluate(TestRuleThreadAndTestName.java:48)
[junit4:junit4]    > 	at org.apache.lucene.util.TestRuleIgnoreAfterMaxFailures$1.evaluate(TestRuleIgnoreAfterMaxFailures.java:70)
[junit4:junit4]    > 	at org.apache.lucene.util.TestRuleMarkFailure$1.evaluate(TestRuleMarkFailure.java:48)
[junit4:junit4]    > 	at com.carrotsearch.randomizedtesting.rules.StatementAdapter.evaluate(StatementAdapter.java:36)
[junit4:junit4]    > 	at com.carrotsearch.randomizedtesting.ThreadLeakControl$StatementRunner.run(ThreadLeakControl.java:358)
[junit4:junit4]    > 	at com.carrotsearch.randomizedtesting.ThreadLeakControl.forkTimeoutingTask(ThreadLeakControl.java:782)
[junit4:junit4]    > 	at com.carrotsearch.randomizedtesting.ThreadLeakControl$3.evaluate(ThreadLeakControl.java:442)
[junit4:junit4]    > 	at com.carrotsearch.randomizedtesting.RandomizedRunner.runSingleTest(RandomizedRunner.java:746)
[junit4:junit4]    > 	at com.carrotsearch.randomizedtesting.RandomizedRunner$3.evaluate(RandomizedRunner.java:648)
[junit4:junit4]    > 	at com.carrotsearch.randomizedtesting.RandomizedRunner$4.evaluate(RandomizedRunner.java:682)
[junit4:junit4]    > 	at com.carrotsearch.randomizedtesting.RandomizedRunner$5.evaluate(RandomizedRunner.java:693)
[junit4:junit4]    > 	at org.apache.lucene.util.AbstractBeforeAfterRule$1.evaluate(AbstractBeforeAfterRule.java:45)
[junit4:junit4]    > 	at org.apache.lucene.util.TestRuleStoreClassName$1.evaluate(TestRuleStoreClassName.java:42)
[junit4:junit4]    > 	at com.carrotsearch.randomizedtesting.rules.SystemPropertiesInvariantRule$1.evaluate(SystemPropertiesInvariantRule.java:55)
[junit4:junit4]    > 	at com.carrotsearch.randomizedtesting.rules.NoShadowingOrOverridesOnMethodsRule$1.evaluate(NoShadowingOrOverridesOnMethodsRule.java:39)
[junit4:junit4]    > 	at com.carrotsearch.randomizedtesting.rules.NoShadowingOrOverridesOnMethodsRule$1.evaluate(NoShadowingOrOverridesOnMethodsRule.java:39)
[junit4:junit4]    > 	at com.carrotsearch.randomizedtesting.rules.StatementAdapter.evaluate(StatementAdapter.java:36)
[junit4:junit4]    > 	at org.apache.lucene.util.TestRuleAssertionsRequired$1.evaluate(TestRuleAssertionsRequired.java:43)
[junit4:junit4]    > 	at org.apache.lucene.util.TestRuleMarkFailure$1.evaluate(TestRuleMarkFailure.java:48)
[junit4:junit4]    > 	at org.apache.lucene.util.TestRuleIgnoreAfterMaxFailures$1.evaluate(TestRuleIgnoreAfterMaxFailures.java:70)
[junit4:junit4]    > 	at org.apache.lucene.util.TestRuleIgnoreTestSuites$1.evaluate(TestRuleIgnoreTestSuites.java:55)
[junit4:junit4]    > 	at com.carrotsearch.randomizedtesting.rules.StatementAdapter.evaluate(StatementAdapter.java:36)
[junit4:junit4]    > 	at com.carrotsearch.randomizedtesting.ThreadLeakControl$StatementRunner.run(ThreadLeakControl.java:358)
[junit4:junit4]    > 	at java.lang.Thread.run(Thread.java:662)
[junit4:junit4]   2> NOTE: test params are: codec=Lucene40: {f=Pulsing40(freqCutoff=8 minBlockSize=61 maxBlockSize=190), field=Pulsing40(freqCutoff=8 minBlockSize=61 maxBlockSize=190), field5=MockFixedIntBlock(blockSize=45), id=MockFixedIntBlock(blockSize=45), field4=PostingsFormat(name=Direct), field3=PostingsFormat(name=MockSep), field2=Pulsing40(freqCutoff=8 minBlockSize=61 maxBlockSize=190), foo=Pulsing40(freqCutoff=8 minBlockSize=61 maxBlockSize=190), field1=MockFixedIntBlock(blockSize=45), indexname=PostingsFormat(name=MockSep)}, sim=RandomSimilarityProvider(queryNorm=false,coord=crazy): {f=DFR I(n)BZ(0.3), field=DFR GL2, field5=DFR I(F)LZ(0.3), field4=DFR I(F)B3(800.0), field3=DFR I(n)L1, field2=DFR GB1, foo=DFR I(F)L1, field1=DFR I(ne)LZ(0.3), indexname=DFR I(ne)Z(0.3)}, locale=pt_BR, timezone=Pacific/Rarotonga
[junit4:junit4]   2> NOTE: Linux 3.2.0-26-generic amd64/Sun Microsystems Inc. 1.6.0_33 (64-bit)/cpus=8,threads=1,free=131133984,total=225640448
[junit4:junit4]   2> NOTE: All tests run in this JVM: [TestForceMergeForever, TestIndexWriterOnJRECrash, TestRegexpRandom2, TestTermsEnum2, TestDeterminism, TestDateFilter, TestThreadedForceMerge, TestPagedBytes, TestSentinelIntSet, TestStressAdvance, Nested1, TestIndexWriterUnicode, TestSumDocFreq, TestCrash, TestNumericRangeQuery64, TestCompoundFile, TestStressIndexing2, TestByteArrayDataInput, TestPerFieldPostingsFormat2, TestIndexWriterReader]
[junit4:junit4] Completed on J5 in 20.25s, 20 tests, 1 failure <<< FAILURES!
[junit4:junit4] 
[junit4:junit4] Suite: org.apache.lucene.search.TestSearchAfter
[junit4:junit4] Completed on J2 in 10.17s, 1 test
[junit4:junit4] 
[junit4:junit4] Suite: org.apache.lucene.index.TestPersistentSnapshotDeletionPolicy
[junit4:junit4] Completed on J1 in 3.29s, 14 tests
[junit4:junit4] 
[junit4:junit4] Suite: org.apache.lucene.search.TestTopDocsMerge
[junit4:junit4] Completed on J0 in 13.50s, 1 test
[junit4:junit4] 
[junit4:junit4] Suite: org.apache.lucene.store.TestNRTCachingDirectory
[junit4:junit4] Completed on J1 in 3.19s, 5 tests
[junit4:junit4] 
[junit4:junit4] Suite: org.apache.lucene.index.TestIndexWriter
[junit4:junit4] Completed on J4 in 43.01s, 51 tests
[junit4:junit4] 
[junit4:junit4] Suite: org.apache.lucene.store.TestBufferedIndexInput
[junit4:junit4] Completed on J2 in 6.31s, 4 tests
[junit4:junit4] 
[junit4:junit4] Suite: org.apache.lucene.index.TestBackwardsCompatibility
[junit4:junit4] Completed on J3 in 9.81s, 13 tests
[junit4:junit4] 
[junit4:junit4] Suite: org.apache.lucene.search.TestSearchWithThreads
[junit4:junit4] Completed on J5 in 9.64s, 1 test
[junit4:junit4] 
[junit4:junit4] Suite: org.apache.lucene.util.TestCollectionUtil
[junit4:junit4] Completed on J0 in 8.44s, 5 tests
[junit4:junit4] 
[junit4:junit4] Suite: org.apache.lucene.search.TestSloppyPhraseQuery
[junit4:junit4] Completed on J7 in 14.56s, 9 tests
[junit4:junit4] 
[junit4:junit4] Suite: org.apache.lucene.search.TestSort
[junit4:junit4] Completed on J6 in 10.90s, 25 tests
[junit4:junit4] 
[junit4:junit4] Suite: org.apache.lucene.index.TestDirectoryReader
[junit4:junit4] Completed on J4 in 4.39s, 23 tests
[junit4:junit4] 
[junit4:junit4] Suite: org.apache.lucene.index.TestLongPostings
[junit4:junit4] Completed on J1 in 6.66s, 2 tests
[junit4:junit4] 
[junit4:junit4] Suite: org.apache.lucene.index.TestDocumentsWriterStallControl
[junit4:junit4] Completed on J7 in 1.42s, 3 tests
[junit4:junit4] 
[junit4:junit4] Suite: org.apache.lucene.index.TestSnapshotDeletionPolicy
[junit4:junit4] Completed on J5 in 2.83s, 8 tests
[junit4:junit4] 
[junit4:junit4] Suite: org.apache.lucene.analysis.TestToken
[junit4:junit4] Completed on J3 in 4.75s, 10 tests
[junit4:junit4] 
[junit4:junit4] Suite: org.apache.lucene.util.TestFixedBitSet
[junit4:junit4] Completed on J2 in 5.95s, 5 tests
[junit4:junit4] 
[junit4:junit4] Suite: org.apache.lucene.store.TestHugeRamFile
[junit4:junit4] Completed on J1 in 2.65s, 1 test
[junit4:junit4] 
[junit4:junit4] Suite: org.apache.lucene.index.TestIndexWriterNRTIsCurrent
[junit4:junit4] Completed on J6 in 3.41s, 1 test
[junit4:junit4] 
[junit4:junit4] Suite: org.apache.lucene.store.TestLockFactory
[junit4:junit4] IGNOR/A 0.22s J2 | TestLockFactory.testStressLocks
[junit4:junit4]    > Assumption #1: 'nightly' test group is disabled (@Nightly)
[junit4:junit4] IGNOR/A 0.02s J2 | TestLockFactory.testStressLocksNativeFSLockFactory
[junit4:junit4]    > Assumption #1: 'nightly' test group is disabled (@Nightly)
[junit4:junit4] Completed on J2 in 1.57s, 11 tests, 2 skipped
[junit4:junit4] 
[junit4:junit4] Suite: org.apache.lucene.util.TestDoubleBarrelLRUCache
[junit4:junit4] Completed on J6 in 1.12s, 2 tests
[junit4:junit4] 
[junit4:junit4] Suite: org.apache.lucene.search.TestSloppyPhraseQuery2
[junit4:junit4] Completed on J7 in 3.93s, 9 tests
[junit4:junit4] 
[junit4:junit4] Suite: org.apache.lucene.index.Test2BDocs
[junit4:junit4] Completed on J5 in 2.94s, 2 tests
[junit4:junit4] 
[junit4:junit4] Suite: org.apache.lucene.index.TestTieredMergePolicy
[junit4:junit4] Completed on J4 in 5.21s, 4 tests
[junit4:junit4] 
[junit4:junit4] Suite: org.apache.lucene.analysis.TestMockAnalyzer
[junit4:junit4] Completed on J0 in 7.72s, 9 tests
[junit4:junit4] 
[junit4:junit4] Suite: org.apache.lucene.search.TestPhraseQuery
[junit4:junit4] Completed on J3 in 5.99s, 17 tests
[junit4:junit4] 
[junit4:junit4] Suite: org.apache.lucene.index.TestOmitNorms
[junit4:junit4] Completed on J5 in 3.22s, 5 tests
[junit4:junit4] 
[junit4:junit4] Suite: org.apache.lucene.util.automaton.TestLevenshteinAutomata
[junit4:junit4] Completed on J6 in 4.05s, 4 tests
[junit4:junit4] 
[junit4:junit4] Suite: org.apache.lucene.search.TestMultiValuedNumericRangeQuery
[junit4:junit4] Completed on J7 in 4.19s, 1 test
[junit4:junit4] 
[junit4:junit4] Suite: org.apache.lucene.search.TestComplexExplanations
[junit4:junit4] Completed on J2 in 5.64s, 22 tests
[junit4:junit4] 
[junit4:junit4] Suite: org.apache.lucene.util.TestBytesRefHash
[junit4:junit4] Completed on J0 in 2.62s, 7 tests
[junit4:junit4] 
[junit4:junit4] Suite: org.apache.lucene.store.TestWindowsMMap
[junit4:junit4] Completed on J6 in 1.30s, 1 test
[junit4:junit4] 
[junit4:junit4] Suite: org.apache.lucene.search.TestFieldCache
[junit4:junit4] Completed on J5 in 3.38s, 5 tests
[junit4:junit4] 
[junit4:junit4] Suite: org.apache.lucene.search.TestFieldCacheRangeFilter
[junit4:junit4] Completed on J2 in 2.23s, 9 tests
[junit4:junit4] 
[junit4:junit4] Suite: org.apache.lucene.index.TestSegmentMerger
[junit4:junit4] Completed on J4 in 7.06s, 3 tests
[junit4:junit4] 
[junit4:junit4] Suite: org.apache.lucene.codecs.lucene40.TestReuseDocsEnum
[junit4:junit4] Completed on J0 in 2.32s, 3 tests
[junit4:junit4] 
[junit4:junit4] Suite: org.apache.lucene.search.TestCustomSearcherSort
[junit4:junit4] Completed on J6 in 3.01s, 2 tests
[junit4:junit4] 
[junit4:junit4] Suite: org.apache.lucene.search.TestFieldCacheRewriteMethod
[junit4:junit4] Completed on J1 in 10.31s, 1 test
[junit4:junit4] 
[junit4:junit4] Suite: org.apache.lucene.search.TestBooleanMinShouldMatch
[junit4:junit4] Completed on J7 in 5.22s, 17 tests
[junit4:junit4] 
[junit4:junit4] Suite: org.apache.lucene.search.spans.TestSpanSearchEquivalence
[junit4:junit4] Completed on J5 in 2.73s, 8 tests
[junit4:junit4] 
[junit4:junit4] Suite: org.apache.lucene.search.spans.TestSpans
[junit4:junit4] Completed on J4 in 2.18s, 25 tests
[junit4:junit4] 
[junit4:junit4] Suite: org.apache.lucene.index.TestLazyProxSkipping
[junit4:junit4] Completed on J0 in 2.20s, 2 tests
[junit4:junit4] 
[junit4:junit4] Suite: org.apache.lucene.codecs.perfield.TestPerFieldPostingsFormat
[junit4:junit4] Completed on J3 in 7.29s, 7 tests
[junit4:junit4] 
[junit4:junit4] Suite: org.apache.lucene.store.TestCopyBytes
[junit4:junit4] Completed on J0 in 0.93s, 2 tests
[junit4:junit4] 
[junit4:junit4] Suite: org.apache.lucene.index.TestOmitTf
[junit4:junit4] Completed on J7 in 1.39s, 6 tests
[junit4:junit4] 
[junit4:junit4] Suite: org.apache.lucene.util.junitcompat.TestReproduceMessage
[junit4:junit4] Completed on J4 in 1.93s, 21 tests
[junit4:junit4] 
[junit4:junit4] Suite: org.apache.lucene.search.payloads.TestPayloadNearQuery
[junit4:junit4] Completed on J0 in 1.40s, 7 tests
[junit4:junit4] 
[junit4:junit4] Suite: org.apache.lucene.search.TestTermRangeFilter
[junit4:junit4] Completed on J3 in 1.55s, 3 tests
[junit4:junit4] 
[junit4:junit4] Suite: org.apache.lucene.util.TestFieldCacheSanityChecker
[junit4:junit4] Completed on J6 in 4.00s, 3 tests
[junit4:junit4] 
[junit4:junit4] Suite: org.apache.lucene.search.TestPrefixRandom
[junit4:junit4] Completed on J7 in 2.24s, 1 test
[junit4:junit4] 
[junit4:junit4] Suite: org.apache.lucene.search.TestMultiTermConstantScore
[junit4:junit4] Completed on J6 in 0.76s, 7 tests
[junit4:junit4] 
[junit4:junit4] Suite: org.apache.lucene.index.TestDocumentWriter
[junit4:junit4] Completed on J4 in 2.12s, 7 tests
[junit4:junit4] 
[junit4:junit4] Suite: org.apache.lucene.search.TestQueryWrapperFilter
[junit4:junit4] Completed on J0 in 1.67s, 3 tests
[junit4:junit4] 
[junit4:junit4] Suite: org.apache.lucene.search.TestMultiThreadTermVectors
[junit4:junit4] Completed on J2 in 7.85s, 1 test
[junit4:junit4] 
[junit4:junit4] Suite: org.apache.lucene.index.TestFlex
[junit4:junit4] Completed on J0 in 0.86s, 2 tests
[junit4:junit4] 
[junit4:junit4] Suite: org.apache.lucene.index.TestTermVectorsWriter
[junit4:junit4] Completed on J4 in 1.06s, 13 tests
[junit4:junit4] 
[junit4:junit4] Suite: org.apache.lucene.search.TestTermVectors
[junit4:junit4] Completed on J6 in 1.89s, 11 tests
[junit4:junit4] 
[junit4:junit4] Suite: org.apache.lucene.index.TestDocsAndPositions
[junit4:junit4] Completed on J7 in 2.15s, 6 tests
[junit4:junit4] 
[junit4:junit4] Suite: org.apache.lucene.index.TestTransactionRollback
[junit4:junit4] Completed on J2 in 0.89s, 2 tests
[junit4:junit4] 
[junit4:junit4] Suite: org.apache.lucene.search.TestMultiPhraseQuery
[junit4:junit4] Completed on J0 in 1.24s, 16 tests, 1 skipped
[junit4:junit4] 
[junit4:junit4] Suite: org.apache.lucene.index.TestIndexableField
[junit4:junit4] Completed on J6 in 1.19s, 1 test
[junit4:junit4] 
[junit4:junit4] Suite: org.apache.lucene.search.TestSimpleSearchEquivalence
[junit4:junit4] Completed on J5 in 7.10s, 12 tests
[junit4:junit4] 
[junit4:junit4] Suite: org.apache.lucene.index.TestDocTermOrds
[junit4:junit4] Completed on J7 in 1.19s, 3 tests
[junit4:junit4] 
[junit4:junit4] Suite: org.apache.lucene.index.TestPrefixCodedTerms
[junit4:junit4] Completed on J3 in 4.47s, 6 tests
[junit4:junit4] 
[junit4:junit4] Suite: org.apache.lucene.codecs.lucene40.TestAllFilesHaveCodecHeader
[junit4:junit4] Completed on J0 in 0.38s, 1 test
[junit4:junit4] 
[junit4:junit4] Suite: org.apache.lucene.search.similarities.TestSimilarity2
[junit4:junit4] Completed on J2 in 1.04s, 7 tests
[junit4:junit4] 
[junit4:junit4] Suite: org.apache.lucene.search.TestBooleanQuery
[junit4:junit4] Completed on J5 in 0.74s, 5 tests
[junit4:junit4] 
[junit4:junit4] Suite: org.apache.lucene.index.TestPayloads
[junit4:junit4] Completed on J3 in 0.72s, 7 tests
[junit4:junit4] 
[junit4:junit4] Suite: org.apache.lucene.search.TestTermRangeQuery
[junit4:junit4] Completed on J7 in 0.82s, 7 tests
[junit4:junit4] 
[junit4:junit4] Suite: org.apache.lucene.search.TestRegexpRandom
[junit4:junit4] Completed on J0 in 0.83s, 1 test
[junit4:junit4] 
[junit4:junit4] Suite: org.apache.lucene.index.TestMultiLevelSkipList
[junit4:junit4] Completed on J6 in 1.25s, 1 test
[junit4:junit4] 
[junit4:junit4] Suite: org.apache.lucene.search.TestScorerPerf
[junit4:junit4] Completed on J1 in 9.85s, 1 test
[junit4:junit4] 
[junit4:junit4] Suite: org.apache.lucene.search.TestFuzzyQuery
[junit4:junit4] Completed on J5 in 1.07s, 6 tests
[junit4:junit4] 
[junit4:junit4] Suite: org.apache.lucene.search.TestWildcard
[junit4:junit4] Completed on J6 in 0.55s, 8 tests
[junit4:junit4] 
[junit4:junit4] Suite: org.apache.lucene.search.TestSimpleExplanationsOfNonMatches
[junit4:junit4] Completed on J2 in 1.82s, 69 tests
[junit4:junit4] 
[junit4:junit4] Suite: org.apache.lucene.util.TestRollingBuffer
[junit4:junit4] Completed on J3 in 1.65s, 1 test
[junit4:junit4] 
[junit4:junit4] Suite: org.apache.lucene.search.spans.TestSpansAdvanced2
[junit4:junit4] Completed on J7 in 1.30s, 4 tests
[junit4:junit4] 
[junit4:junit4] Suite: org.apache.lucene.search.spans.TestSpanExplanationsOfNonMatches
[junit4:junit4] Completed on J5 in 0.75s, 31 tests
[junit4:junit4] 
[junit4:junit4] Suite: org.apache.lucene.search.spans.TestSpanMultiTermQueryWrapper
[junit4:junit4] Completed on J6 in 0.53s, 4 tests
[junit4:junit4] 
[junit4:junit4] Suite: org.apache.lucene.search.TestComplexExplanationsOfNonMatches
[junit4:junit4] Completed on J7 in 0.52s, 22 tests
[junit4:junit4] 
[junit4:junit4] Suite: org.apache.lucene.util.TestIdentityHashSet
[junit4:junit4] Completed on J1 in 1.48s, 1 test
[junit4:junit4] 
[junit4:junit4] Suite: org.apache.lucene.util.automaton.TestCompiledAutomaton
[junit4:junit4] Completed on J4 in 4.60s, 2 tests
[junit4:junit4] 
[junit4:junit4] Suite: org.apache.lucene.index.TestPerSegmentDeletes
[junit4:junit4] Completed on J5 in 0.31s, 1 test
[junit4:junit4] 
[junit4:junit4] Suite: org.apache.lucene.search.TestWildcardRandom
[junit4:junit4] Completed on J3 in 0.60s, 1 test
[junit4:junit4] 
[junit4:junit4] Suite: org.apache.lucene.index.TestUniqueTermCount
[junit4:junit4] Completed on J2 in 0.55s, 1 test
[junit4:junit4] 
[junit4:junit4] Suite: org.apache.lucene.util.junitcompat.TestBeforeAfterOverrides
[junit4:junit4] Completed on J1 in 0.10s, 2 tests
[junit4:junit4] 
[junit4:junit4] Suite: org.apache.lucene.index.TestBinaryTerms
[junit4:junit4] Completed on J6 in 0.34s, 1 test
[junit4:junit4] 
[junit4:junit4] Suite: org.apache.lucene.document.TestDocument
[junit4:junit4] Completed on J7 in 0.27s, 11 tests
[junit4:junit4] 
[junit4:junit4] Suite: org.apache.lucene.search.TestSubScorerFreqs
[junit4:junit4] Completed on J1 in 0.22s, 3 tests
[junit4:junit4] 
[junit4:junit4] Suite: org.apache.lucene.index.TestFilterAtomicReader
[junit4:junit4] Completed on J6 in 0.14s, 2 tests
[junit4:junit4] 
[junit4:junit4] Suite: org.apache.lucene.util.TestSetOnce
[junit4:junit4] Completed on J4 in 0.27s, 4 tests
[junit4:junit4] 
[junit4:junit4] Suite: org.apache.lucene.search.TestFilteredSearch
[junit4:junit4] Completed on J5 in 0.29s, 1 test
[junit4:junit4] 
[junit4:junit4] Suite: org.apache.lucene.index.TestNoDeletionPolicy
[junit4:junit4] Completed on J2 in 0.38s, 4 tests
[junit4:junit4] 
[junit4:junit4] Suite: org.apache.lucene.search.TestCachingWrapperFilter
[junit4:junit4] Completed on J3 in 0.26s, 5 tests
[junit4:junit4] 
[junit4:junit4] Suite: org.apache.lucene.search.TestMultiTermQueryRewrites
[junit4:junit4] Completed on J7 in 0.19s, 3 tests
[junit4:junit4] 
[junit4:junit4] Suite: org.apache.lucene.util.junitcompat.TestCodecReported
[junit4:junit4] Completed on J4 in 0.07s, 1 test
[junit4:junit4] 
[junit4:junit4] Suite: org.apache.lucene.TestSearch
[junit4:junit4] Completed on J5 in 0.15s, 2 tests
[junit4:junit4] 
[junit4:junit4] Suite: org.apache.lucene.index.TestParallelTermEnum
[junit4:junit4] Completed on J3 in 0.17s, 1 test
[junit4:junit4] 
[junit4:junit4] Suite: org.apache.lucene.search.TestExplanations
[junit4:junit4] Completed on J2 in 0.12s, 1 test
[junit4:junit4] 
[junit4:junit4] Suite: org.apache.lucene.store.TestFileSwitchDirectory
[junit4:junit4] Completed on J1 in 0.36s, 4 tests
[junit4:junit4] 
[junit4:junit4] Suite: org.apache.lucene.search.TestPositionIncrement
[junit4:junit4] Completed on J6 in 0.27s, 2 tests
[junit4:junit4] 
[junit4:junit4] Suite: org.apache.lucene.search.TestMatchAllDocsQuery
[junit4:junit4] Completed on J4 in 0.18s, 2 tests
[junit4:junit4] 
[junit4:junit4] Suite: org.apache.lucene.search.TestSimilarity
[junit4:junit4] Completed on J5 in 0.10s, 1 test
[junit4:junit4] 
[junit4:junit4] Suite: org.apache.lucene.search.TestSimilarityProvider
[junit4:junit4] Completed on J2 in 0.19s, 1 test
[junit4:junit4] 
[junit4:junit4] Suite: org.apache.lucene.util.TestAttributeSource
[junit4:junit4] Completed on J3 in 0.16s, 5 tests
[junit4:junit4] 
[junit4:junit4] Suite: org.apache.lucene.search.TestDateSort
[junit4:junit4] Completed on J1 in 0.22s, 1 test
[junit4:junit4] 
[junit4:junit4] Suite: org.apache.lucene.search.TestFieldCacheTermsFilter
[junit4:junit4] Completed on J7 in 0.27s, 1 test
[junit4:junit4] 
[junit4:junit4] Suite: org.apache.lucene.search.TestCachingCollector
[junit4:junit4] Completed on J6 in 0.16s, 5 tests
[junit4:junit4] 
[junit4:junit4] Suite: org.apache.lucene.search.TestBooleanOr
[junit4:junit4] Completed on J0 in 3.27s, 6 tests
[junit4:junit4] 
[junit4:junit4] Suite: org.apache.lucene.search.TestPrefixQuery
[junit4:junit4] Completed on J4 in 0.11s, 1 test
[junit4:junit4] 
[junit4:junit4] Suite: org.apache.lucene.search.TestTopScoreDocCollector
[junit4:junit4] Completed on J5 in 0.11s, 1 test
[junit4:junit4] 
[junit4:junit4] Suite: org.apache.lucene.search.spans.TestSpanFirstQuery
[junit4:junit4] Completed on J3 in 0.12s, 1 test
[junit4:junit4] 
[junit4:junit4] Suite: org.apache.lucene.util.TestIntsRef
[junit4:junit4] Completed on J2 in 0.10s, 2 tests
[junit4:junit4] 
[junit4:junit4] Suite: org.apache.lucene.index.TestNoMergePolicy
[junit4:junit4] Completed on J1 in 0.13s, 4 tests
[junit4:junit4] 
[junit4:junit4] Suite: org.apache.lucene.search.TestNGramPhraseQuery
[junit4:junit4] Completed on J7 in 0.10s, 1 test
[junit4:junit4] 
[junit4:junit4] Suite: org.apache.lucene.analysis.TestMockCharFilter
[junit4:junit4] Completed on J6 in 0.10s, 1 test
[junit4:junit4] 
[junit4:junit4] Suite: org.apache.lucene.index.TestFieldInfos
[junit4:junit4] Completed on J0 in 0.17s, 2 tests
[junit4:junit4] 
[junit4:junit4] Suite: org.apache.lucene.search.TestScoreCachingWrappingScorer
[junit4:junit4] Completed on J4 in 0.08s, 1 test
[junit4:junit4] 
[junit4:junit4] Suite: org.apache.lucene.index.TestIndexWriterLockRelease
[junit4:junit4] Completed on J5 in 0.08s, 1 test
[junit4:junit4] 
[junit4:junit4] Suite: org.apache.lucene.util.TestCloseableThreadLocal
[junit4:junit4] Completed on J2 in 0.12s, 3 tests
[junit4:junit4] 
[junit4:junit4] Suite: org.apache.lucene.index.TestNewestSegment
[junit4:junit4] Completed on J3 in 0.07s, 1 test
[junit4:junit4] 
[junit4:junit4] Suite: org.apache.lucene.index.TestNoMergeScheduler
[junit4:junit4] Completed on J1 in 0.10s, 3 tests
[junit4:junit4] 
[junit4:junit4] Suite: org.apache.lucene.util.TestByteBlockPool
[junit4:junit4] Completed on J7 in 0.06s, 1 test
[junit4:junit4] 
[junit4:junit4] Suite: org.apache.lucene.index.TestIndexCommit
[junit4:junit4] Completed on J6 in 0.09s, 1 test
[junit4:junit4] 
[junit4:junit4] Suite: org.apache.lucene.analysis.tokenattributes.TestSimpleAttributeImpl
[junit4:junit4] Completed on J0 in 0.10s, 1 test
[junit4:junit4] 
[junit4:junit4] Suite: org.apache.lucene.index.TestTermdocPerf
[junit4:junit4] Completed on J4 in 0.07s, 1 test
[junit4:junit4] 
[junit4:junit4] Suite: org.apache.lucene.util.TestIOUtils
[junit4:junit4] Completed on J5 in 0.07s, 1 test
[junit4:junit4] 
[junit4:junit4] Suite: org.apache.lucene.index.TestTerm
[junit4:junit4] Completed on J2 in 0.06s, 1 test
[junit4:junit4] 
[junit4:junit4] Suite: org.apache.lucene.TestWorstCaseTestBehavior
[junit4:junit4] Completed on J3 in 0.10s, 6 tests, 6 skipped
[junit4:junit4] 
[junit4:junit4] Suite: org.apache.lucene.analysis.TestCharFilter
[junit4:junit4] Completed on J1 in 0.08s, 4 tests
[junit4:junit4] 
[junit4:junit4] Suite: org.apache.lucene.index.TestTwoPhaseCommitTool
[junit4:junit4] Completed on J4 in 0.14s, 4 tests
[junit4:junit4] 
[junit4:junit4] Suite: org.apache.lucene.search.TestBooleanQueryVisitSubscorers
[junit4:junit4] Completed on J6 in 0.19s, 3 tests
[junit4:junit4] 
[junit4:junit4] Suite: org.apache.lucene.store.TestMockDirectoryWrapper
[junit4:junit4] Completed on J0 in 0.10s, 2 tests
[junit4:junit4] 
[junit4:junit4] Suite: org.apache.lucene.index.TestPostingsFormat
[junit4:junit4] Completed on J7 in 2.03s, 7 tests
[junit4:junit4] 
[junit4:junit4] 
[junit4:junit4] Tests with failures:
[junit4:junit4]   - org.apache.lucene.index.TestIndexWriterReader.testDuringAddIndexes
[junit4:junit4] 
[junit4:junit4] 
[junit4:junit4] JVM J0:     1.70 ..   196.77 =   195.07s
[junit4:junit4] JVM J1:     1.69 ..   196.67 =   194.98s
[junit4:junit4] JVM J2:     1.50 ..   196.87 =   195.38s
[junit4:junit4] JVM J3:     1.95 ..   196.66 =   194.72s
[junit4:junit4] JVM J4:     1.69 ..   197.00 =   195.30s
[junit4:junit4] JVM J5:     1.70 ..   196.51 =   194.82s
[junit4:junit4] JVM J6:     1.71 ..   197.00 =   195.30s
[junit4:junit4] JVM J7:     1.93 ..   198.93 =   197.00s
[junit4:junit4] Execution time total: 3 minutes 18 seconds
[junit4:junit4] Tests summary: 309 suites, 1801 tests, 1 failure, 17 ignored (9 assumptions)

BUILD FAILED
/var/lib/jenkins/workspace/Lucene-trunk-Linux-Java6-64-test-only/checkout/lucene/build.xml:49: The following error occurred while executing this line:
/var/lib/jenkins/workspace/Lucene-trunk-Linux-Java6-64-test-only/checkout/lucene/common-build.xml:1143: The following error occurred while executing this line:
/var/lib/jenkins/workspace/Lucene-trunk-Linux-Java6-64-test-only/checkout/lucene/common-build.xml:816: There were test failures: 309 suites, 1801 tests, 1 failure, 17 ignored (9 assumptions)

Total time: 3 minutes 41 seconds
Build step 'Invoke Ant' marked build as failure
Archiving artifacts
Recording test results
Email was triggered for: Failure
Sending email for trigger: Failure




Mime
View raw message