lucene-dev mailing list archives

Site index · List index
Message view « Date » · « Thread »
Top « Date » · « Thread »
From Apache Jenkins Server <jenk...@builds.apache.org>
Subject [JENKINS] Lucene-Solr-NightlyTests-trunk - Build # 51 - Failure
Date Tue, 02 Oct 2012 08:52:42 GMT
Build: https://builds.apache.org/job/Lucene-Solr-NightlyTests-trunk/51/

1 tests failed.
REGRESSION:  org.apache.lucene.codecs.memory.TestMemoryPostingsFormat.testDocsAndFreqsAndPositionsAndOffsetsAndPayloads

Error Message:
Captured an uncaught exception in thread: Thread[id=388, name=Thread-374, state=RUNNABLE,
group=TGRP-TestMemoryPostingsFormat]

Stack Trace:
com.carrotsearch.randomizedtesting.UncaughtExceptionError: Captured an uncaught exception
in thread: Thread[id=388, name=Thread-374, state=RUNNABLE, group=TGRP-TestMemoryPostingsFormat]
Caused by: java.lang.RuntimeException: java.lang.OutOfMemoryError: Java heap space
	at __randomizedtesting.SeedInfo.seed([58FF4B48F37B8EDD]:0)
	at org.apache.lucene.index.BasePostingsFormatTestCase$TestThread.run(BasePostingsFormatTestCase.java:826)
Caused by: java.lang.OutOfMemoryError: Java heap space
	at org.apache.lucene.util.BytesRef.<init>(BytesRef.java:75)
	at org.apache.lucene.util.fst.ByteSequenceOutputs.read(ByteSequenceOutputs.java:124)
	at org.apache.lucene.util.fst.ByteSequenceOutputs.read(ByteSequenceOutputs.java:33)
	at org.apache.lucene.util.fst.FST.readNextRealArc(FST.java:962)
	at org.apache.lucene.util.fst.FST.findTargetArc(FST.java:1115)
	at org.apache.lucene.util.fst.FSTEnum.doSeekExact(FSTEnum.java:441)
	at org.apache.lucene.util.fst.BytesRefFSTEnum.seekExact(BytesRefFSTEnum.java:84)
	at org.apache.lucene.codecs.memory.MemoryPostingsFormat$FSTTermsEnum.seekExact(MemoryPostingsFormat.java:656)
	at org.apache.lucene.index.TermsEnum.seekExact(TermsEnum.java:121)
	at org.apache.lucene.index.BasePostingsFormatTestCase.testTermsOneThread(BasePostingsFormatTestCase.java:895)
	at org.apache.lucene.index.BasePostingsFormatTestCase.access$200(BasePostingsFormatTestCase.java:80)
	at org.apache.lucene.index.BasePostingsFormatTestCase$TestThread.run(BasePostingsFormatTestCase.java:824)




Build Log:
[...truncated 5490 lines...]
[junit4:junit4] Suite: org.apache.lucene.codecs.memory.TestMemoryPostingsFormat
[junit4:junit4]   2> 2012 DF�mh 2 20:39:27 com.carrotsearch.randomizedtesting.RandomizedRunner$QueueUncaughtExceptionsHandler
uncaughtException
[junit4:junit4]   2> WARNING: Uncaught exception in thread: Thread[Thread-374,5,TGRP-TestMemoryPostingsFormat]
[junit4:junit4]   2> java.lang.RuntimeException: java.lang.OutOfMemoryError: Java heap
space
[junit4:junit4]   2> 	at __randomizedtesting.SeedInfo.seed([58FF4B48F37B8EDD]:0)
[junit4:junit4]   2> 	at org.apache.lucene.index.BasePostingsFormatTestCase$TestThread.run(BasePostingsFormatTestCase.java:826)
[junit4:junit4]   2> Caused by: java.lang.OutOfMemoryError: Java heap space
[junit4:junit4]   2> 	at org.apache.lucene.util.BytesRef.<init>(BytesRef.java:75)
[junit4:junit4]   2> 	at org.apache.lucene.util.fst.ByteSequenceOutputs.read(ByteSequenceOutputs.java:124)
[junit4:junit4]   2> 	at org.apache.lucene.util.fst.ByteSequenceOutputs.read(ByteSequenceOutputs.java:33)
[junit4:junit4]   2> 	at org.apache.lucene.util.fst.FST.readNextRealArc(FST.java:962)
[junit4:junit4]   2> 	at org.apache.lucene.util.fst.FST.findTargetArc(FST.java:1115)
[junit4:junit4]   2> 	at org.apache.lucene.util.fst.FSTEnum.doSeekExact(FSTEnum.java:441)
[junit4:junit4]   2> 	at org.apache.lucene.util.fst.BytesRefFSTEnum.seekExact(BytesRefFSTEnum.java:84)
[junit4:junit4]   2> 	at org.apache.lucene.codecs.memory.MemoryPostingsFormat$FSTTermsEnum.seekExact(MemoryPostingsFormat.java:656)
[junit4:junit4]   2> 	at org.apache.lucene.index.TermsEnum.seekExact(TermsEnum.java:121)
[junit4:junit4]   2> 	at org.apache.lucene.index.BasePostingsFormatTestCase.testTermsOneThread(BasePostingsFormatTestCase.java:895)
[junit4:junit4]   2> 	at org.apache.lucene.index.BasePostingsFormatTestCase.access$200(BasePostingsFormatTestCase.java:80)
[junit4:junit4]   2> 	at org.apache.lucene.index.BasePostingsFormatTestCase$TestThread.run(BasePostingsFormatTestCase.java:824)
[junit4:junit4]   2> 2012 DF�mh 2 20:39:34 com.carrotsearch.randomizedtesting.RandomizedRunner$QueueUncaughtExceptionsHandler
uncaughtException
[junit4:junit4]   2> WARNING: Uncaught exception in thread: Thread[Thread-375,5,TGRP-TestMemoryPostingsFormat]
[junit4:junit4]   2> java.lang.RuntimeException: java.lang.OutOfMemoryError: Java heap
space
[junit4:junit4]   2> 	at __randomizedtesting.SeedInfo.seed([58FF4B48F37B8EDD]:0)
[junit4:junit4]   2> 	at org.apache.lucene.index.BasePostingsFormatTestCase$TestThread.run(BasePostingsFormatTestCase.java:826)
[junit4:junit4]   2> Caused by: java.lang.OutOfMemoryError: Java heap space
[junit4:junit4]   2> 	at org.apache.lucene.util.BytesRef.<init>(BytesRef.java:75)
[junit4:junit4]   2> 	at org.apache.lucene.util.fst.ByteSequenceOutputs.read(ByteSequenceOutputs.java:124)
[junit4:junit4]   2> 	at org.apache.lucene.util.fst.ByteSequenceOutputs.read(ByteSequenceOutputs.java:33)
[junit4:junit4]   2> 	at org.apache.lucene.util.fst.FST.readNextRealArc(FST.java:962)
[junit4:junit4]   2> 	at org.apache.lucene.util.fst.FST.findTargetArc(FST.java:1115)
[junit4:junit4]   2> 	at org.apache.lucene.util.fst.FSTEnum.doSeekExact(FSTEnum.java:441)
[junit4:junit4]   2> 	at org.apache.lucene.util.fst.BytesRefFSTEnum.seekExact(BytesRefFSTEnum.java:84)
[junit4:junit4]   2> 	at org.apache.lucene.codecs.memory.MemoryPostingsFormat$FSTTermsEnum.seekExact(MemoryPostingsFormat.java:656)
[junit4:junit4]   2> 	at org.apache.lucene.index.BasePostingsFormatTestCase.testTermsOneThread(BasePostingsFormatTestCase.java:893)
[junit4:junit4]   2> 	at org.apache.lucene.index.BasePostingsFormatTestCase.access$200(BasePostingsFormatTestCase.java:80)
[junit4:junit4]   2> 	at org.apache.lucene.index.BasePostingsFormatTestCase$TestThread.run(BasePostingsFormatTestCase.java:824)
[junit4:junit4]   2> NOTE: download the large Jenkins line-docs file by running 'ant get-jenkins-line-docs'
in the lucene directory.
[junit4:junit4]   2> NOTE: reproduce with: ant test  -Dtestcase=TestMemoryPostingsFormat
-Dtests.method=testDocsAndFreqsAndPositionsAndOffsetsAndPayloads -Dtests.seed=58FF4B48F37B8EDD
-Dtests.multiplier=3 -Dtests.nightly=true -Dtests.slow=true -Dtests.linedocsfile=/home/hudson/lucene-data/enwiki.random.lines.txt
-Dtests.locale=ga -Dtests.timezone=Pacific/Tarawa -Dtests.file.encoding=UTF-8
[junit4:junit4] ERROR   41.7s J0 | TestMemoryPostingsFormat.testDocsAndFreqsAndPositionsAndOffsetsAndPayloads
<<<
[junit4:junit4]    > Throwable #1: com.carrotsearch.randomizedtesting.UncaughtExceptionError:
Captured an uncaught exception in thread: Thread[id=388, name=Thread-374, state=RUNNABLE,
group=TGRP-TestMemoryPostingsFormat]
[junit4:junit4]    > Caused by: java.lang.RuntimeException: java.lang.OutOfMemoryError:
Java heap space
[junit4:junit4]    > 	at __randomizedtesting.SeedInfo.seed([58FF4B48F37B8EDD]:0)
[junit4:junit4]    > 	at org.apache.lucene.index.BasePostingsFormatTestCase$TestThread.run(BasePostingsFormatTestCase.java:826)
[junit4:junit4]    > Caused by: java.lang.OutOfMemoryError: Java heap space
[junit4:junit4]    > 	at org.apache.lucene.util.BytesRef.<init>(BytesRef.java:75)
[junit4:junit4]    > 	at org.apache.lucene.util.fst.ByteSequenceOutputs.read(ByteSequenceOutputs.java:124)
[junit4:junit4]    > 	at org.apache.lucene.util.fst.ByteSequenceOutputs.read(ByteSequenceOutputs.java:33)
[junit4:junit4]    > 	at org.apache.lucene.util.fst.FST.readNextRealArc(FST.java:962)
[junit4:junit4]    > 	at org.apache.lucene.util.fst.FST.findTargetArc(FST.java:1115)
[junit4:junit4]    > 	at org.apache.lucene.util.fst.FSTEnum.doSeekExact(FSTEnum.java:441)
[junit4:junit4]    > 	at org.apache.lucene.util.fst.BytesRefFSTEnum.seekExact(BytesRefFSTEnum.java:84)
[junit4:junit4]    > 	at org.apache.lucene.codecs.memory.MemoryPostingsFormat$FSTTermsEnum.seekExact(MemoryPostingsFormat.java:656)
[junit4:junit4]    > 	at org.apache.lucene.index.TermsEnum.seekExact(TermsEnum.java:121)
[junit4:junit4]    > 	at org.apache.lucene.index.BasePostingsFormatTestCase.testTermsOneThread(BasePostingsFormatTestCase.java:895)
[junit4:junit4]    > 	at org.apache.lucene.index.BasePostingsFormatTestCase.access$200(BasePostingsFormatTestCase.java:80)
[junit4:junit4]    > 	at org.apache.lucene.index.BasePostingsFormatTestCase$TestThread.run(BasePostingsFormatTestCase.java:824)
[junit4:junit4]    > Throwable #2: com.carrotsearch.randomizedtesting.UncaughtExceptionError:
Captured an uncaught exception in thread: Thread[id=389, name=Thread-375, state=RUNNABLE,
group=TGRP-TestMemoryPostingsFormat]
[junit4:junit4]    > Caused by: java.lang.RuntimeException: java.lang.OutOfMemoryError:
Java heap space
[junit4:junit4]    > 	at __randomizedtesting.SeedInfo.seed([58FF4B48F37B8EDD]:0)
[junit4:junit4]    > 	at org.apache.lucene.index.BasePostingsFormatTestCase$TestThread.run(BasePostingsFormatTestCase.java:826)
[junit4:junit4]    > Caused by: java.lang.OutOfMemoryError: Java heap space
[junit4:junit4]    > 	at org.apache.lucene.util.BytesRef.<init>(BytesRef.java:75)
[junit4:junit4]    > 	at org.apache.lucene.util.fst.ByteSequenceOutputs.read(ByteSequenceOutputs.java:124)
[junit4:junit4]    > 	at org.apache.lucene.util.fst.ByteSequenceOutputs.read(ByteSequenceOutputs.java:33)
[junit4:junit4]    > 	at org.apache.lucene.util.fst.FST.readNextRealArc(FST.java:962)
[junit4:junit4]    > 	at org.apache.lucene.util.fst.FST.findTargetArc(FST.java:1115)
[junit4:junit4]    > 	at org.apache.lucene.util.fst.FSTEnum.doSeekExact(FSTEnum.java:441)
[junit4:junit4]    > 	at org.apache.lucene.util.fst.BytesRefFSTEnum.seekExact(BytesRefFSTEnum.java:84)
[junit4:junit4]    > 	at org.apache.lucene.codecs.memory.MemoryPostingsFormat$FSTTermsEnum.seekExact(MemoryPostingsFormat.java:656)
[junit4:junit4]    > 	at org.apache.lucene.index.BasePostingsFormatTestCase.testTermsOneThread(BasePostingsFormatTestCase.java:893)
[junit4:junit4]    > 	at org.apache.lucene.index.BasePostingsFormatTestCase.access$200(BasePostingsFormatTestCase.java:80)
[junit4:junit4]    > 	at org.apache.lucene.index.BasePostingsFormatTestCase$TestThread.run(BasePostingsFormatTestCase.java:824)
[junit4:junit4]   2> NOTE: test params are: codec=Lucene40: {}, sim=RandomSimilarityProvider(queryNorm=false,coord=no):
{}, locale=ga, timezone=Pacific/Tarawa
[junit4:junit4]   2> NOTE: FreeBSD 9.0-RELEASE amd64/Sun Microsystems Inc. 1.6.0_32 (64-bit)/cpus=16,threads=1,free=148212360,total=477233152
[junit4:junit4]   2> NOTE: All tests run in this JVM: [TestBlockPostingsFormat2, TestBloomPostingsFormat,
TestMemoryPostingsFormat]
[junit4:junit4] Completed on J0 in 122.93s, 7 tests, 1 error <<< FAILURES!

[...truncated 30 lines...]
BUILD FAILED
/usr/home/hudson/hudson-slave/workspace/Lucene-Solr-NightlyTests-trunk/build.xml:38: The following
error occurred while executing this line:
/usr/home/hudson/hudson-slave/workspace/Lucene-Solr-NightlyTests-trunk/lucene/build.xml:508:
The following error occurred while executing this line:
/usr/home/hudson/hudson-slave/workspace/Lucene-Solr-NightlyTests-trunk/lucene/common-build.xml:1641:
The following error occurred while executing this line:
/usr/home/hudson/hudson-slave/workspace/Lucene-Solr-NightlyTests-trunk/lucene/module-build.xml:61:
The following error occurred while executing this line:
/usr/home/hudson/hudson-slave/workspace/Lucene-Solr-NightlyTests-trunk/lucene/common-build.xml:1143:
The following error occurred while executing this line:
/usr/home/hudson/hudson-slave/workspace/Lucene-Solr-NightlyTests-trunk/lucene/common-build.xml:816:
There were test failures: 18 suites, 84 tests, 1 error

Total time: 66 minutes 40 seconds
Build step 'Invoke Ant' marked build as failure
Recording test results
Email was triggered for: Failure
Sending email for trigger: Failure



Mime
View raw message