lucene-dev mailing list archives

Site index · List index
Message view « Date » · « Thread »
Top « Date » · « Thread »
From Policeman Jenkins Server <jenk...@sd-datasolutions.de>
Subject [JENKINS] Lucene-Solr-trunk-Linux (32bit/jdk1.8.0-ea-b58) - Build # 2085 - Still Failing!
Date Tue, 30 Oct 2012 02:56:24 GMT
Build: http://jenkins.sd-datasolutions.de/job/Lucene-Solr-trunk-Linux/2085/
Java: 32bit/jdk1.8.0-ea-b58 -client -XX:+UseParallelGC

2 tests failed.
FAILED:  junit.framework.TestSuite.org.apache.solr.schema.TestBinaryField

Error Message:
2 threads leaked from SUITE scope at org.apache.solr.schema.TestBinaryField:     1) Thread[id=21,
name=metrics-meter-tick-thread-1, state=TIMED_WAITING, group=TGRP-TestBinaryField]       
 at sun.misc.Unsafe.park(Native Method)         at java.util.concurrent.locks.LockSupport.parkNanos(LockSupport.java:226)
        at java.util.concurrent.locks.AbstractQueuedSynchronizer$ConditionObject.awaitNanos(AbstractQueuedSynchronizer.java:2082)
        at java.util.concurrent.ScheduledThreadPoolExecutor$DelayedWorkQueue.take(ScheduledThreadPoolExecutor.java:1091)
        at java.util.concurrent.ScheduledThreadPoolExecutor$DelayedWorkQueue.take(ScheduledThreadPoolExecutor.java:808)
        at java.util.concurrent.ThreadPoolExecutor.getTask(ThreadPoolExecutor.java:1045) 
       at java.util.concurrent.ThreadPoolExecutor.runWorker(ThreadPoolExecutor.java:1103)
        at java.util.concurrent.ThreadPoolExecutor$Worker.run(ThreadPoolExecutor.java:603)
        at java.lang.Thread.run(Thread.java:722)    2) Thread[id=22, name=metrics-meter-tick-thread-2,
state=WAITING, group=TGRP-TestBinaryField]         at sun.misc.Unsafe.park(Native Method)
        at java.util.concurrent.locks.LockSupport.park(LockSupport.java:186)         at java.util.concurrent.locks.AbstractQueuedSynchronizer$ConditionObject.await(AbstractQueuedSynchronizer.java:2043)
        at java.util.concurrent.ScheduledThreadPoolExecutor$DelayedWorkQueue.take(ScheduledThreadPoolExecutor.java:1086)
        at java.util.concurrent.ScheduledThreadPoolExecutor$DelayedWorkQueue.take(ScheduledThreadPoolExecutor.java:808)
        at java.util.concurrent.ThreadPoolExecutor.getTask(ThreadPoolExecutor.java:1045) 
       at java.util.concurrent.ThreadPoolExecutor.runWorker(ThreadPoolExecutor.java:1103)
        at java.util.concurrent.ThreadPoolExecutor$Worker.run(ThreadPoolExecutor.java:603)
        at java.lang.Thread.run(Thread.java:722)

Stack Trace:
com.carrotsearch.randomizedtesting.ThreadLeakError: 2 threads leaked from SUITE scope at org.apache.solr.schema.TestBinaryField:

   1) Thread[id=21, name=metrics-meter-tick-thread-1, state=TIMED_WAITING, group=TGRP-TestBinaryField]
        at sun.misc.Unsafe.park(Native Method)
        at java.util.concurrent.locks.LockSupport.parkNanos(LockSupport.java:226)
        at java.util.concurrent.locks.AbstractQueuedSynchronizer$ConditionObject.awaitNanos(AbstractQueuedSynchronizer.java:2082)
        at java.util.concurrent.ScheduledThreadPoolExecutor$DelayedWorkQueue.take(ScheduledThreadPoolExecutor.java:1091)
        at java.util.concurrent.ScheduledThreadPoolExecutor$DelayedWorkQueue.take(ScheduledThreadPoolExecutor.java:808)
        at java.util.concurrent.ThreadPoolExecutor.getTask(ThreadPoolExecutor.java:1045)
        at java.util.concurrent.ThreadPoolExecutor.runWorker(ThreadPoolExecutor.java:1103)
        at java.util.concurrent.ThreadPoolExecutor$Worker.run(ThreadPoolExecutor.java:603)
        at java.lang.Thread.run(Thread.java:722)
   2) Thread[id=22, name=metrics-meter-tick-thread-2, state=WAITING, group=TGRP-TestBinaryField]
        at sun.misc.Unsafe.park(Native Method)
        at java.util.concurrent.locks.LockSupport.park(LockSupport.java:186)
        at java.util.concurrent.locks.AbstractQueuedSynchronizer$ConditionObject.await(AbstractQueuedSynchronizer.java:2043)
        at java.util.concurrent.ScheduledThreadPoolExecutor$DelayedWorkQueue.take(ScheduledThreadPoolExecutor.java:1086)
        at java.util.concurrent.ScheduledThreadPoolExecutor$DelayedWorkQueue.take(ScheduledThreadPoolExecutor.java:808)
        at java.util.concurrent.ThreadPoolExecutor.getTask(ThreadPoolExecutor.java:1045)
        at java.util.concurrent.ThreadPoolExecutor.runWorker(ThreadPoolExecutor.java:1103)
        at java.util.concurrent.ThreadPoolExecutor$Worker.run(ThreadPoolExecutor.java:603)
        at java.lang.Thread.run(Thread.java:722)
	at __randomizedtesting.SeedInfo.seed([22CE607FB4B0C94E]:0)


FAILED:  junit.framework.TestSuite.org.apache.solr.schema.TestBinaryField

Error Message:
There are still zombie threads that couldn't be terminated:    1) Thread[id=22, name=metrics-meter-tick-thread-2,
state=TIMED_WAITING, group=TGRP-TestBinaryField]         at sun.misc.Unsafe.park(Native Method)
        at java.util.concurrent.locks.LockSupport.parkNanos(LockSupport.java:226)        
at java.util.concurrent.locks.AbstractQueuedSynchronizer$ConditionObject.awaitNanos(AbstractQueuedSynchronizer.java:2082)
        at java.util.concurrent.ScheduledThreadPoolExecutor$DelayedWorkQueue.take(ScheduledThreadPoolExecutor.java:1091)
        at java.util.concurrent.ScheduledThreadPoolExecutor$DelayedWorkQueue.take(ScheduledThreadPoolExecutor.java:808)
        at java.util.concurrent.ThreadPoolExecutor.getTask(ThreadPoolExecutor.java:1045) 
       at java.util.concurrent.ThreadPoolExecutor.runWorker(ThreadPoolExecutor.java:1103)
        at java.util.concurrent.ThreadPoolExecutor$Worker.run(ThreadPoolExecutor.java:603)
        at java.lang.Thread.run(Thread.java:722)    2) Thread[id=21, name=metrics-meter-tick-thread-1,
state=WAITING, group=TGRP-TestBinaryField]         at sun.misc.Unsafe.park(Native Method)
        at java.util.concurrent.locks.LockSupport.park(LockSupport.java:186)         at java.util.concurrent.locks.AbstractQueuedSynchronizer$ConditionObject.await(AbstractQueuedSynchronizer.java:2043)
        at java.util.concurrent.ScheduledThreadPoolExecutor$DelayedWorkQueue.take(ScheduledThreadPoolExecutor.java:1086)
        at java.util.concurrent.ScheduledThreadPoolExecutor$DelayedWorkQueue.take(ScheduledThreadPoolExecutor.java:808)
        at java.util.concurrent.ThreadPoolExecutor.getTask(ThreadPoolExecutor.java:1045) 
       at java.util.concurrent.ThreadPoolExecutor.runWorker(ThreadPoolExecutor.java:1103)
        at java.util.concurrent.ThreadPoolExecutor$Worker.run(ThreadPoolExecutor.java:603)
        at java.lang.Thread.run(Thread.java:722)

Stack Trace:
com.carrotsearch.randomizedtesting.ThreadLeakError: There are still zombie threads that couldn't
be terminated:
   1) Thread[id=22, name=metrics-meter-tick-thread-2, state=TIMED_WAITING, group=TGRP-TestBinaryField]
        at sun.misc.Unsafe.park(Native Method)
        at java.util.concurrent.locks.LockSupport.parkNanos(LockSupport.java:226)
        at java.util.concurrent.locks.AbstractQueuedSynchronizer$ConditionObject.awaitNanos(AbstractQueuedSynchronizer.java:2082)
        at java.util.concurrent.ScheduledThreadPoolExecutor$DelayedWorkQueue.take(ScheduledThreadPoolExecutor.java:1091)
        at java.util.concurrent.ScheduledThreadPoolExecutor$DelayedWorkQueue.take(ScheduledThreadPoolExecutor.java:808)
        at java.util.concurrent.ThreadPoolExecutor.getTask(ThreadPoolExecutor.java:1045)
        at java.util.concurrent.ThreadPoolExecutor.runWorker(ThreadPoolExecutor.java:1103)
        at java.util.concurrent.ThreadPoolExecutor$Worker.run(ThreadPoolExecutor.java:603)
        at java.lang.Thread.run(Thread.java:722)
   2) Thread[id=21, name=metrics-meter-tick-thread-1, state=WAITING, group=TGRP-TestBinaryField]
        at sun.misc.Unsafe.park(Native Method)
        at java.util.concurrent.locks.LockSupport.park(LockSupport.java:186)
        at java.util.concurrent.locks.AbstractQueuedSynchronizer$ConditionObject.await(AbstractQueuedSynchronizer.java:2043)
        at java.util.concurrent.ScheduledThreadPoolExecutor$DelayedWorkQueue.take(ScheduledThreadPoolExecutor.java:1086)
        at java.util.concurrent.ScheduledThreadPoolExecutor$DelayedWorkQueue.take(ScheduledThreadPoolExecutor.java:808)
        at java.util.concurrent.ThreadPoolExecutor.getTask(ThreadPoolExecutor.java:1045)
        at java.util.concurrent.ThreadPoolExecutor.runWorker(ThreadPoolExecutor.java:1103)
        at java.util.concurrent.ThreadPoolExecutor$Worker.run(ThreadPoolExecutor.java:603)
        at java.lang.Thread.run(Thread.java:722)
	at __randomizedtesting.SeedInfo.seed([22CE607FB4B0C94E]:0)




Build Log:
[...truncated 8367 lines...]
[junit4:junit4] Suite: org.apache.solr.schema.TestBinaryField
[junit4:junit4]   2> -7 T9 oasc.SolrResourceLoader.<init> new SolrResourceLoader
for directory: 'solr/collection1/'
[junit4:junit4]   2> 237 T9 oejs.Server.doStart jetty-8.1.2.v20120308
[junit4:junit4]   2> 355 T9 oejs.AbstractConnector.doStart Started SelectChannelConnector@0.0.0.0:57881
[junit4:junit4]   2> 393 T9 oasc.SolrResourceLoader.locateSolrHome JNDI not configured
for solr (NoInitialContextEx)
[junit4:junit4]   2> 394 T9 oasc.SolrResourceLoader.locateSolrHome using system property
solr.solr.home: /mnt/ssd/jenkins/workspace/Lucene-Solr-trunk-Linux/solr/build/solr-core/test/J1/./solrtest-TestBinaryField-1351565583921/example
[junit4:junit4]   2> 395 T9 oasc.SolrResourceLoader.<init> new SolrResourceLoader
for deduced Solr Home: '/mnt/ssd/jenkins/workspace/Lucene-Solr-trunk-Linux/solr/build/solr-core/test/J1/./solrtest-TestBinaryField-1351565583921/example/'
[junit4:junit4]   2> 464 T9 oass.SolrDispatchFilter.init SolrDispatchFilter.init()
[junit4:junit4]   2> 465 T9 oasc.SolrResourceLoader.locateSolrHome JNDI not configured
for solr (NoInitialContextEx)
[junit4:junit4]   2> 466 T9 oasc.SolrResourceLoader.locateSolrHome using system property
solr.solr.home: /mnt/ssd/jenkins/workspace/Lucene-Solr-trunk-Linux/solr/build/solr-core/test/J1/./solrtest-TestBinaryField-1351565583921/example
[junit4:junit4]   2> 478 T9 oasc.CoreContainer$Initializer.initialize looking for solr.xml:
/mnt/ssd/jenkins/workspace/Lucene-Solr-trunk-Linux/solr/build/solr-core/test/J1/./solrtest-TestBinaryField-1351565583921/example/solr.xml
[junit4:junit4]   2> 480 T9 oasc.CoreContainer.<init> New CoreContainer 123349
[junit4:junit4]   2> 481 T9 oasc.CoreContainer$Initializer.initialize no solr.xml file
found - using default
[junit4:junit4]   2> 482 T9 oasc.CoreContainer.load Loading CoreContainer using Solr Home:
'/mnt/ssd/jenkins/workspace/Lucene-Solr-trunk-Linux/solr/build/solr-core/test/J1/./solrtest-TestBinaryField-1351565583921/example/'
[junit4:junit4]   2> 483 T9 oasc.SolrResourceLoader.<init> new SolrResourceLoader
for directory: '/mnt/ssd/jenkins/workspace/Lucene-Solr-trunk-Linux/solr/build/solr-core/test/J1/./solrtest-TestBinaryField-1351565583921/example/'
[junit4:junit4]   2> 527 T9 oasc.CoreContainer.load Registering Log Listener
[junit4:junit4]   2> 658 T9 oasc.CoreContainer.create Creating SolrCore 'collection1' using
instanceDir: /mnt/ssd/jenkins/workspace/Lucene-Solr-trunk-Linux/solr/build/solr-core/test/J1/./solrtest-TestBinaryField-1351565583921/example/collection1
[junit4:junit4]   2> 659 T9 oasc.SolrResourceLoader.<init> new SolrResourceLoader
for directory: '/mnt/ssd/jenkins/workspace/Lucene-Solr-trunk-Linux/solr/build/solr-core/test/J1/./solrtest-TestBinaryField-1351565583921/example/collection1/'
[junit4:junit4]   2> 727 T9 oasc.SolrConfig.<init> Using Lucene MatchVersion: LUCENE_50
[junit4:junit4]   2> 880 T9 oasc.SolrConfig.<init> Loaded SolrConfig: solrconfig.xml
[junit4:junit4]   2> 890 T9 oass.IndexSchema.readSchema Reading Solr Schema
[junit4:junit4]   2> 899 T9 oass.IndexSchema.readSchema Schema name=test
[junit4:junit4]   2> 1065 T9 oass.IndexSchema.readSchema unique key field: id
[junit4:junit4]   2> 1096 T9 oasc.SolrCore.<init> [collection1] Opening new SolrCore
at /mnt/ssd/jenkins/workspace/Lucene-Solr-trunk-Linux/solr/build/solr-core/test/J1/./solrtest-TestBinaryField-1351565583921/example/collection1/,
dataDir=/mnt/ssd/jenkins/workspace/Lucene-Solr-trunk-Linux/solr/build/solr-core/test/J1/./solrtest-TestBinaryField-1351565583921/example/collection1/data/
[junit4:junit4]   2> 1097 T9 oasc.SolrCore.<init> JMX monitoring not detected for
core: collection1
[junit4:junit4]   2> 1102 T9 oasc.SolrCore.initDirectoryFactory org.apache.solr.core.MockDirectoryFactory
[junit4:junit4]   2> 1131 T9 oasc.CachingDirectoryFactory.injectLockFactory WARNING No
lockType configured for MockDirWrapper(NRTCachingDirectory(org.apache.lucene.store.RAMDirectory@13e3e90
lockFactory=org.apache.lucene.store.SingleInstanceLockFactory@17d93dd; maxCacheMB=0.8251953125
maxMergeSizeMB=0.5244140625)) assuming 'simple'
[junit4:junit4]   2> 1132 T9 oasc.CachingDirectoryFactory.get return new directory for
/mnt/ssd/jenkins/workspace/Lucene-Solr-trunk-Linux/solr/build/solr-core/test/J1/./solrtest-TestBinaryField-1351565583921/example/collection1/data
forceNew:false
[junit4:junit4]   2> 1133 T9 oasc.CachingDirectoryFactory.close Releasing directory:/mnt/ssd/jenkins/workspace/Lucene-Solr-trunk-Linux/solr/build/solr-core/test/J1/./solrtest-TestBinaryField-1351565583921/example/collection1/data
[junit4:junit4]   2> 1133 T9 oasc.SolrCore.getNewIndexDir New index directory detected:
old=null new=/mnt/ssd/jenkins/workspace/Lucene-Solr-trunk-Linux/solr/build/solr-core/test/J1/./solrtest-TestBinaryField-1351565583921/example/collection1/data/index/
[junit4:junit4]   2> 1134 T9 oasc.SolrCore.initIndex WARNING [collection1] Solr index directory
'/mnt/ssd/jenkins/workspace/Lucene-Solr-trunk-Linux/solr/build/solr-core/test/J1/./solrtest-TestBinaryField-1351565583921/example/collection1/data/index'
doesn't exist. Creating new index...
[junit4:junit4]   2> 1145 T9 oasc.CachingDirectoryFactory.get return new directory for
/mnt/ssd/jenkins/workspace/Lucene-Solr-trunk-Linux/solr/build/solr-core/test/J1/./solrtest-TestBinaryField-1351565583921/example/collection1/data/index
forceNew:false
[junit4:junit4]   2> 1245 T9 oasc.SolrDeletionPolicy.onCommit SolrDeletionPolicy.onCommit:
commits:num=1
[junit4:junit4]   2> 		commit{dir=MockDirWrapper(org.apache.lucene.store.RAMDirectory@1751189
lockFactory=org.apache.lucene.store.SingleInstanceLockFactory@179b415),segFN=segments_1,generation=1,filenames=[segments_1]
[junit4:junit4]   2> 1246 T9 oasc.SolrDeletionPolicy.updateCommits newest commit = 1[segments_1]
[junit4:junit4]   2> 1246 T9 oasc.CachingDirectoryFactory.close Releasing directory:/mnt/ssd/jenkins/workspace/Lucene-Solr-trunk-Linux/solr/build/solr-core/test/J1/./solrtest-TestBinaryField-1351565583921/example/collection1/data/index
[junit4:junit4]   2> 1442 T9 oasc.RequestHandlers.initHandlersFromConfig created standard:
solr.StandardRequestHandler
[junit4:junit4]   2> 1443 T9 oasc.RequestHandlers.initHandlersFromConfig created defaults:
solr.StandardRequestHandler
[junit4:junit4]   2> 1444 T9 oasc.RequestHandlers.initHandlersFromConfig adding lazy requestHandler:
solr.StandardRequestHandler
[junit4:junit4]   2> 1445 T9 oasc.RequestHandlers.initHandlersFromConfig created lazy:
solr.StandardRequestHandler
[junit4:junit4]   2> 1453 T9 oasc.RequestHandlers.initHandlersFromConfig created /update:
solr.UpdateRequestHandler
[junit4:junit4]   2> 1470 T9 oasc.RequestHandlers.initHandlersFromConfig created /replication:
solr.ReplicationHandler
[junit4:junit4]   2> 1505 T9 oashl.XMLLoader.init xsltCacheLifetimeSeconds=60
[junit4:junit4]   2> 1514 T9 oasc.CachingDirectoryFactory.close Releasing directory:/mnt/ssd/jenkins/workspace/Lucene-Solr-trunk-Linux/solr/build/solr-core/test/J1/./solrtest-TestBinaryField-1351565583921/example/collection1/data
[junit4:junit4]   2> 1528 T9 oass.SolrIndexSearcher.<init> Opening Searcher@f0eee1
main
[junit4:junit4]   2> 1549 T9 oasu.CommitTracker.<init> Hard AutoCommit: disabled
[junit4:junit4]   2> 1549 T9 oasu.CommitTracker.<init> Soft AutoCommit: disabled
[junit4:junit4]   2> 1572 T9 oashc.HttpShardHandlerFactory.getParameter Setting socketTimeout
to: 0
[junit4:junit4]   2> 1573 T9 oashc.HttpShardHandlerFactory.getParameter Setting urlScheme
to: http://
[junit4:junit4]   2> 1573 T9 oashc.HttpShardHandlerFactory.getParameter Setting connTimeout
to: 0
[junit4:junit4]   2> 1574 T9 oashc.HttpShardHandlerFactory.getParameter Setting maxConnectionsPerHost
to: 20
[junit4:junit4]   2> 1574 T9 oashc.HttpShardHandlerFactory.getParameter Setting corePoolSize
to: 0
[junit4:junit4]   2> 1575 T9 oashc.HttpShardHandlerFactory.getParameter Setting maximumPoolSize
to: 2147483647
[junit4:junit4]   2> 1575 T9 oashc.HttpShardHandlerFactory.getParameter Setting maxThreadIdleTime
to: 5
[junit4:junit4]   2> 1575 T9 oashc.HttpShardHandlerFactory.getParameter Setting sizeOfQueue
to: -1
[junit4:junit4]   2> 1576 T9 oashc.HttpShardHandlerFactory.getParameter Setting fairnessPolicy
to: false
[junit4:junit4]   2> 1585 T9 oascsi.HttpClientUtil.createClient Creating new http client,
config:maxConnectionsPerHost=20&maxConnections=10000&socketTimeout=0&connTimeout=0&retry=false
[junit4:junit4]   2> 1774 T9 oash.ReplicationHandler.inform Commits will be reserved for
 10000
[junit4:junit4]   2> 1775 T9 oasc.CoreContainer.register registering core: collection1
[junit4:junit4]   2> 1775 T23 oasc.SolrCore.registerSearcher [collection1] Registered new
searcher Searcher@f0eee1 main{StandardDirectoryReader(segments_1:1)}
[junit4:junit4]   2> 1776 T9 oass.SolrDispatchFilter.init user.dir=/mnt/ssd/jenkins/workspace/Lucene-Solr-trunk-Linux/solr/build/solr-core/test/J1
[junit4:junit4]   2> 1776 T9 oass.SolrDispatchFilter.init SolrDispatchFilter.init() done
[junit4:junit4]   2> 1794 T9 oascsi.HttpClientUtil.createClient Creating new http client,
config:maxConnections=128&maxConnectionsPerHost=32&followRedirects=false
[junit4:junit4]   2> ASYNC  NEW_CORE C0 name=collection1 org.apache.solr.core.SolrCore@1067c73
[junit4:junit4]   2> 2507 T15 C0 oasc.CachingDirectoryFactory.close Releasing directory:/mnt/ssd/jenkins/workspace/Lucene-Solr-trunk-Linux/solr/build/solr-core/test/J1/./solrtest-TestBinaryField-1351565583921/example/collection1/data
[junit4:junit4]   2> 2510 T15 C0 oasc.SolrDeletionPolicy.onInit SolrDeletionPolicy.onInit:
commits:num=1
[junit4:junit4]   2> 		commit{dir=MockDirWrapper(org.apache.lucene.store.RAMDirectory@1751189
lockFactory=org.apache.lucene.store.SingleInstanceLockFactory@179b415),segFN=segments_1,generation=1,filenames=[segments_1]
[junit4:junit4]   2> 2511 T15 C0 oasc.SolrDeletionPolicy.updateCommits newest commit =
1[segments_1]
[junit4:junit4]   2> 2608 T15 C0 UPDATE [collection1] webapp=/example path=/update params={version=2&wt=javabin}
{add=[1]} 0 222
[junit4:junit4]   2> 2650 T13 C0 UPDATE [collection1] webapp=/example path=/update params={version=2&wt=javabin}
{add=[2]} 0 1
[junit4:junit4]   2> 2653 T14 C0 UPDATE [collection1] webapp=/example path=/update params={version=2&wt=javabin}
{add=[3]} 0 1
[junit4:junit4]   2> 2664 T15 C0 oasu.DirectUpdateHandler2.commit start commit{flags=0,_version_=0,optimize=false,openSearcher=true,waitSearcher=true,expungeDeletes=false,softCommit=false}
[junit4:junit4]   2> 2731 T15 C0 oasc.SolrDeletionPolicy.onCommit SolrDeletionPolicy.onCommit:
commits:num=2
[junit4:junit4]   2> 		commit{dir=MockDirWrapper(org.apache.lucene.store.RAMDirectory@1751189
lockFactory=org.apache.lucene.store.SingleInstanceLockFactory@179b415),segFN=segments_1,generation=1,filenames=[segments_1]
[junit4:junit4]   2> 		commit{dir=MockDirWrapper(org.apache.lucene.store.RAMDirectory@1751189
lockFactory=org.apache.lucene.store.SingleInstanceLockFactory@179b415),segFN=segments_2,generation=2,filenames=[_0_Lucene40_0.tim,
_0.si, _0_nrm.cfe, segments_2, _0_Lucene40_0.tip, _0.fnm, _0_Lucene40_0.frq, _0.fdt, _0_nrm.cfs,
_0.fdx]
[junit4:junit4]   2> 2732 T15 C0 oasc.SolrDeletionPolicy.updateCommits newest commit =
2[_0_Lucene40_0.tim, _0.si, _0_nrm.cfe, segments_2, _0_Lucene40_0.tip, _0.fnm, _0_Lucene40_0.frq,
_0.fdt, _0_nrm.cfs, _0.fdx]
[junit4:junit4]   2> 2733 T15 C0 oasc.CachingDirectoryFactory.close Releasing directory:/mnt/ssd/jenkins/workspace/Lucene-Solr-trunk-Linux/solr/build/solr-core/test/J1/./solrtest-TestBinaryField-1351565583921/example/collection1/data
[junit4:junit4]   2> 2767 T15 C0 oass.SolrIndexSearcher.<init> Opening Searcher@eddac6
main
[junit4:junit4]   2> 2769 T15 C0 oasu.DirectUpdateHandler2.commit end_commit_flush
[junit4:junit4]   2> 2771 T23 oasc.SolrCore.registerSearcher [collection1] Registered new
searcher Searcher@eddac6 main{StandardDirectoryReader(segments_2:3 _0(5.0):C3)}
[junit4:junit4]   2> 2772 T23 oasc.CachingDirectoryFactory.close Releasing directory:/mnt/ssd/jenkins/workspace/Lucene-Solr-trunk-Linux/solr/build/solr-core/test/J1/./solrtest-TestBinaryField-1351565583921/example/collection1/data/index
[junit4:junit4]   2> 2772 T15 C0 UPDATE [collection1] webapp=/example path=/update params={version=2&softCommit=false&wt=javabin&waitSearcher=true&commit=true}
{commit=} 0 109
[junit4:junit4]   2> 2871 T13 C0 REQ [collection1] webapp=/example path=/select params={version=2&q=*:*&wt=javabin}
hits=3 status=0 QTime=85 
[junit4:junit4]   2> 2909 T9 oasc.CoreContainer.shutdown Shutting down CoreContainer instance=123349
[junit4:junit4]   2> 2910 T9 oasc.SolrCore.close [collection1]  CLOSING SolrCore org.apache.solr.core.SolrCore@1067c73
[junit4:junit4]   2> 2910 T9 oasu.DirectUpdateHandler2.close closing DirectUpdateHandler2{commits=1,autocommits=0,soft
autocommits=0,optimizes=0,rollbacks=0,expungeDeletes=0,docsPending=0,adds=0,deletesById=0,deletesByQuery=0,errors=0,cumulative_adds=3,cumulative_deletesById=0,cumulative_deletesByQuery=0,cumulative_errors=0}
[junit4:junit4]   2> 2911 T9 oasc.SolrCore.decrefSolrCoreState Closing SolrCoreState
[junit4:junit4]   2> 2911 T9 oasu.DefaultSolrCoreState.closeIndexWriter SolrCoreState ref
count has reached 0 - closing IndexWriter
[junit4:junit4]   2> 2912 T9 oasu.DefaultSolrCoreState.closeIndexWriter closing IndexWriter
with IndexWriterCloser
[junit4:junit4]   2> 2912 T9 C0 oasc.CachingDirectoryFactory.close Releasing directory:/mnt/ssd/jenkins/workspace/Lucene-Solr-trunk-Linux/solr/build/solr-core/test/J1/./solrtest-TestBinaryField-1351565583921/example/collection1/data/index
[junit4:junit4]   2> 2913 T9 oasc.SolrCore.closeSearcher [collection1] Closing main searcher
on request.
[junit4:junit4]   2> 2914 T9 oasc.CachingDirectoryFactory.close Releasing directory:/mnt/ssd/jenkins/workspace/Lucene-Solr-trunk-Linux/solr/build/solr-core/test/J1/./solrtest-TestBinaryField-1351565583921/example/collection1/data/index
[junit4:junit4]   2> 2915 T9 oejsh.ContextHandler.doStop stopped o.e.j.s.ServletContextHandler{/example,null}
[junit4:junit4]   2> 3025 T8 ccr.ThreadLeakControl.checkThreadLeaks WARNING Will linger
awaiting termination of 2 leaked thread(s).
[junit4:junit4]   2> 23087 T8 ccr.ThreadLeakControl.checkThreadLeaks SEVERE 2 threads leaked
from SUITE scope at org.apache.solr.schema.TestBinaryField: 
[junit4:junit4]   2> 	   1) Thread[id=21, name=metrics-meter-tick-thread-1, state=TIMED_WAITING,
group=TGRP-TestBinaryField]
[junit4:junit4]   2> 	        at sun.misc.Unsafe.park(Native Method)
[junit4:junit4]   2> 	        at java.util.concurrent.locks.LockSupport.parkNanos(LockSupport.java:226)
[junit4:junit4]   2> 	        at java.util.concurrent.locks.AbstractQueuedSynchronizer$ConditionObject.awaitNanos(AbstractQueuedSynchronizer.java:2082)
[junit4:junit4]   2> 	        at java.util.concurrent.ScheduledThreadPoolExecutor$DelayedWorkQueue.take(ScheduledThreadPoolExecutor.java:1091)
[junit4:junit4]   2> 	        at java.util.concurrent.ScheduledThreadPoolExecutor$DelayedWorkQueue.take(ScheduledThreadPoolExecutor.java:808)
[junit4:junit4]   2> 	        at java.util.concurrent.ThreadPoolExecutor.getTask(ThreadPoolExecutor.java:1045)
[junit4:junit4]   2> 	        at java.util.concurrent.ThreadPoolExecutor.runWorker(ThreadPoolExecutor.java:1103)
[junit4:junit4]   2> 	        at java.util.concurrent.ThreadPoolExecutor$Worker.run(ThreadPoolExecutor.java:603)
[junit4:junit4]   2> 	        at java.lang.Thread.run(Thread.java:722)
[junit4:junit4]   2> 	   2) Thread[id=22, name=metrics-meter-tick-thread-2, state=WAITING,
group=TGRP-TestBinaryField]
[junit4:junit4]   2> 	        at sun.misc.Unsafe.park(Native Method)
[junit4:junit4]   2> 	        at java.util.concurrent.locks.LockSupport.park(LockSupport.java:186)
[junit4:junit4]   2> 	        at java.util.concurrent.locks.AbstractQueuedSynchronizer$ConditionObject.await(AbstractQueuedSynchronizer.java:2043)
[junit4:junit4]   2> 	        at java.util.concurrent.ScheduledThreadPoolExecutor$DelayedWorkQueue.take(ScheduledThreadPoolExecutor.java:1086)
[junit4:junit4]   2> 	        at java.util.concurrent.ScheduledThreadPoolExecutor$DelayedWorkQueue.take(ScheduledThreadPoolExecutor.java:808)
[junit4:junit4]   2> 	        at java.util.concurrent.ThreadPoolExecutor.getTask(ThreadPoolExecutor.java:1045)
[junit4:junit4]   2> 	        at java.util.concurrent.ThreadPoolExecutor.runWorker(ThreadPoolExecutor.java:1103)
[junit4:junit4]   2> 	        at java.util.concurrent.ThreadPoolExecutor$Worker.run(ThreadPoolExecutor.java:603)
[junit4:junit4]   2> 	        at java.lang.Thread.run(Thread.java:722)
[junit4:junit4]   2> 23088 T8 ccr.ThreadLeakControl.tryToInterruptAll Starting to interrupt
leaked threads:
[junit4:junit4]   2> 	   1) Thread[id=21, name=metrics-meter-tick-thread-1, state=TIMED_WAITING,
group=TGRP-TestBinaryField]
[junit4:junit4]   2> 	   2) Thread[id=22, name=metrics-meter-tick-thread-2, state=WAITING,
group=TGRP-TestBinaryField]
[junit4:junit4]   2> 26096 T8 ccr.ThreadLeakControl.tryToInterruptAll SEVERE There are
still zombie threads that couldn't be terminated:
[junit4:junit4]   2> 	   1) Thread[id=22, name=metrics-meter-tick-thread-2, state=TIMED_WAITING,
group=TGRP-TestBinaryField]
[junit4:junit4]   2> 	        at sun.misc.Unsafe.park(Native Method)
[junit4:junit4]   2> 	        at java.util.concurrent.locks.LockSupport.parkNanos(LockSupport.java:226)
[junit4:junit4]   2> 	        at java.util.concurrent.locks.AbstractQueuedSynchronizer$ConditionObject.awaitNanos(AbstractQueuedSynchronizer.java:2082)
[junit4:junit4]   2> 	        at java.util.concurrent.ScheduledThreadPoolExecutor$DelayedWorkQueue.take(ScheduledThreadPoolExecutor.java:1091)
[junit4:junit4]   2> 	        at java.util.concurrent.ScheduledThreadPoolExecutor$DelayedWorkQueue.take(ScheduledThreadPoolExecutor.java:808)
[junit4:junit4]   2> 	        at java.util.concurrent.ThreadPoolExecutor.getTask(ThreadPoolExecutor.java:1045)
[junit4:junit4]   2> 	        at java.util.concurrent.ThreadPoolExecutor.runWorker(ThreadPoolExecutor.java:1103)
[junit4:junit4]   2> 	        at java.util.concurrent.ThreadPoolExecutor$Worker.run(ThreadPoolExecutor.java:603)
[junit4:junit4]   2> 	        at java.lang.Thread.run(Thread.java:722)
[junit4:junit4]   2> 	   2) Thread[id=21, name=metrics-meter-tick-thread-1, state=WAITING,
group=TGRP-TestBinaryField]
[junit4:junit4]   2> 	        at sun.misc.Unsafe.park(Native Method)
[junit4:junit4]   2> 	        at java.util.concurrent.locks.LockSupport.park(LockSupport.java:186)
[junit4:junit4]   2> 	        at java.util.concurrent.locks.AbstractQueuedSynchronizer$ConditionObject.await(AbstractQueuedSynchronizer.java:2043)
[junit4:junit4]   2> 	        at java.util.concurrent.ScheduledThreadPoolExecutor$DelayedWorkQueue.take(ScheduledThreadPoolExecutor.java:1086)
[junit4:junit4]   2> 	        at java.util.concurrent.ScheduledThreadPoolExecutor$DelayedWorkQueue.take(ScheduledThreadPoolExecutor.java:808)
[junit4:junit4]   2> 	        at java.util.concurrent.ThreadPoolExecutor.getTask(ThreadPoolExecutor.java:1045)
[junit4:junit4]   2> 	        at java.util.concurrent.ThreadPoolExecutor.runWorker(ThreadPoolExecutor.java:1103)
[junit4:junit4]   2> 	        at java.util.concurrent.ThreadPoolExecutor$Worker.run(ThreadPoolExecutor.java:603)
[junit4:junit4]   2> 	        at java.lang.Thread.run(Thread.java:722)
[junit4:junit4]   2> NOTE: test params are: codec=Lucene40, sim=RandomSimilarityProvider(queryNorm=false,coord=crazy):
{}, locale=el, timezone=America/Detroit
[junit4:junit4]   2> NOTE: Linux 3.2.0-32-generic i386/Oracle Corporation 1.8.0-ea (32-bit)/cpus=8,threads=3,free=45955072,total=92405760
[junit4:junit4]   2> NOTE: All tests run in this JVM: [TestBinaryField]
[junit4:junit4]   2> NOTE: reproduce with: ant test  -Dtestcase=TestBinaryField -Dtests.seed=22CE607FB4B0C94E
-Dtests.multiplier=3 -Dtests.slow=true -Dtests.locale=el -Dtests.timezone=America/Detroit
-Dtests.file.encoding=ISO-8859-1
[junit4:junit4] ERROR   0.00s J1 | TestBinaryField (suite) <<<
[junit4:junit4]    > Throwable #1: com.carrotsearch.randomizedtesting.ThreadLeakError:
2 threads leaked from SUITE scope at org.apache.solr.schema.TestBinaryField: 
[junit4:junit4]    >    1) Thread[id=21, name=metrics-meter-tick-thread-1, state=TIMED_WAITING,
group=TGRP-TestBinaryField]
[junit4:junit4]    >         at sun.misc.Unsafe.park(Native Method)
[junit4:junit4]    >         at java.util.concurrent.locks.LockSupport.parkNanos(LockSupport.java:226)
[junit4:junit4]    >         at java.util.concurrent.locks.AbstractQueuedSynchronizer$ConditionObject.awaitNanos(AbstractQueuedSynchronizer.java:2082)
[junit4:junit4]    >         at java.util.concurrent.ScheduledThreadPoolExecutor$DelayedWorkQueue.take(ScheduledThreadPoolExecutor.java:1091)
[junit4:junit4]    >         at java.util.concurrent.ScheduledThreadPoolExecutor$DelayedWorkQueue.take(ScheduledThreadPoolExecutor.java:808)
[junit4:junit4]    >         at java.util.concurrent.ThreadPoolExecutor.getTask(ThreadPoolExecutor.java:1045)
[junit4:junit4]    >         at java.util.concurrent.ThreadPoolExecutor.runWorker(ThreadPoolExecutor.java:1103)
[junit4:junit4]    >         at java.util.concurrent.ThreadPoolExecutor$Worker.run(ThreadPoolExecutor.java:603)
[junit4:junit4]    >         at java.lang.Thread.run(Thread.java:722)
[junit4:junit4]    >    2) Thread[id=22, name=metrics-meter-tick-thread-2, state=WAITING,
group=TGRP-TestBinaryField]
[junit4:junit4]    >         at sun.misc.Unsafe.park(Native Method)
[junit4:junit4]    >         at java.util.concurrent.locks.LockSupport.park(LockSupport.java:186)
[junit4:junit4]    >         at java.util.concurrent.locks.AbstractQueuedSynchronizer$ConditionObject.await(AbstractQueuedSynchronizer.java:2043)
[junit4:junit4]    >         at java.util.concurrent.ScheduledThreadPoolExecutor$DelayedWorkQueue.take(ScheduledThreadPoolExecutor.java:1086)
[junit4:junit4]    >         at java.util.concurrent.ScheduledThreadPoolExecutor$DelayedWorkQueue.take(ScheduledThreadPoolExecutor.java:808)
[junit4:junit4]    >         at java.util.concurrent.ThreadPoolExecutor.getTask(ThreadPoolExecutor.java:1045)
[junit4:junit4]    >         at java.util.concurrent.ThreadPoolExecutor.runWorker(ThreadPoolExecutor.java:1103)
[junit4:junit4]    >         at java.util.concurrent.ThreadPoolExecutor$Worker.run(ThreadPoolExecutor.java:603)
[junit4:junit4]    >         at java.lang.Thread.run(Thread.java:722)
[junit4:junit4]    > 	at __randomizedtesting.SeedInfo.seed([22CE607FB4B0C94E]:0)
[junit4:junit4]    > Throwable #2: com.carrotsearch.randomizedtesting.ThreadLeakError:
There are still zombie threads that couldn't be terminated:
[junit4:junit4]    >    1) Thread[id=22, name=metrics-meter-tick-thread-2, state=TIMED_WAITING,
group=TGRP-TestBinaryField]
[junit4:junit4]    >         at sun.misc.Unsafe.park(Native Method)
[junit4:junit4]    >         at java.util.concurrent.locks.LockSupport.parkNanos(LockSupport.java:226)
[junit4:junit4]    >         at java.util.concurrent.locks.AbstractQueuedSynchronizer$ConditionObject.awaitNanos(AbstractQueuedSynchronizer.java:2082)
[junit4:junit4]    >         at java.util.concurrent.ScheduledThreadPoolExecutor$DelayedWorkQueue.take(ScheduledThreadPoolExecutor.java:1091)
[junit4:junit4]    >         at java.util.concurrent.ScheduledThreadPoolExecutor$DelayedWorkQueue.take(ScheduledThreadPoolExecutor.java:808)
[junit4:junit4]    >         at java.util.concurrent.ThreadPoolExecutor.getTask(ThreadPoolExecutor.java:1045)
[junit4:junit4]    >         at java.util.concurrent.ThreadPoolExecutor.runWorker(ThreadPoolExecutor.java:1103)
[junit4:junit4]    >         at java.util.concurrent.ThreadPoolExecutor$Worker.run(ThreadPoolExecutor.java:603)
[junit4:junit4]    >         at java.lang.Thread.run(Thread.java:722)
[junit4:junit4]    >    2) Thread[id=21, name=metrics-meter-tick-thread-1, state=WAITING,
group=TGRP-TestBinaryField]
[junit4:junit4]    >         at sun.misc.Unsafe.park(Native Method)
[junit4:junit4]    >         at java.util.concurrent.locks.LockSupport.park(LockSupport.java:186)
[junit4:junit4]    >         at java.util.concurrent.locks.AbstractQueuedSynchronizer$ConditionObject.await(AbstractQueuedSynchronizer.java:2043)
[junit4:junit4]    >         at java.util.concurrent.ScheduledThreadPoolExecutor$DelayedWorkQueue.take(ScheduledThreadPoolExecutor.java:1086)
[junit4:junit4]    >         at java.util.concurrent.ScheduledThreadPoolExecutor$DelayedWorkQueue.take(ScheduledThreadPoolExecutor.java:808)
[junit4:junit4]    >         at java.util.concurrent.ThreadPoolExecutor.getTask(ThreadPoolExecutor.java:1045)
[junit4:junit4]    >         at java.util.concurrent.ThreadPoolExecutor.runWorker(ThreadPoolExecutor.java:1103)
[junit4:junit4]    >         at java.util.concurrent.ThreadPoolExecutor$Worker.run(ThreadPoolExecutor.java:603)
[junit4:junit4]    >         at java.lang.Thread.run(Thread.java:722)
[junit4:junit4]    > 	at __randomizedtesting.SeedInfo.seed([22CE607FB4B0C94E]:0)
[junit4:junit4] Completed on J1 in 26.56s, 1 test, 2 errors <<< FAILURES!

[...truncated 687 lines...]
BUILD FAILED
/mnt/ssd/jenkins/workspace/Lucene-Solr-trunk-Linux/build.xml:335: The following error occurred
while executing this line:
/mnt/ssd/jenkins/workspace/Lucene-Solr-trunk-Linux/build.xml:39: The following error occurred
while executing this line:
/mnt/ssd/jenkins/workspace/Lucene-Solr-trunk-Linux/solr/build.xml:178: The following error
occurred while executing this line:
/mnt/ssd/jenkins/workspace/Lucene-Solr-trunk-Linux/lucene/module-build.xml:61: The following
error occurred while executing this line:
/mnt/ssd/jenkins/workspace/Lucene-Solr-trunk-Linux/lucene/common-build.xml:1159: The following
error occurred while executing this line:
/mnt/ssd/jenkins/workspace/Lucene-Solr-trunk-Linux/lucene/common-build.xml:827: There were
test failures: 232 suites, 962 tests, 2 suite-level errors, 697 ignored (1 assumption)

Total time: 16 minutes 26 seconds
Build step 'Invoke Ant' marked build as failure
Archiving artifacts
Recording test results
Description set: Java: 32bit/jdk1.8.0-ea-b58 -client -XX:+UseParallelGC
Email was triggered for: Failure
Sending email for trigger: Failure



Mime
View raw message