lucene-dev mailing list archives

Site index · List index
Message view « Date » · « Thread »
Top « Date » · « Thread »
From Charlie Cron <hudsonsevilt...@gmail.com>
Subject Build failed in Jenkins: fast-io-beasting #6120
Date Sun, 28 Oct 2012 11:12:11 GMT
See <http://sierranevada.servebeer.com/job/fast-io-beasting/6120/>

------------------------------------------
[...truncated 12597 lines...]
[junit4:junit4]   2> 	        at java.util.concurrent.ThreadPoolExecutor.getTask(ThreadPoolExecutor.java:947)
[junit4:junit4]   2> 	        at java.util.concurrent.ThreadPoolExecutor$Worker.run(ThreadPoolExecutor.java:907)
[junit4:junit4]   2> 	        at java.lang.Thread.run(Thread.java:662)
[junit4:junit4]   2> 	   2) Thread[id=355, name=qtp1507851527-355 Selector1, state=RUNNABLE,
group=TGRP-BasicDistributedZk2Test]
[junit4:junit4]   2> 	        at sun.nio.ch.EPollArrayWrapper.epollWait(Native Method)
[junit4:junit4]   2> 	        at sun.nio.ch.EPollArrayWrapper.poll(EPollArrayWrapper.java:210)
[junit4:junit4]   2> 	        at sun.nio.ch.EPollSelectorImpl.doSelect(EPollSelectorImpl.java:65)
[junit4:junit4]   2> 	        at sun.nio.ch.SelectorImpl.lockAndDoSelect(SelectorImpl.java:69)
[junit4:junit4]   2> 	        at sun.nio.ch.SelectorImpl.select(SelectorImpl.java:80)
[junit4:junit4]   2> 	        at org.eclipse.jetty.io.nio.SelectorManager$SelectSet.doSelect(SelectorManager.java:564)
[junit4:junit4]   2> 	        at org.eclipse.jetty.io.nio.SelectorManager$1.run(SelectorManager.java:285)
[junit4:junit4]   2> 	        at org.eclipse.jetty.util.thread.QueuedThreadPool.runJob(QueuedThreadPool.java:599)
[junit4:junit4]   2> 	        at org.eclipse.jetty.util.thread.QueuedThreadPool$3.run(QueuedThreadPool.java:534)
[junit4:junit4]   2> 	        at java.lang.Thread.run(Thread.java:662)
[junit4:junit4]   2> 	   3) Thread[id=354, name=qtp1507851527-354 Selector0, state=RUNNABLE,
group=TGRP-BasicDistributedZk2Test]
[junit4:junit4]   2> 	        at sun.nio.ch.EPollArrayWrapper.epollWait(Native Method)
[junit4:junit4]   2> 	        at sun.nio.ch.EPollArrayWrapper.poll(EPollArrayWrapper.java:210)
[junit4:junit4]   2> 	        at sun.nio.ch.EPollSelectorImpl.doSelect(EPollSelectorImpl.java:65)
[junit4:junit4]   2> 	        at sun.nio.ch.SelectorImpl.lockAndDoSelect(SelectorImpl.java:69)
[junit4:junit4]   2> 	        at sun.nio.ch.SelectorImpl.select(SelectorImpl.java:80)
[junit4:junit4]   2> 	        at org.eclipse.jetty.io.nio.SelectorManager$SelectSet.doSelect(SelectorManager.java:564)
[junit4:junit4]   2> 	        at org.eclipse.jetty.io.nio.SelectorManager$1.run(SelectorManager.java:285)
[junit4:junit4]   2> 	        at org.eclipse.jetty.util.thread.QueuedThreadPool.runJob(QueuedThreadPool.java:599)
[junit4:junit4]   2> 	        at org.eclipse.jetty.util.thread.QueuedThreadPool$3.run(QueuedThreadPool.java:534)
[junit4:junit4]   2> 	        at java.lang.Thread.run(Thread.java:662)
[junit4:junit4]   2> 	   4) Thread[id=353, name=HashSessionScavenger-11, state=TIMED_WAITING,
group=TGRP-BasicDistributedZk2Test]
[junit4:junit4]   2> 	        at java.lang.Object.wait(Native Method)
[junit4:junit4]   2> 	        at java.util.TimerThread.mainLoop(Timer.java:509)
[junit4:junit4]   2> 	        at java.util.TimerThread.run(Timer.java:462)
[junit4:junit4]   2> 	   5) Thread[id=362, name=TEST-BasicDistributedZk2Test.testDistribSearch-seed#[1CC8DE1026D91344]-SendThread(localhost.localdomain:54157),
state=TIMED_WAITING, group=TGRP-BasicDistributedZk2Test]
[junit4:junit4]   2> 	        at java.lang.Thread.sleep(Native Method)
[junit4:junit4]   2> 	        at org.apache.zookeeper.ClientCnxn$SendThread.startConnect(ClientCnxn.java:1045)
[junit4:junit4]   2> 	        at org.apache.zookeeper.ClientCnxn$SendThread.run(ClientCnxn.java:1101)
[junit4:junit4]   2> 	   6) Thread[id=357, name=qtp1507851527-357 Acceptor1 SelectChannelConnector@0.0.0.0:45525,
state=RUNNABLE, group=TGRP-BasicDistributedZk2Test]
[junit4:junit4]   2> 	        at org.eclipse.jetty.server.AbstractConnector$Acceptor.run(AbstractConnector.java:951)
[junit4:junit4]   2> 	        at org.eclipse.jetty.util.thread.QueuedThreadPool.runJob(QueuedThreadPool.java:599)
[junit4:junit4]   2> 	        at org.eclipse.jetty.util.thread.QueuedThreadPool$3.run(QueuedThreadPool.java:534)
[junit4:junit4]   2> 	        at java.lang.Thread.run(Thread.java:662)
[junit4:junit4]   2> 	   7) Thread[id=356, name=qtp1507851527-356 Acceptor0 SelectChannelConnector@0.0.0.0:45525,
state=BLOCKED, group=TGRP-BasicDistributedZk2Test]
[junit4:junit4]   2> 	        at org.eclipse.jetty.server.AbstractConnector$Acceptor.run(AbstractConnector.java:951)
[junit4:junit4]   2> 	        at org.eclipse.jetty.util.thread.QueuedThreadPool.runJob(QueuedThreadPool.java:599)
[junit4:junit4]   2> 	        at org.eclipse.jetty.util.thread.QueuedThreadPool$3.run(QueuedThreadPool.java:534)
[junit4:junit4]   2> 	        at java.lang.Thread.run(Thread.java:662)
[junit4:junit4]   2> NOTE: test params are: codec=SimpleText, sim=RandomSimilarityProvider(queryNorm=false,coord=crazy):
{}, locale=es_VE, timezone=Etc/GMT+9
[junit4:junit4]   2> NOTE: Linux 3.2.0-24-generic amd64/Sun Microsystems Inc. 1.6.0_27
(64-bit)/cpus=8,threads=10,free=146124864,total=346488832
[junit4:junit4]   2> NOTE: All tests run in this JVM: [StatelessScriptUpdateProcessorFactoryTest,
DistanceFunctionTest, TestStressRecovery, UpdateParamsTest, PluginInfoTest, TestLMDirichletSimilarityFactory,
ZkNodePropsTest, TestGroupingSearch, TestIBSimilarityFactory, TestCSVLoader, HighlighterTest,
DocumentAnalysisRequestHandlerTest, DebugComponentTest, TestCollationField, TestStressVersions,
TestDistributedSearch, TestJoin, ConvertedLegacyTest, SignatureUpdateProcessorFactoryTest,
DirectSolrConnectionTest, TestWordDelimiterFilterFactory, BinaryUpdateRequestHandlerTest,
FieldAnalysisRequestHandlerTest, TestSolrQueryParser, CopyFieldTest, TestSolrDeletionPolicy1,
HighlighterConfigTest, TestQuerySenderNoQuery, ResourceLoaderTest, PreAnalyzedFieldTest, BasicDistributedZk2Test]
[junit4:junit4]   2> NOTE: reproduce with: ant test  -Dtestcase=BasicDistributedZk2Test
-Dtests.seed=1CC8DE1026D91344 -Dtests.slow=true -Dtests.locale=es_VE -Dtests.timezone=Etc/GMT+9
-Dtests.file.encoding=UTF-8
[junit4:junit4] ERROR   0.00s J1 | BasicDistributedZk2Test (suite) <<<
[junit4:junit4]    > Throwable #1: java.lang.AssertionError: ERROR: SolrIndexSearcher opens=2
closes=1
[junit4:junit4]    > 	at __randomizedtesting.SeedInfo.seed([1CC8DE1026D91344]:0)
[junit4:junit4]    > 	at org.junit.Assert.fail(Assert.java:93)
[junit4:junit4]    > 	at org.apache.solr.SolrTestCaseJ4.endTrackingSearchers(SolrTestCaseJ4.java:242)
[junit4:junit4]    > 	at org.apache.solr.SolrTestCaseJ4.afterClass(SolrTestCaseJ4.java:97)
[junit4:junit4]    > 	at sun.reflect.GeneratedMethodAccessor28.invoke(Unknown Source)
[junit4:junit4]    > 	at sun.reflect.DelegatingMethodAccessorImpl.invoke(DelegatingMethodAccessorImpl.java:25)
[junit4:junit4]    > 	at java.lang.reflect.Method.invoke(Method.java:597)
[junit4:junit4]    > 	at com.carrotsearch.randomizedtesting.RandomizedRunner.invoke(RandomizedRunner.java:1559)
[junit4:junit4]    > 	at com.carrotsearch.randomizedtesting.RandomizedRunner.access$600(RandomizedRunner.java:79)
[junit4:junit4]    > 	at com.carrotsearch.randomizedtesting.RandomizedRunner$5.evaluate(RandomizedRunner.java:700)
[junit4:junit4]    > 	at com.carrotsearch.randomizedtesting.rules.StatementAdapter.evaluate(StatementAdapter.java:36)
[junit4:junit4]    > 	at com.carrotsearch.randomizedtesting.rules.SystemPropertiesRestoreRule$1.evaluate(SystemPropertiesRestoreRule.java:53)
[junit4:junit4]    > 	at org.apache.lucene.util.AbstractBeforeAfterRule$1.evaluate(AbstractBeforeAfterRule.java:45)
[junit4:junit4]    > 	at org.apache.lucene.util.TestRuleStoreClassName$1.evaluate(TestRuleStoreClassName.java:42)
[junit4:junit4]    > 	at com.carrotsearch.randomizedtesting.rules.SystemPropertiesInvariantRule$1.evaluate(SystemPropertiesInvariantRule.java:55)
[junit4:junit4]    > 	at com.carrotsearch.randomizedtesting.rules.NoShadowingOrOverridesOnMethodsRule$1.evaluate(NoShadowingOrOverridesOnMethodsRule.java:39)
[junit4:junit4]    > 	at com.carrotsearch.randomizedtesting.rules.NoShadowingOrOverridesOnMethodsRule$1.evaluate(NoShadowingOrOverridesOnMethodsRule.java:39)
[junit4:junit4]    > 	at com.carrotsearch.randomizedtesting.rules.StatementAdapter.evaluate(StatementAdapter.java:36)
[junit4:junit4]    > 	at org.apache.lucene.util.TestRuleAssertionsRequired$1.evaluate(TestRuleAssertionsRequired.java:43)
[junit4:junit4]    > 	at org.apache.lucene.util.TestRuleMarkFailure$1.evaluate(TestRuleMarkFailure.java:48)
[junit4:junit4]    > 	at org.apache.lucene.util.TestRuleIgnoreAfterMaxFailures$1.evaluate(TestRuleIgnoreAfterMaxFailures.java:70)
[junit4:junit4]    > 	at org.apache.lucene.util.TestRuleIgnoreTestSuites$1.evaluate(TestRuleIgnoreTestSuites.java:55)
[junit4:junit4]    > 	at com.carrotsearch.randomizedtesting.rules.StatementAdapter.evaluate(StatementAdapter.java:36)
[junit4:junit4]    > 	at com.carrotsearch.randomizedtesting.ThreadLeakControl$StatementRunner.run(ThreadLeakControl.java:358)
[junit4:junit4]    > 	at java.lang.Thread.run(Thread.java:662)
[junit4:junit4]    > Throwable #2: com.carrotsearch.randomizedtesting.ThreadLeakError:
12 threads leaked from SUITE scope at org.apache.solr.cloud.BasicDistributedZk2Test: 
[junit4:junit4]    >    1) Thread[id=359, name=qtp1507851527-359, state=TIMED_WAITING,
group=TGRP-BasicDistributedZk2Test]
[junit4:junit4]    >         at sun.misc.Unsafe.park(Native Method)
[junit4:junit4]    >         at java.util.concurrent.locks.LockSupport.parkNanos(LockSupport.java:196)
[junit4:junit4]    >         at java.util.concurrent.locks.AbstractQueuedSynchronizer$ConditionObject.awaitNanos(AbstractQueuedSynchronizer.java:2025)
[junit4:junit4]    >         at org.eclipse.jetty.util.BlockingArrayQueue.poll(BlockingArrayQueue.java:337)
[junit4:junit4]    >         at org.eclipse.jetty.util.thread.QueuedThreadPool.idleJobPoll(QueuedThreadPool.java:517)
[junit4:junit4]    >         at org.eclipse.jetty.util.thread.QueuedThreadPool.access$600(QueuedThreadPool.java:39)
[junit4:junit4]    >         at org.eclipse.jetty.util.thread.QueuedThreadPool$3.run(QueuedThreadPool.java:563)
[junit4:junit4]    >         at java.lang.Thread.run(Thread.java:662)
[junit4:junit4]    >    2) Thread[id=360, name=qtp1507851527-360, state=TIMED_WAITING,
group=TGRP-BasicDistributedZk2Test]
[junit4:junit4]    >         at sun.misc.Unsafe.park(Native Method)
[junit4:junit4]    >         at java.util.concurrent.locks.LockSupport.parkNanos(LockSupport.java:196)
[junit4:junit4]    >         at java.util.concurrent.locks.AbstractQueuedSynchronizer$ConditionObject.awaitNanos(AbstractQueuedSynchronizer.java:2025)
[junit4:junit4]    >         at org.eclipse.jetty.util.BlockingArrayQueue.poll(BlockingArrayQueue.java:337)
[junit4:junit4]    >         at org.eclipse.jetty.util.thread.QueuedThreadPool.idleJobPoll(QueuedThreadPool.java:517)
[junit4:junit4]    >         at org.eclipse.jetty.util.thread.QueuedThreadPool.access$600(QueuedThreadPool.java:39)
[junit4:junit4]    >         at org.eclipse.jetty.util.thread.QueuedThreadPool$3.run(QueuedThreadPool.java:563)
[junit4:junit4]    >         at java.lang.Thread.run(Thread.java:662)
[junit4:junit4]    >    3) Thread[id=363, name=TEST-BasicDistributedZk2Test.testDistribSearch-seed#[1CC8DE1026D91344]-EventThread,
state=WAITING, group=TGRP-BasicDistributedZk2Test]
[junit4:junit4]    >         at sun.misc.Unsafe.park(Native Method)
[junit4:junit4]    >         at java.util.concurrent.locks.LockSupport.park(LockSupport.java:156)
[junit4:junit4]    >         at java.util.concurrent.locks.AbstractQueuedSynchronizer$ConditionObject.await(AbstractQueuedSynchronizer.java:1987)
[junit4:junit4]    >         at java.util.concurrent.LinkedBlockingQueue.take(LinkedBlockingQueue.java:399)
[junit4:junit4]    >         at org.apache.zookeeper.ClientCnxn$EventThread.run(ClientCnxn.java:498)
[junit4:junit4]    >    4) Thread[id=354, name=qtp1507851527-354 Selector0, state=RUNNABLE,
group=TGRP-BasicDistributedZk2Test]
[junit4:junit4]    >         at sun.nio.ch.EPollArrayWrapper.epollWait(Native Method)
[junit4:junit4]    >         at sun.nio.ch.EPollArrayWrapper.poll(EPollArrayWrapper.java:210)
[junit4:junit4]    >         at sun.nio.ch.EPollSelectorImpl.doSelect(EPollSelectorImpl.java:65)
[junit4:junit4]    >         at sun.nio.ch.SelectorImpl.lockAndDoSelect(SelectorImpl.java:69)
[junit4:junit4]    >         at sun.nio.ch.SelectorImpl.select(SelectorImpl.java:80)
[junit4:junit4]    >         at org.eclipse.jetty.io.nio.SelectorManager$SelectSet.doSelect(SelectorManager.java:564)
[junit4:junit4]    >         at org.eclipse.jetty.io.nio.SelectorManager$1.run(SelectorManager.java:285)
[junit4:junit4]    >         at org.eclipse.jetty.util.thread.QueuedThreadPool.runJob(QueuedThreadPool.java:599)
[junit4:junit4]    >         at org.eclipse.jetty.util.thread.QueuedThreadPool$3.run(QueuedThreadPool.java:534)
[junit4:junit4]    >         at java.lang.Thread.run(Thread.java:662)
[junit4:junit4]    >    5) Thread[id=356, name=qtp1507851527-356 Acceptor0 SelectChannelConnector@0.0.0.0:45525,
state=RUNNABLE, group=TGRP-BasicDistributedZk2Test]
[junit4:junit4]    >         at sun.nio.ch.ServerSocketChannelImpl.accept0(Native Method)
[junit4:junit4]    >         at sun.nio.ch.ServerSocketChannelImpl.accept(ServerSocketChannelImpl.java:152)
[junit4:junit4]    >         at org.eclipse.jetty.server.nio.SelectChannelConnector.accept(SelectChannelConnector.java:104)
[junit4:junit4]    >         at org.eclipse.jetty.server.AbstractConnector$Acceptor.run(AbstractConnector.java:933)
[junit4:junit4]    >         at org.eclipse.jetty.util.thread.QueuedThreadPool.runJob(QueuedThreadPool.java:599)
[junit4:junit4]    >         at org.eclipse.jetty.util.thread.QueuedThreadPool$3.run(QueuedThreadPool.java:534)
[junit4:junit4]    >         at java.lang.Thread.run(Thread.java:662)
[junit4:junit4]    >    6) Thread[id=361, name=qtp1507851527-361, state=TIMED_WAITING,
group=TGRP-BasicDistributedZk2Test]
[junit4:junit4]    >         at sun.misc.Unsafe.park(Native Method)
[junit4:junit4]    >         at java.util.concurrent.locks.LockSupport.parkNanos(LockSupport.java:196)
[junit4:junit4]    >         at java.util.concurrent.locks.AbstractQueuedSynchronizer$ConditionObject.awaitNanos(AbstractQueuedSynchronizer.java:2025)
[junit4:junit4]    >         at org.eclipse.jetty.util.BlockingArrayQueue.poll(BlockingArrayQueue.java:337)
[junit4:junit4]    >         at org.eclipse.jetty.util.thread.QueuedThreadPool.idleJobPoll(QueuedThreadPool.java:517)
[junit4:junit4]    >         at org.eclipse.jetty.util.thread.QueuedThreadPool.access$600(QueuedThreadPool.java:39)
[junit4:junit4]    >         at org.eclipse.jetty.util.thread.QueuedThreadPool$3.run(QueuedThreadPool.java:563)
[junit4:junit4]    >         at java.lang.Thread.run(Thread.java:662)
[junit4:junit4]    >    7) Thread[id=364, name=searcherExecutor-194-thread-1, state=WAITING,
group=TGRP-BasicDistributedZk2Test]
[junit4:junit4]    >         at sun.misc.Unsafe.park(Native Method)
[junit4:junit4]    >         at java.util.concurrent.locks.LockSupport.park(LockSupport.java:156)
[junit4:junit4]    >         at java.util.concurrent.locks.AbstractQueuedSynchronizer$ConditionObject.await(AbstractQueuedSynchronizer.java:1987)
[junit4:junit4]    >         at java.util.concurrent.LinkedBlockingQueue.take(LinkedBlockingQueue.java:399)
[junit4:junit4]    >         at java.util.concurrent.ThreadPoolExecutor.getTask(ThreadPoolExecutor.java:947)
[junit4:junit4]    >         at java.util.concurrent.ThreadPoolExecutor$Worker.run(ThreadPoolExecutor.java:907)
[junit4:junit4]    >         at java.lang.Thread.run(Thread.java:662)
[junit4:junit4]    >    8) Thread[id=355, name=qtp1507851527-355 Selector1, state=RUNNABLE,
group=TGRP-BasicDistributedZk2Test]
[junit4:junit4]    >         at sun.nio.ch.EPollArrayWrapper.epollWait(Native Method)
[junit4:junit4]    >         at sun.nio.ch.EPollArrayWrapper.poll(EPollArrayWrapper.java:210)
[junit4:junit4]    >         at sun.nio.ch.EPollSelectorImpl.doSelect(EPollSelectorImpl.java:65)
[junit4:junit4]    >         at sun.nio.ch.SelectorImpl.lockAndDoSelect(SelectorImpl.java:69)
[junit4:junit4]    >         at sun.nio.ch.SelectorImpl.select(SelectorImpl.java:80)
[junit4:junit4]    >         at org.eclipse.jetty.io.nio.SelectorManager$SelectSet.doSelect(SelectorManager.java:564)
[junit4:junit4]    >         at org.eclipse.jetty.io.nio.SelectorManager$1.run(SelectorManager.java:285)
[junit4:junit4]    >         at org.eclipse.jetty.util.thread.QueuedThreadPool.runJob(QueuedThreadPool.java:599)
[junit4:junit4]    >         at org.eclipse.jetty.util.thread.QueuedThreadPool$3.run(QueuedThreadPool.java:534)
[junit4:junit4]    >         at java.lang.Thread.run(Thread.java:662)
[junit4:junit4]    >    9) Thread[id=353, name=HashSessionScavenger-11, state=TIMED_WAITING,
group=TGRP-BasicDistributedZk2Test]
[junit4:junit4]    >         at java.lang.Object.wait(Native Method)
[junit4:junit4]    >         at java.util.TimerThread.mainLoop(Timer.java:509)
[junit4:junit4]    >         at java.util.TimerThread.run(Timer.java:462)
[junit4:junit4]    >   10) Thread[id=362, name=TEST-BasicDistributedZk2Test.testDistribSearch-seed#[1CC8DE1026D91344]-SendThread(localhost.localdomain:54157),
state=TIMED_WAITING, group=TGRP-BasicDistributedZk2Test]
[junit4:junit4]    >         at java.lang.Thread.sleep(Native Method)
[junit4:junit4]    >         at org.apache.zookeeper.ClientCnxn$SendThread.startConnect(ClientCnxn.java:1045)
[junit4:junit4]    >         at org.apache.zookeeper.ClientCnxn$SendThread.run(ClientCnxn.java:1101)
[junit4:junit4]    >   11) Thread[id=357, name=qtp1507851527-357 Acceptor1 SelectChannelConnector@0.0.0.0:45525,
state=BLOCKED, group=TGRP-BasicDistributedZk2Test]
[junit4:junit4]    >         at sun.nio.ch.ServerSocketChannelImpl.accept(ServerSocketChannelImpl.java:136)
[junit4:junit4]    >         at org.eclipse.jetty.server.nio.SelectChannelConnector.accept(SelectChannelConnector.java:104)
[junit4:junit4]    >         at org.eclipse.jetty.server.AbstractConnector$Acceptor.run(AbstractConnector.java:933)
[junit4:junit4]    >         at org.eclipse.jetty.util.thread.QueuedThreadPool.runJob(QueuedThreadPool.java:599)
[junit4:junit4]    >         at org.eclipse.jetty.util.thread.QueuedThreadPool$3.run(QueuedThreadPool.java:534)
[junit4:junit4]    >         at java.lang.Thread.run(Thread.java:662)
[junit4:junit4]    >   12) Thread[id=358, name=qtp1507851527-358, state=TIMED_WAITING,
group=TGRP-BasicDistributedZk2Test]
[junit4:junit4]    >         at sun.misc.Unsafe.park(Native Method)
[junit4:junit4]    >         at java.util.concurrent.locks.LockSupport.parkNanos(LockSupport.java:196)
[junit4:junit4]    >         at java.util.concurrent.locks.AbstractQueuedSynchronizer$ConditionObject.awaitNanos(AbstractQueuedSynchronizer.java:2025)
[junit4:junit4]    >         at org.eclipse.jetty.util.BlockingArrayQueue.poll(BlockingArrayQueue.java:337)
[junit4:junit4]    >         at org.eclipse.jetty.util.thread.QueuedThreadPool.idleJobPoll(QueuedThreadPool.java:517)
[junit4:junit4]    >         at org.eclipse.jetty.util.thread.QueuedThreadPool.access$600(QueuedThreadPool.java:39)
[junit4:junit4]    >         at org.eclipse.jetty.util.thread.QueuedThreadPool$3.run(QueuedThreadPool.java:563)
[junit4:junit4]    >         at java.lang.Thread.run(Thread.java:662)
[junit4:junit4]    > 	at __randomizedtesting.SeedInfo.seed([1CC8DE1026D91344]:0)
[junit4:junit4]    > Throwable #3: com.carrotsearch.randomizedtesting.ThreadLeakError:
There are still zombie threads that couldn't be terminated:
[junit4:junit4]    >    1) Thread[id=364, name=searcherExecutor-194-thread-1, state=WAITING,
group=TGRP-BasicDistributedZk2Test]
[junit4:junit4]    >         at sun.misc.Unsafe.park(Native Method)
[junit4:junit4]    >         at java.util.concurrent.locks.LockSupport.park(LockSupport.java:156)
[junit4:junit4]    >         at java.util.concurrent.locks.AbstractQueuedSynchronizer$ConditionObject.await(AbstractQueuedSynchronizer.java:1987)
[junit4:junit4]    >         at java.util.concurrent.LinkedBlockingQueue.take(LinkedBlockingQueue.java:399)
[junit4:junit4]    >         at java.util.concurrent.ThreadPoolExecutor.getTask(ThreadPoolExecutor.java:947)
[junit4:junit4]    >         at java.util.concurrent.ThreadPoolExecutor$Worker.run(ThreadPoolExecutor.java:907)
[junit4:junit4]    >         at java.lang.Thread.run(Thread.java:662)
[junit4:junit4]    >    2) Thread[id=355, name=qtp1507851527-355 Selector1, state=RUNNABLE,
group=TGRP-BasicDistributedZk2Test]
[junit4:junit4]    >         at sun.nio.ch.EPollArrayWrapper.epollWait(Native Method)
[junit4:junit4]    >         at sun.nio.ch.EPollArrayWrapper.poll(EPollArrayWrapper.java:210)
[junit4:junit4]    >         at sun.nio.ch.EPollSelectorImpl.doSelect(EPollSelectorImpl.java:65)
[junit4:junit4]    >         at sun.nio.ch.SelectorImpl.lockAndDoSelect(SelectorImpl.java:69)
[junit4:junit4]    >         at sun.nio.ch.SelectorImpl.select(SelectorImpl.java:80)
[junit4:junit4]    >         at org.eclipse.jetty.io.nio.SelectorManager$SelectSet.doSelect(SelectorManager.java:564)
[junit4:junit4]    >         at org.eclipse.jetty.io.nio.SelectorManager$1.run(SelectorManager.java:285)
[junit4:junit4]    >         at org.eclipse.jetty.util.thread.QueuedThreadPool.runJob(QueuedThreadPool.java:599)
[junit4:junit4]    >         at org.eclipse.jetty.util.thread.QueuedThreadPool$3.run(QueuedThreadPool.java:534)
[junit4:junit4]    >         at java.lang.Thread.run(Thread.java:662)
[junit4:junit4]    >    3) Thread[id=354, name=qtp1507851527-354 Selector0, state=RUNNABLE,
group=TGRP-BasicDistributedZk2Test]
[junit4:junit4]    >         at sun.nio.ch.EPollArrayWrapper.epollWait(Native Method)
[junit4:junit4]    >         at sun.nio.ch.EPollArrayWrapper.poll(EPollArrayWrapper.java:210)
[junit4:junit4]    >         at sun.nio.ch.EPollSelectorImpl.doSelect(EPollSelectorImpl.java:65)
[junit4:junit4]    >         at sun.nio.ch.SelectorImpl.lockAndDoSelect(SelectorImpl.java:69)
[junit4:junit4]    >         at sun.nio.ch.SelectorImpl.select(SelectorImpl.java:80)
[junit4:junit4]    >         at org.eclipse.jetty.io.nio.SelectorManager$SelectSet.doSelect(SelectorManager.java:564)
[junit4:junit4]    >         at org.eclipse.jetty.io.nio.SelectorManager$1.run(SelectorManager.java:285)
[junit4:junit4]    >         at org.eclipse.jetty.util.thread.QueuedThreadPool.runJob(QueuedThreadPool.java:599)
[junit4:junit4]    >         at org.eclipse.jetty.util.thread.QueuedThreadPool$3.run(QueuedThreadPool.java:534)
[junit4:junit4]    >         at java.lang.Thread.run(Thread.java:662)
[junit4:junit4]    >    4) Thread[id=353, name=HashSessionScavenger-11, state=TIMED_WAITING,
group=TGRP-BasicDistributedZk2Test]
[junit4:junit4]    >         at java.lang.Object.wait(Native Method)
[junit4:junit4]    >         at java.util.TimerThread.mainLoop(Timer.java:509)
[junit4:junit4]    >         at java.util.TimerThread.run(Timer.java:462)
[junit4:junit4]    >    5) Thread[id=362, name=TEST-BasicDistributedZk2Test.testDistribSearch-seed#[1CC8DE1026D91344]-SendThread(localhost.localdomain:54157),
state=TIMED_WAITING, group=TGRP-BasicDistributedZk2Test]
[junit4:junit4]    >         at java.lang.Thread.sleep(Native Method)
[junit4:junit4]    >         at org.apache.zookeeper.ClientCnxn$SendThread.startConnect(ClientCnxn.java:1045)
[junit4:junit4]    >         at org.apache.zookeeper.ClientCnxn$SendThread.run(ClientCnxn.java:1101)
[junit4:junit4]    >    6) Thread[id=357, name=qtp1507851527-357 Acceptor1 SelectChannelConnector@0.0.0.0:45525,
state=RUNNABLE, group=TGRP-BasicDistributedZk2Test]
[junit4:junit4]    >         at org.eclipse.jetty.server.AbstractConnector$Acceptor.run(AbstractConnector.java:951)
[junit4:junit4]    >         at org.eclipse.jetty.util.thread.QueuedThreadPool.runJob(QueuedThreadPool.java:599)
[junit4:junit4]    >         at org.eclipse.jetty.util.thread.QueuedThreadPool$3.run(QueuedThreadPool.java:534)
[junit4:junit4]    >         at java.lang.Thread.run(Thread.java:662)
[junit4:junit4]    >    7) Thread[id=356, name=qtp1507851527-356 Acceptor0 SelectChannelConnector@0.0.0.0:45525,
state=BLOCKED, group=TGRP-BasicDistributedZk2Test]
[junit4:junit4]    >         at org.eclipse.jetty.server.AbstractConnector$Acceptor.run(AbstractConnector.java:951)
[junit4:junit4]    >         at org.eclipse.jetty.util.thread.QueuedThreadPool.runJob(QueuedThreadPool.java:599)
[junit4:junit4]    >         at org.eclipse.jetty.util.thread.QueuedThreadPool$3.run(QueuedThreadPool.java:534)
[junit4:junit4]    >         at java.lang.Thread.run(Thread.java:662)
[junit4:junit4]    > 	at __randomizedtesting.SeedInfo.seed([1CC8DE1026D91344]:0)
[junit4:junit4] Completed on J1 in 149.51s, 1 test, 1 failure, 3 errors <<< FAILURES!
[junit4:junit4] 
[junit4:junit4] 
[junit4:junit4] Tests with failures:
[junit4:junit4]   - org.apache.solr.cloud.BasicDistributedZk2Test.testDistribSearch
[junit4:junit4]   - org.apache.solr.cloud.BasicDistributedZk2Test (suite)
[junit4:junit4] 
[junit4:junit4] 
[junit4:junit4] JVM J0:     1.13 ..   176.66 =   175.53s
[junit4:junit4] JVM J1:     1.12 ..   258.95 =   257.83s
[junit4:junit4] JVM J2:     0.90 ..   144.67 =   143.77s
[junit4:junit4] JVM J3:     1.12 ..   119.36 =   118.24s
[junit4:junit4] JVM J4:     1.12 ..   114.18 =   113.07s
[junit4:junit4] JVM J5:     1.12 ..   116.51 =   115.39s
[junit4:junit4] JVM J6:     0.88 ..   114.30 =   113.42s
[junit4:junit4] JVM J7:     1.12 ..   121.86 =   120.75s
[junit4:junit4] Execution time total: 4 minutes 19 seconds
[junit4:junit4] Tests summary: 233 suites, 965 tests, 3 suite-level errors, 1 error, 7 ignored
(2 assumptions)

BUILD FAILED
<http://sierranevada.servebeer.com/job/fast-io-beasting/ws/build.xml>:39: The following
error occurred while executing this line:
<http://sierranevada.servebeer.com/job/fast-io-beasting/ws/solr/build.xml>:178: The
following error occurred while executing this line:
<http://sierranevada.servebeer.com/job/fast-io-beasting/ws/lucene/module-build.xml>:61:
The following error occurred while executing this line:
<http://sierranevada.servebeer.com/job/fast-io-beasting/ws/lucene/common-build.xml>:1159:
The following error occurred while executing this line:
<http://sierranevada.servebeer.com/job/fast-io-beasting/ws/lucene/common-build.xml>:827:
There were test failures: 233 suites, 965 tests, 3 suite-level errors, 1 error, 7 ignored
(2 assumptions)

Total time: 9 minutes 34 seconds
Build step 'Invoke Ant' marked build as failure

---------------------------------------------------------------------
To unsubscribe, e-mail: dev-unsubscribe@lucene.apache.org
For additional commands, e-mail: dev-help@lucene.apache.org


Mime
View raw message