lucene-dev mailing list archives

Site index · List index
Message view « Date » · « Thread »
Top « Date » · « Thread »
From Charlie Cron <hudsonsevilt...@gmail.com>
Subject Build failed in Jenkins: fast-io-beasting #6154
Date Sun, 28 Oct 2012 19:04:29 GMT
See <http://sierranevada.servebeer.com/job/fast-io-beasting/6154/>

------------------------------------------
[...truncated 24164 lines...]
[junit4:junit4]   2> 112510 T18 oasu.DefaultSolrCoreState.closeIndexWriter closing IndexWriter
with IndexWriterCloser
[junit4:junit4]   2> 112512 T18 oasc.SolrCore.closeSearcher [collection3] Closing main
searcher on request.
[junit4:junit4]   2> 112512 T18 oasc.SolrCore.close [awholynewcollection_0]  CLOSING SolrCore
org.apache.solr.core.SolrCore@73c4390a
[junit4:junit4]   2> 112513 T18 oasu.DirectUpdateHandler2.close closing DirectUpdateHandler2{commits=0,autocommits=0,soft
autocommits=0,optimizes=0,rollbacks=0,expungeDeletes=0,docsPending=0,adds=0,deletesById=0,deletesByQuery=0,errors=0,cumulative_adds=0,cumulative_deletesById=0,cumulative_deletesByQuery=0,cumulative_errors=0}
[junit4:junit4]   2> 112514 T18 oasc.SolrCore.decrefSolrCoreState Closing SolrCoreState
[junit4:junit4]   2> 112514 T18 oasu.DefaultSolrCoreState.closeIndexWriter SolrCoreState
ref count has reached 0 - closing IndexWriter
[junit4:junit4]   2> 112514 T18 oasu.DefaultSolrCoreState.closeIndexWriter closing IndexWriter
with IndexWriterCloser
[junit4:junit4]   2> 112515 T18 oasc.SolrCore.closeSearcher [awholynewcollection_0] Closing
main searcher on request.
[junit4:junit4]   2> 112516 T18 oasc.SolrCore.close [awholynewcollection_1]  CLOSING SolrCore
org.apache.solr.core.SolrCore@57e75713
[junit4:junit4]   2> 112527 T18 oasu.DirectUpdateHandler2.close closing DirectUpdateHandler2{commits=1,autocommits=0,soft
autocommits=0,optimizes=0,rollbacks=0,expungeDeletes=0,docsPending=0,adds=0,deletesById=0,deletesByQuery=0,errors=0,cumulative_adds=0,cumulative_deletesById=0,cumulative_deletesByQuery=0,cumulative_errors=0}
[junit4:junit4]   2> 112528 T18 oasc.SolrCore.decrefSolrCoreState Closing SolrCoreState
[junit4:junit4]   2> 112528 T18 oasu.DefaultSolrCoreState.closeIndexWriter SolrCoreState
ref count has reached 0 - closing IndexWriter
[junit4:junit4]   2> 112529 T18 oasu.DefaultSolrCoreState.closeIndexWriter closing IndexWriter
with IndexWriterCloser
[junit4:junit4]   2> 112530 T18 oasc.SolrCore.closeSearcher [awholynewcollection_1] Closing
main searcher on request.
[junit4:junit4]   2> 112530 T18 oasc.SolrCore.close [awholynewcollection_3]  CLOSING SolrCore
org.apache.solr.core.SolrCore@2414b575
[junit4:junit4]   2> 112534 T18 oasu.DirectUpdateHandler2.close closing DirectUpdateHandler2{commits=1,autocommits=0,soft
autocommits=0,optimizes=0,rollbacks=0,expungeDeletes=0,docsPending=0,adds=0,deletesById=0,deletesByQuery=0,errors=0,cumulative_adds=0,cumulative_deletesById=0,cumulative_deletesByQuery=0,cumulative_errors=0}
[junit4:junit4]   2> 112534 T18 oasc.SolrCore.decrefSolrCoreState Closing SolrCoreState
[junit4:junit4]   2> 112535 T18 oasu.DefaultSolrCoreState.closeIndexWriter SolrCoreState
ref count has reached 0 - closing IndexWriter
[junit4:junit4]   2> 112535 T18 oasu.DefaultSolrCoreState.closeIndexWriter closing IndexWriter
with IndexWriterCloser
[junit4:junit4]   2> 112536 T18 oasc.SolrCore.closeSearcher [awholynewcollection_3] Closing
main searcher on request.
[junit4:junit4]   2> 112536 T18 oasc.SolrCore.close [unloadcollection3]  CLOSING SolrCore
org.apache.solr.core.SolrCore@83e591f
[junit4:junit4]   2> 112542 T18 oasu.DirectUpdateHandler2.close closing DirectUpdateHandler2{commits=1,autocommits=0,soft
autocommits=0,optimizes=0,rollbacks=0,expungeDeletes=0,docsPending=80,adds=80,deletesById=0,deletesByQuery=0,errors=0,cumulative_adds=80,cumulative_deletesById=0,cumulative_deletesByQuery=0,cumulative_errors=0}
[junit4:junit4]   2> 112543 T18 oasc.SolrCore.decrefSolrCoreState Closing SolrCoreState
[junit4:junit4]   2> 112543 T18 oasu.DefaultSolrCoreState.closeIndexWriter SolrCoreState
ref count has reached 0 - closing IndexWriter
[junit4:junit4]   2> 112543 T18 oasu.DefaultSolrCoreState.closeIndexWriter closing IndexWriter
with IndexWriterCloser
[junit4:junit4]   2> 112546 T18 oasc.SolrCore.closeSearcher [unloadcollection3] Closing
main searcher on request.
[junit4:junit4]   2> 113562 T76 oaz.ClientCnxn$SendThread.startConnect Opening socket connection
to server localhost.localdomain/127.0.0.1:43304
[junit4:junit4]   2> 113609 T90 oaz.ClientCnxn$SendThread.startConnect Opening socket connection
to server localhost.localdomain/127.0.0.1:43304
[junit4:junit4]   2> 113610 T90 oaz.ClientCnxn$SendThread.run WARNING Session 0x13aa8c0f0310006
for server null, unexpected error, closing socket connection and attempting reconnect java.net.ConnectException:
Connection refused
[junit4:junit4]   2> 	at sun.nio.ch.SocketChannelImpl.checkConnect(Native Method)
[junit4:junit4]   2> 	at sun.nio.ch.SocketChannelImpl.finishConnect(SocketChannelImpl.java:567)
[junit4:junit4]   2> 	at org.apache.zookeeper.ClientCnxn$SendThread.run(ClientCnxn.java:1143)
[junit4:junit4]   2> 
[junit4:junit4]   2> 113663 T77 oaz.ClientCnxn$EventThread.run EventThread shut down
[junit4:junit4]   2> 113663 T18 oaz.ZooKeeper.close Session: 0x13aa8c0f0310005 closed
[junit4:junit4]   2> 113685 T18 oejsh.ContextHandler.doStop stopped o.e.j.s.ServletContextHandler{/solr,null}
[junit4:junit4]   2> 113737 T18 oasc.ChaosMonkey.monkeyLog monkey: stop shard! 43806
[junit4:junit4]   2> 113737 T18 oasc.CoreContainer.shutdown Shutting down CoreContainer
instance=1820523433
[junit4:junit4]   2> 113738 T18 oasc.SolrCore.close [collection1]  CLOSING SolrCore org.apache.solr.core.SolrCore@49e21540
[junit4:junit4]   2> 113750 T18 oasu.DirectUpdateHandler2.close closing DirectUpdateHandler2{commits=106,autocommits=0,soft
autocommits=0,optimizes=0,rollbacks=0,expungeDeletes=0,docsPending=0,adds=0,deletesById=0,deletesByQuery=0,errors=0,cumulative_adds=80,cumulative_deletesById=0,cumulative_deletesByQuery=1,cumulative_errors=0}
[junit4:junit4]   2> 113751 T18 oasc.SolrCore.decrefSolrCoreState Closing SolrCoreState
[junit4:junit4]   2> 113751 T18 oasu.DefaultSolrCoreState.closeIndexWriter SolrCoreState
ref count has reached 0 - closing IndexWriter
[junit4:junit4]   2> 113751 T18 oasu.DefaultSolrCoreState.closeIndexWriter closing IndexWriter
with IndexWriterCloser
[junit4:junit4]   2> 113754 T18 oasc.SolrCore.closeSearcher [collection1] Closing main
searcher on request.
[junit4:junit4]   2> 113755 T18 oasc.SolrCore.close [collection2]  CLOSING SolrCore org.apache.solr.core.SolrCore@51274873
[junit4:junit4]   2> 113762 T18 oasu.DirectUpdateHandler2.close closing DirectUpdateHandler2{commits=2,autocommits=0,soft
autocommits=0,optimizes=0,rollbacks=0,expungeDeletes=0,docsPending=0,adds=0,deletesById=0,deletesByQuery=0,errors=0,cumulative_adds=2,cumulative_deletesById=0,cumulative_deletesByQuery=0,cumulative_errors=0}
[junit4:junit4]   2> 113763 T18 oasc.SolrCore.decrefSolrCoreState Closing SolrCoreState
[junit4:junit4]   2> 113763 T18 oasu.DefaultSolrCoreState.closeIndexWriter SolrCoreState
ref count has reached 0 - closing IndexWriter
[junit4:junit4]   2> 113763 T18 oasu.DefaultSolrCoreState.closeIndexWriter closing IndexWriter
with IndexWriterCloser
[junit4:junit4]   2> 113764 T18 oasc.SolrCore.closeSearcher [collection2] Closing main
searcher on request.
[junit4:junit4]   2> 113765 T18 oasc.SolrCore.close [collection3]  CLOSING SolrCore org.apache.solr.core.SolrCore@3b13eb9c
[junit4:junit4]   2> 113772 T18 oasu.DirectUpdateHandler2.close closing DirectUpdateHandler2{commits=2,autocommits=0,soft
autocommits=0,optimizes=0,rollbacks=0,expungeDeletes=0,docsPending=0,adds=0,deletesById=0,deletesByQuery=0,errors=0,cumulative_adds=0,cumulative_deletesById=0,cumulative_deletesByQuery=0,cumulative_errors=0}
[junit4:junit4]   2> 113773 T18 oasc.SolrCore.decrefSolrCoreState Closing SolrCoreState
[junit4:junit4]   2> 113773 T18 oasu.DefaultSolrCoreState.closeIndexWriter SolrCoreState
ref count has reached 0 - closing IndexWriter
[junit4:junit4]   2> 113773 T18 oasu.DefaultSolrCoreState.closeIndexWriter closing IndexWriter
with IndexWriterCloser
[junit4:junit4]   2> 113774 T18 oasc.SolrCore.closeSearcher [collection3] Closing main
searcher on request.
[junit4:junit4]   2> 113775 T18 oasc.SolrCore.close [awholynewcollection_0]  CLOSING SolrCore
org.apache.solr.core.SolrCore@715e12dc
[junit4:junit4]   2> 113776 T18 oasu.DirectUpdateHandler2.close closing DirectUpdateHandler2{commits=0,autocommits=0,soft
autocommits=0,optimizes=0,rollbacks=0,expungeDeletes=0,docsPending=0,adds=0,deletesById=0,deletesByQuery=0,errors=0,cumulative_adds=0,cumulative_deletesById=0,cumulative_deletesByQuery=0,cumulative_errors=0}
[junit4:junit4]   2> 113776 T18 oasc.SolrCore.decrefSolrCoreState Closing SolrCoreState
[junit4:junit4]   2> 113777 T18 oasu.DefaultSolrCoreState.closeIndexWriter SolrCoreState
ref count has reached 0 - closing IndexWriter
[junit4:junit4]   2> 113777 T18 oasu.DefaultSolrCoreState.closeIndexWriter closing IndexWriter
with IndexWriterCloser
[junit4:junit4]   2> 113777 T18 oasc.SolrCore.closeSearcher [awholynewcollection_0] Closing
main searcher on request.
[junit4:junit4]   2> 113778 T18 oasc.SolrCore.close [awholynewcollection_3]  CLOSING SolrCore
org.apache.solr.core.SolrCore@498fb7b1
[junit4:junit4]   2> 113781 T18 oasu.DirectUpdateHandler2.close closing DirectUpdateHandler2{commits=1,autocommits=0,soft
autocommits=0,optimizes=0,rollbacks=0,expungeDeletes=0,docsPending=0,adds=0,deletesById=0,deletesByQuery=0,errors=0,cumulative_adds=0,cumulative_deletesById=0,cumulative_deletesByQuery=0,cumulative_errors=0}
[junit4:junit4]   2> 113782 T18 oasc.SolrCore.decrefSolrCoreState Closing SolrCoreState
[junit4:junit4]   2> 113782 T18 oasu.DefaultSolrCoreState.closeIndexWriter SolrCoreState
ref count has reached 0 - closing IndexWriter
[junit4:junit4]   2> 113782 T18 oasu.DefaultSolrCoreState.closeIndexWriter closing IndexWriter
with IndexWriterCloser
[junit4:junit4]   2> 113783 T18 oasc.SolrCore.closeSearcher [awholynewcollection_3] Closing
main searcher on request.
[junit4:junit4]   2> 114048 T103 oaz.ClientCnxn$SendThread.startConnect Opening socket
connection to server localhost.localdomain/127.0.0.1:43304
[junit4:junit4]   2> 114048 T103 oaz.ClientCnxn$SendThread.run WARNING Session 0x13aa8c0f0310009
for server null, unexpected error, closing socket connection and attempting reconnect java.net.ConnectException:
Connection refused
[junit4:junit4]   2> 	at sun.nio.ch.SocketChannelImpl.checkConnect(Native Method)
[junit4:junit4]   2> 	at sun.nio.ch.SocketChannelImpl.finishConnect(SocketChannelImpl.java:567)
[junit4:junit4]   2> 	at org.apache.zookeeper.ClientCnxn$SendThread.run(ClientCnxn.java:1143)
[junit4:junit4]   2> 
[junit4:junit4]   2> 115311 T103 oaz.ClientCnxn$SendThread.startConnect Opening socket
connection to server localhost.localdomain/127.0.0.1:43304
[junit4:junit4]   2> 115311 T103 oaz.ClientCnxn$SendThread.run WARNING Session 0x13aa8c0f0310009
for server null, unexpected error, closing socket connection and attempting reconnect java.net.ConnectException:
Connection refused
[junit4:junit4]   2> 	at sun.nio.ch.SocketChannelImpl.checkConnect(Native Method)
[junit4:junit4]   2> 	at sun.nio.ch.SocketChannelImpl.finishConnect(SocketChannelImpl.java:567)
[junit4:junit4]   2> 	at org.apache.zookeeper.ClientCnxn$SendThread.run(ClientCnxn.java:1143)
[junit4:junit4]   2> 
[junit4:junit4]   2> 115375 T90 oaz.ClientCnxn$SendThread.startConnect Opening socket connection
to server localhost.localdomain/127.0.0.1:43304
[junit4:junit4]   2> 115479 T91 oaz.ClientCnxn$EventThread.run EventThread shut down
[junit4:junit4]   2> 115479 T18 oaz.ZooKeeper.close Session: 0x13aa8c0f0310006 closed
[junit4:junit4]   2> 115506 T18 oejsh.ContextHandler.doStop stopped o.e.j.s.ServletContextHandler{/solr,null}
[junit4:junit4]   2> 115605 T18 oas.SolrTestCaseJ4.tearDown ###Ending testDistribSearch
[junit4:junit4]   2> 116683 T103 oaz.ClientCnxn$SendThread.startConnect Opening socket
connection to server localhost.localdomain/127.0.0.1:43304
[junit4:junit4]   2> 116784 T104 oaz.ClientCnxn$EventThread.run EventThread shut down
[junit4:junit4]   2> 116784 T18 oaz.ZooKeeper.close Session: 0x13aa8c0f0310009 closed
[junit4:junit4]   1>            "base_url":"http://127.0.0.1:33102/solr"}
[junit4:junit4]   1>    /solr/collections/control_collection (3)
[junit4:junit4]   1>    DATA:
[junit4:junit4]   1>        {"configName":"conf1"}
[junit4:junit4]   1>     /solr/collections/control_collection/shards (0)
[junit4:junit4]   1>     /solr/collections/control_collection/leader_elect (1)
[junit4:junit4]   1>      /solr/collections/control_collection/leader_elect/control_shard
(1)
[junit4:junit4]   1>       /solr/collections/control_collection/leader_elect/control_shard/election
(1)
[junit4:junit4]   1>        /solr/collections/control_collection/leader_elect/control_shard/election/88568689304076290-127.0.0.1:58571_solr_collection1-n_0000000000
(0)
[junit4:junit4]   1>     /solr/collections/control_collection/leaders (1)
[junit4:junit4]   1>      /solr/collections/control_collection/leaders/control_shard (0)
[junit4:junit4]   1>      DATA:
[junit4:junit4]   1>          {
[junit4:junit4]   1>            "core":"collection1",
[junit4:junit4]   1>            "node_name":"127.0.0.1:58571_solr",
[junit4:junit4]   1>            "base_url":"http://127.0.0.1:58571/solr"}
[junit4:junit4]   1>   /solr/clusterstate.json (0)
[junit4:junit4]   1>   DATA:
[junit4:junit4]   1>       {
[junit4:junit4]   1>         "collection1":{
[junit4:junit4]   1>           "shard1":{
[junit4:junit4]   1>             "range":"80000000-ffffffff",
[junit4:junit4]   1>             "replicas":{
[junit4:junit4]   1>               "127.0.0.1:59725_solr_collection1":{
[junit4:junit4]   1>                 "shard":"shard1",
[junit4:junit4]   1>                 "roles":null,
[junit4:junit4]   1>                 "state":"active",
[junit4:junit4]   1>                 "core":"collection1",
[junit4:junit4]   1>                 "collection":"collection1",
[junit4:junit4]   1>                 "node_name":"127.0.0.1:59725_solr",
[junit4:junit4]   1>                 "base_url":"http://127.0.0.1:59725/solr",
[junit4:junit4]   1>                 "leader":"true"},
[junit4:junit4]   1>               "127.0.0.1:38915_solr_collection1":{
[junit4:junit4]   1>                 "shard":"shard1",
[junit4:junit4]   1>                 "roles":null,
[junit4:junit4]   1>                 "state":"active",
[junit4:junit4]   1>                 "core":"collection1",
[junit4:junit4]   1>                 "collection":"collection1",
[junit4:junit4]   1>                 "node_name":"127.0.0.1:38915_solr",
[junit4:junit4]   1>                 "base_url":"http://127.0.0.1:38915/solr"}}},
[junit4:junit4]   1>           "shard2":{
[junit4:junit4]   1>             "range":"0-7fffffff",
[junit4:junit4]   1>             "replicas":{
[junit4:junit4]   1>               "127.0.0.1:33102_solr_collection1":{
[junit4:junit4]   1>                 "shard":"shard2",
[junit4:junit4]   1>                 "roles":null,
[junit4:junit4]   1>                 "state":"active",
[junit4:junit4]   1>                 "core":"collection1",
[junit4:junit4]   1>                 "collection":"collection1",
[junit4:junit4]   1>                 "node_name":"127.0.0.1:33102_solr",
[junit4:junit4]   1>                 "base_url":"http://127.0.0.1:33102/solr",
[junit4:junit4]   1>                 "leader":"true"},
[junit4:junit4]   1>               "127.0.0.1:43806_solr_collection1":{
[junit4:junit4]   1>                 "shard":"shard2",
[junit4:junit4]   1>                 "roles":null,
[junit4:junit4]   1>                 "state":"active",
[junit4:junit4]   1>                 "core":"collection1",
[junit4:junit4]   1>                 "collection":"collection1",
[junit4:junit4]   1>                 "node_name":"127.0.0.1:43806_solr",
[junit4:junit4]   1>                 "base_url":"http://127.0.0.1:43806/solr"}}}},
[junit4:junit4]   1>         "control_collection":{"control_shard":{"replicas":{"127.0.0.1:58571_solr_collection1":{
[junit4:junit4]   1>                 "shard":"control_shard",
[junit4:junit4]   1>                 "roles":null,
[junit4:junit4]   1>                 "state":"active",
[junit4:junit4]   1>                 "core":"collection1",
[junit4:junit4]   1>                 "collection":"control_collection",
[junit4:junit4]   1>                 "node_name":"127.0.0.1:58571_solr",
[junit4:junit4]   1>                 "base_url":"http://127.0.0.1:58571/solr",
[junit4:junit4]   1>                 "leader":"true"}}}}}
[junit4:junit4]   1>  /zookeeper (1)
[junit4:junit4]   1>  DATA:
[junit4:junit4]   1>      
[junit4:junit4]   1> 
[junit4:junit4]   2> NOTE: reproduce with: ant test  -Dtestcase=BasicDistributedZkTest
-Dtests.method=testDistribSearch -Dtests.seed=4660776299BFD442 -Dtests.slow=true -Dtests.locale=da_DK
-Dtests.timezone=America/Panama -Dtests.file.encoding=UTF-8
[junit4:junit4] FAILURE  117s J0 | BasicDistributedZkTest.testDistribSearch <<<
[junit4:junit4]    > Throwable #1: java.lang.AssertionError: Leader never changed
[junit4:junit4]    > 	at __randomizedtesting.SeedInfo.seed([4660776299BFD442:C786F97AEEE0B47E]:0)
[junit4:junit4]    > 	at org.junit.Assert.fail(Assert.java:93)
[junit4:junit4]    > 	at org.apache.solr.cloud.BasicDistributedZkTest.testCoreUnloadAndLeaders(BasicDistributedZkTest.java:446)
[junit4:junit4]    > 	at org.apache.solr.cloud.BasicDistributedZkTest.doTest(BasicDistributedZkTest.java:335)
[junit4:junit4]    > 	at org.apache.solr.BaseDistributedSearchTestCase.testDistribSearch(BaseDistributedSearchTestCase.java:695)
[junit4:junit4]    > 	at sun.reflect.NativeMethodAccessorImpl.invoke0(Native Method)
[junit4:junit4]    > 	at sun.reflect.NativeMethodAccessorImpl.invoke(NativeMethodAccessorImpl.java:39)
[junit4:junit4]    > 	at sun.reflect.DelegatingMethodAccessorImpl.invoke(DelegatingMethodAccessorImpl.java:25)
[junit4:junit4]    > 	at java.lang.reflect.Method.invoke(Method.java:597)
[junit4:junit4]    > 	at com.carrotsearch.randomizedtesting.RandomizedRunner.invoke(RandomizedRunner.java:1559)
[junit4:junit4]    > 	at com.carrotsearch.randomizedtesting.RandomizedRunner.access$600(RandomizedRunner.java:79)
[junit4:junit4]    > 	at com.carrotsearch.randomizedtesting.RandomizedRunner$6.evaluate(RandomizedRunner.java:737)
[junit4:junit4]    > 	at com.carrotsearch.randomizedtesting.RandomizedRunner$7.evaluate(RandomizedRunner.java:773)
[junit4:junit4]    > 	at com.carrotsearch.randomizedtesting.RandomizedRunner$8.evaluate(RandomizedRunner.java:787)
[junit4:junit4]    > 	at com.carrotsearch.randomizedtesting.rules.SystemPropertiesRestoreRule$1.evaluate(SystemPropertiesRestoreRule.java:53)
[junit4:junit4]    > 	at org.apache.lucene.util.TestRuleSetupTeardownChained$1.evaluate(TestRuleSetupTeardownChained.java:50)
[junit4:junit4]    > 	at org.apache.lucene.util.TestRuleFieldCacheSanity$1.evaluate(TestRuleFieldCacheSanity.java:51)
[junit4:junit4]    > 	at org.apache.lucene.util.AbstractBeforeAfterRule$1.evaluate(AbstractBeforeAfterRule.java:45)
[junit4:junit4]    > 	at com.carrotsearch.randomizedtesting.rules.SystemPropertiesInvariantRule$1.evaluate(SystemPropertiesInvariantRule.java:55)
[junit4:junit4]    > 	at org.apache.lucene.util.TestRuleThreadAndTestName$1.evaluate(TestRuleThreadAndTestName.java:48)
[junit4:junit4]    > 	at org.apache.lucene.util.TestRuleIgnoreAfterMaxFailures$1.evaluate(TestRuleIgnoreAfterMaxFailures.java:70)
[junit4:junit4]    > 	at org.apache.lucene.util.TestRuleMarkFailure$1.evaluate(TestRuleMarkFailure.java:48)
[junit4:junit4]    > 	at com.carrotsearch.randomizedtesting.rules.StatementAdapter.evaluate(StatementAdapter.java:36)
[junit4:junit4]    > 	at com.carrotsearch.randomizedtesting.ThreadLeakControl$StatementRunner.run(ThreadLeakControl.java:358)
[junit4:junit4]    > 	at com.carrotsearch.randomizedtesting.ThreadLeakControl.forkTimeoutingTask(ThreadLeakControl.java:782)
[junit4:junit4]    > 	at com.carrotsearch.randomizedtesting.ThreadLeakControl$3.evaluate(ThreadLeakControl.java:442)
[junit4:junit4]    > 	at com.carrotsearch.randomizedtesting.RandomizedRunner.runSingleTest(RandomizedRunner.java:746)
[junit4:junit4]    > 	at com.carrotsearch.randomizedtesting.RandomizedRunner$3.evaluate(RandomizedRunner.java:648)
[junit4:junit4]    > 	at com.carrotsearch.randomizedtesting.RandomizedRunner$4.evaluate(RandomizedRunner.java:682)
[junit4:junit4]    > 	at com.carrotsearch.randomizedtesting.RandomizedRunner$5.evaluate(RandomizedRunner.java:693)
[junit4:junit4]    > 	at com.carrotsearch.randomizedtesting.rules.StatementAdapter.evaluate(StatementAdapter.java:36)
[junit4:junit4]    > 	at com.carrotsearch.randomizedtesting.rules.SystemPropertiesRestoreRule$1.evaluate(SystemPropertiesRestoreRule.java:53)
[junit4:junit4]    > 	at org.apache.lucene.util.AbstractBeforeAfterRule$1.evaluate(AbstractBeforeAfterRule.java:45)
[junit4:junit4]    > 	at org.apache.lucene.util.TestRuleStoreClassName$1.evaluate(TestRuleStoreClassName.java:42)
[junit4:junit4]    > 	at com.carrotsearch.randomizedtesting.rules.SystemPropertiesInvariantRule$1.evaluate(SystemPropertiesInvariantRule.java:55)
[junit4:junit4]    > 	at com.carrotsearch.randomizedtesting.rules.NoShadowingOrOverridesOnMethodsRule$1.evaluate(NoShadowingOrOverridesOnMethodsRule.java:39)
[junit4:junit4]    > 	at com.carrotsearch.randomizedtesting.rules.NoShadowingOrOverridesOnMethodsRule$1.evaluate(NoShadowingOrOverridesOnMethodsRule.java:39)
[junit4:junit4]    > 	at com.carrotsearch.randomizedtesting.rules.StatementAdapter.evaluate(StatementAdapter.java:36)
[junit4:junit4]    > 	at org.apache.lucene.util.TestRuleAssertionsRequired$1.evaluate(TestRuleAssertionsRequired.java:43)
[junit4:junit4]    > 	at org.apache.lucene.util.TestRuleMarkFailure$1.evaluate(TestRuleMarkFailure.java:48)
[junit4:junit4]    > 	at org.apache.lucene.util.TestRuleIgnoreAfterMaxFailures$1.evaluate(TestRuleIgnoreAfterMaxFailures.java:70)
[junit4:junit4]    > 	at org.apache.lucene.util.TestRuleIgnoreTestSuites$1.evaluate(TestRuleIgnoreTestSuites.java:55)
[junit4:junit4]    > 	at com.carrotsearch.randomizedtesting.rules.StatementAdapter.evaluate(StatementAdapter.java:36)
[junit4:junit4]    > 	at com.carrotsearch.randomizedtesting.ThreadLeakControl$StatementRunner.run(ThreadLeakControl.java:358)
[junit4:junit4]    > 	at java.lang.Thread.run(Thread.java:662)
[junit4:junit4]   2> 116821 T18 oas.SolrTestCaseJ4.deleteCore ###deleteCore
[junit4:junit4]   2> NOTE: test params are: codec=SimpleText, sim=DefaultSimilarity, locale=da_DK,
timezone=America/Panama
[junit4:junit4]   2> NOTE: Linux 3.2.0-24-generic amd64/Sun Microsystems Inc. 1.6.0_27
(64-bit)/cpus=8,threads=1,free=129981048,total=347602944
[junit4:junit4]   2> NOTE: All tests run in this JVM: [PathHierarchyTokenizerFactoryTest,
CoreContainerCoreInitFailuresTest, BasicDistributedZkTest]
[junit4:junit4] Completed on J0 in 116.97s, 1 test, 1 failure <<< FAILURES!
[junit4:junit4] 
[junit4:junit4] Suite: org.apache.solr.search.TestStressRecovery
[junit4:junit4] Completed on J3 in 3.27s, 1 test
[junit4:junit4] 
[junit4:junit4] Suite: org.apache.solr.search.TestReload
[junit4:junit4] Completed on J7 in 5.34s, 1 test
[junit4:junit4] 
[junit4:junit4] Suite: org.apache.solr.util.SimplePostToolTest
[junit4:junit4] Completed on J1 in 6.08s, 11 tests
[junit4:junit4] 
[junit4:junit4] 
[junit4:junit4] Tests with failures:
[junit4:junit4]   - org.apache.solr.cloud.BasicDistributedZkTest.testDistribSearch
[junit4:junit4] 
[junit4:junit4] 
[junit4:junit4] JVM J0:     1.12 ..   126.83 =   125.71s
[junit4:junit4] JVM J1:     1.12 ..   130.83 =   129.71s
[junit4:junit4] JVM J2:     0.89 ..   124.77 =   123.88s
[junit4:junit4] JVM J3:     0.89 ..   127.77 =   126.88s
[junit4:junit4] JVM J4:     0.89 ..   124.93 =   124.04s
[junit4:junit4] JVM J5:     0.89 ..   124.63 =   123.74s
[junit4:junit4] JVM J6:     1.12 ..   124.93 =   123.81s
[junit4:junit4] JVM J7:     1.12 ..   129.69 =   128.57s
[junit4:junit4] Execution time total: 2 minutes 10 seconds
[junit4:junit4] Tests summary: 233 suites, 965 tests, 1 failure, 7 ignored (2 assumptions)

BUILD FAILED
<http://sierranevada.servebeer.com/job/fast-io-beasting/ws/build.xml>:39: The following
error occurred while executing this line:
<http://sierranevada.servebeer.com/job/fast-io-beasting/ws/solr/build.xml>:178: The
following error occurred while executing this line:
<http://sierranevada.servebeer.com/job/fast-io-beasting/ws/lucene/module-build.xml>:61:
The following error occurred while executing this line:
<http://sierranevada.servebeer.com/job/fast-io-beasting/ws/lucene/common-build.xml>:1159:
The following error occurred while executing this line:
<http://sierranevada.servebeer.com/job/fast-io-beasting/ws/lucene/common-build.xml>:827:
There were test failures: 233 suites, 965 tests, 1 failure, 7 ignored (2 assumptions)

Total time: 7 minutes 25 seconds
Build step 'Invoke Ant' marked build as failure

---------------------------------------------------------------------
To unsubscribe, e-mail: dev-unsubscribe@lucene.apache.org
For additional commands, e-mail: dev-help@lucene.apache.org


Mime
View raw message