lucene-dev mailing list archives

Site index · List index
Message view « Date » · « Thread »
Top « Date » · « Thread »
From Apache Jenkins Server <jenk...@builds.apache.org>
Subject [JENKINS] Lucene-Solr-Tests-trunk-java7 - Build # 3343 - Still Failing
Date Fri, 26 Oct 2012 13:08:35 GMT
Build: https://builds.apache.org/job/Lucene-Solr-Tests-trunk-java7/3343/

4 tests failed.
FAILED:  junit.framework.TestSuite.org.apache.solr.request.TestRemoteStreaming

Error Message:
4 threads leaked from SUITE scope at org.apache.solr.request.TestRemoteStreaming:     1) Thread[id=26, name=qtp1191745850-26 Acceptor2 SelectChannelConnector@0.0.0.0:27291, state=BLOCKED, group=TGRP-TestRemoteStreaming]         at sun.nio.ch.ServerSocketChannelImpl.accept(ServerSocketChannelImpl.java:210)         at org.eclipse.jetty.server.nio.SelectChannelConnector.accept(SelectChannelConnector.java:104)         at org.eclipse.jetty.server.AbstractConnector$Acceptor.run(AbstractConnector.java:933)         at org.eclipse.jetty.util.thread.QueuedThreadPool.runJob(QueuedThreadPool.java:599)         at org.eclipse.jetty.util.thread.QueuedThreadPool$3.run(QueuedThreadPool.java:534)         at java.lang.Thread.run(Thread.java:722)    2) Thread[id=24, name=qtp1191745850-24 Acceptor0 SelectChannelConnector@0.0.0.0:27291, state=BLOCKED, group=TGRP-TestRemoteStreaming]         at sun.nio.ch.ServerSocketChannelImpl.accept(ServerSocketChannelImpl.java:210)         at org.eclipse.jetty.server.nio.SelectChannelConnector.accept(SelectChannelConnector.java:104)         at org.eclipse.jetty.server.AbstractConnector$Acceptor.run(AbstractConnector.java:933)         at org.eclipse.jetty.util.thread.QueuedThreadPool.runJob(QueuedThreadPool.java:599)         at org.eclipse.jetty.util.thread.QueuedThreadPool$3.run(QueuedThreadPool.java:534)         at java.lang.Thread.run(Thread.java:722)    3) Thread[id=25, name=qtp1191745850-25 Acceptor1 SelectChannelConnector@0.0.0.0:27291, state=RUNNABLE, group=TGRP-TestRemoteStreaming]         at sun.nio.ch.ServerSocketChannelImpl.accept0(Native Method)         at sun.nio.ch.ServerSocketChannelImpl.accept(ServerSocketChannelImpl.java:226)         at org.eclipse.jetty.server.nio.SelectChannelConnector.accept(SelectChannelConnector.java:104)         at org.eclipse.jetty.server.AbstractConnector$Acceptor.run(AbstractConnector.java:933)         at org.eclipse.jetty.util.thread.QueuedThreadPool.runJob(QueuedThreadPool.java:599)         at org.eclipse.jetty.util.thread.QueuedThreadPool$3.run(QueuedThreadPool.java:534)         at java.lang.Thread.run(Thread.java:722)    4) Thread[id=27, name=qtp1191745850-27 Acceptor3 SelectChannelConnector@0.0.0.0:27291, state=BLOCKED, group=TGRP-TestRemoteStreaming]         at sun.nio.ch.ServerSocketChannelImpl.accept(ServerSocketChannelImpl.java:210)         at org.eclipse.jetty.server.nio.SelectChannelConnector.accept(SelectChannelConnector.java:104)         at org.eclipse.jetty.server.AbstractConnector$Acceptor.run(AbstractConnector.java:933)         at org.eclipse.jetty.util.thread.QueuedThreadPool.runJob(QueuedThreadPool.java:599)         at org.eclipse.jetty.util.thread.QueuedThreadPool$3.run(QueuedThreadPool.java:534)         at java.lang.Thread.run(Thread.java:722)

Stack Trace:
com.carrotsearch.randomizedtesting.ThreadLeakError: 4 threads leaked from SUITE scope at org.apache.solr.request.TestRemoteStreaming: 
   1) Thread[id=26, name=qtp1191745850-26 Acceptor2 SelectChannelConnector@0.0.0.0:27291, state=BLOCKED, group=TGRP-TestRemoteStreaming]
        at sun.nio.ch.ServerSocketChannelImpl.accept(ServerSocketChannelImpl.java:210)
        at org.eclipse.jetty.server.nio.SelectChannelConnector.accept(SelectChannelConnector.java:104)
        at org.eclipse.jetty.server.AbstractConnector$Acceptor.run(AbstractConnector.java:933)
        at org.eclipse.jetty.util.thread.QueuedThreadPool.runJob(QueuedThreadPool.java:599)
        at org.eclipse.jetty.util.thread.QueuedThreadPool$3.run(QueuedThreadPool.java:534)
        at java.lang.Thread.run(Thread.java:722)
   2) Thread[id=24, name=qtp1191745850-24 Acceptor0 SelectChannelConnector@0.0.0.0:27291, state=BLOCKED, group=TGRP-TestRemoteStreaming]
        at sun.nio.ch.ServerSocketChannelImpl.accept(ServerSocketChannelImpl.java:210)
        at org.eclipse.jetty.server.nio.SelectChannelConnector.accept(SelectChannelConnector.java:104)
        at org.eclipse.jetty.server.AbstractConnector$Acceptor.run(AbstractConnector.java:933)
        at org.eclipse.jetty.util.thread.QueuedThreadPool.runJob(QueuedThreadPool.java:599)
        at org.eclipse.jetty.util.thread.QueuedThreadPool$3.run(QueuedThreadPool.java:534)
        at java.lang.Thread.run(Thread.java:722)
   3) Thread[id=25, name=qtp1191745850-25 Acceptor1 SelectChannelConnector@0.0.0.0:27291, state=RUNNABLE, group=TGRP-TestRemoteStreaming]
        at sun.nio.ch.ServerSocketChannelImpl.accept0(Native Method)
        at sun.nio.ch.ServerSocketChannelImpl.accept(ServerSocketChannelImpl.java:226)
        at org.eclipse.jetty.server.nio.SelectChannelConnector.accept(SelectChannelConnector.java:104)
        at org.eclipse.jetty.server.AbstractConnector$Acceptor.run(AbstractConnector.java:933)
        at org.eclipse.jetty.util.thread.QueuedThreadPool.runJob(QueuedThreadPool.java:599)
        at org.eclipse.jetty.util.thread.QueuedThreadPool$3.run(QueuedThreadPool.java:534)
        at java.lang.Thread.run(Thread.java:722)
   4) Thread[id=27, name=qtp1191745850-27 Acceptor3 SelectChannelConnector@0.0.0.0:27291, state=BLOCKED, group=TGRP-TestRemoteStreaming]
        at sun.nio.ch.ServerSocketChannelImpl.accept(ServerSocketChannelImpl.java:210)
        at org.eclipse.jetty.server.nio.SelectChannelConnector.accept(SelectChannelConnector.java:104)
        at org.eclipse.jetty.server.AbstractConnector$Acceptor.run(AbstractConnector.java:933)
        at org.eclipse.jetty.util.thread.QueuedThreadPool.runJob(QueuedThreadPool.java:599)
        at org.eclipse.jetty.util.thread.QueuedThreadPool$3.run(QueuedThreadPool.java:534)
        at java.lang.Thread.run(Thread.java:722)
	at __randomizedtesting.SeedInfo.seed([474DCF77A80DB23F]:0)


FAILED:  junit.framework.TestSuite.org.apache.solr.request.TestRemoteStreaming

Error Message:
There are still zombie threads that couldn't be terminated:    1) Thread[id=26, name=qtp1191745850-26 Acceptor2 SelectChannelConnector@0.0.0.0:27291, state=BLOCKED, group=TGRP-TestRemoteStreaming]         at sun.nio.ch.ServerSocketChannelImpl.accept(ServerSocketChannelImpl.java:210)         at org.eclipse.jetty.server.nio.SelectChannelConnector.accept(SelectChannelConnector.java:104)         at org.eclipse.jetty.server.AbstractConnector$Acceptor.run(AbstractConnector.java:933)         at org.eclipse.jetty.util.thread.QueuedThreadPool.runJob(QueuedThreadPool.java:599)         at org.eclipse.jetty.util.thread.QueuedThreadPool$3.run(QueuedThreadPool.java:534)         at java.lang.Thread.run(Thread.java:722)    2) Thread[id=24, name=qtp1191745850-24 Acceptor0 SelectChannelConnector@0.0.0.0:27291, state=BLOCKED, group=TGRP-TestRemoteStreaming]         at sun.nio.ch.ServerSocketChannelImpl.accept(ServerSocketChannelImpl.java:210)         at org.eclipse.jetty.server.nio.SelectChannelConnector.accept(SelectChannelConnector.java:104)         at org.eclipse.jetty.server.AbstractConnector$Acceptor.run(AbstractConnector.java:933)         at org.eclipse.jetty.util.thread.QueuedThreadPool.runJob(QueuedThreadPool.java:599)         at org.eclipse.jetty.util.thread.QueuedThreadPool$3.run(QueuedThreadPool.java:534)         at java.lang.Thread.run(Thread.java:722)    3) Thread[id=25, name=qtp1191745850-25 Acceptor1 SelectChannelConnector@0.0.0.0:27291, state=RUNNABLE, group=TGRP-TestRemoteStreaming]         at sun.nio.ch.ServerSocketChannelImpl.accept0(Native Method)         at sun.nio.ch.ServerSocketChannelImpl.accept(ServerSocketChannelImpl.java:226)         at org.eclipse.jetty.server.nio.SelectChannelConnector.accept(SelectChannelConnector.java:104)         at org.eclipse.jetty.server.AbstractConnector$Acceptor.run(AbstractConnector.java:933)         at org.eclipse.jetty.util.thread.QueuedThreadPool.runJob(QueuedThreadPool.java:599)         at org.eclipse.jetty.util.thread.QueuedThreadPool$3.run(QueuedThreadPool.java:534)         at java.lang.Thread.run(Thread.java:722)    4) Thread[id=27, name=qtp1191745850-27 Acceptor3 SelectChannelConnector@0.0.0.0:27291, state=BLOCKED, group=TGRP-TestRemoteStreaming]         at sun.nio.ch.ServerSocketChannelImpl.accept(ServerSocketChannelImpl.java:210)         at org.eclipse.jetty.server.nio.SelectChannelConnector.accept(SelectChannelConnector.java:104)         at org.eclipse.jetty.server.AbstractConnector$Acceptor.run(AbstractConnector.java:933)         at org.eclipse.jetty.util.thread.QueuedThreadPool.runJob(QueuedThreadPool.java:599)         at org.eclipse.jetty.util.thread.QueuedThreadPool$3.run(QueuedThreadPool.java:534)         at java.lang.Thread.run(Thread.java:722)

Stack Trace:
com.carrotsearch.randomizedtesting.ThreadLeakError: There are still zombie threads that couldn't be terminated:
   1) Thread[id=26, name=qtp1191745850-26 Acceptor2 SelectChannelConnector@0.0.0.0:27291, state=BLOCKED, group=TGRP-TestRemoteStreaming]
        at sun.nio.ch.ServerSocketChannelImpl.accept(ServerSocketChannelImpl.java:210)
        at org.eclipse.jetty.server.nio.SelectChannelConnector.accept(SelectChannelConnector.java:104)
        at org.eclipse.jetty.server.AbstractConnector$Acceptor.run(AbstractConnector.java:933)
        at org.eclipse.jetty.util.thread.QueuedThreadPool.runJob(QueuedThreadPool.java:599)
        at org.eclipse.jetty.util.thread.QueuedThreadPool$3.run(QueuedThreadPool.java:534)
        at java.lang.Thread.run(Thread.java:722)
   2) Thread[id=24, name=qtp1191745850-24 Acceptor0 SelectChannelConnector@0.0.0.0:27291, state=BLOCKED, group=TGRP-TestRemoteStreaming]
        at sun.nio.ch.ServerSocketChannelImpl.accept(ServerSocketChannelImpl.java:210)
        at org.eclipse.jetty.server.nio.SelectChannelConnector.accept(SelectChannelConnector.java:104)
        at org.eclipse.jetty.server.AbstractConnector$Acceptor.run(AbstractConnector.java:933)
        at org.eclipse.jetty.util.thread.QueuedThreadPool.runJob(QueuedThreadPool.java:599)
        at org.eclipse.jetty.util.thread.QueuedThreadPool$3.run(QueuedThreadPool.java:534)
        at java.lang.Thread.run(Thread.java:722)
   3) Thread[id=25, name=qtp1191745850-25 Acceptor1 SelectChannelConnector@0.0.0.0:27291, state=RUNNABLE, group=TGRP-TestRemoteStreaming]
        at sun.nio.ch.ServerSocketChannelImpl.accept0(Native Method)
        at sun.nio.ch.ServerSocketChannelImpl.accept(ServerSocketChannelImpl.java:226)
        at org.eclipse.jetty.server.nio.SelectChannelConnector.accept(SelectChannelConnector.java:104)
        at org.eclipse.jetty.server.AbstractConnector$Acceptor.run(AbstractConnector.java:933)
        at org.eclipse.jetty.util.thread.QueuedThreadPool.runJob(QueuedThreadPool.java:599)
        at org.eclipse.jetty.util.thread.QueuedThreadPool$3.run(QueuedThreadPool.java:534)
        at java.lang.Thread.run(Thread.java:722)
   4) Thread[id=27, name=qtp1191745850-27 Acceptor3 SelectChannelConnector@0.0.0.0:27291, state=BLOCKED, group=TGRP-TestRemoteStreaming]
        at sun.nio.ch.ServerSocketChannelImpl.accept(ServerSocketChannelImpl.java:210)
        at org.eclipse.jetty.server.nio.SelectChannelConnector.accept(SelectChannelConnector.java:104)
        at org.eclipse.jetty.server.AbstractConnector$Acceptor.run(AbstractConnector.java:933)
        at org.eclipse.jetty.util.thread.QueuedThreadPool.runJob(QueuedThreadPool.java:599)
        at org.eclipse.jetty.util.thread.QueuedThreadPool$3.run(QueuedThreadPool.java:534)
        at java.lang.Thread.run(Thread.java:722)
	at __randomizedtesting.SeedInfo.seed([474DCF77A80DB23F]:0)


FAILED:  junit.framework.TestSuite.org.apache.solr.servlet.NoCacheHeaderTest

Error Message:
4 threads leaked from SUITE scope at org.apache.solr.servlet.NoCacheHeaderTest:     1) Thread[id=274, name=qtp2142072753-274 Acceptor1 SelectChannelConnector@0.0.0.0:58447, state=BLOCKED, group=TGRP-NoCacheHeaderTest]         at sun.nio.ch.ServerSocketChannelImpl.accept(ServerSocketChannelImpl.java:210)         at org.eclipse.jetty.server.nio.SelectChannelConnector.accept(SelectChannelConnector.java:104)         at org.eclipse.jetty.server.AbstractConnector$Acceptor.run(AbstractConnector.java:933)         at org.eclipse.jetty.util.thread.QueuedThreadPool.runJob(QueuedThreadPool.java:599)         at org.eclipse.jetty.util.thread.QueuedThreadPool$3.run(QueuedThreadPool.java:534)         at java.lang.Thread.run(Thread.java:722)    2) Thread[id=275, name=qtp2142072753-275 Acceptor2 SelectChannelConnector@0.0.0.0:58447, state=BLOCKED, group=TGRP-NoCacheHeaderTest]         at sun.nio.ch.ServerSocketChannelImpl.accept(ServerSocketChannelImpl.java:210)         at org.eclipse.jetty.server.nio.SelectChannelConnector.accept(SelectChannelConnector.java:104)         at org.eclipse.jetty.server.AbstractConnector$Acceptor.run(AbstractConnector.java:933)         at org.eclipse.jetty.util.thread.QueuedThreadPool.runJob(QueuedThreadPool.java:599)         at org.eclipse.jetty.util.thread.QueuedThreadPool$3.run(QueuedThreadPool.java:534)         at java.lang.Thread.run(Thread.java:722)    3) Thread[id=273, name=qtp2142072753-273 Acceptor0 SelectChannelConnector@0.0.0.0:58447, state=BLOCKED, group=TGRP-NoCacheHeaderTest]         at sun.nio.ch.ServerSocketChannelImpl.accept(ServerSocketChannelImpl.java:210)         at org.eclipse.jetty.server.nio.SelectChannelConnector.accept(SelectChannelConnector.java:104)         at org.eclipse.jetty.server.AbstractConnector$Acceptor.run(AbstractConnector.java:933)         at org.eclipse.jetty.util.thread.QueuedThreadPool.runJob(QueuedThreadPool.java:599)         at org.eclipse.jetty.util.thread.QueuedThreadPool$3.run(QueuedThreadPool.java:534)         at java.lang.Thread.run(Thread.java:722)    4) Thread[id=276, name=qtp2142072753-276 Acceptor3 SelectChannelConnector@0.0.0.0:58447, state=RUNNABLE, group=TGRP-NoCacheHeaderTest]         at sun.nio.ch.ServerSocketChannelImpl.accept0(Native Method)         at sun.nio.ch.ServerSocketChannelImpl.accept(ServerSocketChannelImpl.java:226)         at org.eclipse.jetty.server.nio.SelectChannelConnector.accept(SelectChannelConnector.java:104)         at org.eclipse.jetty.server.AbstractConnector$Acceptor.run(AbstractConnector.java:933)         at org.eclipse.jetty.util.thread.QueuedThreadPool.runJob(QueuedThreadPool.java:599)         at org.eclipse.jetty.util.thread.QueuedThreadPool$3.run(QueuedThreadPool.java:534)         at java.lang.Thread.run(Thread.java:722)

Stack Trace:
com.carrotsearch.randomizedtesting.ThreadLeakError: 4 threads leaked from SUITE scope at org.apache.solr.servlet.NoCacheHeaderTest: 
   1) Thread[id=274, name=qtp2142072753-274 Acceptor1 SelectChannelConnector@0.0.0.0:58447, state=BLOCKED, group=TGRP-NoCacheHeaderTest]
        at sun.nio.ch.ServerSocketChannelImpl.accept(ServerSocketChannelImpl.java:210)
        at org.eclipse.jetty.server.nio.SelectChannelConnector.accept(SelectChannelConnector.java:104)
        at org.eclipse.jetty.server.AbstractConnector$Acceptor.run(AbstractConnector.java:933)
        at org.eclipse.jetty.util.thread.QueuedThreadPool.runJob(QueuedThreadPool.java:599)
        at org.eclipse.jetty.util.thread.QueuedThreadPool$3.run(QueuedThreadPool.java:534)
        at java.lang.Thread.run(Thread.java:722)
   2) Thread[id=275, name=qtp2142072753-275 Acceptor2 SelectChannelConnector@0.0.0.0:58447, state=BLOCKED, group=TGRP-NoCacheHeaderTest]
        at sun.nio.ch.ServerSocketChannelImpl.accept(ServerSocketChannelImpl.java:210)
        at org.eclipse.jetty.server.nio.SelectChannelConnector.accept(SelectChannelConnector.java:104)
        at org.eclipse.jetty.server.AbstractConnector$Acceptor.run(AbstractConnector.java:933)
        at org.eclipse.jetty.util.thread.QueuedThreadPool.runJob(QueuedThreadPool.java:599)
        at org.eclipse.jetty.util.thread.QueuedThreadPool$3.run(QueuedThreadPool.java:534)
        at java.lang.Thread.run(Thread.java:722)
   3) Thread[id=273, name=qtp2142072753-273 Acceptor0 SelectChannelConnector@0.0.0.0:58447, state=BLOCKED, group=TGRP-NoCacheHeaderTest]
        at sun.nio.ch.ServerSocketChannelImpl.accept(ServerSocketChannelImpl.java:210)
        at org.eclipse.jetty.server.nio.SelectChannelConnector.accept(SelectChannelConnector.java:104)
        at org.eclipse.jetty.server.AbstractConnector$Acceptor.run(AbstractConnector.java:933)
        at org.eclipse.jetty.util.thread.QueuedThreadPool.runJob(QueuedThreadPool.java:599)
        at org.eclipse.jetty.util.thread.QueuedThreadPool$3.run(QueuedThreadPool.java:534)
        at java.lang.Thread.run(Thread.java:722)
   4) Thread[id=276, name=qtp2142072753-276 Acceptor3 SelectChannelConnector@0.0.0.0:58447, state=RUNNABLE, group=TGRP-NoCacheHeaderTest]
        at sun.nio.ch.ServerSocketChannelImpl.accept0(Native Method)
        at sun.nio.ch.ServerSocketChannelImpl.accept(ServerSocketChannelImpl.java:226)
        at org.eclipse.jetty.server.nio.SelectChannelConnector.accept(SelectChannelConnector.java:104)
        at org.eclipse.jetty.server.AbstractConnector$Acceptor.run(AbstractConnector.java:933)
        at org.eclipse.jetty.util.thread.QueuedThreadPool.runJob(QueuedThreadPool.java:599)
        at org.eclipse.jetty.util.thread.QueuedThreadPool$3.run(QueuedThreadPool.java:534)
        at java.lang.Thread.run(Thread.java:722)
	at __randomizedtesting.SeedInfo.seed([474DCF77A80DB23F]:0)


FAILED:  junit.framework.TestSuite.org.apache.solr.servlet.NoCacheHeaderTest

Error Message:
There are still zombie threads that couldn't be terminated:    1) Thread[id=274, name=qtp2142072753-274 Acceptor1 SelectChannelConnector@0.0.0.0:58447, state=BLOCKED, group=TGRP-NoCacheHeaderTest]         at sun.nio.ch.ServerSocketChannelImpl.accept(ServerSocketChannelImpl.java:210)         at org.eclipse.jetty.server.nio.SelectChannelConnector.accept(SelectChannelConnector.java:104)         at org.eclipse.jetty.server.AbstractConnector$Acceptor.run(AbstractConnector.java:933)         at org.eclipse.jetty.util.thread.QueuedThreadPool.runJob(QueuedThreadPool.java:599)         at org.eclipse.jetty.util.thread.QueuedThreadPool$3.run(QueuedThreadPool.java:534)         at java.lang.Thread.run(Thread.java:722)    2) Thread[id=275, name=qtp2142072753-275 Acceptor2 SelectChannelConnector@0.0.0.0:58447, state=BLOCKED, group=TGRP-NoCacheHeaderTest]         at sun.nio.ch.ServerSocketChannelImpl.accept(ServerSocketChannelImpl.java:210)         at org.eclipse.jetty.server.nio.SelectChannelConnector.accept(SelectChannelConnector.java:104)         at org.eclipse.jetty.server.AbstractConnector$Acceptor.run(AbstractConnector.java:933)         at org.eclipse.jetty.util.thread.QueuedThreadPool.runJob(QueuedThreadPool.java:599)         at org.eclipse.jetty.util.thread.QueuedThreadPool$3.run(QueuedThreadPool.java:534)         at java.lang.Thread.run(Thread.java:722)    3) Thread[id=273, name=qtp2142072753-273 Acceptor0 SelectChannelConnector@0.0.0.0:58447, state=BLOCKED, group=TGRP-NoCacheHeaderTest]         at sun.nio.ch.ServerSocketChannelImpl.accept(ServerSocketChannelImpl.java:210)         at org.eclipse.jetty.server.nio.SelectChannelConnector.accept(SelectChannelConnector.java:104)         at org.eclipse.jetty.server.AbstractConnector$Acceptor.run(AbstractConnector.java:933)         at org.eclipse.jetty.util.thread.QueuedThreadPool.runJob(QueuedThreadPool.java:599)         at org.eclipse.jetty.util.thread.QueuedThreadPool$3.run(QueuedThreadPool.java:534)         at java.lang.Thread.run(Thread.java:722)    4) Thread[id=276, name=qtp2142072753-276 Acceptor3 SelectChannelConnector@0.0.0.0:58447, state=RUNNABLE, group=TGRP-NoCacheHeaderTest]         at sun.nio.ch.ServerSocketChannelImpl.accept0(Native Method)         at sun.nio.ch.ServerSocketChannelImpl.accept(ServerSocketChannelImpl.java:226)         at org.eclipse.jetty.server.nio.SelectChannelConnector.accept(SelectChannelConnector.java:104)         at org.eclipse.jetty.server.AbstractConnector$Acceptor.run(AbstractConnector.java:933)         at org.eclipse.jetty.util.thread.QueuedThreadPool.runJob(QueuedThreadPool.java:599)         at org.eclipse.jetty.util.thread.QueuedThreadPool$3.run(QueuedThreadPool.java:534)         at java.lang.Thread.run(Thread.java:722)

Stack Trace:
com.carrotsearch.randomizedtesting.ThreadLeakError: There are still zombie threads that couldn't be terminated:
   1) Thread[id=274, name=qtp2142072753-274 Acceptor1 SelectChannelConnector@0.0.0.0:58447, state=BLOCKED, group=TGRP-NoCacheHeaderTest]
        at sun.nio.ch.ServerSocketChannelImpl.accept(ServerSocketChannelImpl.java:210)
        at org.eclipse.jetty.server.nio.SelectChannelConnector.accept(SelectChannelConnector.java:104)
        at org.eclipse.jetty.server.AbstractConnector$Acceptor.run(AbstractConnector.java:933)
        at org.eclipse.jetty.util.thread.QueuedThreadPool.runJob(QueuedThreadPool.java:599)
        at org.eclipse.jetty.util.thread.QueuedThreadPool$3.run(QueuedThreadPool.java:534)
        at java.lang.Thread.run(Thread.java:722)
   2) Thread[id=275, name=qtp2142072753-275 Acceptor2 SelectChannelConnector@0.0.0.0:58447, state=BLOCKED, group=TGRP-NoCacheHeaderTest]
        at sun.nio.ch.ServerSocketChannelImpl.accept(ServerSocketChannelImpl.java:210)
        at org.eclipse.jetty.server.nio.SelectChannelConnector.accept(SelectChannelConnector.java:104)
        at org.eclipse.jetty.server.AbstractConnector$Acceptor.run(AbstractConnector.java:933)
        at org.eclipse.jetty.util.thread.QueuedThreadPool.runJob(QueuedThreadPool.java:599)
        at org.eclipse.jetty.util.thread.QueuedThreadPool$3.run(QueuedThreadPool.java:534)
        at java.lang.Thread.run(Thread.java:722)
   3) Thread[id=273, name=qtp2142072753-273 Acceptor0 SelectChannelConnector@0.0.0.0:58447, state=BLOCKED, group=TGRP-NoCacheHeaderTest]
        at sun.nio.ch.ServerSocketChannelImpl.accept(ServerSocketChannelImpl.java:210)
        at org.eclipse.jetty.server.nio.SelectChannelConnector.accept(SelectChannelConnector.java:104)
        at org.eclipse.jetty.server.AbstractConnector$Acceptor.run(AbstractConnector.java:933)
        at org.eclipse.jetty.util.thread.QueuedThreadPool.runJob(QueuedThreadPool.java:599)
        at org.eclipse.jetty.util.thread.QueuedThreadPool$3.run(QueuedThreadPool.java:534)
        at java.lang.Thread.run(Thread.java:722)
   4) Thread[id=276, name=qtp2142072753-276 Acceptor3 SelectChannelConnector@0.0.0.0:58447, state=RUNNABLE, group=TGRP-NoCacheHeaderTest]
        at sun.nio.ch.ServerSocketChannelImpl.accept0(Native Method)
        at sun.nio.ch.ServerSocketChannelImpl.accept(ServerSocketChannelImpl.java:226)
        at org.eclipse.jetty.server.nio.SelectChannelConnector.accept(SelectChannelConnector.java:104)
        at org.eclipse.jetty.server.AbstractConnector$Acceptor.run(AbstractConnector.java:933)
        at org.eclipse.jetty.util.thread.QueuedThreadPool.runJob(QueuedThreadPool.java:599)
        at org.eclipse.jetty.util.thread.QueuedThreadPool$3.run(QueuedThreadPool.java:534)
        at java.lang.Thread.run(Thread.java:722)
	at __randomizedtesting.SeedInfo.seed([474DCF77A80DB23F]:0)




Build Log:
[...truncated 8399 lines...]
[junit4:junit4] Suite: org.apache.solr.request.TestRemoteStreaming
[junit4:junit4]   2> 0 T17 oas.SolrTestCaseJ4.initCore ####initCore
[junit4:junit4]   2> Creating dataDir: /usr/home/hudson/hudson-slave/workspace/Lucene-Solr-Tests-trunk-java7/solr/build/solr-core/test/J1/./solrtest-TestRemoteStreaming-1351256762559
[junit4:junit4]   2> 1 T17 oas.SolrTestCaseJ4.initCore ####initCore end
[junit4:junit4]   2> 492 T17 oejs.Server.doStart jetty-8.1.2.v20120308
[junit4:junit4]   2> 1097 T17 oejs.AbstractConnector.doStart Started SelectChannelConnector@0.0.0.0:27291
[junit4:junit4]   2> 1149 T17 oasc.SolrResourceLoader.locateSolrHome JNDI not configured for solr (NoInitialContextEx)
[junit4:junit4]   2> 1150 T17 oasc.SolrResourceLoader.locateSolrHome using system property solr.solr.home: solr/
[junit4:junit4]   2> 1151 T17 oasc.SolrResourceLoader.<init> new SolrResourceLoader for deduced Solr Home: 'solr/'
[junit4:junit4]   2> 1204 T17 oass.SolrDispatchFilter.init SolrDispatchFilter.init()
[junit4:junit4]   2> 1205 T17 oasc.SolrResourceLoader.locateSolrHome JNDI not configured for solr (NoInitialContextEx)
[junit4:junit4]   2> 1205 T17 oasc.SolrResourceLoader.locateSolrHome using system property solr.solr.home: solr/
[junit4:junit4]   2> 1206 T17 oasc.CoreContainer$Initializer.initialize looking for solr.xml: /usr/home/hudson/hudson-slave/workspace/Lucene-Solr-Tests-trunk-java7/solr/build/solr-core/test/J1/solr/solr.xml
[junit4:junit4]   2> 1207 T17 oasc.CoreContainer.<init> New CoreContainer 622527324
[junit4:junit4]   2> 1207 T17 oasc.CoreContainer$Initializer.initialize no solr.xml file found - using default
[junit4:junit4]   2> 1208 T17 oasc.CoreContainer.load Loading CoreContainer using Solr Home: 'solr/'
[junit4:junit4]   2> 1209 T17 oasc.SolrResourceLoader.<init> new SolrResourceLoader for directory: 'solr/'
[junit4:junit4]   2> 1258 T17 oasc.CoreContainer.load Registering Log Listener
[junit4:junit4]   2> 1319 T17 oasc.CoreContainer.create Creating SolrCore 'collection1' using instanceDir: solr/collection1
[junit4:junit4]   2> 1321 T17 oasc.SolrResourceLoader.<init> new SolrResourceLoader for directory: 'solr/collection1/'
[junit4:junit4]   2> 1448 T17 oasc.SolrConfig.<init> Using Lucene MatchVersion: LUCENE_50
[junit4:junit4]   2> 1540 T17 oasc.SolrConfig.<init> Loaded SolrConfig: solrconfig.xml
[junit4:junit4]   2> 1546 T17 oass.IndexSchema.readSchema Reading Solr Schema
[junit4:junit4]   2> 1600 T17 oass.IndexSchema.readSchema Schema name=test
[junit4:junit4]   2> 2665 T17 oass.OpenExchangeRatesOrgProvider.init Initialized with rates=open-exchange-rates.json, refreshInterval=1440.
[junit4:junit4]   2> 2681 T17 oass.IndexSchema.readSchema default search field in schema is text
[junit4:junit4]   2> 2685 T17 oass.IndexSchema.readSchema unique key field: id
[junit4:junit4]   2> 2730 T17 oass.FileExchangeRateProvider.reload Reloading exchange rates from file currency.xml
[junit4:junit4]   2> 2746 T17 oass.FileExchangeRateProvider.reload Reloading exchange rates from file currency.xml
[junit4:junit4]   2> 2751 T17 oass.OpenExchangeRatesOrgProvider.reload Reloading exchange rates from open-exchange-rates.json
[junit4:junit4]   2> 2760 T17 oass.OpenExchangeRatesOrgProvider.reload Reloading exchange rates from open-exchange-rates.json
[junit4:junit4]   2> 2763 T17 oasc.SolrCore.<init> [collection1] Opening new SolrCore at solr/collection1/, dataDir=/usr/home/hudson/hudson-slave/workspace/Lucene-Solr-Tests-trunk-java7/solr/build/solr-core/test/J1/solrtest-TestRemoteStreaming-1351256762559/
[junit4:junit4]   2> 2764 T17 oasc.JmxMonitoredMap.<init> JMX monitoring is enabled. Adding Solr mbeans to JMX Server: com.sun.jmx.mbeanserver.JmxMBeanServer@4178e9db
[junit4:junit4]   2> 2766 T17 oasc.SolrCore.getNewIndexDir New index directory detected: old=null new=/usr/home/hudson/hudson-slave/workspace/Lucene-Solr-Tests-trunk-java7/solr/build/solr-core/test/J1/solrtest-TestRemoteStreaming-1351256762559/index/
[junit4:junit4]   2> 2767 T17 oasc.SolrCore.initIndex WARNING [collection1] Solr index directory '/usr/home/hudson/hudson-slave/workspace/Lucene-Solr-Tests-trunk-java7/solr/build/solr-core/test/J1/solrtest-TestRemoteStreaming-1351256762559/index' doesn't exist. Creating new index...
[junit4:junit4]   2> 2772 T17 oasc.CachingDirectoryFactory.get return new directory for /usr/home/hudson/hudson-slave/workspace/Lucene-Solr-Tests-trunk-java7/solr/build/solr-core/test/J1/solrtest-TestRemoteStreaming-1351256762559/index forceNew:false
[junit4:junit4]   2> 2774 T17 oasc.SolrDeletionPolicy.onCommit SolrDeletionPolicy.onCommit: commits:num=1
[junit4:junit4]   2> 		commit{dir=MockDirWrapper(org.apache.lucene.store.RAMDirectory@7a8f7f18 lockFactory=org.apache.lucene.store.NativeFSLockFactory@321125d3),segFN=segments_1,generation=1,filenames=[segments_1]
[junit4:junit4]   2> 2775 T17 oasc.SolrDeletionPolicy.updateCommits newest commit = 1
[junit4:junit4]   2> 2775 T17 oasc.SolrCore.initWriters created xml: solr.XMLResponseWriter
[junit4:junit4]   2> 2778 T17 oasup.UpdateRequestProcessorChain.init inserting DistributedUpdateProcessorFactory into updateRequestProcessorChain "dedupe"
[junit4:junit4]   2> 2779 T17 oasup.UpdateRequestProcessorChain.init inserting DistributedUpdateProcessorFactory into updateRequestProcessorChain "dedupe-allfields"
[junit4:junit4]   2> 2779 T17 oasup.UpdateRequestProcessorChain.init inserting DistributedUpdateProcessorFactory into updateRequestProcessorChain "stored_sig"
[junit4:junit4]   2> 2780 T17 oasup.UpdateRequestProcessorChain.init inserting DistributedUpdateProcessorFactory into updateRequestProcessorChain "uniq-fields"
[junit4:junit4]   2> 2781 T17 oasup.UpdateRequestProcessorChain.init inserting DistributedUpdateProcessorFactory into updateRequestProcessorChain "distrib-dup-test-chain-implicit"
[junit4:junit4]   2> 2781 T17 oasc.RequestHandlers.initHandlersFromConfig adding lazy requestHandler: solr.ReplicationHandler
[junit4:junit4]   2> 2782 T17 oasc.RequestHandlers.initHandlersFromConfig created /replication: solr.ReplicationHandler
[junit4:junit4]   2> 2783 T17 oasc.RequestHandlers.initHandlersFromConfig created standard: solr.StandardRequestHandler
[junit4:junit4]   2> 2783 T17 oasc.RequestHandlers.initHandlersFromConfig created /get: solr.RealTimeGetHandler
[junit4:junit4]   2> 2784 T17 oasc.RequestHandlers.initHandlersFromConfig created dismax: solr.SearchHandler
[junit4:junit4]   2> 2785 T17 oasc.RequestHandlers.initHandlersFromConfig created mock: org.apache.solr.core.MockQuerySenderListenerReqHandler
[junit4:junit4]   2> 2785 T17 oasc.RequestHandlers.initHandlersFromConfig created /admin/: org.apache.solr.handler.admin.AdminHandlers
[junit4:junit4]   2> 2786 T17 oasc.RequestHandlers.initHandlersFromConfig created defaults: solr.StandardRequestHandler
[junit4:junit4]   2> 2787 T17 oasc.RequestHandlers.initHandlersFromConfig adding lazy requestHandler: solr.StandardRequestHandler
[junit4:junit4]   2> 2787 T17 oasc.RequestHandlers.initHandlersFromConfig created lazy: solr.StandardRequestHandler
[junit4:junit4]   2> 2788 T17 oasc.RequestHandlers.initHandlersFromConfig created /update: solr.UpdateRequestHandler
[junit4:junit4]   2> 2789 T17 oasc.RequestHandlers.initHandlersFromConfig created /terms: org.apache.solr.handler.component.SearchHandler
[junit4:junit4]   2> 2789 T17 oasc.RequestHandlers.initHandlersFromConfig created spellCheckCompRH: org.apache.solr.handler.component.SearchHandler
[junit4:junit4]   2> 2790 T17 oasc.RequestHandlers.initHandlersFromConfig created spellCheckCompRH_Direct: org.apache.solr.handler.component.SearchHandler
[junit4:junit4]   2> 2791 T17 oasc.RequestHandlers.initHandlersFromConfig created spellCheckWithWordbreak: org.apache.solr.handler.component.SearchHandler
[junit4:junit4]   2> 2791 T17 oasc.RequestHandlers.initHandlersFromConfig created spellCheckWithWordbreak_Direct: org.apache.solr.handler.component.SearchHandler
[junit4:junit4]   2> 2792 T17 oasc.RequestHandlers.initHandlersFromConfig created spellCheckCompRH1: org.apache.solr.handler.component.SearchHandler
[junit4:junit4]   2> 2793 T17 oasc.RequestHandlers.initHandlersFromConfig created tvrh: org.apache.solr.handler.component.SearchHandler
[junit4:junit4]   2> 2793 T17 oasc.RequestHandlers.initHandlersFromConfig created /mlt: solr.MoreLikeThisHandler
[junit4:junit4]   2> 2794 T17 oasc.RequestHandlers.initHandlersFromConfig created /debug/dump: solr.DumpRequestHandler
[junit4:junit4]   2> 2805 T17 oashl.XMLLoader.init xsltCacheLifetimeSeconds=60
[junit4:junit4]   2> 2809 T17 oasc.SolrCore.initDeprecatedSupport WARNING solrconfig.xml uses deprecated <admin/gettableFiles>, Please update your config to use the ShowFileRequestHandler.
[junit4:junit4]   2> 2810 T17 oasc.SolrCore.initDeprecatedSupport WARNING adding ShowFileRequestHandler with hidden files: []
[junit4:junit4]   2> 2814 T17 oass.SolrIndexSearcher.<init> Opening Searcher@2299c6c7 main
[junit4:junit4]   2> 2814 T17 oass.SolrIndexSearcher.getIndexDir WARNING WARNING: Directory impl does not support setting indexDir: org.apache.lucene.store.MockDirectoryWrapper
[junit4:junit4]   2> 2815 T17 oasu.CommitTracker.<init> Hard AutoCommit: disabled
[junit4:junit4]   2> 2815 T17 oasu.CommitTracker.<init> Soft AutoCommit: disabled
[junit4:junit4]   2> 2816 T17 oashc.SpellCheckComponent.inform Initializing spell checkers
[junit4:junit4]   2> 2824 T17 oass.DirectSolrSpellChecker.init init: {name=direct,classname=DirectSolrSpellChecker,field=lowerfilt,minQueryLength=3}
[junit4:junit4]   2> 2873 T17 oashc.HttpShardHandlerFactory.getParameter Setting socketTimeout to: 0
[junit4:junit4]   2> 2874 T17 oashc.HttpShardHandlerFactory.getParameter Setting urlScheme to: http://
[junit4:junit4]   2> 2874 T17 oashc.HttpShardHandlerFactory.getParameter Setting connTimeout to: 0
[junit4:junit4]   2> 2875 T17 oashc.HttpShardHandlerFactory.getParameter Setting maxConnectionsPerHost to: 20
[junit4:junit4]   2> 2875 T17 oashc.HttpShardHandlerFactory.getParameter Setting corePoolSize to: 0
[junit4:junit4]   2> 2876 T17 oashc.HttpShardHandlerFactory.getParameter Setting maximumPoolSize to: 2147483647
[junit4:junit4]   2> 2876 T17 oashc.HttpShardHandlerFactory.getParameter Setting maxThreadIdleTime to: 5
[junit4:junit4]   2> 2876 T17 oashc.HttpShardHandlerFactory.getParameter Setting sizeOfQueue to: -1
[junit4:junit4]   2> 2877 T17 oashc.HttpShardHandlerFactory.getParameter Setting fairnessPolicy to: false
[junit4:junit4]   2> 2877 T17 oascsi.HttpClientUtil.createClient Creating new http client, config:maxConnectionsPerHost=20&maxConnections=10000&socketTimeout=0&connTimeout=0&retry=false
[junit4:junit4]   2> 2895 T32 oasc.SolrCore.registerSearcher [collection1] Registered new searcher Searcher@2299c6c7 main{StandardDirectoryReader(segments_1:1)}
[junit4:junit4]   2> 2902 T17 oasc.CoreContainer.register registering core: collection1
[junit4:junit4]   2> 2902 T17 oass.SolrDispatchFilter.init user.dir=/usr/home/hudson/hudson-slave/workspace/Lucene-Solr-Tests-trunk-java7/solr/build/solr-core/test/J1
[junit4:junit4]   2> 2903 T17 oass.SolrDispatchFilter.init SolrDispatchFilter.init() done
[junit4:junit4]   2> 2903 T17 oas.SolrJettyTestBase.createJetty Jetty Assigned Port#27291
[junit4:junit4]   2> 2911 T17 oas.SolrTestCaseJ4.setUp ###Starting testQtUpdateFails
[junit4:junit4]   2> 2960 T17 oascsi.HttpClientUtil.createClient Creating new http client, config:maxConnections=128&maxConnectionsPerHost=32&followRedirects=false
[junit4:junit4]   2> ASYNC  NEW_CORE C3 name=collection1 org.apache.solr.core.SolrCore@243d886
[junit4:junit4]   2> 4164 T29 C3 oasc.SolrDeletionPolicy.onInit SolrDeletionPolicy.onInit: commits:num=1
[junit4:junit4]   2> 		commit{dir=MockDirWrapper(org.apache.lucene.store.RAMDirectory@7a8f7f18 lockFactory=org.apache.lucene.store.NativeFSLockFactory@321125d3),segFN=segments_1,generation=1,filenames=[segments_1]
[junit4:junit4]   2> 4165 T29 C3 oasc.SolrDeletionPolicy.updateCommits newest commit = 1
[junit4:junit4]   2> 4190 T29 C3 UPDATE [collection1] webapp=/solr path=/update params={wt=javabin&version=2} {add=[1234]} 0 77
[junit4:junit4]   2> 4322 T30 C3 oasu.DirectUpdateHandler2.commit start commit{flags=0,_version_=0,optimize=false,openSearcher=true,waitSearcher=true,expungeDeletes=false,softCommit=false}
[junit4:junit4]   2> 4531 T30 C3 oasc.SolrDeletionPolicy.onCommit SolrDeletionPolicy.onCommit: commits:num=2
[junit4:junit4]   2> 		commit{dir=MockDirWrapper(org.apache.lucene.store.RAMDirectory@7a8f7f18 lockFactory=org.apache.lucene.store.NativeFSLockFactory@321125d3),segFN=segments_1,generation=1,filenames=[segments_1]
[junit4:junit4]   2> 		commit{dir=MockDirWrapper(org.apache.lucene.store.RAMDirectory@7a8f7f18 lockFactory=org.apache.lucene.store.NativeFSLockFactory@321125d3),segFN=segments_2,generation=2,filenames=[_0_Pulsing41_0.doc, _0_Pulsing41_0.pos, _0.fnm, _0_Pulsing41_0.tim, _0_Pulsing41_0.tip, _0_Memory_0.ram, _0_nrm.cfe, segments_2, _0.fdx, _0_nrm.cfs, _0.si, _0_Memory_1.ram, _0.fdt]
[junit4:junit4]   2> 4532 T30 C3 oasc.SolrDeletionPolicy.updateCommits newest commit = 2
[junit4:junit4]   2> 4577 T30 C3 oass.SolrIndexSearcher.<init> Opening Searcher@6bee43a2 main
[junit4:junit4]   2> 4577 T30 C3 oass.SolrIndexSearcher.getIndexDir WARNING WARNING: Directory impl does not support setting indexDir: org.apache.lucene.store.MockDirectoryWrapper
[junit4:junit4]   2> 4579 T30 C3 oasu.DirectUpdateHandler2.commit end_commit_flush
[junit4:junit4]   2> 4581 T32 oasc.SolrCore.registerSearcher [collection1] Registered new searcher Searcher@6bee43a2 main{StandardDirectoryReader(segments_2:3 _0(5.0):C1)}
[junit4:junit4]   2> 4582 T30 C3 UPDATE [collection1] webapp=/solr path=/update params={waitSearcher=true&wt=javabin&commit=true&softCommit=false&version=2} {commit=} 0 260
[junit4:junit4]   2> 4665 T29 C3 REQ [collection1] webapp=/solr path=/select params={wt=javabin&q=id:1234&version=2} hits=1 status=0 QTime=52 
[junit4:junit4]   2> 4671 T17 oas.SolrTestCaseJ4.tearDown ###Ending testQtUpdateFails
[junit4:junit4]   2> 4682 T17 oas.SolrTestCaseJ4.setUp ###Starting testMakeDeleteAllUrl
[junit4:junit4]   2> 4688 T31 C3 UPDATE [collection1] webapp=/solr path=/update params={wt=javabin&version=2} {add=[1234]} 0 2
[junit4:junit4]   2> 4692 T29 C3 oasu.DirectUpdateHandler2.commit start commit{flags=0,_version_=0,optimize=false,openSearcher=true,waitSearcher=true,expungeDeletes=false,softCommit=false}
[junit4:junit4]   2> 4701 T29 C3 oasc.SolrDeletionPolicy.onCommit SolrDeletionPolicy.onCommit: commits:num=2
[junit4:junit4]   2> 		commit{dir=MockDirWrapper(org.apache.lucene.store.RAMDirectory@7a8f7f18 lockFactory=org.apache.lucene.store.NativeFSLockFactory@321125d3),segFN=segments_2,generation=2,filenames=[_0_Pulsing41_0.doc, _0_Pulsing41_0.pos, _0.fnm, _0_Pulsing41_0.tim, _0_Pulsing41_0.tip, _0_Memory_0.ram, _0_nrm.cfe, segments_2, _0.fdx, _0_nrm.cfs, _0.si, _0_Memory_1.ram, _0.fdt]
[junit4:junit4]   2> 		commit{dir=MockDirWrapper(org.apache.lucene.store.RAMDirectory@7a8f7f18 lockFactory=org.apache.lucene.store.NativeFSLockFactory@321125d3),segFN=segments_3,generation=3,filenames=[_1.fdx, _1_nrm.cfs, _1_Memory_0.ram, _1_Pulsing41_0.tip, _1.fdt, _1_Pulsing41_0.tim, _1_Memory_1.ram, _1.si, _1_Pulsing41_0.doc, _1.fnm, _1_Pulsing41_0.pos, segments_3, _1_nrm.cfe]
[junit4:junit4]   2> 4702 T29 C3 oasc.SolrDeletionPolicy.updateCommits newest commit = 3
[junit4:junit4]   2> 4707 T29 C3 oass.SolrIndexSearcher.<init> Opening Searcher@3512e6d9 main
[junit4:junit4]   2> 4707 T29 C3 oass.SolrIndexSearcher.getIndexDir WARNING WARNING: Directory impl does not support setting indexDir: org.apache.lucene.store.MockDirectoryWrapper
[junit4:junit4]   2> 4708 T29 C3 oasu.DirectUpdateHandler2.commit end_commit_flush
[junit4:junit4]   2> 4711 T32 oasc.SolrCore.registerSearcher [collection1] Registered new searcher Searcher@3512e6d9 main{StandardDirectoryReader(segments_3:7 _1(5.0):C1)}
[junit4:junit4]   2> 4712 T29 C3 UPDATE [collection1] webapp=/solr path=/update params={waitSearcher=true&wt=javabin&commit=true&softCommit=false&version=2} {commit=} 0 21
[junit4:junit4]   2> 4716 T31 C3 REQ [collection1] webapp=/solr path=/select params={wt=javabin&q=id:1234&version=2} hits=1 status=0 QTime=1 
[junit4:junit4]   2> 4727 T29 C3 oasu.DirectUpdateHandler2.deleteAll [collection1] REMOVING ALL DOCUMENTS FROM INDEX
[junit4:junit4]   2> 4728 T29 C3 oasu.DirectUpdateHandler2.commit start commit{flags=0,_version_=0,optimize=false,openSearcher=true,waitSearcher=true,expungeDeletes=false,softCommit=false}
[junit4:junit4]   2> 4729 T29 C3 oasc.SolrDeletionPolicy.onCommit SolrDeletionPolicy.onCommit: commits:num=2
[junit4:junit4]   2> 		commit{dir=MockDirWrapper(org.apache.lucene.store.RAMDirectory@7a8f7f18 lockFactory=org.apache.lucene.store.NativeFSLockFactory@321125d3),segFN=segments_3,generation=3,filenames=[_1.fdx, _1_nrm.cfs, _1_Memory_0.ram, _1_Pulsing41_0.tip, _1.fdt, _1_Pulsing41_0.tim, _1_Memory_1.ram, _1.si, _1_Pulsing41_0.doc, _1.fnm, _1_Pulsing41_0.pos, segments_3, _1_nrm.cfe]
[junit4:junit4]   2> 		commit{dir=MockDirWrapper(org.apache.lucene.store.RAMDirectory@7a8f7f18 lockFactory=org.apache.lucene.store.NativeFSLockFactory@321125d3),segFN=segments_4,generation=4,filenames=[segments_4]
[junit4:junit4]   2> 4730 T29 C3 oasc.SolrDeletionPolicy.updateCommits newest commit = 4
[junit4:junit4]   2> 4732 T29 C3 oass.SolrIndexSearcher.<init> Opening Searcher@1bb1dfe5 main
[junit4:junit4]   2> 4732 T29 C3 oass.SolrIndexSearcher.getIndexDir WARNING WARNING: Directory impl does not support setting indexDir: org.apache.lucene.store.MockDirectoryWrapper
[junit4:junit4]   2> 4733 T29 C3 oasu.DirectUpdateHandler2.commit end_commit_flush
[junit4:junit4]   2> 4736 T32 oasc.SolrCore.registerSearcher [collection1] Registered new searcher Searcher@1bb1dfe5 main{StandardDirectoryReader(segments_4:8)}
[junit4:junit4]   2> 4736 T29 C3 UPDATE [collection1] webapp=/solr path=/update params={commit=true&stream.body=<delete><query>*:*</query></delete>} {deleteByQuery=*:*,commit=} 0 10
[junit4:junit4]   2> 4750 T31 C3 REQ [collection1] webapp=/solr path=/select params={wt=javabin&q=id:1234&version=2} hits=0 status=0 QTime=1 
[junit4:junit4]   2> 4752 T17 oas.SolrTestCaseJ4.tearDown ###Ending testMakeDeleteAllUrl
[junit4:junit4]   2> 4764 T17 oas.SolrTestCaseJ4.setUp ###Starting testNoUrlAccess
[junit4:junit4]   2> 4770 T30 C3 UPDATE [collection1] webapp=/solr path=/update params={wt=javabin&version=2} {add=[1234]} 0 2
[junit4:junit4]   2> 4774 T29 C3 oasu.DirectUpdateHandler2.commit start commit{flags=0,_version_=0,optimize=false,openSearcher=true,waitSearcher=true,expungeDeletes=false,softCommit=false}
[junit4:junit4]   2> 4784 T29 C3 oasc.SolrDeletionPolicy.onCommit SolrDeletionPolicy.onCommit: commits:num=2
[junit4:junit4]   2> 		commit{dir=MockDirWrapper(org.apache.lucene.store.RAMDirectory@7a8f7f18 lockFactory=org.apache.lucene.store.NativeFSLockFactory@321125d3),segFN=segments_4,generation=4,filenames=[segments_4]
[junit4:junit4]   2> 		commit{dir=MockDirWrapper(org.apache.lucene.store.RAMDirectory@7a8f7f18 lockFactory=org.apache.lucene.store.NativeFSLockFactory@321125d3),segFN=segments_5,generation=5,filenames=[_2_Pulsing41_0.doc, _2.si, _2.fdt, _2.fdx, _2.fnm, _2_Pulsing41_0.tim, _2_Pulsing41_0.pos, _2_nrm.cfe, _2_Memory_1.ram, _2_Pulsing41_0.tip, _2_Memory_0.ram, _2_nrm.cfs, segments_5]
[junit4:junit4]   2> 4785 T29 C3 oasc.SolrDeletionPolicy.updateCommits newest commit = 5
[junit4:junit4]   2> 4790 T29 C3 oass.SolrIndexSearcher.<init> Opening Searcher@4f899ed4 main
[junit4:junit4]   2> 4790 T29 C3 oass.SolrIndexSearcher.getIndexDir WARNING WARNING: Directory impl does not support setting indexDir: org.apache.lucene.store.MockDirectoryWrapper
[junit4:junit4]   2> 4791 T29 C3 oasu.DirectUpdateHandler2.commit end_commit_flush
[junit4:junit4]   2> 4795 T32 oasc.SolrCore.registerSearcher [collection1] Registered new searcher Searcher@4f899ed4 main{StandardDirectoryReader(segments_5:10 _2(5.0):C1)}
[junit4:junit4]   2> 4796 T29 C3 UPDATE [collection1] webapp=/solr path=/update params={waitSearcher=true&wt=javabin&commit=true&softCommit=false&version=2} {commit=} 0 22
[junit4:junit4]   2> 4806 T31 C3 REQ [collection1] webapp=/solr path=/select params={wt=javabin&q=id:1234&version=2} hits=1 status=0 QTime=6 
[junit4:junit4]   2> 4817 T30 C3 REQ [collection1] webapp=/solr path=/select params={wt=javabin&stream.url=http://127.0.0.1:27291/solr/update?commit%3Dtrue%26stream.body%3D%253Cdelete%253E%253Cquery%253E*%253A*%253C%252Fquery%253E%253C%252Fdelete%253E&q=*:*&version=2} hits=1 status=0 QTime=5 
[junit4:junit4]   2> 4821 T29 C3 REQ [collection1] webapp=/solr path=/select params={wt=javabin&q=id:1234&version=2} hits=1 status=0 QTime=0 
[junit4:junit4]   2> 4822 T17 oas.SolrTestCaseJ4.tearDown ###Ending testNoUrlAccess
[junit4:junit4]   2> 4833 T17 oas.SolrTestCaseJ4.setUp ###Starting testStreamUrl
[junit4:junit4]   2> 4840 T31 C3 UPDATE [collection1] webapp=/solr path=/update params={wt=javabin&version=2} {add=[1234]} 0 3
[junit4:junit4]   2> 4844 T30 C3 oasu.DirectUpdateHandler2.commit start commit{flags=0,_version_=0,optimize=false,openSearcher=true,waitSearcher=true,expungeDeletes=false,softCommit=false}
[junit4:junit4]   2> 4855 T30 C3 oasc.SolrDeletionPolicy.onCommit SolrDeletionPolicy.onCommit: commits:num=2
[junit4:junit4]   2> 		commit{dir=MockDirWrapper(org.apache.lucene.store.RAMDirectory@7a8f7f18 lockFactory=org.apache.lucene.store.NativeFSLockFactory@321125d3),segFN=segments_5,generation=5,filenames=[_2_Pulsing41_0.doc, _2.si, _2.fdt, _2.fdx, _2.fnm, _2_Pulsing41_0.tim, _2_Pulsing41_0.pos, _2_nrm.cfe, _2_Memory_1.ram, _2_Pulsing41_0.tip, _2_Memory_0.ram, _2_nrm.cfs, segments_5]
[junit4:junit4]   2> 		commit{dir=MockDirWrapper(org.apache.lucene.store.RAMDirectory@7a8f7f18 lockFactory=org.apache.lucene.store.NativeFSLockFactory@321125d3),segFN=segments_6,generation=6,filenames=[_3_nrm.cfe, _3.fnm, _3.fdt, _3_Pulsing41_0.pos, _3.fdx, _3_nrm.cfs, _3_Pulsing41_0.tim, _3.si, _3_Memory_0.ram, _3_Pulsing41_0.tip, segments_6, _3_Pulsing41_0.doc, _3_Memory_1.ram]
[junit4:junit4]   2> 4855 T30 C3 oasc.SolrDeletionPolicy.updateCommits newest commit = 6
[junit4:junit4]   2> 4859 T30 C3 oass.SolrIndexSearcher.<init> Opening Searcher@6e6ccb30 main
[junit4:junit4]   2> 4859 T30 C3 oass.SolrIndexSearcher.getIndexDir WARNING WARNING: Directory impl does not support setting indexDir: org.apache.lucene.store.MockDirectoryWrapper
[junit4:junit4]   2> 4860 T30 C3 oasu.DirectUpdateHandler2.commit end_commit_flush
[junit4:junit4]   2> 4862 T32 oasc.SolrCore.registerSearcher [collection1] Registered new searcher Searcher@6e6ccb30 main{StandardDirectoryReader(segments_6:14 _3(5.0):C1)}
[junit4:junit4]   2> 4863 T30 C3 UPDATE [collection1] webapp=/solr path=/update params={waitSearcher=true&wt=javabin&commit=true&softCommit=false&version=2} {commit=} 0 19
[junit4:junit4]   2> 4867 T29 C3 REQ [collection1] webapp=/solr path=/select params={wt=javabin&q=id:1234&version=2} hits=1 status=0 QTime=1 
[junit4:junit4]   2> 4880 T30 C3 REQ [collection1] webapp=/solr path=/select params={wt=csv&q=*:*&fl=id} hits=1 status=0 QTime=4 
[junit4:junit4]   2> 4906 T31 C3 REQ [collection1] webapp=/solr path=/debug/dump params={wt=xml&stream.url=http://127.0.0.1:27291/solr/select?q%3D*:*%26fl%3Did%26wt%3Dcsv} status=0 QTime=33 
[junit4:junit4]   2> 4908 T17 oas.SolrTestCaseJ4.tearDown ###Ending testStreamUrl
[junit4:junit4]   2> 4956 T17 oasc.CoreContainer.shutdown Shutting down CoreContainer instance=622527324
[junit4:junit4]   2> 4956 T17 oasc.SolrCore.close [collection1]  CLOSING SolrCore org.apache.solr.core.SolrCore@243d886
[junit4:junit4]   2> 4973 T17 oasu.DirectUpdateHandler2.close closing DirectUpdateHandler2{commits=5,autocommits=0,soft autocommits=0,optimizes=0,rollbacks=0,expungeDeletes=0,docsPending=0,adds=0,deletesById=0,deletesByQuery=0,errors=0,cumulative_adds=4,cumulative_deletesById=0,cumulative_deletesByQuery=1,cumulative_errors=0}
[junit4:junit4]   2> 4973 T17 oasc.SolrCore.decrefSolrCoreState Closing SolrCoreState
[junit4:junit4]   2> 4974 T17 oasu.DefaultSolrCoreState.closeIndexWriter SolrCoreState ref count has reached 0 - closing IndexWriter
[junit4:junit4]   2> 4974 T17 oasu.DefaultSolrCoreState.closeIndexWriter closing IndexWriter with IndexWriterCloser
[junit4:junit4]   2> 4976 T17 oasc.SolrCore.closeSearcher [collection1] Closing main searcher on request.
[junit4:junit4]   2> 5037 T17 oejsh.ContextHandler.doStop stopped o.e.j.s.ServletContextHandler{/solr,null}
[junit4:junit4]   2> 5138 T17 oejut.QueuedThreadPool.doStop WARNING 4 threads could not be stopped
[junit4:junit4]   2> 5139 T17 oas.SolrTestCaseJ4.deleteCore ###deleteCore
[junit4:junit4]   2> 5149 T16 ccr.ThreadLeakControl.checkThreadLeaks WARNING Will linger awaiting termination of 4 leaked thread(s).
[junit4:junit4]   2> 25290 T16 ccr.ThreadLeakControl.checkThreadLeaks SEVERE 4 threads leaked from SUITE scope at org.apache.solr.request.TestRemoteStreaming: 
[junit4:junit4]   2> 	   1) Thread[id=26, name=qtp1191745850-26 Acceptor2 SelectChannelConnector@0.0.0.0:27291, state=BLOCKED, group=TGRP-TestRemoteStreaming]
[junit4:junit4]   2> 	        at sun.nio.ch.ServerSocketChannelImpl.accept(ServerSocketChannelImpl.java:210)
[junit4:junit4]   2> 	        at org.eclipse.jetty.server.nio.SelectChannelConnector.accept(SelectChannelConnector.java:104)
[junit4:junit4]   2> 	        at org.eclipse.jetty.server.AbstractConnector$Acceptor.run(AbstractConnector.java:933)
[junit4:junit4]   2> 	        at org.eclipse.jetty.util.thread.QueuedThreadPool.runJob(QueuedThreadPool.java:599)
[junit4:junit4]   2> 	        at org.eclipse.jetty.util.thread.QueuedThreadPool$3.run(QueuedThreadPool.java:534)
[junit4:junit4]   2> 	        at java.lang.Thread.run(Thread.java:722)
[junit4:junit4]   2> 	   2) Thread[id=24, name=qtp1191745850-24 Acceptor0 SelectChannelConnector@0.0.0.0:27291, state=BLOCKED, group=TGRP-TestRemoteStreaming]
[junit4:junit4]   2> 	        at sun.nio.ch.ServerSocketChannelImpl.accept(ServerSocketChannelImpl.java:210)
[junit4:junit4]   2> 	        at org.eclipse.jetty.server.nio.SelectChannelConnector.accept(SelectChannelConnector.java:104)
[junit4:junit4]   2> 	        at org.eclipse.jetty.server.AbstractConnector$Acceptor.run(AbstractConnector.java:933)
[junit4:junit4]   2> 	        at org.eclipse.jetty.util.thread.QueuedThreadPool.runJob(QueuedThreadPool.java:599)
[junit4:junit4]   2> 	        at org.eclipse.jetty.util.thread.QueuedThreadPool$3.run(QueuedThreadPool.java:534)
[junit4:junit4]   2> 	        at java.lang.Thread.run(Thread.java:722)
[junit4:junit4]   2> 	   3) Thread[id=25, name=qtp1191745850-25 Acceptor1 SelectChannelConnector@0.0.0.0:27291, state=RUNNABLE, group=TGRP-TestRemoteStreaming]
[junit4:junit4]   2> 	        at sun.nio.ch.ServerSocketChannelImpl.accept0(Native Method)
[junit4:junit4]   2> 	        at sun.nio.ch.ServerSocketChannelImpl.accept(ServerSocketChannelImpl.java:226)
[junit4:junit4]   2> 	        at org.eclipse.jetty.server.nio.SelectChannelConnector.accept(SelectChannelConnector.java:104)
[junit4:junit4]   2> 	        at org.eclipse.jetty.server.AbstractConnector$Acceptor.run(AbstractConnector.java:933)
[junit4:junit4]   2> 	        at org.eclipse.jetty.util.thread.QueuedThreadPool.runJob(QueuedThreadPool.java:599)
[junit4:junit4]   2> 	        at org.eclipse.jetty.util.thread.QueuedThreadPool$3.run(QueuedThreadPool.java:534)
[junit4:junit4]   2> 	        at java.lang.Thread.run(Thread.java:722)
[junit4:junit4]   2> 	   4) Thread[id=27, name=qtp1191745850-27 Acceptor3 SelectChannelConnector@0.0.0.0:27291, state=BLOCKED, group=TGRP-TestRemoteStreaming]
[junit4:junit4]   2> 	        at sun.nio.ch.ServerSocketChannelImpl.accept(ServerSocketChannelImpl.java:210)
[junit4:junit4]   2> 	        at org.eclipse.jetty.server.nio.SelectChannelConnector.accept(SelectChannelConnector.java:104)
[junit4:junit4]   2> 	        at org.eclipse.jetty.server.AbstractConnector$Acceptor.run(AbstractConnector.java:933)
[junit4:junit4]   2> 	        at org.eclipse.jetty.util.thread.QueuedThreadPool.runJob(QueuedThreadPool.java:599)
[junit4:junit4]   2> 	        at org.eclipse.jetty.util.thread.QueuedThreadPool$3.run(QueuedThreadPool.java:534)
[junit4:junit4]   2> 	        at java.lang.Thread.run(Thread.java:722)
[junit4:junit4]   2> 25291 T16 ccr.ThreadLeakControl.tryToInterruptAll Starting to interrupt leaked threads:
[junit4:junit4]   2> 	   1) Thread[id=26, name=qtp1191745850-26 Acceptor2 SelectChannelConnector@0.0.0.0:27291, state=BLOCKED, group=TGRP-TestRemoteStreaming]
[junit4:junit4]   2> 	   2) Thread[id=24, name=qtp1191745850-24 Acceptor0 SelectChannelConnector@0.0.0.0:27291, state=BLOCKED, group=TGRP-TestRemoteStreaming]
[junit4:junit4]   2> 	   3) Thread[id=25, name=qtp1191745850-25 Acceptor1 SelectChannelConnector@0.0.0.0:27291, state=RUNNABLE, group=TGRP-TestRemoteStreaming]
[junit4:junit4]   2> 	   4) Thread[id=27, name=qtp1191745850-27 Acceptor3 SelectChannelConnector@0.0.0.0:27291, state=BLOCKED, group=TGRP-TestRemoteStreaming]
[junit4:junit4]   2> 28335 T16 ccr.ThreadLeakControl.tryToInterruptAll SEVERE There are still zombie threads that couldn't be terminated:
[junit4:junit4]   2> 	   1) Thread[id=26, name=qtp1191745850-26 Acceptor2 SelectChannelConnector@0.0.0.0:27291, state=BLOCKED, group=TGRP-TestRemoteStreaming]
[junit4:junit4]   2> 	        at sun.nio.ch.ServerSocketChannelImpl.accept(ServerSocketChannelImpl.java:210)
[junit4:junit4]   2> 	        at org.eclipse.jetty.server.nio.SelectChannelConnector.accept(SelectChannelConnector.java:104)
[junit4:junit4]   2> 	        at org.eclipse.jetty.server.AbstractConnector$Acceptor.run(AbstractConnector.java:933)
[junit4:junit4]   2> 	        at org.eclipse.jetty.util.thread.QueuedThreadPool.runJob(QueuedThreadPool.java:599)
[junit4:junit4]   2> 	        at org.eclipse.jetty.util.thread.QueuedThreadPool$3.run(QueuedThreadPool.java:534)
[junit4:junit4]   2> 	        at java.lang.Thread.run(Thread.java:722)
[junit4:junit4]   2> 	   2) Thread[id=24, name=qtp1191745850-24 Acceptor0 SelectChannelConnector@0.0.0.0:27291, state=BLOCKED, group=TGRP-TestRemoteStreaming]
[junit4:junit4]   2> 	        at sun.nio.ch.ServerSocketChannelImpl.accept(ServerSocketChannelImpl.java:210)
[junit4:junit4]   2> 	        at org.eclipse.jetty.server.nio.SelectChannelConnector.accept(SelectChannelConnector.java:104)
[junit4:junit4]   2> 	        at org.eclipse.jetty.server.AbstractConnector$Acceptor.run(AbstractConnector.java:933)
[junit4:junit4]   2> 	        at org.eclipse.jetty.util.thread.QueuedThreadPool.runJob(QueuedThreadPool.java:599)
[junit4:junit4]   2> 	        at org.eclipse.jetty.util.thread.QueuedThreadPool$3.run(QueuedThreadPool.java:534)
[junit4:junit4]   2> 	        at java.lang.Thread.run(Thread.java:722)
[junit4:junit4]   2> 	   3) Thread[id=25, name=qtp1191745850-25 Acceptor1 SelectChannelConnector@0.0.0.0:27291, state=RUNNABLE, group=TGRP-TestRemoteStreaming]
[junit4:junit4]   2> 	        at sun.nio.ch.ServerSocketChannelImpl.accept0(Native Method)
[junit4:junit4]   2> 	        at sun.nio.ch.ServerSocketChannelImpl.accept(ServerSocketChannelImpl.java:226)
[junit4:junit4]   2> 	        at org.eclipse.jetty.server.nio.SelectChannelConnector.accept(SelectChannelConnector.java:104)
[junit4:junit4]   2> 	        at org.eclipse.jetty.server.AbstractConnector$Acceptor.run(AbstractConnector.java:933)
[junit4:junit4]   2> 	        at org.eclipse.jetty.util.thread.QueuedThreadPool.runJob(QueuedThreadPool.java:599)
[junit4:junit4]   2> 	        at org.eclipse.jetty.util.thread.QueuedThreadPool$3.run(QueuedThreadPool.java:534)
[junit4:junit4]   2> 	        at java.lang.Thread.run(Thread.java:722)
[junit4:junit4]   2> 	   4) Thread[id=27, name=qtp1191745850-27 Acceptor3 SelectChannelConnector@0.0.0.0:27291, state=BLOCKED, group=TGRP-TestRemoteStreaming]
[junit4:junit4]   2> 	        at sun.nio.ch.ServerSocketChannelImpl.accept(ServerSocketChannelImpl.java:210)
[junit4:junit4]   2> 	        at org.eclipse.jetty.server.nio.SelectChannelConnector.accept(SelectChannelConnector.java:104)
[junit4:junit4]   2> 	        at org.eclipse.jetty.server.AbstractConnector$Acceptor.run(AbstractConnector.java:933)
[junit4:junit4]   2> 	        at org.eclipse.jetty.util.thread.QueuedThreadPool.runJob(QueuedThreadPool.java:599)
[junit4:junit4]   2> 	        at org.eclipse.jetty.util.thread.QueuedThreadPool$3.run(QueuedThreadPool.java:534)
[junit4:junit4]   2> 	        at java.lang.Thread.run(Thread.java:722)
[junit4:junit4]   2> NOTE: test params are: codec=Lucene41: {timestamp=PostingsFormat(name=Memory doPackFST= true), range_facet_l=PostingsFormat(name=Memory doPackFST= true), id=Pulsing41(freqCutoff=19 minBlockSize=83 maxBlockSize=178), range_facet_sl=Pulsing41(freqCutoff=19 minBlockSize=83 maxBlockSize=178), range_facet_si=PostingsFormat(name=Memory doPackFST= true), multiDefault=PostingsFormat(name=Memory doPackFST= true), intDefault=PostingsFormat(name=Memory doPackFST= false)}, sim=DefaultSimilarity, locale=vi_VN, timezone=America/Louisville
[junit4:junit4]   2> NOTE: FreeBSD 9.0-RELEASE amd64/Oracle Corporation 1.7.0_06 (64-bit)/cpus=16,threads=5,free=29267912,total=142606336
[junit4:junit4]   2> NOTE: All tests run in this JVM: [DirectUpdateHandlerTest, TestRemoteStreaming]
[junit4:junit4]   2> NOTE: reproduce with: ant test  -Dtestcase=TestRemoteStreaming -Dtests.seed=474DCF77A80DB23F -Dtests.multiplier=3 -Dtests.slow=true -Dtests.locale=vi_VN -Dtests.timezone=America/Louisville -Dtests.file.encoding=US-ASCII
[junit4:junit4] ERROR   0.00s J1 | TestRemoteStreaming (suite) <<<
[junit4:junit4]    > Throwable #1: com.carrotsearch.randomizedtesting.ThreadLeakError: 4 threads leaked from SUITE scope at org.apache.solr.request.TestRemoteStreaming: 
[junit4:junit4]    >    1) Thread[id=26, name=qtp1191745850-26 Acceptor2 SelectChannelConnector@0.0.0.0:27291, state=BLOCKED, group=TGRP-TestRemoteStreaming]
[junit4:junit4]    >         at sun.nio.ch.ServerSocketChannelImpl.accept(ServerSocketChannelImpl.java:210)
[junit4:junit4]    >         at org.eclipse.jetty.server.nio.SelectChannelConnector.accept(SelectChannelConnector.java:104)
[junit4:junit4]    >         at org.eclipse.jetty.server.AbstractConnector$Acceptor.run(AbstractConnector.java:933)
[junit4:junit4]    >         at org.eclipse.jetty.util.thread.QueuedThreadPool.runJob(QueuedThreadPool.java:599)
[junit4:junit4]    >         at org.eclipse.jetty.util.thread.QueuedThreadPool$3.run(QueuedThreadPool.java:534)
[junit4:junit4]    >         at java.lang.Thread.run(Thread.java:722)
[junit4:junit4]    >    2) Thread[id=24, name=qtp1191745850-24 Acceptor0 SelectChannelConnector@0.0.0.0:27291, state=BLOCKED, group=TGRP-TestRemoteStreaming]
[junit4:junit4]    >         at sun.nio.ch.ServerSocketChannelImpl.accept(ServerSocketChannelImpl.java:210)
[junit4:junit4]    >         at org.eclipse.jetty.server.nio.SelectChannelConnector.accept(SelectChannelConnector.java:104)
[junit4:junit4]    >         at org.eclipse.jetty.server.AbstractConnector$Acceptor.run(AbstractConnector.java:933)
[junit4:junit4]    >         at org.eclipse.jetty.util.thread.QueuedThreadPool.runJob(QueuedThreadPool.java:599)
[junit4:junit4]    >         at org.eclipse.jetty.util.thread.QueuedThreadPool$3.run(QueuedThreadPool.java:534)
[junit4:junit4]    >         at java.lang.Thread.run(Thread.java:722)
[junit4:junit4]    >    3) Thread[id=25, name=qtp1191745850-25 Acceptor1 SelectChannelConnector@0.0.0.0:27291, state=RUNNABLE, group=TGRP-TestRemoteStreaming]
[junit4:junit4]    >         at sun.nio.ch.ServerSocketChannelImpl.accept0(Native Method)
[junit4:junit4]    >         at sun.nio.ch.ServerSocketChannelImpl.accept(ServerSocketChannelImpl.java:226)
[junit4:junit4]    >         at org.eclipse.jetty.server.nio.SelectChannelConnector.accept(SelectChannelConnector.java:104)
[junit4:junit4]    >         at org.eclipse.jetty.server.AbstractConnector$Acceptor.run(AbstractConnector.java:933)
[junit4:junit4]    >         at org.eclipse.jetty.util.thread.QueuedThreadPool.runJob(QueuedThreadPool.java:599)
[junit4:junit4]    >         at org.eclipse.jetty.util.thread.QueuedThreadPool$3.run(QueuedThreadPool.java:534)
[junit4:junit4]    >         at java.lang.Thread.run(Thread.java:722)
[junit4:junit4]    >    4) Thread[id=27, name=qtp1191745850-27 Acceptor3 SelectChannelConnector@0.0.0.0:27291, state=BLOCKED, group=TGRP-TestRemoteStreaming]
[junit4:junit4]    >         at sun.nio.ch.ServerSocketChannelImpl.accept(ServerSocketChannelImpl.java:210)
[junit4:junit4]    >         at org.eclipse.jetty.server.nio.SelectChannelConnector.accept(SelectChannelConnector.java:104)
[junit4:junit4]    >         at org.eclipse.jetty.server.AbstractConnector$Acceptor.run(AbstractConnector.java:933)
[junit4:junit4]    >         at org.eclipse.jetty.util.thread.QueuedThreadPool.runJob(QueuedThreadPool.java:599)
[junit4:junit4]    >         at org.eclipse.jetty.util.thread.QueuedThreadPool$3.run(QueuedThreadPool.java:534)
[junit4:junit4]    >         at java.lang.Thread.run(Thread.java:722)
[junit4:junit4]    > 	at __randomizedtesting.SeedInfo.seed([474DCF77A80DB23F]:0)
[junit4:junit4]    > Throwable #2: com.carrotsearch.randomizedtesting.ThreadLeakError: There are still zombie threads that couldn't be terminated:
[junit4:junit4]    >    1) Thread[id=26, name=qtp1191745850-26 Acceptor2 SelectChannelConnector@0.0.0.0:27291, state=BLOCKED, group=TGRP-TestRemoteStreaming]
[junit4:junit4]    >         at sun.nio.ch.ServerSocketChannelImpl.accept(ServerSocketChannelImpl.java:210)
[junit4:junit4]    >         at org.eclipse.jetty.server.nio.SelectChannelConnector.accept(SelectChannelConnector.java:104)
[junit4:junit4]    >         at org.eclipse.jetty.server.AbstractConnector$Acceptor.run(AbstractConnector.java:933)
[junit4:junit4]    >         at org.eclipse.jetty.util.thread.QueuedThreadPool.runJob(QueuedThreadPool.java:599)
[junit4:junit4]    >         at org.eclipse.jetty.util.thread.QueuedThreadPool$3.run(QueuedThreadPool.java:534)
[junit4:junit4]    >         at java.lang.Thread.run(Thread.java:722)
[junit4:junit4]    >    2) Thread[id=24, name=qtp1191745850-24 Acceptor0 SelectChannelConnector@0.0.0.0:27291, state=BLOCKED, group=TGRP-TestRemoteStreaming]
[junit4:junit4]    >         at sun.nio.ch.ServerSocketChannelImpl.accept(ServerSocketChannelImpl.java:210)
[junit4:junit4]    >         at org.eclipse.jetty.server.nio.SelectChannelConnector.accept(SelectChannelConnector.java:104)
[junit4:junit4]    >         at org.eclipse.jetty.server.AbstractConnector$Acceptor.run(AbstractConnector.java:933)
[junit4:junit4]    >         at org.eclipse.jetty.util.thread.QueuedThreadPool.runJob(QueuedThreadPool.java:599)
[junit4:junit4]    >         at org.eclipse.jetty.util.thread.QueuedThreadPool$3.run(QueuedThreadPool.java:534)
[junit4:junit4]    >         at java.lang.Thread.run(Thread.java:722)
[junit4:junit4]    >    3) Thread[id=25, name=qtp1191745850-25 Acceptor1 SelectChannelConnector@0.0.0.0:27291, state=RUNNABLE, group=TGRP-TestRemoteStreaming]
[junit4:junit4]    >         at sun.nio.ch.ServerSocketChannelImpl.accept0(Native Method)
[junit4:junit4]    >         at sun.nio.ch.ServerSocketChannelImpl.accept(ServerSocketChannelImpl.java:226)
[junit4:junit4]    >         at org.eclipse.jetty.server.nio.SelectChannelConnector.accept(SelectChannelConnector.java:104)
[junit4:junit4]    >         at org.eclipse.jetty.server.AbstractConnector$Acceptor.run(AbstractConnector.java:933)
[junit4:junit4]    >         at org.eclipse.jetty.util.thread.QueuedThreadPool.runJob(QueuedThreadPool.java:599)
[junit4:junit4]    >         at org.eclipse.jetty.util.thread.QueuedThreadPool$3.run(QueuedThreadPool.java:534)
[junit4:junit4]    >         at java.lang.Thread.run(Thread.java:722)
[junit4:junit4]    >    4) Thread[id=27, name=qtp1191745850-27 Acceptor3 SelectChannelConnector@0.0.0.0:27291, state=BLOCKED, group=TGRP-TestRemoteStreaming]
[junit4:junit4]    >         at sun.nio.ch.ServerSocketChannelImpl.accept(ServerSocketChannelImpl.java:210)
[junit4:junit4]    >         at org.eclipse.jetty.server.nio.SelectChannelConnector.accept(SelectChannelConnector.java:104)
[junit4:junit4]    >         at org.eclipse.jetty.server.AbstractConnector$Acceptor.run(AbstractConnector.java:933)
[junit4:junit4]    >         at org.eclipse.jetty.util.thread.QueuedThreadPool.runJob(QueuedThreadPool.java:599)
[junit4:junit4]    >         at org.eclipse.jetty.util.thread.QueuedThreadPool$3.run(QueuedThreadPool.java:534)
[junit4:junit4]    >         at java.lang.Thread.run(Thread.java:722)
[junit4:junit4]    > 	at __randomizedtesting.SeedInfo.seed([474DCF77A80DB23F]:0)
[junit4:junit4] Completed on J1 in 28.54s, 4 tests, 2 errors <<< FAILURES!

[...truncated 576 lines...]
[junit4:junit4] Suite: org.apache.solr.servlet.NoCacheHeaderTest
[junit4:junit4]   2> 1 T266 oas.SolrTestCaseJ4.initCore ####initCore
[junit4:junit4]   2> Creating dataDir: /usr/home/hudson/hudson-slave/workspace/Lucene-Solr-Tests-trunk-java7/solr/build/solr-core/test/J0/./solrtest-NoCacheHeaderTest-1351256881105
[junit4:junit4]   2> 2 T266 oas.SolrTestCaseJ4.initCore ####initCore end
[junit4:junit4]   2> 556 T266 oejs.Server.doStart jetty-8.1.2.v20120308
[junit4:junit4]   2> 800 T266 oejs.AbstractConnector.doStart Started SelectChannelConnector@0.0.0.0:58447
[junit4:junit4]   2> 833 T266 oasc.SolrResourceLoader.locateSolrHome JNDI not configured for solr (NoInitialContextEx)
[junit4:junit4]   2> 834 T266 oasc.SolrResourceLoader.locateSolrHome using system property solr.solr.home: /usr/home/hudson/hudson-slave/workspace/Lucene-Solr-Tests-trunk-java7/solr/build/solr-core/test-files/solr
[junit4:junit4]   2> 834 T266 oasc.SolrResourceLoader.<init> new SolrResourceLoader for deduced Solr Home: '/usr/home/hudson/hudson-slave/workspace/Lucene-Solr-Tests-trunk-java7/solr/build/solr-core/test-files/solr/'
[junit4:junit4]   2> 866 T266 oass.SolrDispatchFilter.init SolrDispatchFilter.init()
[junit4:junit4]   2> 866 T266 oasc.SolrResourceLoader.locateSolrHome JNDI not configured for solr (NoInitialContextEx)
[junit4:junit4]   2> 866 T266 oasc.SolrResourceLoader.locateSolrHome using system property solr.solr.home: /usr/home/hudson/hudson-slave/workspace/Lucene-Solr-Tests-trunk-java7/solr/build/solr-core/test-files/solr
[junit4:junit4]   2> 866 T266 oasc.CoreContainer$Initializer.initialize looking for solr.xml: /usr/home/hudson/hudson-slave/workspace/Lucene-Solr-Tests-trunk-java7/solr/build/solr-core/test-files/solr/solr.xml
[junit4:junit4]   2> 867 T266 oasc.CoreContainer.<init> New CoreContainer 216082549
[junit4:junit4]   2> 867 T266 oasc.CoreContainer.load Loading CoreContainer using Solr Home: '/usr/home/hudson/hudson-slave/workspace/Lucene-Solr-Tests-trunk-java7/solr/build/solr-core/test-files/solr/'
[junit4:junit4]   2> 867 T266 oasc.SolrResourceLoader.<init> new SolrResourceLoader for directory: '/usr/home/hudson/hudson-slave/workspace/Lucene-Solr-Tests-trunk-java7/solr/build/solr-core/test-files/solr/'
[junit4:junit4]   2> 901 T266 oasc.CoreContainer.load Registering Log Listener
[junit4:junit4]   2> 940 T266 oasc.CoreContainer.create Creating SolrCore 'collection1' using instanceDir: /usr/home/hudson/hudson-slave/workspace/Lucene-Solr-Tests-trunk-java7/solr/build/solr-core/test-files/solr/collection1
[junit4:junit4]   2> 940 T266 oasc.SolrResourceLoader.<init> new SolrResourceLoader for directory: '/usr/home/hudson/hudson-slave/workspace/Lucene-Solr-Tests-trunk-java7/solr/build/solr-core/test-files/solr/collection1/'
[junit4:junit4]   2> 941 T266 oasc.SolrResourceLoader.replaceClassLoader Adding 'file:/usr/home/hudson/hudson-slave/workspace/Lucene-Solr-Tests-trunk-java7/solr/build/solr-core/test-files/solr/collection1/lib/classes/' to classloader
[junit4:junit4]   2> 942 T266 oasc.SolrResourceLoader.replaceClassLoader Adding 'file:/usr/home/hudson/hudson-slave/workspace/Lucene-Solr-Tests-trunk-java7/solr/build/solr-core/test-files/solr/collection1/lib/README' to classloader
[junit4:junit4]   2> 986 T266 oasc.SolrConfig.<init> Using Lucene MatchVersion: LUCENE_50
[junit4:junit4]   2> 1024 T266 oasc.SolrConfig.<init> Loaded SolrConfig: solr/collection1/conf/solrconfig-nocache.xml
[junit4:junit4]   2> 1025 T266 oass.IndexSchema.readSchema Reading Solr Schema
[junit4:junit4]   2> 1032 T266 oass.IndexSchema.readSchema Schema name=test
[junit4:junit4]   2> 1500 T266 oass.OpenExchangeRatesOrgProvider.init Initialized with rates=open-exchange-rates.json, refreshInterval=1440.
[junit4:junit4]   2> 1509 T266 oass.IndexSchema.readSchema default search field in schema is text
[junit4:junit4]   2> 1512 T266 oass.IndexSchema.readSchema unique key field: id
[junit4:junit4]   2> 1523 T266 oass.FileExchangeRateProvider.reload Reloading exchange rates from file currency.xml
[junit4:junit4]   2> 1527 T266 oass.FileExchangeRateProvider.reload Reloading exchange rates from file currency.xml
[junit4:junit4]   2> 1530 T266 oass.OpenExchangeRatesOrgProvider.reload Reloading exchange rates from open-exchange-rates.json
[junit4:junit4]   2> 1531 T266 oass.OpenExchangeRatesOrgProvider.reload Reloading exchange rates from open-exchange-rates.json
[junit4:junit4]   2> 1532 T266 oasc.SolrCore.<init> [collection1] Opening new SolrCore at /usr/home/hudson/hudson-slave/workspace/Lucene-Solr-Tests-trunk-java7/solr/build/solr-core/test-files/solr/collection1/, dataDir=/usr/home/hudson/hudson-slave/workspace/Lucene-Solr-Tests-trunk-java7/solr/build/solr-core/test/J0/solrtest-NoCacheHeaderTest-1351256881105/
[junit4:junit4]   2> 1532 T266 oasc.SolrCore.<init> JMX monitoring not detected for core: collection1
[junit4:junit4]   2> 1533 T266 oasc.SolrCore.getNewIndexDir New index directory detected: old=null new=/usr/home/hudson/hudson-slave/workspace/Lucene-Solr-Tests-trunk-java7/solr/build/solr-core/test/J0/solrtest-NoCacheHeaderTest-1351256881105/index/
[junit4:junit4]   2> 1533 T266 oasc.SolrCore.initIndex WARNING [collection1] Solr index directory '/usr/home/hudson/hudson-slave/workspace/Lucene-Solr-Tests-trunk-java7/solr/build/solr-core/test/J0/solrtest-NoCacheHeaderTest-1351256881105/index' doesn't exist. Creating new index...
[junit4:junit4]   2> 1534 T266 oasc.CachingDirectoryFactory.get return new directory for /usr/home/hudson/hudson-slave/workspace/Lucene-Solr-Tests-trunk-java7/solr/build/solr-core/test/J0/solrtest-NoCacheHeaderTest-1351256881105/index forceNew:false
[junit4:junit4]   2> 1536 T266 oasc.SolrDeletionPolicy.onCommit SolrDeletionPolicy.onCommit: commits:num=1
[junit4:junit4]   2> 		commit{dir=MockDirWrapper(org.apache.lucene.store.RAMDirectory@6883f5e4 lockFactory=org.apache.lucene.store.NativeFSLockFactory@24478f20),segFN=segments_1,generation=1,filenames=[segments_1]
[junit4:junit4]   2> 1536 T266 oasc.SolrDeletionPolicy.updateCommits newest commit = 1
[junit4:junit4]   2> 1537 T266 oasc.RequestHandlers.initHandlersFromConfig created standard: solr.StandardRequestHandler
[junit4:junit4]   2> 1541 T266 oass.SolrIndexSearcher.<init> Opening Searcher@3a2b9097 main
[junit4:junit4]   2> 1542 T266 oass.SolrIndexSearcher.getIndexDir WARNING WARNING: Directory impl does not support setting indexDir: org.apache.lucene.store.MockDirectoryWrapper
[junit4:junit4]   2> 1542 T266 oasu.CommitTracker.<init> Hard AutoCommit: disabled
[junit4:junit4]   2> 1542 T266 oasu.CommitTracker.<init> Soft AutoCommit: disabled
[junit4:junit4]   2> 1543 T266 oashc.HttpShardHandlerFactory.getParameter Setting socketTimeout to: 0
[junit4:junit4]   2> 1543 T266 oashc.HttpShardHandlerFactory.getParameter Setting urlScheme to: http://
[junit4:junit4]   2> 1543 T266 oashc.HttpShardHandlerFactory.getParameter Setting connTimeout to: 0
[junit4:junit4]   2> 1543 T266 oashc.HttpShardHandlerFactory.getParameter Setting maxConnectionsPerHost to: 20
[junit4:junit4]   2> 1544 T266 oashc.HttpShardHandlerFactory.getParameter Setting corePoolSize to: 0
[junit4:junit4]   2> 1544 T266 oashc.HttpShardHandlerFactory.getParameter Setting maximumPoolSize to: 2147483647
[junit4:junit4]   2> 1544 T266 oashc.HttpShardHandlerFactory.getParameter Setting maxThreadIdleTime to: 5
[junit4:junit4]   2> 1545 T266 oashc.HttpShardHandlerFactory.getParameter Setting sizeOfQueue to: -1
[junit4:junit4]   2> 1545 T266 oashc.HttpShardHandlerFactory.getParameter Setting fairnessPolicy to: false
[junit4:junit4]   2> 1545 T266 oascsi.HttpClientUtil.createClient Creating new http client, config:maxConnectionsPerHost=20&maxConnections=10000&socketTimeout=0&connTimeout=0&retry=false
[junit4:junit4]   2> 1558 T266 oasc.CoreContainer.register registering core: collection1
[junit4:junit4]   2> 1558 T281 oasc.SolrCore.registerSearcher [collection1] Registered new searcher Searcher@3a2b9097 main{StandardDirectoryReader(segments_1:1)}
[junit4:junit4]   2> 1558 T266 oass.SolrDispatchFilter.init user.dir=/usr/home/hudson/hudson-slave/workspace/Lucene-Solr-Tests-trunk-java7/solr/build/solr-core/test/J0
[junit4:junit4]   2> 1559 T266 oass.SolrDispatchFilter.init SolrDispatchFilter.init() done
[junit4:junit4]   2> 1559 T266 oas.SolrJettyTestBase.createJetty Jetty Assigned Port#58447
[junit4:junit4]   2> 1564 T266 oas.SolrTestCaseJ4.setUp ###Starting testLastModified
[junit4:junit4]   2> 1583 T266 oascsi.HttpClientUtil.createClient Creating new http client, config:maxConnections=128&maxConnectionsPerHost=32&followRedirects=false
[junit4:junit4]   2> ASYNC  NEW_CORE C6 name=collection1 org.apache.solr.core.SolrCore@520073d7
[junit4:junit4]   2> 2415 T279 C6 REQ [collection1] webapp=/solr path=/select params={qt=standard&q=solr} hits=0 status=0 QTime=18 
[junit4:junit4]   2> 2527 T278 C6 REQ [collection1] webapp=/solr path=/select params={qt=standard&q=solr} hits=0 status=0 QTime=0 
[junit4:junit4]   2> 2531 T279 C6 REQ [collection1] webapp=/solr path=/select params={qt=standard&q=solr} hits=0 status=0 QTime=1 
[junit4:junit4]   2> 2535 T280 C6 REQ [collection1] webapp=/solr path=/select params={qt=standard&q=solr} hits=0 status=0 QTime=1 
[junit4:junit4]   2> 2538 T278 C6 REQ [collection1] webapp=/solr path=/select params={qt=standard&q=solr} hits=0 status=0 QTime=0 
[junit4:junit4]   2> 2541 T279 C6 REQ [collection1] webapp=/solr path=/select params={qt=standard&q=solr} hits=0 status=0 QTime=0 
[junit4:junit4]   2> 2544 T280 C6 REQ [collection1] webapp=/solr path=/select params={qt=standard&q=solr} hits=0 status=0 QTime=0 
[junit4:junit4]   2> 2547 T278 C6 REQ [collection1] webapp=/solr path=/select params={qt=standard&q=solr} hits=0 status=0 QTime=0 
[junit4:junit4]   2> 2550 T279 C6 REQ [collection1] webapp=/solr path=/select params={qt=standard&q=solr} hits=0 status=0 QTime=0 
[junit4:junit4]   2> 2553 T280 C6 REQ [collection1] webapp=/solr path=/select params={qt=standard&q=solr} hits=0 status=0 QTime=0 
[junit4:junit4]   2> 2554 T266 oas.SolrTestCaseJ4.tearDown ###Ending testLastModified
[junit4:junit4]   2> 2567 T266 oas.SolrTestCaseJ4.setUp ###Starting testCacheControl
[junit4:junit4]   2> 2571 T278 C6 REQ [collection1] webapp=/solr path=/select params={qt=standard&q=solr} hits=0 status=0 QTime=1 
[junit4:junit4]   2> 2574 T279 C6 REQ [collection1] webapp=/solr path=/select params={qt=standard&q=solr} hits=0 status=0 QTime=0 
[junit4:junit4]   2> 2581 T280 C6 REQ [collection1] webapp=/solr path=/select params={q=solr&qt=standard} hits=0 status=0 QTime=0 
[junit4:junit4]   2> 2581 T266 oas.SolrTestCaseJ4.tearDown ###Ending testCacheControl
[junit4:junit4]   2> 2587 T266 oas.SolrTestCaseJ4.setUp ###Starting testEtag
[junit4:junit4]   2> 2590 T278 C6 REQ [collection1] webapp=/solr path=/select params={qt=standard&q=solr} hits=0 status=0 QTime=0 
[junit4:junit4]   2> 2593 T279 C6 REQ [collection1] webapp=/solr path=/select params={qt=standard&q=solr} hits=0 status=0 QTime=0 
[junit4:junit4]   2> 2596 T280 C6 REQ [collection1] webapp=/solr path=/select params={qt=standard&q=solr} hits=0 status=0 QTime=0 
[junit4:junit4]   2> 2599 T278 C6 REQ [collection1] webapp=/solr path=/select params={qt=standard&q=solr} hits=0 status=0 QTime=0 
[junit4:junit4]   2> 2602 T279 C6 REQ [collection1] webapp=/solr path=/select params={qt=standard&q=solr} hits=0 status=0 QTime=0 
[junit4:junit4]   2> 2605 T280 C6 REQ [collection1] webapp=/solr path=/select params={qt=standard&q=solr} hits=0 status=0 QTime=0 
[junit4:junit4]   2> 2608 T278 C6 REQ [collection1] webapp=/solr path=/select params={qt=standard&q=solr} hits=0 status=0 QTime=0 
[junit4:junit4]   2> 2611 T279 C6 REQ [collection1] webapp=/solr path=/select params={qt=standard&q=solr} hits=0 status=0 QTime=0 
[junit4:junit4]   2> 2614 T280 C6 REQ [collection1] webapp=/solr path=/select params={qt=standard&q=solr} hits=0 status=0 QTime=0 
[junit4:junit4]   2> 2617 T278 C6 REQ [collection1] webapp=/solr path=/select params={qt=standard&q=solr} hits=0 status=0 QTime=0 
[junit4:junit4]   2> 2618 T266 oas.SolrTestCaseJ4.tearDown ###Ending testEtag
[junit4:junit4]   2> 2664 T266 oasc.CoreContainer.shutdown Shutting down CoreContainer instance=216082549
[junit4:junit4]   2> 2664 T266 oasc.SolrCore.close [collection1]  CLOSING SolrCore org.apache.solr.core.SolrCore@520073d7
[junit4:junit4]   2> 2665 T266 oasu.DirectUpdateHandler2.close closing DirectUpdateHandler2{commits=0,autocommits=0,soft autocommits=0,optimizes=0,rollbacks=0,expungeDeletes=0,docsPending=0,adds=0,deletesById=0,deletesByQuery=0,errors=0,cumulative_adds=0,cumulative_deletesById=0,cumulative_deletesByQuery=0,cumulative_errors=0}
[junit4:junit4]   2> 2665 T266 oasc.SolrCore.decrefSolrCoreState Closing SolrCoreState
[junit4:junit4]   2> 2665 T266 oasu.DefaultSolrCoreState.closeIndexWriter SolrCoreState ref count has reached 0 - closing IndexWriter
[junit4:junit4]   2> 2666 T266 oasu.DefaultSolrCoreState.closeIndexWriter closing IndexWriter with IndexWriterCloser
[junit4:junit4]   2> 2666 T266 oasc.SolrCore.closeSearcher [collection1] Closing main searcher on request.
[junit4:junit4]   2> 2667 T266 oejsh.ContextHandler.doStop stopped o.e.j.s.ServletContextHandler{/solr,null}
[junit4:junit4]   2> 2767 T266 oejut.QueuedThreadPool.doStop WARNING 4 threads could not be stopped
[junit4:junit4]   2> 2767 T266 oas.SolrTestCaseJ4.deleteCore ###deleteCore
[junit4:junit4]   2> 2771 T265 ccr.ThreadLeakControl.checkThreadLeaks WARNING Will linger awaiting termination of 4 leaked thread(s).
[junit4:junit4]   2> 22899 T265 ccr.ThreadLeakControl.checkThreadLeaks SEVERE 4 threads leaked from SUITE scope at org.apache.solr.servlet.NoCacheHeaderTest: 
[junit4:junit4]   2> 	   1) Thread[id=274, name=qtp2142072753-274 Acceptor1 SelectChannelConnector@0.0.0.0:58447, state=BLOCKED, group=TGRP-NoCacheHeaderTest]
[junit4:junit4]   2> 	        at sun.nio.ch.ServerSocketChannelImpl.accept(ServerSocketChannelImpl.java:210)
[junit4:junit4]   2> 	        at org.eclipse.jetty.server.nio.SelectChannelConnector.accept(SelectChannelConnector.java:104)
[junit4:junit4]   2> 	        at org.eclipse.jetty.server.AbstractConnector$Acceptor.run(AbstractConnector.java:933)
[junit4:junit4]   2> 	        at org.eclipse.jetty.util.thread.QueuedThreadPool.runJob(QueuedThreadPool.java:599)
[junit4:junit4]   2> 	        at org.eclipse.jetty.util.thread.QueuedThreadPool$3.run(QueuedThreadPool.java:534)
[junit4:junit4]   2> 	        at java.lang.Thread.run(Thread.java:722)
[junit4:junit4]   2> 	   2) Thread[id=275, name=qtp2142072753-275 Acceptor2 SelectChannelConnector@0.0.0.0:58447, state=BLOCKED, group=TGRP-NoCacheHeaderTest]
[junit4:junit4]   2> 	        at sun.nio.ch.ServerSocketChannelImpl.accept(ServerSocketChannelImpl.java:210)
[junit4:junit4]   2> 	        at org.eclipse.jetty.server.nio.SelectChannelConnector.accept(SelectChannelConnector.java:104)
[junit4:junit4]   2> 	        at org.eclipse.jetty.server.AbstractConnector$Acceptor.run(AbstractConnector.java:933)
[junit4:junit4]   2> 	        at org.eclipse.jetty.util.thread.QueuedThreadPool.runJob(QueuedThreadPool.java:599)
[junit4:junit4]   2> 	        at org.eclipse.jetty.util.thread.QueuedThreadPool$3.run(QueuedThreadPool.java:534)
[junit4:junit4]   2> 	        at java.lang.Thread.run(Thread.java:722)
[junit4:junit4]   2> 	   3) Thread[id=273, name=qtp2142072753-273 Acceptor0 SelectChannelConnector@0.0.0.0:58447, state=BLOCKED, group=TGRP-NoCacheHeaderTest]
[junit4:junit4]   2> 	        at sun.nio.ch.ServerSocketChannelImpl.accept(ServerSocketChannelImpl.java:210)
[junit4:junit4]   2> 	        at org.eclipse.jetty.server.nio.SelectChannelConnector.accept(SelectChannelConnector.java:104)
[junit4:junit4]   2> 	        at org.eclipse.jetty.server.AbstractConnector$Acceptor.run(AbstractConnector.java:933)
[junit4:junit4]   2> 	        at org.eclipse.jetty.util.thread.QueuedThreadPool.runJob(QueuedThreadPool.java:599)
[junit4:junit4]   2> 	        at org.eclipse.jetty.util.thread.QueuedThreadPool$3.run(QueuedThreadPool.java:534)
[junit4:junit4]   2> 	        at java.lang.Thread.run(Thread.java:722)
[junit4:junit4]   2> 	   4) Thread[id=276, name=qtp2142072753-276 Acceptor3 SelectChannelConnector@0.0.0.0:58447, state=RUNNABLE, group=TGRP-NoCacheHeaderTest]
[junit4:junit4]   2> 	        at sun.nio.ch.ServerSocketChannelImpl.accept0(Native Method)
[junit4:junit4]   2> 	        at sun.nio.ch.ServerSocketChannelImpl.accept(ServerSocketChannelImpl.java:226)
[junit4:junit4]   2> 	        at org.eclipse.jetty.server.nio.SelectChannelConnector.accept(SelectChannelConnector.java:104)
[junit4:junit4]   2> 	        at org.eclipse.jetty.server.AbstractConnector$Acceptor.run(AbstractConnector.java:933)
[junit4:junit4]   2> 	        at org.eclipse.jetty.util.thread.QueuedThreadPool.runJob(QueuedThreadPool.java:599)
[junit4:junit4]   2> 	        at org.eclipse.jetty.util.thread.QueuedThreadPool$3.run(QueuedThreadPool.java:534)
[junit4:junit4]   2> 	        at java.lang.Thread.run(Thread.java:722)
[junit4:junit4]   2> 22900 T265 ccr.ThreadLeakControl.tryToInterruptAll Starting to interrupt leaked threads:
[junit4:junit4]   2> 	   1) Thread[id=274, name=qtp2142072753-274 Acceptor1 SelectChannelConnector@0.0.0.0:58447, state=BLOCKED, group=TGRP-NoCacheHeaderTest]
[junit4:junit4]   2> 	   2) Thread[id=275, name=qtp2142072753-275 Acceptor2 SelectChannelConnector@0.0.0.0:58447, state=BLOCKED, group=TGRP-NoCacheHeaderTest]
[junit4:junit4]   2> 	   3) Thread[id=273, name=qtp2142072753-273 Acceptor0 SelectChannelConnector@0.0.0.0:58447, state=BLOCKED, group=TGRP-NoCacheHeaderTest]
[junit4:junit4]   2> 	   4) Thread[id=276, name=qtp2142072753-276 Acceptor3 SelectChannelConnector@0.0.0.0:58447, state=RUNNABLE, group=TGRP-NoCacheHeaderTest]
[junit4:junit4]   2> 25943 T265 ccr.ThreadLeakControl.tryToInterruptAll SEVERE There are still zombie threads that couldn't be terminated:
[junit4:junit4]   2> 	   1) Thread[id=274, name=qtp2142072753-274 Acceptor1 SelectChannelConnector@0.0.0.0:58447, state=BLOCKED, group=TGRP-NoCacheHeaderTest]
[junit4:junit4]   2> 	        at sun.nio.ch.ServerSocketChannelImpl.accept(ServerSocketChannelImpl.java:210)
[junit4:junit4]   2> 	        at org.eclipse.jetty.server.nio.SelectChannelConnector.accept(SelectChannelConnector.java:104)
[junit4:junit4]   2> 	        at org.eclipse.jetty.server.AbstractConnector$Acceptor.run(AbstractConnector.java:933)
[junit4:junit4]   2> 	        at org.eclipse.jetty.util.thread.QueuedThreadPool.runJob(QueuedThreadPool.java:599)
[junit4:junit4]   2> 	        at org.eclipse.jetty.util.thread.QueuedThreadPool$3.run(QueuedThreadPool.java:534)
[junit4:junit4]   2> 	        at java.lang.Thread.run(Thread.java:722)
[junit4:junit4]   2> 	   2) Thread[id=275, name=qtp2142072753-275 Acceptor2 SelectChannelConnector@0.0.0.0:58447, state=BLOCKED, group=TGRP-NoCacheHeaderTest]
[junit4:junit4]   2> 	        at sun.nio.ch.ServerSocketChannelImpl.accept(ServerSocketChannelImpl.java:210)
[junit4:junit4]   2> 	        at org.eclipse.jetty.server.nio.SelectChannelConnector.accept(SelectChannelConnector.java:104)
[junit4:junit4]   2> 	        at org.eclipse.jetty.server.AbstractConnector$Acceptor.run(AbstractConnector.java:933)
[junit4:junit4]   2> 	        at org.eclipse.jetty.util.thread.QueuedThreadPool.runJob(QueuedThreadPool.java:599)
[junit4:junit4]   2> 	        at org.eclipse.jetty.util.thread.QueuedThreadPool$3.run(QueuedThreadPool.java:534)
[junit4:junit4]   2> 	        at java.lang.Thread.run(Thread.java:722)
[junit4:junit4]   2> 	   3) Thread[id=273, name=qtp2142072753-273 Acceptor0 SelectChannelConnector@0.0.0.0:58447, state=BLOCKED, group=TGRP-NoCacheHeaderTest]
[junit4:junit4]   2> 	        at sun.nio.ch.ServerSocketChannelImpl.accept(ServerSocketChannelImpl.java:210)
[junit4:junit4]   2> 	        at org.eclipse.jetty.server.nio.SelectChannelConnector.accept(SelectChannelConnector.java:104)
[junit4:junit4]   2> 	        at org.eclipse.jetty.server.AbstractConnector$Acceptor.run(AbstractConnector.java:933)
[junit4:junit4]   2> 	        at org.eclipse.jetty.util.thread.QueuedThreadPool.runJob(QueuedThreadPool.java:599)
[junit4:junit4]   2> 	        at org.eclipse.jetty.util.thread.QueuedThreadPool$3.run(QueuedThreadPool.java:534)
[junit4:junit4]   2> 	        at java.lang.Thread.run(Thread.java:722)
[junit4:junit4]   2> 	   4) Thread[id=276, name=qtp2142072753-276 Acceptor3 SelectChannelConnector@0.0.0.0:58447, state=RUNNABLE, group=TGRP-NoCacheHeaderTest]
[junit4:junit4]   2> 	        at sun.nio.ch.ServerSocketChannelImpl.accept0(Native Method)
[junit4:junit4]   2> 	        at sun.nio.ch.ServerSocketChannelImpl.accept(ServerSocketChannelImpl.java:226)
[junit4:junit4]   2> 	        at org.eclipse.jetty.server.nio.SelectChannelConnector.accept(SelectChannelConnector.java:104)
[junit4:junit4]   2> 	        at org.eclipse.jetty.server.AbstractConnector$Acceptor.run(AbstractConnector.java:933)
[junit4:junit4]   2> 	        at org.eclipse.jetty.util.thread.QueuedThreadPool.runJob(QueuedThreadPool.java:599)
[junit4:junit4]   2> 	        at org.eclipse.jetty.util.thread.QueuedThreadPool$3.run(QueuedThreadPool.java:534)
[junit4:junit4]   2> 	        at java.lang.Thread.run(Thread.java:722)
[junit4:junit4]   2> NOTE: test params are: codec=Lucene41: {}, sim=DefaultSimilarity, locale=es_NI, timezone=Africa/Nairobi
[junit4:junit4]   2> NOTE: FreeBSD 9.0-RELEASE amd64/Oracle Corporation 1.7.0_06 (64-bit)/cpus=16,threads=5,free=96118160,total=142606336
[junit4:junit4]   2> NOTE: All tests run in this JVM: [MinimalSchemaTest, TestPerFieldSimilarity, TestRandomFaceting, TestLMJelinekMercerSimilarityFactory, TestPHPSerializedResponseWriter, TestNumberUtils, CSVRequestHandlerTest, FileBasedSpellCheckerTest, WordBreakSolrSpellCheckerTest, TestConfig, BadComponentTest, TestXIncludeConfig, TestBadConfig, TestQuerySenderNoQuery, SimplePostToolTest, SpatialFilterTest, TestLuceneMatchVersion, TestRangeQuery, DirectUpdateHandlerOptimizeTest, NoCacheHeaderTest]
[junit4:junit4]   2> NOTE: reproduce with: ant test  -Dtestcase=NoCacheHeaderTest -Dtests.seed=474DCF77A80DB23F -Dtests.multiplier=3 -Dtests.slow=true -Dtests.locale=es_NI -Dtests.timezone=Africa/Nairobi -Dtests.file.encoding=US-ASCII
[junit4:junit4] ERROR   0.00s J0 | NoCacheHeaderTest (suite) <<<
[junit4:junit4]    > Throwable #1: com.carrotsearch.randomizedtesting.ThreadLeakError: 4 threads leaked from SUITE scope at org.apache.solr.servlet.NoCacheHeaderTest: 
[junit4:junit4]    >    1) Thread[id=274, name=qtp2142072753-274 Acceptor1 SelectChannelConnector@0.0.0.0:58447, state=BLOCKED, group=TGRP-NoCacheHeaderTest]
[junit4:junit4]    >         at sun.nio.ch.ServerSocketChannelImpl.accept(ServerSocketChannelImpl.java:210)
[junit4:junit4]    >         at org.eclipse.jetty.server.nio.SelectChannelConnector.accept(SelectChannelConnector.java:104)
[junit4:junit4]    >         at org.eclipse.jetty.server.AbstractConnector$Acceptor.run(AbstractConnector.java:933)
[junit4:junit4]    >         at org.eclipse.jetty.util.thread.QueuedThreadPool.runJob(QueuedThreadPool.java:599)
[junit4:junit4]    >         at org.eclipse.jetty.util.thread.QueuedThreadPool$3.run(QueuedThreadPool.java:534)
[junit4:junit4]    >         at java.lang.Thread.run(Thread.java:722)
[junit4:junit4]    >    2) Thread[id=275, name=qtp2142072753-275 Acceptor2 SelectChannelConnector@0.0.0.0:58447, state=BLOCKED, group=TGRP-NoCacheHeaderTest]
[junit4:junit4]    >         at sun.nio.ch.ServerSocketChannelImpl.accept(ServerSocketChannelImpl.java:210)
[junit4:junit4]    >         at org.eclipse.jetty.server.nio.SelectChannelConnector.accept(SelectChannelConnector.java:104)
[junit4:junit4]    >         at org.eclipse.jetty.server.AbstractConnector$Acceptor.run(AbstractConnector.java:933)
[junit4:junit4]    >         at org.eclipse.jetty.util.thread.QueuedThreadPool.runJob(QueuedThreadPool.java:599)
[junit4:junit4]    >         at org.eclipse.jetty.util.thread.QueuedThreadPool$3.run(QueuedThreadPool.java:534)
[junit4:junit4]    >         at java.lang.Thread.run(Thread.java:722)
[junit4:junit4]    >    3) Thread[id=273, name=qtp2142072753-273 Acceptor0 SelectChannelConnector@0.0.0.0:58447, state=BLOCKED, group=TGRP-NoCacheHeaderTest]
[junit4:junit4]    >         at sun.nio.ch.ServerSocketChannelImpl.accept(ServerSocketChannelImpl.java:210)
[junit4:junit4]    >         at org.eclipse.jetty.server.nio.SelectChannelConnector.accept(SelectChannelConnector.java:104)
[junit4:junit4]    >         at org.eclipse.jetty.server.AbstractConnector$Acceptor.run(AbstractConnector.java:933)
[junit4:junit4]    >         at org.eclipse.jetty.util.thread.QueuedThreadPool.runJob(QueuedThreadPool.java:599)
[junit4:junit4]    >         at org.eclipse.jetty.util.thread.QueuedThreadPool$3.run(QueuedThreadPool.java:534)
[junit4:junit4]    >         at java.lang.Thread.run(Thread.java:722)
[junit4:junit4]    >    4) Thread[id=276, name=qtp2142072753-276 Acceptor3 SelectChannelConnector@0.0.0.0:58447, state=RUNNABLE, group=TGRP-NoCacheHeaderTest]
[junit4:junit4]    >         at sun.nio.ch.ServerSocketChannelImpl.accept0(Native Method)
[junit4:junit4]    >         at sun.nio.ch.ServerSocketChannelImpl.accept(ServerSocketChannelImpl.java:226)
[junit4:junit4]    >         at org.eclipse.jetty.server.nio.SelectChannelConnector.accept(SelectChannelConnector.java:104)
[junit4:junit4]    >         at org.eclipse.jetty.server.AbstractConnector$Acceptor.run(AbstractConnector.java:933)
[junit4:junit4]    >         at org.eclipse.jetty.util.thread.QueuedThreadPool.runJob(QueuedThreadPool.java:599)
[junit4:junit4]    >         at org.eclipse.jetty.util.thread.QueuedThreadPool$3.run(QueuedThreadPool.java:534)
[junit4:junit4]    >         at java.lang.Thread.run(Thread.java:722)
[junit4:junit4]    > 	at __randomizedtesting.SeedInfo.seed([474DCF77A80DB23F]:0)
[junit4:junit4]    > Throwable #2: com.carrotsearch.randomizedtesting.ThreadLeakError: There are still zombie threads that couldn't be terminated:
[junit4:junit4]    >    1) Thread[id=274, name=qtp2142072753-274 Acceptor1 SelectChannelConnector@0.0.0.0:58447, state=BLOCKED, group=TGRP-NoCacheHeaderTest]
[junit4:junit4]    >         at sun.nio.ch.ServerSocketChannelImpl.accept(ServerSocketChannelImpl.java:210)
[junit4:junit4]    >         at org.eclipse.jetty.server.nio.SelectChannelConnector.accept(SelectChannelConnector.java:104)
[junit4:junit4]    >         at org.eclipse.jetty.server.AbstractConnector$Acceptor.run(AbstractConnector.java:933)
[junit4:junit4]    >         at org.eclipse.jetty.util.thread.QueuedThreadPool.runJob(QueuedThreadPool.java:599)
[junit4:junit4]    >         at org.eclipse.jetty.util.thread.QueuedThreadPool$3.run(QueuedThreadPool.java:534)
[junit4:junit4]    >         at java.lang.Thread.run(Thread.java:722)
[junit4:junit4]    >    2) Thread[id=275, name=qtp2142072753-275 Acceptor2 SelectChannelConnector@0.0.0.0:58447, state=BLOCKED, group=TGRP-NoCacheHeaderTest]
[junit4:junit4]    >         at sun.nio.ch.ServerSocketChannelImpl.accept(ServerSocketChannelImpl.java:210)
[junit4:junit4]    >         at org.eclipse.jetty.server.nio.SelectChannelConnector.accept(SelectChannelConnector.java:104)
[junit4:junit4]    >         at org.eclipse.jetty.server.AbstractConnector$Acceptor.run(AbstractConnector.java:933)
[junit4:junit4]    >         at org.eclipse.jetty.util.thread.QueuedThreadPool.runJob(QueuedThreadPool.java:599)
[junit4:junit4]    >         at org.eclipse.jetty.util.thread.QueuedThreadPool$3.run(QueuedThreadPool.java:534)
[junit4:junit4]    >         at java.lang.Thread.run(Thread.java:722)
[junit4:junit4]    >    3) Thread[id=273, name=qtp2142072753-273 Acceptor0 SelectChannelConnector@0.0.0.0:58447, state=BLOCKED, group=TGRP-NoCacheHeaderTest]
[junit4:junit4]    >         at sun.nio.ch.ServerSocketChannelImpl.accept(ServerSocketChannelImpl.java:210)
[junit4:junit4]    >         at org.eclipse.jetty.server.nio.SelectChannelConnector.accept(SelectChannelConnector.java:104)
[junit4:junit4]    >         at org.eclipse.jetty.server.AbstractConnector$Acceptor.run(AbstractConnector.java:933)
[junit4:junit4]    >         at org.eclipse.jetty.util.thread.QueuedThreadPool.runJob(QueuedThreadPool.java:599)
[junit4:junit4]    >         at org.eclipse.jetty.util.thread.QueuedThreadPool$3.run(QueuedThreadPool.java:534)
[junit4:junit4]    >         at java.lang.Thread.run(Thread.java:722)
[junit4:junit4]    >    4) Thread[id=276, name=qtp2142072753-276 Acceptor3 SelectChannelConnector@0.0.0.0:58447, state=RUNNABLE, group=TGRP-NoCacheHeaderTest]
[junit4:junit4]    >         at sun.nio.ch.ServerSocketChannelImpl.accept0(Native Method)
[junit4:junit4]    >         at sun.nio.ch.ServerSocketChannelImpl.accept(ServerSocketChannelImpl.java:226)
[junit4:junit4]    >         at org.eclipse.jetty.server.nio.SelectChannelConnector.accept(SelectChannelConnector.java:104)
[junit4:junit4]    >         at org.eclipse.jetty.server.AbstractConnector$Acceptor.run(AbstractConnector.java:933)
[junit4:junit4]    >         at org.eclipse.jetty.util.thread.QueuedThreadPool.runJob(QueuedThreadPool.java:599)
[junit4:junit4]    >         at org.eclipse.jetty.util.thread.QueuedThreadPool$3.run(QueuedThreadPool.java:534)
[junit4:junit4]    >         at java.lang.Thread.run(Thread.java:722)
[junit4:junit4]    > 	at __randomizedtesting.SeedInfo.seed([474DCF77A80DB23F]:0)
[junit4:junit4] Completed on J0 in 26.00s, 3 tests, 2 errors <<< FAILURES!

[...truncated 119 lines...]
BUILD FAILED
/usr/home/hudson/hudson-slave/workspace/Lucene-Solr-Tests-trunk-java7/build.xml:335: The following error occurred while executing this line:
/usr/home/hudson/hudson-slave/workspace/Lucene-Solr-Tests-trunk-java7/build.xml:39: The following error occurred while executing this line:
/usr/home/hudson/hudson-slave/workspace/Lucene-Solr-Tests-trunk-java7/solr/build.xml:178: The following error occurred while executing this line:
/usr/home/hudson/hudson-slave/workspace/Lucene-Solr-Tests-trunk-java7/lucene/module-build.xml:61: The following error occurred while executing this line:
/usr/home/hudson/hudson-slave/workspace/Lucene-Solr-Tests-trunk-java7/lucene/common-build.xml:1171: The following error occurred while executing this line:
/usr/home/hudson/hudson-slave/workspace/Lucene-Solr-Tests-trunk-java7/lucene/common-build.xml:839: There were test failures: 232 suites, 961 tests, 4 suite-level errors, 808 ignored (2 assumptions)

Total time: 19 minutes 59 seconds
Build step 'Invoke Ant' marked build as failure
Archiving artifacts
Recording test results
Email was triggered for: Failure
Sending email for trigger: Failure



Mime
View raw message