lucene-dev mailing list archives

Site index · List index
Message view « Date » · « Thread »
Top « Date » · « Thread »
From Apache Jenkins Server <jenk...@builds.apache.org>
Subject [JENKINS] Lucene-Solr-Tests-4.x-java7 - Build # 538 - Failure
Date Thu, 11 Oct 2012 14:48:15 GMT
Build: https://builds.apache.org/job/Lucene-Solr-Tests-4.x-java7/538/

1 tests failed.
REGRESSION:  org.apache.solr.cloud.BasicDistributedZkTest.testDistribSearch

Error Message:
some core start times did not change on reload

Stack Trace:
java.lang.AssertionError: some core start times did not change on reload
	at __randomizedtesting.SeedInfo.seed([C3264DB7ABB9D8A6:42C0C3AFDCE6B89A]:0)
	at org.junit.Assert.fail(Assert.java:93)
	at org.junit.Assert.assertTrue(Assert.java:43)
	at org.apache.solr.cloud.BasicDistributedZkTest.testCollectionsAPI(BasicDistributedZkTest.java:442)
	at org.apache.solr.cloud.BasicDistributedZkTest.doTest(BasicDistributedZkTest.java:331)
	at org.apache.solr.BaseDistributedSearchTestCase.testDistribSearch(BaseDistributedSearchTestCase.java:695)
	at sun.reflect.NativeMethodAccessorImpl.invoke0(Native Method)
	at sun.reflect.NativeMethodAccessorImpl.invoke(NativeMethodAccessorImpl.java:57)
	at sun.reflect.DelegatingMethodAccessorImpl.invoke(DelegatingMethodAccessorImpl.java:43)
	at java.lang.reflect.Method.invoke(Method.java:601)
	at com.carrotsearch.randomizedtesting.RandomizedRunner.invoke(RandomizedRunner.java:1559)
	at com.carrotsearch.randomizedtesting.RandomizedRunner.access$600(RandomizedRunner.java:79)
	at com.carrotsearch.randomizedtesting.RandomizedRunner$6.evaluate(RandomizedRunner.java:737)
	at com.carrotsearch.randomizedtesting.RandomizedRunner$7.evaluate(RandomizedRunner.java:773)
	at com.carrotsearch.randomizedtesting.RandomizedRunner$8.evaluate(RandomizedRunner.java:787)
	at com.carrotsearch.randomizedtesting.rules.SystemPropertiesRestoreRule$1.evaluate(SystemPropertiesRestoreRule.java:53)
	at org.apache.lucene.util.TestRuleSetupTeardownChained$1.evaluate(TestRuleSetupTeardownChained.java:50)
	at org.apache.lucene.util.TestRuleFieldCacheSanity$1.evaluate(TestRuleFieldCacheSanity.java:51)
	at org.apache.lucene.util.AbstractBeforeAfterRule$1.evaluate(AbstractBeforeAfterRule.java:45)
	at com.carrotsearch.randomizedtesting.rules.SystemPropertiesInvariantRule$1.evaluate(SystemPropertiesInvariantRule.java:55)
	at org.apache.lucene.util.TestRuleThreadAndTestName$1.evaluate(TestRuleThreadAndTestName.java:48)
	at org.apache.lucene.util.TestRuleIgnoreAfterMaxFailures$1.evaluate(TestRuleIgnoreAfterMaxFailures.java:70)
	at org.apache.lucene.util.TestRuleMarkFailure$1.evaluate(TestRuleMarkFailure.java:48)
	at com.carrotsearch.randomizedtesting.rules.StatementAdapter.evaluate(StatementAdapter.java:36)
	at com.carrotsearch.randomizedtesting.ThreadLeakControl$StatementRunner.run(ThreadLeakControl.java:358)
	at com.carrotsearch.randomizedtesting.ThreadLeakControl.forkTimeoutingTask(ThreadLeakControl.java:782)
	at com.carrotsearch.randomizedtesting.ThreadLeakControl$3.evaluate(ThreadLeakControl.java:442)
	at com.carrotsearch.randomizedtesting.RandomizedRunner.runSingleTest(RandomizedRunner.java:746)
	at com.carrotsearch.randomizedtesting.RandomizedRunner$3.evaluate(RandomizedRunner.java:648)
	at com.carrotsearch.randomizedtesting.RandomizedRunner$4.evaluate(RandomizedRunner.java:682)
	at com.carrotsearch.randomizedtesting.RandomizedRunner$5.evaluate(RandomizedRunner.java:693)
	at com.carrotsearch.randomizedtesting.rules.StatementAdapter.evaluate(StatementAdapter.java:36)
	at com.carrotsearch.randomizedtesting.rules.SystemPropertiesRestoreRule$1.evaluate(SystemPropertiesRestoreRule.java:53)
	at org.apache.lucene.util.AbstractBeforeAfterRule$1.evaluate(AbstractBeforeAfterRule.java:45)
	at org.apache.lucene.util.TestRuleStoreClassName$1.evaluate(TestRuleStoreClassName.java:42)
	at com.carrotsearch.randomizedtesting.rules.SystemPropertiesInvariantRule$1.evaluate(SystemPropertiesInvariantRule.java:55)
	at com.carrotsearch.randomizedtesting.rules.NoShadowingOrOverridesOnMethodsRule$1.evaluate(NoShadowingOrOverridesOnMethodsRule.java:39)
	at com.carrotsearch.randomizedtesting.rules.NoShadowingOrOverridesOnMethodsRule$1.evaluate(NoShadowingOrOverridesOnMethodsRule.java:39)
	at com.carrotsearch.randomizedtesting.rules.StatementAdapter.evaluate(StatementAdapter.java:36)
	at org.apache.lucene.util.TestRuleAssertionsRequired$1.evaluate(TestRuleAssertionsRequired.java:43)
	at org.apache.lucene.util.TestRuleMarkFailure$1.evaluate(TestRuleMarkFailure.java:48)
	at org.apache.lucene.util.TestRuleIgnoreAfterMaxFailures$1.evaluate(TestRuleIgnoreAfterMaxFailures.java:70)
	at org.apache.lucene.util.TestRuleIgnoreTestSuites$1.evaluate(TestRuleIgnoreTestSuites.java:55)
	at com.carrotsearch.randomizedtesting.rules.StatementAdapter.evaluate(StatementAdapter.java:36)
	at com.carrotsearch.randomizedtesting.ThreadLeakControl$StatementRunner.run(ThreadLeakControl.java:358)
	at java.lang.Thread.run(Thread.java:722)




Build Log:
[...truncated 8663 lines...]
[junit4:junit4] Suite: org.apache.solr.cloud.BasicDistributedZkTest
[junit4:junit4]   2> 4 T582 oas.SolrTestCaseJ4.setUp ###Starting testDistribSearch
[junit4:junit4]   2> Creating dataDir: /usr/home/hudson/hudson-slave/workspace/Lucene-Solr-Tests-4.x-java7/solr/build/solr-core/test/J0/./solrtest-BasicDistributedZkTest-1349966056692
[junit4:junit4]   2> 11 T582 oasc.ZkTestServer.run STARTING ZK TEST SERVER
[junit4:junit4]   2> 130 T583 oaz.Environment.logEnv Server environment:zookeeper.version=3.3.6-1366786, built on 07/29/2012 06:22 GMT
[junit4:junit4]   2> 131 T583 oaz.Environment.logEnv Server environment:host.name=lucene.zones.apache.org
[junit4:junit4]   2> 131 T583 oaz.Environment.logEnv Server environment:java.version=1.7.0_06
[junit4:junit4]   2> 131 T583 oaz.Environment.logEnv Server environment:java.vendor=Oracle Corporation
[junit4:junit4]   2> 131 T583 oaz.Environment.logEnv Server environment:java.home=/usr/local/openjdk7/jre
[junit4:junit4]   2> 131 T583 oaz.Environment.logEnv Server environment:java.class.path=/usr/home/hudson/hudson-slave/workspace/Lucene-Solr-Tests-4.x-java7/solr/build/solr-core/classes/test:/usr/home/hudson/hudson-slave/workspace/Lucene-Solr-Tests-4.x-java7/solr/build/solr-test-framework/classes/java:/usr/home/hudson/hudson-slave/workspace/Lucene-Solr-Tests-4.x-java7/solr/build/solr-core/test-files:/usr/home/hudson/hudson-slave/workspace/Lucene-Solr-Tests-4.x-java7/lucene/build/test-framework/classes/java:/usr/home/hudson/hudson-slave/workspace/Lucene-Solr-Tests-4.x-java7/lucene/build/codecs/classes/java:/usr/home/hudson/hudson-slave/workspace/Lucene-Solr-Tests-4.x-java7/solr/build/solr-solrj/classes/java:/usr/home/hudson/hudson-slave/workspace/Lucene-Solr-Tests-4.x-java7/solr/build/solr-core/classes/java:/usr/home/hudson/hudson-slave/workspace/Lucene-Solr-Tests-4.x-java7/lucene/build/analysis/common/lucene-analyzers-common-4.1-SNAPSHOT.jar:/usr/home/hudson/hudson-slave/workspace/Lucene-Solr-Tests-4.x-java7/lucene/build/analysis/kuromoji/lucene-analyzers-kuromoji-4.1-SNAPSHOT.jar:/usr/home/hudson/hudson-slave/workspace/Lucene-Solr-Tests-4.x-java7/lucene/build/analysis/phonetic/lucene-analyzers-phonetic-4.1-SNAPSHOT.jar:/usr/home/hudson/hudson-slave/workspace/Lucene-Solr-Tests-4.x-java7/lucene/build/highlighter/lucene-highlighter-4.1-SNAPSHOT.jar:/usr/home/hudson/hudson-slave/workspace/Lucene-Solr-Tests-4.x-java7/lucene/build/memory/lucene-memory-4.1-SNAPSHOT.jar:/usr/home/hudson/hudson-slave/workspace/Lucene-Solr-Tests-4.x-java7/lucene/build/misc/lucene-misc-4.1-SNAPSHOT.jar:/usr/home/hudson/hudson-slave/workspace/Lucene-Solr-Tests-4.x-java7/lucene/build/spatial/lucene-spatial-4.1-SNAPSHOT.jar:/usr/home/hudson/hudson-slave/workspace/Lucene-Solr-Tests-4.x-java7/lucene/build/suggest/lucene-suggest-4.1-SNAPSHOT.jar:/usr/home/hudson/hudson-slave/workspace/Lucene-Solr-Tests-4.x-java7/lucene/build/grouping/lucene-grouping-4.1-SNAPSHOT.jar:/usr/home/hudson/hudson-slave/workspace/Lucene-Solr-Tests-4.x-java7/lucene/build/queries/lucene-queries-4.1-SNAPSHOT.jar:/usr/home/hudson/hudson-slave/workspace/Lucene-Solr-Tests-4.x-java7/lucene/build/queryparser/lucene-queryparser-4.1-SNAPSHOT.jar:/usr/home/hudson/hudson-slave/workspace/Lucene-Solr-Tests-4.x-java7/solr/core/lib/commons-cli-1.2.jar:/usr/home/hudson/hudson-slave/workspace/Lucene-Solr-Tests-4.x-java7/solr/core/lib/commons-codec-1.7.jar:/usr/home/hudson/hudson-slave/workspace/Lucene-Solr-Tests-4.x-java7/solr/core/lib/commons-fileupload-1.2.1.jar:/usr/home/hudson/hudson-slave/workspace/Lucene-Solr-Tests-4.x-java7/solr/core/lib/commons-lang-2.6.jar:/usr/home/hudson/hudson-slave/workspace/Lucene-Solr-Tests-4.x-java7/solr/core/lib/easymock-2.2.jar:/usr/home/hudson/hudson-slave/workspace/Lucene-Solr-Tests-4.x-java7/solr/core/lib/guava-r05.jar:/usr/home/hudson/hudson-slave/workspace/Lucene-Solr-Tests-4.x-java7/solr/core/lib/javax.servlet-api-3.0.1.jar:/usr/home/hudson/hudson-slave/workspace/Lucene-Solr-Tests-4.x-java7/solr/core/lib/spatial4j-0.3.jar:/usr/home/hudson/hudson-slave/workspace/Lucene-Solr-Tests-4.x-java7/solr/solrj/lib/commons-io-2.1.jar:/usr/home/hudson/hudson-slave/workspace/Lucene-Solr-Tests-4.x-java7/solr/solrj/lib/httpclient-4.1.3.jar:/usr/home/hudson/hudson-slave/workspace/Lucene-Solr-Tests-4.x-java7/solr/solrj/lib/httpcore-4.1.4.jar:/usr/home/hudson/hudson-slave/workspace/Lucene-Solr-Tests-4.x-java7/solr/solrj/lib/httpmime-4.1.3.jar:/usr/home/hudson/hudson-slave/workspace/Lucene-Solr-Tests-4.x-java7/solr/solrj/lib/jcl-over-slf4j-1.6.4.jar:/usr/home/hudson/hudson-slave/workspace/Lucene-Solr-Tests-4.x-java7/solr/solrj/lib/log4j-over-slf4j-1.6.4.jar:/usr/home/hudson/hudson-slave/workspace/Lucene-Solr-Tests-4.x-java7/solr/solrj/lib/slf4j-api-1.6.4.jar:/usr/home/hudson/hudson-slave/workspace/Lucene-Solr-Tests-4.x-java7/solr/solrj/lib/slf4j-jdk14-1.6.4.jar:/usr/home/hudson/hudson-slave/workspace/Lucene-Solr-Tests-4.x-java7/solr/solrj/lib/wstx-asl-3.2.7.jar:/usr/home/hudson/hudson-slave/workspace/Lucene-Solr-Tests-4.x-java7/solr/solrj/lib/zookeeper-3.3.6.jar:/usr/home/hudson/hudson-slave/workspace/Lucene-Solr-Tests-4.x-java7/solr/example/lib/jetty-continuation-8.1.2.v20120308.jar:/usr/home/hudson/hudson-slave/workspace/Lucene-Solr-Tests-4.x-java7/solr/example/lib/jetty-deploy-8.1.2.v20120308.jar:/usr/home/hudson/hudson-slave/workspace/Lucene-Solr-Tests-4.x-java7/solr/example/lib/jetty-http-8.1.2.v20120308.jar:/usr/home/hudson/hudson-slave/workspace/Lucene-Solr-Tests-4.x-java7/solr/example/lib/jetty-io-8.1.2.v20120308.jar:/usr/home/hudson/hudson-slave/workspace/Lucene-Solr-Tests-4.x-java7/solr/example/lib/jetty-jmx-8.1.2.v20120308.jar:/usr/home/hudson/hudson-slave/workspace/Lucene-Solr-Tests-4.x-java7/solr/example/lib/jetty-security-8.1.2.v20120308.jar:/usr/home/hudson/hudson-slave/workspace/Lucene-Solr-Tests-4.x-java7/solr/example/lib/jetty-server-8.1.2.v20120308.jar:/usr/home/hudson/hudson-slave/workspace/Lucene-Solr-Tests-4.x-java7/solr/example/lib/jetty-servlet-8.1.2.v20120308.jar:/usr/home/hudson/hudson-slave/workspace/Lucene-Solr-Tests-4.x-java7/solr/example/lib/jetty-util-8.1.2.v20120308.jar:/usr/home/hudson/hudson-slave/workspace/Lucene-Solr-Tests-4.x-java7/solr/example/lib/jetty-webapp-8.1.2.v20120308.jar:/usr/home/hudson/hudson-slave/workspace/Lucene-Solr-Tests-4.x-java7/solr/example/lib/jetty-xml-8.1.2.v20120308.jar:/usr/home/hudson/hudson-slave/workspace/Lucene-Solr-Tests-4.x-java7/solr/example/lib/servlet-api-3.0.jar:/usr/home/hudson/hudson-slave/workspace/Lucene-Solr-Tests-4.x-java7/solr/example/example-DIH/solr/db/lib/hsqldb-1.8.0.10.jar:/usr/home/hudson/hudson-slave/workspace/Lucene-Solr-Tests-4.x-java7/lucene/build/core/classes/java:/usr/home/hudson/hudson-slave/workspace/Lucene-Solr-Tests-4.x-java7/lucene/test-framework/lib/junit-4.10.jar:/usr/home/hudson/hudson-slave/workspace/Lucene-Solr-Tests-4.x-java7/lucene/test-framework/lib/randomizedtesting-runner-2.0.3.jar:/home/hudson/hudson-slave/tools/Ant/ant-1.8.2/lib/ant-launcher.jar:/home/hudson/.ant/lib/ivy-2.2.0.jar:/home/hudson/hudson-slave/tools/Ant/ant-1.8.2/lib/ant-apache-regexp.jar:/home/hudson/hudson-slave/tools/Ant/ant-1.8.2/lib/ant-junit.jar:/home/hudson/hudson-slave/tools/Ant/ant-1.8.2/lib/ant-apache-bsf.jar:/home/hudson/hudson-slave/tools/Ant/ant-1.8.2/lib/ant-commons-net.jar:/home/hudson/hudson-slave/tools/Ant/ant-1.8.2/lib/ant-antlr.jar:/home/hudson/hudson-slave/tools/Ant/ant-1.8.2/lib/ant-apache-log4j.jar:/home/hudson/hudson-slave/tools/Ant/ant-1.8.2/lib/ant-commons-logging.jar:/home/hudson/hudson-slave/tools/Ant/ant-1.8.2/lib/ant-apache-xalan2.jar:/home/hudson/hudson-slave/tools/Ant/ant-1.8.2/lib/ant-apache-oro.jar:/home/hudson/hudson-slave/tools/Ant/ant-1.8.2/lib/ant-junit4.jar:/home/hudson/hudson-slave/tools/Ant/ant-1.8.2/lib/ant-netrexx.jar:/home/hudson/hudson-slave/tools/Ant/ant-1.8.2/lib/ant-swing.jar:/home/hudson/hudson-slave/tools/Ant/ant-1.8.2/lib/ant-javamail.jar:/home/hudson/hudson-slave/tools/Ant/ant-1.8.2/lib/ant-jsch.jar:/home/hudson/hudson-slave/tools/Ant/ant-1.8.2/lib/ant-jmf.jar:/home/hudson/hudson-slave/tools/Ant/ant-1.8.2/lib/ant.jar:/home/hudson/hudson-slave/tools/Ant/ant-1.8.2/lib/ant-apache-bcel.jar:/home/hudson/hudson-slave/tools/Ant/ant-1.8.2/lib/ant-jai.jar:/home/hudson/hudson-slave/tools/Ant/ant-1.8.2/lib/ant-testutil.jar:/home/hudson/hudson-slave/tools/Ant/ant-1.8.2/lib/ant-apache-resolver.jar:/home/hudson/hudson-slave/tools/Ant/ant-1.8.2/lib/ant-jdepend.jar:/usr/local/openjdk7/lib/tools.jar:/home/hudson/.ivy2/cache/com.carrotsearch.randomizedtesting/junit4-ant/jars/junit4-ant-2.0.3.jar
[junit4:junit4]   2> 133 T583 oaz.Environment.logEnv Server environment:java.library.path=/usr/local/openjdk7/jre/lib/amd64/server:/usr/local/openjdk7/jre/lib/amd64:/usr/local/openjdk7/jre/../lib/amd64:/usr/local/openjdk6/jre/lib/amd64/server:/usr/local/openjdk6/jre/lib/amd64:/usr/local/openjdk6/jre/../lib/amd64:/usr/java/packages/lib/amd64:/lib:/usr/lib:/usr/local/lib
[junit4:junit4]   2> 133 T583 oaz.Environment.logEnv Server environment:java.io.tmpdir=.
[junit4:junit4]   2> 133 T583 oaz.Environment.logEnv Server environment:java.compiler=<NA>
[junit4:junit4]   2> 133 T583 oaz.Environment.logEnv Server environment:os.name=FreeBSD
[junit4:junit4]   2> 133 T583 oaz.Environment.logEnv Server environment:os.arch=amd64
[junit4:junit4]   2> 133 T583 oaz.Environment.logEnv Server environment:os.version=9.0-RELEASE
[junit4:junit4]   2> 133 T583 oaz.Environment.logEnv Server environment:user.name=hudson
[junit4:junit4]   2> 134 T583 oaz.Environment.logEnv Server environment:user.home=/home/hudson
[junit4:junit4]   2> 134 T583 oaz.Environment.logEnv Server environment:user.dir=/usr/home/hudson/hudson-slave/workspace/Lucene-Solr-Tests-4.x-java7/solr/build/solr-core/test/J0
[junit4:junit4]   2> 186 T583 oazs.ZooKeeperServer.setTickTime tickTime set to 1000
[junit4:junit4]   2> 228 T583 oazs.NIOServerCnxn$Factory.<init> binding to port 0.0.0.0/0.0.0.0:0
[junit4:junit4]   2> 309 T583 oazsp.FileTxnSnapLog.save Snapshotting: 0
[junit4:junit4]   2> 318 T582 oasc.ZkTestServer.run start zk server on port:31220
[junit4:junit4]   2> 409 T582 oaz.Environment.logEnv Client environment:zookeeper.version=3.3.6-1366786, built on 07/29/2012 06:22 GMT
[junit4:junit4]   2> 410 T582 oaz.Environment.logEnv Client environment:host.name=lucene.zones.apache.org
[junit4:junit4]   2> 410 T582 oaz.Environment.logEnv Client environment:java.version=1.7.0_06
[junit4:junit4]   2> 411 T582 oaz.Environment.logEnv Client environment:java.vendor=Oracle Corporation
[junit4:junit4]   2> 411 T582 oaz.Environment.logEnv Client environment:java.home=/usr/local/openjdk7/jre
[junit4:junit4]   2> 411 T582 oaz.Environment.logEnv Client environment:java.class.path=/usr/home/hudson/hudson-slave/workspace/Lucene-Solr-Tests-4.x-java7/solr/build/solr-core/classes/test:/usr/home/hudson/hudson-slave/workspace/Lucene-Solr-Tests-4.x-java7/solr/build/solr-test-framework/classes/java:/usr/home/hudson/hudson-slave/workspace/Lucene-Solr-Tests-4.x-java7/solr/build/solr-core/test-files:/usr/home/hudson/hudson-slave/workspace/Lucene-Solr-Tests-4.x-java7/lucene/build/test-framework/classes/java:/usr/home/hudson/hudson-slave/workspace/Lucene-Solr-Tests-4.x-java7/lucene/build/codecs/classes/java:/usr/home/hudson/hudson-slave/workspace/Lucene-Solr-Tests-4.x-java7/solr/build/solr-solrj/classes/java:/usr/home/hudson/hudson-slave/workspace/Lucene-Solr-Tests-4.x-java7/solr/build/solr-core/classes/java:/usr/home/hudson/hudson-slave/workspace/Lucene-Solr-Tests-4.x-java7/lucene/build/analysis/common/lucene-analyzers-common-4.1-SNAPSHOT.jar:/usr/home/hudson/hudson-slave/workspace/Lucene-Solr-Tests-4.x-java7/lucene/build/analysis/kuromoji/lucene-analyzers-kuromoji-4.1-SNAPSHOT.jar:/usr/home/hudson/hudson-slave/workspace/Lucene-Solr-Tests-4.x-java7/lucene/build/analysis/phonetic/lucene-analyzers-phonetic-4.1-SNAPSHOT.jar:/usr/home/hudson/hudson-slave/workspace/Lucene-Solr-Tests-4.x-java7/lucene/build/highlighter/lucene-highlighter-4.1-SNAPSHOT.jar:/usr/home/hudson/hudson-slave/workspace/Lucene-Solr-Tests-4.x-java7/lucene/build/memory/lucene-memory-4.1-SNAPSHOT.jar:/usr/home/hudson/hudson-slave/workspace/Lucene-Solr-Tests-4.x-java7/lucene/build/misc/lucene-misc-4.1-SNAPSHOT.jar:/usr/home/hudson/hudson-slave/workspace/Lucene-Solr-Tests-4.x-java7/lucene/build/spatial/lucene-spatial-4.1-SNAPSHOT.jar:/usr/home/hudson/hudson-slave/workspace/Lucene-Solr-Tests-4.x-java7/lucene/build/suggest/lucene-suggest-4.1-SNAPSHOT.jar:/usr/home/hudson/hudson-slave/workspace/Lucene-Solr-Tests-4.x-java7/lucene/build/grouping/lucene-grouping-4.1-SNAPSHOT.jar:/usr/home/hudson/hudson-slave/workspace/Lucene-Solr-Tests-4.x-java7/lucene/build/queries/lucene-queries-4.1-SNAPSHOT.jar:/usr/home/hudson/hudson-slave/workspace/Lucene-Solr-Tests-4.x-java7/lucene/build/queryparser/lucene-queryparser-4.1-SNAPSHOT.jar:/usr/home/hudson/hudson-slave/workspace/Lucene-Solr-Tests-4.x-java7/solr/core/lib/commons-cli-1.2.jar:/usr/home/hudson/hudson-slave/workspace/Lucene-Solr-Tests-4.x-java7/solr/core/lib/commons-codec-1.7.jar:/usr/home/hudson/hudson-slave/workspace/Lucene-Solr-Tests-4.x-java7/solr/core/lib/commons-fileupload-1.2.1.jar:/usr/home/hudson/hudson-slave/workspace/Lucene-Solr-Tests-4.x-java7/solr/core/lib/commons-lang-2.6.jar:/usr/home/hudson/hudson-slave/workspace/Lucene-Solr-Tests-4.x-java7/solr/core/lib/easymock-2.2.jar:/usr/home/hudson/hudson-slave/workspace/Lucene-Solr-Tests-4.x-java7/solr/core/lib/guava-r05.jar:/usr/home/hudson/hudson-slave/workspace/Lucene-Solr-Tests-4.x-java7/solr/core/lib/javax.servlet-api-3.0.1.jar:/usr/home/hudson/hudson-slave/workspace/Lucene-Solr-Tests-4.x-java7/solr/core/lib/spatial4j-0.3.jar:/usr/home/hudson/hudson-slave/workspace/Lucene-Solr-Tests-4.x-java7/solr/solrj/lib/commons-io-2.1.jar:/usr/home/hudson/hudson-slave/workspace/Lucene-Solr-Tests-4.x-java7/solr/solrj/lib/httpclient-4.1.3.jar:/usr/home/hudson/hudson-slave/workspace/Lucene-Solr-Tests-4.x-java7/solr/solrj/lib/httpcore-4.1.4.jar:/usr/home/hudson/hudson-slave/workspace/Lucene-Solr-Tests-4.x-java7/solr/solrj/lib/httpmime-4.1.3.jar:/usr/home/hudson/hudson-slave/workspace/Lucene-Solr-Tests-4.x-java7/solr/solrj/lib/jcl-over-slf4j-1.6.4.jar:/usr/home/hudson/hudson-slave/workspace/Lucene-Solr-Tests-4.x-java7/solr/solrj/lib/log4j-over-slf4j-1.6.4.jar:/usr/home/hudson/hudson-slave/workspace/Lucene-Solr-Tests-4.x-java7/solr/solrj/lib/slf4j-api-1.6.4.jar:/usr/home/hudson/hudson-slave/workspace/Lucene-Solr-Tests-4.x-java7/solr/solrj/lib/slf4j-jdk14-1.6.4.jar:/usr/home/hudson/hudson-slave/workspace/Lucene-Solr-Tests-4.x-java7/solr/solrj/lib/wstx-asl-3.2.7.jar:/usr/home/hudson/hudson-slave/workspace/Lucene-Solr-Tests-4.x-java7/solr/solrj/lib/zookeeper-3.3.6.jar:/usr/home/hudson/hudson-slave/workspace/Lucene-Solr-Tests-4.x-java7/solr/example/lib/jetty-continuation-8.1.2.v20120308.jar:/usr/home/hudson/hudson-slave/workspace/Lucene-Solr-Tests-4.x-java7/solr/example/lib/jetty-deploy-8.1.2.v20120308.jar:/usr/home/hudson/hudson-slave/workspace/Lucene-Solr-Tests-4.x-java7/solr/example/lib/jetty-http-8.1.2.v20120308.jar:/usr/home/hudson/hudson-slave/workspace/Lucene-Solr-Tests-4.x-java7/solr/example/lib/jetty-io-8.1.2.v20120308.jar:/usr/home/hudson/hudson-slave/workspace/Lucene-Solr-Tests-4.x-java7/solr/example/lib/jetty-jmx-8.1.2.v20120308.jar:/usr/home/hudson/hudson-slave/workspace/Lucene-Solr-Tests-4.x-java7/solr/example/lib/jetty-security-8.1.2.v20120308.jar:/usr/home/hudson/hudson-slave/workspace/Lucene-Solr-Tests-4.x-java7/solr/example/lib/jetty-server-8.1.2.v20120308.jar:/usr/home/hudson/hudson-slave/workspace/Lucene-Solr-Tests-4.x-java7/solr/example/lib/jetty-servlet-8.1.2.v20120308.jar:/usr/home/hudson/hudson-slave/workspace/Lucene-Solr-Tests-4.x-java7/solr/example/lib/jetty-util-8.1.2.v20120308.jar:/usr/home/hudson/hudson-slave/workspace/Lucene-Solr-Tests-4.x-java7/solr/example/lib/jetty-webapp-8.1.2.v20120308.jar:/usr/home/hudson/hudson-slave/workspace/Lucene-Solr-Tests-4.x-java7/solr/example/lib/jetty-xml-8.1.2.v20120308.jar:/usr/home/hudson/hudson-slave/workspace/Lucene-Solr-Tests-4.x-java7/solr/example/lib/servlet-api-3.0.jar:/usr/home/hudson/hudson-slave/workspace/Lucene-Solr-Tests-4.x-java7/solr/example/example-DIH/solr/db/lib/hsqldb-1.8.0.10.jar:/usr/home/hudson/hudson-slave/workspace/Lucene-Solr-Tests-4.x-java7/lucene/build/core/classes/java:/usr/home/hudson/hudson-slave/workspace/Lucene-Solr-Tests-4.x-java7/lucene/test-framework/lib/junit-4.10.jar:/usr/home/hudson/hudson-slave/workspace/Lucene-Solr-Tests-4.x-java7/lucene/test-framework/lib/randomizedtesting-runner-2.0.3.jar:/home/hudson/hudson-slave/tools/Ant/ant-1.8.2/lib/ant-launcher.jar:/home/hudson/.ant/lib/ivy-2.2.0.jar:/home/hudson/hudson-slave/tools/Ant/ant-1.8.2/lib/ant-apache-regexp.jar:/home/hudson/hudson-slave/tools/Ant/ant-1.8.2/lib/ant-junit.jar:/home/hudson/hudson-slave/tools/Ant/ant-1.8.2/lib/ant-apache-bsf.jar:/home/hudson/hudson-slave/tools/Ant/ant-1.8.2/lib/ant-commons-net.jar:/home/hudson/hudson-slave/tools/Ant/ant-1.8.2/lib/ant-antlr.jar:/home/hudson/hudson-slave/tools/Ant/ant-1.8.2/lib/ant-apache-log4j.jar:/home/hudson/hudson-slave/tools/Ant/ant-1.8.2/lib/ant-commons-logging.jar:/home/hudson/hudson-slave/tools/Ant/ant-1.8.2/lib/ant-apache-xalan2.jar:/home/hudson/hudson-slave/tools/Ant/ant-1.8.2/lib/ant-apache-oro.jar:/home/hudson/hudson-slave/tools/Ant/ant-1.8.2/lib/ant-junit4.jar:/home/hudson/hudson-slave/tools/Ant/ant-1.8.2/lib/ant-netrexx.jar:/home/hudson/hudson-slave/tools/Ant/ant-1.8.2/lib/ant-swing.jar:/home/hudson/hudson-slave/tools/Ant/ant-1.8.2/lib/ant-javamail.jar:/home/hudson/hudson-slave/tools/Ant/ant-1.8.2/lib/ant-jsch.jar:/home/hudson/hudson-slave/tools/Ant/ant-1.8.2/lib/ant-jmf.jar:/home/hudson/hudson-slave/tools/Ant/ant-1.8.2/lib/ant.jar:/home/hudson/hudson-slave/tools/Ant/ant-1.8.2/lib/ant-apache-bcel.jar:/home/hudson/hudson-slave/tools/Ant/ant-1.8.2/lib/ant-jai.jar:/home/hudson/hudson-slave/tools/Ant/ant-1.8.2/lib/ant-testutil.jar:/home/hudson/hudson-slave/tools/Ant/ant-1.8.2/lib/ant-apache-resolver.jar:/home/hudson/hudson-slave/tools/Ant/ant-1.8.2/lib/ant-jdepend.jar:/usr/local/openjdk7/lib/tools.jar:/home/hudson/.ivy2/cache/com.carrotsearch.randomizedtesting/junit4-ant/jars/junit4-ant-2.0.3.jar
[junit4:junit4]   2> 413 T582 oaz.Environment.logEnv Client environment:java.library.path=/usr/local/openjdk7/jre/lib/amd64/server:/usr/local/openjdk7/jre/lib/amd64:/usr/local/openjdk7/jre/../lib/amd64:/usr/local/openjdk6/jre/lib/amd64/server:/usr/local/openjdk6/jre/lib/amd64:/usr/local/openjdk6/jre/../lib/amd64:/usr/java/packages/lib/amd64:/lib:/usr/lib:/usr/local/lib
[junit4:junit4]   2> 413 T582 oaz.Environment.logEnv Client environment:java.io.tmpdir=.
[junit4:junit4]   2> 414 T582 oaz.Environment.logEnv Client environment:java.compiler=<NA>
[junit4:junit4]   2> 414 T582 oaz.Environment.logEnv Client environment:os.name=FreeBSD
[junit4:junit4]   2> 414 T582 oaz.Environment.logEnv Client environment:os.arch=amd64
[junit4:junit4]   2> 415 T582 oaz.Environment.logEnv Client environment:os.version=9.0-RELEASE
[junit4:junit4]   2> 415 T582 oaz.Environment.logEnv Client environment:user.name=hudson
[junit4:junit4]   2> 415 T582 oaz.Environment.logEnv Client environment:user.home=/home/hudson
[junit4:junit4]   2> 416 T582 oaz.Environment.logEnv Client environment:user.dir=/usr/home/hudson/hudson-slave/workspace/Lucene-Solr-Tests-4.x-java7/solr/build/solr-core/test/J0
[junit4:junit4]   2> 423 T582 oaz.ZooKeeper.<init> Initiating client connection, connectString=127.0.0.1:31220 sessionTimeout=10000 watcher=org.apache.solr.common.cloud.ConnectionManager@36ea0f4a
[junit4:junit4]   2> 492 T588 oaz.ClientCnxn$SendThread.startConnect Opening socket connection to server /127.0.0.1:31220
[junit4:junit4]   2> 493 T582 oascc.ConnectionManager.waitForConnected Waiting for client to connect to ZooKeeper
[junit4:junit4]   2> 496 T588 oaz.ClientCnxn$SendThread.primeConnection Socket connection established to localhost/127.0.0.1:31220, initiating session
[junit4:junit4]   2> 497 T584 oazs.NIOServerCnxn$Factory.run Accepted socket connection from /140.211.11.196:42512
[junit4:junit4]   2> 518 T584 oazs.NIOServerCnxn.readConnectRequest Client attempting to establish new session at /140.211.11.196:42512
[junit4:junit4]   2> 537 T586 oazsp.FileTxnLog.append Creating new log file: log.1
[junit4:junit4]   2> 604 T586 oazs.NIOServerCnxn.finishSessionInit Established session 0x13a503f4e5d0000 with negotiated timeout 10000 for client /140.211.11.196:42512
[junit4:junit4]   2> 605 T588 oaz.ClientCnxn$SendThread.readConnectResult Session establishment complete on server localhost/127.0.0.1:31220, sessionid = 0x13a503f4e5d0000, negotiated timeout = 10000
[junit4:junit4]   2> 613 T589 oascc.ConnectionManager.process Watcher org.apache.solr.common.cloud.ConnectionManager@36ea0f4a name:ZooKeeperConnection Watcher:127.0.0.1:31220 got event WatchedEvent state:SyncConnected type:None path:null path:null type:None
[junit4:junit4]   2> 613 T582 oascc.ConnectionManager.waitForConnected Client is connected to ZooKeeper
[junit4:junit4]   2> 618 T582 oascc.SolrZkClient.makePath makePath: /solr
[junit4:junit4]   2> 725 T587 oazs.PrepRequestProcessor.pRequest Processed session termination for sessionid: 0x13a503f4e5d0000
[junit4:junit4]   2> 726 T589 oaz.ClientCnxn$EventThread.run EventThread shut down
[junit4:junit4]   2> 726 T582 oaz.ZooKeeper.close Session: 0x13a503f4e5d0000 closed
[junit4:junit4]   2> 727 T582 oaz.ZooKeeper.<init> Initiating client connection, connectString=127.0.0.1:31220/solr sessionTimeout=10000 watcher=org.apache.solr.common.cloud.ConnectionManager@35dc761a
[junit4:junit4]   2> 728 T584 oazs.NIOServerCnxn.closeSock Closed socket connection for client /140.211.11.196:42512 which had sessionid 0x13a503f4e5d0000
[junit4:junit4]   2> 728 T590 oaz.ClientCnxn$SendThread.startConnect Opening socket connection to server /127.0.0.1:31220
[junit4:junit4]   2> 728 T582 oascc.ConnectionManager.waitForConnected Waiting for client to connect to ZooKeeper
[junit4:junit4]   2> 729 T590 oaz.ClientCnxn$SendThread.primeConnection Socket connection established to localhost/127.0.0.1:31220, initiating session
[junit4:junit4]   2> 729 T584 oazs.NIOServerCnxn$Factory.run Accepted socket connection from /140.211.11.196:64642
[junit4:junit4]   2> 730 T584 oazs.NIOServerCnxn.readConnectRequest Client attempting to establish new session at /140.211.11.196:64642
[junit4:junit4]   2> 731 T586 oazs.NIOServerCnxn.finishSessionInit Established session 0x13a503f4e5d0001 with negotiated timeout 10000 for client /140.211.11.196:64642
[junit4:junit4]   2> 731 T590 oaz.ClientCnxn$SendThread.readConnectResult Session establishment complete on server localhost/127.0.0.1:31220, sessionid = 0x13a503f4e5d0001, negotiated timeout = 10000
[junit4:junit4]   2> 732 T591 oascc.ConnectionManager.process Watcher org.apache.solr.common.cloud.ConnectionManager@35dc761a name:ZooKeeperConnection Watcher:127.0.0.1:31220/solr got event WatchedEvent state:SyncConnected type:None path:null path:null type:None
[junit4:junit4]   2> 732 T582 oascc.ConnectionManager.waitForConnected Client is connected to ZooKeeper
[junit4:junit4]   2> 732 T582 oascc.SolrZkClient.makePath makePath: /collections/collection1
[junit4:junit4]   2> 744 T582 oascc.SolrZkClient.makePath makePath: /collections/collection1/shards
[junit4:junit4]   2> 750 T582 oascc.SolrZkClient.makePath makePath: /collections/control_collection
[junit4:junit4]   2> 754 T582 oascc.SolrZkClient.makePath makePath: /collections/control_collection/shards
[junit4:junit4]   2> 758 T582 oasc.AbstractZkTestCase.putConfig put /usr/home/hudson/hudson-slave/workspace/Lucene-Solr-Tests-4.x-java7/solr/build/solr-core/test-files/solr/collection1/conf/solrconfig.xml to /configs/conf1/solrconfig.xml
[junit4:junit4]   2> 761 T582 oascc.SolrZkClient.makePath makePath: /configs/conf1/solrconfig.xml
[junit4:junit4]   2> 775 T582 oasc.AbstractZkTestCase.putConfig put /usr/home/hudson/hudson-slave/workspace/Lucene-Solr-Tests-4.x-java7/solr/build/solr-core/test-files/solr/collection1/conf/schema.xml to /configs/conf1/schema.xml
[junit4:junit4]   2> 777 T582 oascc.SolrZkClient.makePath makePath: /configs/conf1/schema.xml
[junit4:junit4]   2> 882 T582 oasc.AbstractZkTestCase.putConfig put /usr/home/hudson/hudson-slave/workspace/Lucene-Solr-Tests-4.x-java7/solr/build/solr-core/test-files/solr/collection1/conf/solrconfig.xml to /configs/conf1/solrconfig.xml
[junit4:junit4]   2> 883 T582 oascc.SolrZkClient.makePath makePath: /configs/conf1/solrconfig.xml
[junit4:junit4]   2> 899 T582 oasc.AbstractZkTestCase.putConfig put /usr/home/hudson/hudson-slave/workspace/Lucene-Solr-Tests-4.x-java7/solr/build/solr-core/test-files/solr/collection1/conf/stopwords.txt to /configs/conf1/stopwords.txt
[junit4:junit4]   2> 899 T582 oascc.SolrZkClient.makePath makePath: /configs/conf1/stopwords.txt
[junit4:junit4]   2> 904 T582 oasc.AbstractZkTestCase.putConfig put /usr/home/hudson/hudson-slave/workspace/Lucene-Solr-Tests-4.x-java7/solr/build/solr-core/test-files/solr/collection1/conf/protwords.txt to /configs/conf1/protwords.txt
[junit4:junit4]   2> 904 T582 oascc.SolrZkClient.makePath makePath: /configs/conf1/protwords.txt
[junit4:junit4]   2> 908 T582 oasc.AbstractZkTestCase.putConfig put /usr/home/hudson/hudson-slave/workspace/Lucene-Solr-Tests-4.x-java7/solr/build/solr-core/test-files/solr/collection1/conf/currency.xml to /configs/conf1/currency.xml
[junit4:junit4]   2> 909 T582 oascc.SolrZkClient.makePath makePath: /configs/conf1/currency.xml
[junit4:junit4]   2> 913 T582 oasc.AbstractZkTestCase.putConfig put /usr/home/hudson/hudson-slave/workspace/Lucene-Solr-Tests-4.x-java7/solr/build/solr-core/test-files/solr/collection1/conf/open-exchange-rates.json to /configs/conf1/open-exchange-rates.json
[junit4:junit4]   2> 914 T582 oascc.SolrZkClient.makePath makePath: /configs/conf1/open-exchange-rates.json
[junit4:junit4]   2> 918 T582 oasc.AbstractZkTestCase.putConfig put /usr/home/hudson/hudson-slave/workspace/Lucene-Solr-Tests-4.x-java7/solr/build/solr-core/test-files/solr/collection1/conf/mapping-ISOLatin1Accent.txt to /configs/conf1/mapping-ISOLatin1Accent.txt
[junit4:junit4]   2> 919 T582 oascc.SolrZkClient.makePath makePath: /configs/conf1/mapping-ISOLatin1Accent.txt
[junit4:junit4]   2> 923 T582 oasc.AbstractZkTestCase.putConfig put /usr/home/hudson/hudson-slave/workspace/Lucene-Solr-Tests-4.x-java7/solr/build/solr-core/test-files/solr/collection1/conf/old_synonyms.txt to /configs/conf1/old_synonyms.txt
[junit4:junit4]   2> 923 T582 oascc.SolrZkClient.makePath makePath: /configs/conf1/old_synonyms.txt
[junit4:junit4]   2> 928 T582 oasc.AbstractZkTestCase.putConfig put /usr/home/hudson/hudson-slave/workspace/Lucene-Solr-Tests-4.x-java7/solr/build/solr-core/test-files/solr/collection1/conf/synonyms.txt to /configs/conf1/synonyms.txt
[junit4:junit4]   2> 928 T582 oascc.SolrZkClient.makePath makePath: /configs/conf1/synonyms.txt
[junit4:junit4]   2> 932 T587 oazs.PrepRequestProcessor.pRequest Processed session termination for sessionid: 0x13a503f4e5d0001
[junit4:junit4]   2> 933 T591 oaz.ClientCnxn$EventThread.run EventThread shut down
[junit4:junit4]   2> 933 T582 oaz.ZooKeeper.close Session: 0x13a503f4e5d0001 closed
[junit4:junit4]   2> 933 T584 oazs.NIOServerCnxn.closeSock Closed socket connection for client /140.211.11.196:64642 which had sessionid 0x13a503f4e5d0001
[junit4:junit4]   2> 936 T582 oejs.Server.doStart jetty-8.1.2.v20120308
[junit4:junit4]   2> 941 T582 oejs.AbstractConnector.doStart Started SocketConnector@0.0.0.0:16008
[junit4:junit4]   2> 942 T582 oasc.SolrResourceLoader.locateSolrHome JNDI not configured for solr (NoInitialContextEx)
[junit4:junit4]   2> 942 T582 oasc.SolrResourceLoader.locateSolrHome using system property solr.solr.home: /usr/home/hudson/hudson-slave/workspace/Lucene-Solr-Tests-4.x-java7/solr/build/solr-core/test-files/solr
[junit4:junit4]   2> 943 T582 oasc.SolrResourceLoader.<init> new SolrResourceLoader for deduced Solr Home: '/usr/home/hudson/hudson-slave/workspace/Lucene-Solr-Tests-4.x-java7/solr/build/solr-core/test-files/solr/'
[junit4:junit4]   2> 984 T582 oass.SolrDispatchFilter.init SolrDispatchFilter.init()
[junit4:junit4]   2> 985 T582 oasc.SolrResourceLoader.locateSolrHome JNDI not configured for solr (NoInitialContextEx)
[junit4:junit4]   2> 985 T582 oasc.SolrResourceLoader.locateSolrHome using system property solr.solr.home: /usr/home/hudson/hudson-slave/workspace/Lucene-Solr-Tests-4.x-java7/solr/build/solr-core/test-files/solr
[junit4:junit4]   2> 986 T582 oasc.CoreContainer$Initializer.initialize looking for solr.xml: /usr/home/hudson/hudson-slave/workspace/Lucene-Solr-Tests-4.x-java7/solr/build/solr-core/test-files/solr/solr.xml
[junit4:junit4]   2> 986 T582 oasc.CoreContainer.<init> New CoreContainer 551873644
[junit4:junit4]   2> 987 T582 oasc.CoreContainer.load Loading CoreContainer using Solr Home: '/usr/home/hudson/hudson-slave/workspace/Lucene-Solr-Tests-4.x-java7/solr/build/solr-core/test-files/solr/'
[junit4:junit4]   2> 987 T582 oasc.SolrResourceLoader.<init> new SolrResourceLoader for directory: '/usr/home/hudson/hudson-slave/workspace/Lucene-Solr-Tests-4.x-java7/solr/build/solr-core/test-files/solr/'
[junit4:junit4]   2> 1020 T582 oasc.CoreContainer.load Registering Log Listener
[junit4:junit4]   2> 1036 T582 oasc.CoreContainer.initZooKeeper Zookeeper client=127.0.0.1:31220/solr
[junit4:junit4]   2> 1065 T582 oaz.ZooKeeper.<init> Initiating client connection, connectString=127.0.0.1:31220/solr sessionTimeout=5000 watcher=org.apache.solr.common.cloud.ConnectionManager@6d9d9bd9
[junit4:junit4]   2> 1066 T601 oaz.ClientCnxn$SendThread.startConnect Opening socket connection to server /127.0.0.1:31220
[junit4:junit4]   2> 1066 T582 oascc.ConnectionManager.waitForConnected Waiting for client to connect to ZooKeeper
[junit4:junit4]   2> 1067 T601 oaz.ClientCnxn$SendThread.primeConnection Socket connection established to localhost/127.0.0.1:31220, initiating session
[junit4:junit4]   2> 1067 T584 oazs.NIOServerCnxn$Factory.run Accepted socket connection from /140.211.11.196:62867
[junit4:junit4]   2> 1068 T584 oazs.NIOServerCnxn.readConnectRequest Client attempting to establish new session at /140.211.11.196:62867
[junit4:junit4]   2> 1088 T586 oazs.NIOServerCnxn.finishSessionInit Established session 0x13a503f4e5d0002 with negotiated timeout 5000 for client /140.211.11.196:62867
[junit4:junit4]   2> 1088 T601 oaz.ClientCnxn$SendThread.readConnectResult Session establishment complete on server localhost/127.0.0.1:31220, sessionid = 0x13a503f4e5d0002, negotiated timeout = 5000
[junit4:junit4]   2> 1088 T602 oascc.ConnectionManager.process Watcher org.apache.solr.common.cloud.ConnectionManager@6d9d9bd9 name:ZooKeeperConnection Watcher:127.0.0.1:31220/solr got event WatchedEvent state:SyncConnected type:None path:null path:null type:None
[junit4:junit4]   2> 1089 T582 oascc.ConnectionManager.waitForConnected Client is connected to ZooKeeper
[junit4:junit4]   2> 1134 T587 oazs.PrepRequestProcessor.pRequest Got user-level KeeperException when processing sessionid:0x13a503f4e5d0002 type:create cxid:0x2 zxid:0xfffffffffffffffe txntype:unknown reqpath:n/a Error Path:/solr/overseer Error:KeeperErrorCode = NodeExists for /solr/overseer
[junit4:junit4]   2> 1145 T582 oascc.SolrZkClient.makePath makePath: /live_nodes
[junit4:junit4]   2> 1148 T582 oasc.ZkController.createEphemeralLiveNode Register node as live in ZooKeeper:/live_nodes/127.0.0.1:16008_solr
[junit4:junit4]   2> 1155 T587 oazs.PrepRequestProcessor.pRequest Got user-level KeeperException when processing sessionid:0x13a503f4e5d0002 type:delete cxid:0x7 zxid:0xfffffffffffffffe txntype:unknown reqpath:n/a Error Path:/solr/live_nodes/127.0.0.1:16008_solr Error:KeeperErrorCode = NoNode for /solr/live_nodes/127.0.0.1:16008_solr
[junit4:junit4]   2> 1156 T582 oascc.SolrZkClient.makePath makePath: /live_nodes/127.0.0.1:16008_solr
[junit4:junit4]   2> 1160 T582 oashc.HttpShardHandlerFactory.getParameter Setting socketTimeout to: 0
[junit4:junit4]   2> 1161 T582 oashc.HttpShardHandlerFactory.getParameter Setting urlScheme to: http://
[junit4:junit4]   2> 1161 T582 oashc.HttpShardHandlerFactory.getParameter Setting connTimeout to: 0
[junit4:junit4]   2> 1162 T582 oashc.HttpShardHandlerFactory.getParameter Setting maxConnectionsPerHost to: 20
[junit4:junit4]   2> 1162 T582 oashc.HttpShardHandlerFactory.getParameter Setting corePoolSize to: 0
[junit4:junit4]   2> 1163 T582 oashc.HttpShardHandlerFactory.getParameter Setting maximumPoolSize to: 2147483647
[junit4:junit4]   2> 1163 T582 oashc.HttpShardHandlerFactory.getParameter Setting maxThreadIdleTime to: 5
[junit4:junit4]   2> 1163 T582 oashc.HttpShardHandlerFactory.getParameter Setting sizeOfQueue to: -1
[junit4:junit4]   2> 1164 T582 oashc.HttpShardHandlerFactory.getParameter Setting fairnessPolicy to: false
[junit4:junit4]   2> 1164 T582 oascsi.HttpClientUtil.createClient Creating new http client, config:maxConnectionsPerHost=20&maxConnections=10000&socketTimeout=0&connTimeout=0&retry=false
[junit4:junit4]   2> 1183 T582 oascc.SolrZkClient.makePath makePath: /overseer_elect/election
[junit4:junit4]   2> 1205 T587 oazs.PrepRequestProcessor.pRequest Got user-level KeeperException when processing sessionid:0x13a503f4e5d0002 type:delete cxid:0x15 zxid:0xfffffffffffffffe txntype:unknown reqpath:n/a Error Path:/solr/overseer_elect/leader Error:KeeperErrorCode = NoNode for /solr/overseer_elect/leader
[junit4:junit4]   2> 1207 T582 oascc.SolrZkClient.makePath makePath: /overseer_elect/leader
[junit4:junit4]   2> 1210 T582 oasc.Overseer.start Overseer (id=88471375515025410-127.0.0.1:16008_solr-n_0000000000) starting
[junit4:junit4]   2> 1211 T587 oazs.PrepRequestProcessor.pRequest Got user-level KeeperException when processing sessionid:0x13a503f4e5d0002 type:create cxid:0x1a zxid:0xfffffffffffffffe txntype:unknown reqpath:n/a Error Path:/solr/overseer Error:KeeperErrorCode = NodeExists for /solr/overseer
[junit4:junit4]   2> 1231 T587 oazs.PrepRequestProcessor.pRequest Got user-level KeeperException when processing sessionid:0x13a503f4e5d0002 type:create cxid:0x1b zxid:0xfffffffffffffffe txntype:unknown reqpath:n/a Error Path:/solr/overseer Error:KeeperErrorCode = NodeExists for /solr/overseer
[junit4:junit4]   2> 1232 T587 oazs.PrepRequestProcessor.pRequest Got user-level KeeperException when processing sessionid:0x13a503f4e5d0002 type:create cxid:0x1c zxid:0xfffffffffffffffe txntype:unknown reqpath:n/a Error Path:/solr/overseer Error:KeeperErrorCode = NodeExists for /solr/overseer
[junit4:junit4]   2> 1238 T587 oazs.PrepRequestProcessor.pRequest Got user-level KeeperException when processing sessionid:0x13a503f4e5d0002 type:create cxid:0x1d zxid:0xfffffffffffffffe txntype:unknown reqpath:n/a Error Path:/solr/overseer Error:KeeperErrorCode = NodeExists for /solr/overseer
[junit4:junit4]   2> 1239 T604 oasc.OverseerCollectionProcessor.run Process current queue of collection creations
[junit4:junit4]   2> 1240 T582 oascc.SolrZkClient.makePath makePath: /clusterstate.json
[junit4:junit4]   2> 1248 T582 oascc.ZkStateReader.createClusterStateWatchersAndUpdate Updating cluster state from ZooKeeper... 
[junit4:junit4]   2> 1263 T603 oasc.Overseer$ClusterStateUpdater.run Starting to work on the main queue
[junit4:junit4]   2> 1275 T582 oasc.CoreContainer.create Creating SolrCore 'collection1' using instanceDir: /usr/home/hudson/hudson-slave/workspace/Lucene-Solr-Tests-4.x-java7/solr/build/solr-core/test-files/solr/collection1
[junit4:junit4]   2> 1275 T582 oasc.ZkController.createCollectionZkNode Check for collection zkNode:control_collection
[junit4:junit4]   2> 1276 T582 oasc.ZkController.createCollectionZkNode Collection zkNode exists
[junit4:junit4]   2> 1277 T582 oasc.ZkController.readConfigName Load collection config from:/collections/control_collection
[junit4:junit4]   2> 1279 T582 oasc.SolrResourceLoader.<init> new SolrResourceLoader for directory: '/usr/home/hudson/hudson-slave/workspace/Lucene-Solr-Tests-4.x-java7/solr/build/solr-core/test-files/solr/collection1/'
[junit4:junit4]   2> 1280 T582 oasc.SolrResourceLoader.replaceClassLoader Adding 'file:/usr/home/hudson/hudson-slave/workspace/Lucene-Solr-Tests-4.x-java7/solr/build/solr-core/test-files/solr/collection1/lib/README' to classloader
[junit4:junit4]   2> 1281 T582 oasc.SolrResourceLoader.replaceClassLoader Adding 'file:/usr/home/hudson/hudson-slave/workspace/Lucene-Solr-Tests-4.x-java7/solr/build/solr-core/test-files/solr/collection1/lib/classes/' to classloader
[junit4:junit4]   2> 1353 T582 oasc.SolrConfig.<init> Using Lucene MatchVersion: LUCENE_41
[junit4:junit4]   2> 1423 T582 oasc.SolrConfig.<init> Loaded SolrConfig: solrconfig.xml
[junit4:junit4]   2> 1525 T582 oass.IndexSchema.readSchema Reading Solr Schema
[junit4:junit4]   2> 1532 T582 oass.IndexSchema.readSchema Schema name=test
[junit4:junit4]   2> 2159 T582 oass.OpenExchangeRatesOrgProvider.init Initialized with rates=open-exchange-rates.json, refreshInterval=1440.
[junit4:junit4]   2> 2171 T582 oass.IndexSchema.readSchema default search field in schema is text
[junit4:junit4]   2> 2175 T582 oass.IndexSchema.readSchema unique key field: id
[junit4:junit4]   2> 2194 T582 oass.FileExchangeRateProvider.reload Reloading exchange rates from file currency.xml
[junit4:junit4]   2> 2199 T582 oass.FileExchangeRateProvider.reload Reloading exchange rates from file currency.xml
[junit4:junit4]   2> 2205 T582 oass.OpenExchangeRatesOrgProvider.reload Reloading exchange rates from open-exchange-rates.json
[junit4:junit4]   2> 2207 T582 oass.OpenExchangeRatesOrgProvider.reload Reloading exchange rates from open-exchange-rates.json
[junit4:junit4]   2> 2209 T582 oasc.SolrCore.<init> [collection1] Opening new SolrCore at /usr/home/hudson/hudson-slave/workspace/Lucene-Solr-Tests-4.x-java7/solr/build/solr-core/test-files/solr/collection1/, dataDir=./org.apache.solr.cloud.BasicDistributedZkTest-1349966056692/control/data/
[junit4:junit4]   2> 2210 T582 oasc.JmxMonitoredMap.<init> JMX monitoring is enabled. Adding Solr mbeans to JMX Server: com.sun.jmx.mbeanserver.JmxMBeanServer@4748c8a0
[junit4:junit4]   2> 2245 T582 oasc.SolrCore.getNewIndexDir New index directory detected: old=null new=./org.apache.solr.cloud.BasicDistributedZkTest-1349966056692/control/data/index/
[junit4:junit4]   2> 2246 T582 oasc.SolrCore.initIndex WARNING [collection1] Solr index directory './org.apache.solr.cloud.BasicDistributedZkTest-1349966056692/control/data/index' doesn't exist. Creating new index...
[junit4:junit4]   2> 2248 T582 oasc.CachingDirectoryFactory.get return new directory for /usr/home/hudson/hudson-slave/workspace/Lucene-Solr-Tests-4.x-java7/solr/build/solr-core/test/J0/./org.apache.solr.cloud.BasicDistributedZkTest-1349966056692/control/data/index forceNew:false
[junit4:junit4]   2> 2255 T582 oasc.SolrDeletionPolicy.onCommit SolrDeletionPolicy.onCommit: commits:num=1
[junit4:junit4]   2> 		commit{dir=/usr/home/hudson/hudson-slave/workspace/Lucene-Solr-Tests-4.x-java7/solr/build/solr-core/test/J0/org.apache.solr.cloud.BasicDistributedZkTest-1349966056692/control/data/index,segFN=segments_1,generation=1,filenames=[segments_1]
[junit4:junit4]   2> 2256 T582 oasc.SolrDeletionPolicy.updateCommits newest commit = 1
[junit4:junit4]   2> 2256 T582 oasc.SolrCore.initWriters created xml: solr.XMLResponseWriter
[junit4:junit4]   2> 2259 T582 oasup.UpdateRequestProcessorChain.init inserting DistributedUpdateProcessorFactory into updateRequestProcessorChain "dedupe"
[junit4:junit4]   2> 2259 T582 oasup.UpdateRequestProcessorChain.init inserting DistributedUpdateProcessorFactory into updateRequestProcessorChain "dedupe-allfields"
[junit4:junit4]   2> 2260 T582 oasup.UpdateRequestProcessorChain.init inserting DistributedUpdateProcessorFactory into updateRequestProcessorChain "stored_sig"
[junit4:junit4]   2> 2260 T582 oasup.UpdateRequestProcessorChain.init inserting DistributedUpdateProcessorFactory into updateRequestProcessorChain "uniq-fields"
[junit4:junit4]   2> 2261 T582 oasup.UpdateRequestProcessorChain.init inserting DistributedUpdateProcessorFactory into updateRequestProcessorChain "distrib-dup-test-chain-implicit"
[junit4:junit4]   2> 2262 T582 oasc.RequestHandlers.initHandlersFromConfig adding lazy requestHandler: solr.ReplicationHandler
[junit4:junit4]   2> 2262 T582 oasc.RequestHandlers.initHandlersFromConfig created /replication: solr.ReplicationHandler
[junit4:junit4]   2> 2263 T582 oasc.RequestHandlers.initHandlersFromConfig created standard: solr.StandardRequestHandler
[junit4:junit4]   2> 2264 T582 oasc.RequestHandlers.initHandlersFromConfig created /get: solr.RealTimeGetHandler
[junit4:junit4]   2> 2264 T582 oasc.RequestHandlers.initHandlersFromConfig created dismax: solr.SearchHandler
[junit4:junit4]   2> 2265 T582 oasc.RequestHandlers.initHandlersFromConfig created mock: org.apache.solr.core.MockQuerySenderListenerReqHandler
[junit4:junit4]   2> 2266 T582 oasc.RequestHandlers.initHandlersFromConfig created /admin/: org.apache.solr.handler.admin.AdminHandlers
[junit4:junit4]   2> 2267 T582 oasc.RequestHandlers.initHandlersFromConfig created defaults: solr.StandardRequestHandler
[junit4:junit4]   2> 2267 T582 oasc.RequestHandlers.initHandlersFromConfig adding lazy requestHandler: solr.StandardRequestHandler
[junit4:junit4]   2> 2268 T582 oasc.RequestHandlers.initHandlersFromConfig created lazy: solr.StandardRequestHandler
[junit4:junit4]   2> 2268 T582 oasc.RequestHandlers.initHandlersFromConfig created /update: solr.UpdateRequestHandler
[junit4:junit4]   2> 2269 T582 oasc.RequestHandlers.initHandlersFromConfig created /terms: org.apache.solr.handler.component.SearchHandler
[junit4:junit4]   2> 2270 T582 oasc.RequestHandlers.initHandlersFromConfig created spellCheckCompRH: org.apache.solr.handler.component.SearchHandler
[junit4:junit4]   2> 2270 T582 oasc.RequestHandlers.initHandlersFromConfig created spellCheckCompRH_Direct: org.apache.solr.handler.component.SearchHandler
[junit4:junit4]   2> 2271 T582 oasc.RequestHandlers.initHandlersFromConfig created spellCheckWithWordbreak: org.apache.solr.handler.component.SearchHandler
[junit4:junit4]   2> 2272 T582 oasc.RequestHandlers.initHandlersFromConfig created spellCheckWithWordbreak_Direct: org.apache.solr.handler.component.SearchHandler
[junit4:junit4]   2> 2272 T582 oasc.RequestHandlers.initHandlersFromConfig created spellCheckCompRH1: org.apache.solr.handler.component.SearchHandler
[junit4:junit4]   2> 2273 T582 oasc.RequestHandlers.initHandlersFromConfig created tvrh: org.apache.solr.handler.component.SearchHandler
[junit4:junit4]   2> 2273 T582 oasc.RequestHandlers.initHandlersFromConfig created /mlt: solr.MoreLikeThisHandler
[junit4:junit4]   2> 2274 T582 oasc.RequestHandlers.initHandlersFromConfig created /debug/dump: solr.DumpRequestHandler
[junit4:junit4]   2> 2287 T582 oashl.XMLLoader.init xsltCacheLifetimeSeconds=60
[junit4:junit4]   2> 2292 T582 oasc.SolrCore.initDeprecatedSupport WARNING solrconfig.xml uses deprecated <admin/gettableFiles>, Please update your config to use the ShowFileRequestHandler.
[junit4:junit4]   2> 2293 T582 oasc.SolrCore.initDeprecatedSupport WARNING adding ShowFileRequestHandler with hidden files: [SCHEMA.XML, OLD_SYNONYMS.TXT, STOPWORDS.TXT, PROTWORDS.TXT, OPEN-EXCHANGE-RATES.JSON, SYNONYMS.TXT, CURRENCY.XML, MAPPING-ISOLATIN1ACCENT.TXT]
[junit4:junit4]   2> 2298 T582 oass.SolrIndexSearcher.<init> Opening Searcher@28c9c698 main
[junit4:junit4]   2> 2299 T582 oasu.CommitTracker.<init> Hard AutoCommit: disabled
[junit4:junit4]   2> 2300 T582 oasu.CommitTracker.<init> Soft AutoCommit: disabled
[junit4:junit4]   2> 2300 T582 oashc.SpellCheckComponent.inform Initializing spell checkers
[junit4:junit4]   2> 2317 T582 oass.DirectSolrSpellChecker.init init: {name=direct,classname=DirectSolrSpellChecker,field=lowerfilt,minQueryLength=3}
[junit4:junit4]   2> 2370 T605 oasc.SolrCore.registerSearcher [collection1] Registered new searcher Searcher@28c9c698 main{StandardDirectoryReader(segments_1:1)}
[junit4:junit4]   2> 2376 T587 oazs.PrepRequestProcessor.pRequest Got user-level KeeperException when processing sessionid:0x13a503f4e5d0002 type:create cxid:0x56 zxid:0xfffffffffffffffe txntype:unknown reqpath:n/a Error Path:/solr/overseer/queue Error:KeeperErrorCode = NoNode for /solr/overseer/queue
[junit4:junit4]   2> 2388 T582 oasc.CoreContainer.register registering core: collection1
[junit4:junit4]   2> 2389 T582 oasc.ZkController.register Register shard - core:collection1 address:http://127.0.0.1:16008/solr shardId:control_shard
[junit4:junit4]   2> 2399 T582 oascsi.HttpClientUtil.createClient Creating new http client, config:maxConnections=10000&maxConnectionsPerHost=20&connTimeout=30000&socketTimeout=30000&retry=false
[junit4:junit4]   2> 2418 T582 oascc.SolrZkClient.makePath makePath: /collections/control_collection/leader_elect/control_shard/election
[junit4:junit4]   2> 2437 T587 oazs.PrepRequestProcessor.pRequest Got user-level KeeperException when processing sessionid:0x13a503f4e5d0002 type:delete cxid:0x65 zxid:0xfffffffffffffffe txntype:unknown reqpath:n/a Error Path:/solr/collections/control_collection/leaders Error:KeeperErrorCode = NoNode for /solr/collections/control_collection/leaders
[junit4:junit4]   2> 2438 T582 oasc.ShardLeaderElectionContext.runLeaderProcess Running the leader process.
[junit4:junit4]   2> 2439 T587 oazs.PrepRequestProcessor.pRequest Got user-level KeeperException when processing sessionid:0x13a503f4e5d0002 type:create cxid:0x66 zxid:0xfffffffffffffffe txntype:unknown reqpath:n/a Error Path:/solr/overseer Error:KeeperErrorCode = NodeExists for /solr/overseer
[junit4:junit4]   2> 2773 T603 oascc.ZkStateReader.updateClusterState Updating cloud state from ZooKeeper... 
[junit4:junit4]   2> 2775 T587 oazs.PrepRequestProcessor.pRequest Got user-level KeeperException when processing sessionid:0x13a503f4e5d0002 type:create cxid:0x6d zxid:0xfffffffffffffffe txntype:unknown reqpath:n/a Error Path:/solr/overseer/queue-work Error:KeeperErrorCode = NoNode for /solr/overseer/queue-work
[junit4:junit4]   2> 2936 T602 oascc.ZkStateReader$2.process A cluster state change has occurred - updating...
[junit4:junit4]   2> 2950 T582 oasc.ShardLeaderElectionContext.waitForReplicasToComeUp Enough replicas found to continue.
[junit4:junit4]   2> 2951 T582 oasc.ShardLeaderElectionContext.runLeaderProcess I may be the new leader - try and sync
[junit4:junit4]   2> 2951 T582 oasc.SyncStrategy.sync Sync replicas to http://127.0.0.1:16008/solr/collection1/
[junit4:junit4]   2> 2952 T582 oasc.SyncStrategy.syncReplicas Sync Success - now sync replicas to me
[junit4:junit4]   2> 2953 T582 oasc.SyncStrategy.syncToMe http://127.0.0.1:16008/solr/collection1/ has no replicas
[junit4:junit4]   2> 2953 T582 oasc.ShardLeaderElectionContext.runLeaderProcess I am the new leader: http://127.0.0.1:16008/solr/collection1/
[junit4:junit4]   2> 2954 T582 oascc.SolrZkClient.makePath makePath: /collections/control_collection/leaders/control_shard
[junit4:junit4]   2> 2974 T587 oazs.PrepRequestProcessor.pRequest Got user-level KeeperException when processing sessionid:0x13a503f4e5d0002 type:create cxid:0x8b zxid:0xfffffffffffffffe txntype:unknown reqpath:n/a Error Path:/solr/overseer Error:KeeperErrorCode = NodeExists for /solr/overseer
[junit4:junit4]   2> 3444 T603 oascc.ZkStateReader.updateClusterState Updating cloud state from ZooKeeper... 
[junit4:junit4]   2> 3460 T602 oascc.ZkStateReader$2.process A cluster state change has occurred - updating...
[junit4:junit4]   2> 3487 T582 oasc.ZkController.register We are http://127.0.0.1:16008/solr/collection1/ and leader is http://127.0.0.1:16008/solr/collection1/
[junit4:junit4]   2> 3487 T582 oasc.ZkController.register No LogReplay needed for core=collection1 baseURL=http://127.0.0.1:16008/solr
[junit4:junit4]   2> 3488 T582 oasc.ZkController.checkRecovery I am the leader, no recovery necessary
[junit4:junit4]   2> 3491 T582 oascc.ZkStateReader.updateClusterState Updating cloud state from ZooKeeper... 
[junit4:junit4]   2> 3492 T582 oass.SolrDispatchFilter.init user.dir=/usr/home/hudson/hudson-slave/workspace/Lucene-Solr-Tests-4.x-java7/solr/build/solr-core/test/J0
[junit4:junit4]   2> 3492 T582 oass.SolrDispatchFilter.init SolrDispatchFilter.init() done
[junit4:junit4]   2> 3493 T582 oascsi.HttpClientUtil.createClient Creating new http client, config:maxConnections=128&maxConnectionsPerHost=32&followRedirects=false
[junit4:junit4]   2> 3662 T582 oejs.Server.doStart jetty-8.1.2.v20120308
[junit4:junit4]   2> 3665 T582 oejs.AbstractConnector.doStart Started SocketConnector@0.0.0.0:15306
[junit4:junit4]   2> 3666 T582 oasc.SolrResourceLoader.locateSolrHome JNDI not configured for solr (NoInitialContextEx)
[junit4:junit4]   2> 3666 T582 oasc.SolrResourceLoader.locateSolrHome using system property solr.solr.home: /usr/home/hudson/hudson-slave/workspace/Lucene-Solr-Tests-4.x-java7/solr/build/solr-core/test/J0/./solrtest-jetty1-1349966060191
[junit4:junit4]   2> 3667 T582 oasc.SolrResourceLoader.<init> new SolrResourceLoader for deduced Solr Home: '/usr/home/hudson/hudson-slave/workspace/Lucene-Solr-Tests-4.x-java7/solr/build/solr-core/test/J0/./solrtest-jetty1-1349966060191/'
[junit4:junit4]   2> 3708 T582 oass.SolrDispatchFilter.init SolrDispatchFilter.init()
[junit4:junit4]   2> 3709 T582 oasc.SolrResourceLoader.locateSolrHome JNDI not configured for solr (NoInitialContextEx)
[junit4:junit4]   2> 3709 T582 oasc.SolrResourceLoader.locateSolrHome using system property solr.solr.home: /usr/home/hudson/hudson-slave/workspace/Lucene-Solr-Tests-4.x-java7/solr/build/solr-core/test/J0/./solrtest-jetty1-1349966060191
[junit4:junit4]   2> 3709 T582 oasc.CoreContainer$Initializer.initialize looking for solr.xml: /usr/home/hudson/hudson-slave/workspace/Lucene-Solr-Tests-4.x-java7/solr/build/solr-core/test/J0/./solrtest-jetty1-1349966060191/solr.xml
[junit4:junit4]   2> 3710 T582 oasc.CoreContainer.<init> New CoreContainer 988227062
[junit4:junit4]   2> 3711 T582 oasc.CoreContainer.load Loading CoreContainer using Solr Home: '/usr/home/hudson/hudson-slave/workspace/Lucene-Solr-Tests-4.x-java7/solr/build/solr-core/test/J0/./solrtest-jetty1-1349966060191/'
[junit4:junit4]   2> 3711 T582 oasc.SolrResourceLoader.<init> new SolrResourceLoader for directory: '/usr/home/hudson/hudson-slave/workspace/Lucene-Solr-Tests-4.x-java7/solr/build/solr-core/test/J0/./solrtest-jetty1-1349966060191/'
[junit4:junit4]   2> 3743 T582 oasc.CoreContainer.load Registering Log Listener
[junit4:junit4]   2> 3759 T582 oasc.CoreContainer.initZooKeeper Zookeeper client=127.0.0.1:31220/solr
[junit4:junit4]   2> 3759 T582 oaz.ZooKeeper.<init> Initiating client connection, connectString=127.0.0.1:31220/solr sessionTimeout=5000 watcher=org.apache.solr.common.cloud.ConnectionManager@6674cebb
[junit4:junit4]   2> 3760 T615 oaz.ClientCnxn$SendThread.startConnect Opening socket connection to server /127.0.0.1:31220
[junit4:junit4]   2> 3760 T582 oascc.ConnectionManager.waitForConnected Waiting for client to connect to ZooKeeper
[junit4:junit4]   2> 3762 T615 oaz.ClientCnxn$SendThread.primeConnection Socket connection established to localhost/127.0.0.1:31220, initiating session
[junit4:junit4]   2> 3762 T584 oazs.NIOServerCnxn$Factory.run Accepted socket connection from /140.211.11.196:18123
[junit4:junit4]   2> 3762 T584 oazs.NIOServerCnxn.readConnectRequest Client attempting to establish new session at /140.211.11.196:18123
[junit4:junit4]   2> 3765 T586 oazs.NIOServerCnxn.finishSessionInit Established session 0x13a503f4e5d0003 with negotiated timeout 5000 for client /140.211.11.196:18123
[junit4:junit4]   2> 3765 T615 oaz.ClientCnxn$SendThread.readConnectResult Session establishment complete on server localhost/127.0.0.1:31220, sessionid = 0x13a503f4e5d0003, negotiated timeout = 5000
[junit4:junit4]   2> 3766 T616 oascc.ConnectionManager.process Watcher org.apache.solr.common.cloud.ConnectionManager@6674cebb name:ZooKeeperConnection Watcher:127.0.0.1:31220/solr got event WatchedEvent state:SyncConnected type:None path:null path:null type:None
[junit4:junit4]   2> 3766 T582 oascc.ConnectionManager.waitForConnected Client is connected to ZooKeeper
[junit4:junit4]   2> 3767 T587 oazs.PrepRequestProcessor.pRequest Got user-level KeeperException when processing sessionid:0x13a503f4e5d0003 type:create cxid:0x1 zxid:0xfffffffffffffffe txntype:unknown reqpath:n/a Error Path:/solr/overseer Error:KeeperErrorCode = NodeExists for /solr/overseer
[junit4:junit4]   2> 3768 T587 oazs.PrepRequestProcessor.pRequest Got user-level KeeperException when processing sessionid:0x13a503f4e5d0003 type:create cxid:0x2 zxid:0xfffffffffffffffe txntype:unknown reqpath:n/a Error Path:/solr/overseer Error:KeeperErrorCode = NodeExists for /solr/overseer
[junit4:junit4]   2> 3783 T582 oasc.ZkController.createEphemeralLiveNode Register node as live in ZooKeeper:/live_nodes/127.0.0.1:15306_solr
[junit4:junit4]   2> 3784 T587 oazs.PrepRequestProcessor.pRequest Got user-level KeeperException when processing sessionid:0x13a503f4e5d0003 type:delete cxid:0x4 zxid:0xfffffffffffffffe txntype:unknown reqpath:n/a Error Path:/solr/live_nodes/127.0.0.1:15306_solr Error:KeeperErrorCode = NoNode for /solr/live_nodes/127.0.0.1:15306_solr
[junit4:junit4]   2> 3785 T582 oascc.SolrZkClient.makePath makePath: /live_nodes/127.0.0.1:15306_solr
[junit4:junit4]   2> 3788 T602 oascc.ZkStateReader$3.process Updating live nodes
[junit4:junit4]   2> 3789 T582 oashc.HttpShardHandlerFactory.getParameter Setting socketTimeout to: 0
[junit4:junit4]   2> 3790 T582 oashc.HttpShardHandlerFactory.getParameter Setting urlScheme to: http://
[junit4:junit4]   2> 3790 T582 oashc.HttpShardHandlerFactory.getParameter Setting connTimeout to: 0
[junit4:junit4]   2> 3791 T582 oashc.HttpShardHandlerFactory.getParameter Setting maxConnectionsPerHost to: 20
[junit4:junit4]   2> 3791 T582 oashc.HttpShardHandlerFactory.getParameter Setting corePoolSize to: 0
[junit4:junit4]   2> 3792 T582 oashc.HttpShardHandlerFactory.getParameter Setting maximumPoolSize to: 2147483647
[junit4:junit4]   2> 3792 T582 oashc.HttpShardHandlerFactory.getParameter Setting maxThreadIdleTime to: 5
[junit4:junit4]   2> 3792 T582 oashc.HttpShardHandlerFactory.getParameter Setting sizeOfQueue to: -1
[junit4:junit4]   2> 3793 T582 oashc.HttpShardHandlerFactory.getParameter Setting fairnessPolicy to: false
[junit4:junit4]   2> 3793 T582 oascsi.HttpClientUtil.createClient Creating new http client, config:maxConnectionsPerHost=20&maxConnections=10000&socketTimeout=0&connTimeout=0&retry=false
[junit4:junit4]   2> 3816 T582 oascc.ZkStateReader.createClusterStateWatchersAndUpdate Updating cluster state from ZooKeeper... 
[junit4:junit4]   2> 3823 T582 oasc.CoreContainer.create Creating SolrCore 'collection1' using instanceDir: /usr/home/hudson/hudson-slave/workspace/Lucene-Solr-Tests-4.x-java7/solr/build/solr-core/test/J0/./solrtest-jetty1-1349966060191/collection1
[junit4:junit4]   2> 3824 T582 oasc.ZkController.createCollectionZkNode Check for collection zkNode:collection1
[junit4:junit4]   2> 3825 T582 oasc.ZkController.createCollectionZkNode Collection zkNode exists
[junit4:junit4]   2> 3825 T582 oasc.ZkController.readConfigName Load collection config from:/collections/collection1
[junit4:junit4]   2> 3827 T582 oasc.SolrResourceLoader.<init> new SolrResourceLoader for directory: '/usr/home/hudson/hudson-slave/workspace/Lucene-Solr-Tests-4.x-java7/solr/build/solr-core/test/J0/./solrtest-jetty1-1349966060191/collection1/'
[junit4:junit4]   2> 3828 T582 oasc.SolrResourceLoader.replaceClassLoader Adding 'file:/usr/home/hudson/hudson-slave/workspace/Lucene-Solr-Tests-4.x-java7/solr/build/solr-core/test/J0/solrtest-jetty1-1349966060191/collection1/lib/README' to classloader
[junit4:junit4]   2> 3829 T582 oasc.SolrResourceLoader.replaceClassLoader Adding 'file:/usr/home/hudson/hudson-slave/workspace/Lucene-Solr-Tests-4.x-java7/solr/build/solr-core/test/J0/solrtest-jetty1-1349966060191/collection1/lib/classes/' to classloader
[junit4:junit4]   2> 3895 T582 oasc.SolrConfig.<init> Using Lucene MatchVersion: LUCENE_41
[junit4:junit4]   2> 3966 T582 oasc.SolrConfig.<init> Loaded SolrConfig: solrconfig.xml
[junit4:junit4]   2> 3969 T603 oascc.ZkStateReader.updateClusterState Updating cloud state from ZooKeeper... 
[junit4:junit4]   2> 3982 T602 oascc.ZkStateReader$2.process A cluster state change has occurred - updating...
[junit4:junit4]   2> 4068 T616 oascc.ZkStateReader$2.process A cluster state change has occurred - updating...
[junit4:junit4]   2> 4068 T582 oass.IndexSchema.readSchema Reading Solr Schema
[junit4:junit4]   2> 4075 T582 oass.IndexSchema.readSchema Schema name=test
[junit4:junit4]   2> 4677 T582 oass.OpenExchangeRatesOrgProvider.init Initialized with rates=open-exchange-rates.json, refreshInterval=1440.
[junit4:junit4]   2> 4690 T582 oass.IndexSchema.readSchema default search field in schema is text
[junit4:junit4]   2> 4708 T582 oass.IndexSchema.readSchema unique key field: id
[junit4:junit4]   2> 4726 T582 oass.FileExchangeRateProvider.reload Reloading exchange rates from file currency.xml
[junit4:junit4]   2> 4731 T582 oass.FileExchangeRateProvider.reload Reloading exchange rates from file currency.xml
[junit4:junit4]   2> 4737 T582 oass.OpenExchangeRatesOrgProvider.reload Reloading exchange rates from open-exchange-rates.json
[junit4:junit4]   2> 4738 T582 oass.OpenExchangeRatesOrgProvider.reload Reloading exchange rates from open-exchange-rates.json
[junit4:junit4]   2> 4740 T582 oasc.SolrCore.<init> [collection1] Opening new SolrCore at /usr/home/hudson/hudson-slave/workspace/Lucene-Solr-Tests-4.x-java7/solr/build/solr-core/test/J0/./solrtest-jetty1-1349966060191/collection1/, dataDir=./org.apache.solr.cloud.BasicDistributedZkTest-1349966056692/jetty1/
[junit4:junit4]   2> 4741 T582 oasc.JmxMonitoredMap.<init> JMX monitoring is enabled. Adding Solr mbeans to JMX Server: com.sun.jmx.mbeanserver.JmxMBeanServer@4748c8a0
[junit4:junit4]   2> 4742 T582 oasc.SolrCore.getNewIndexDir New index directory detected: old=null new=./org.apache.solr.cloud.BasicDistributedZkTest-1349966056692/jetty1/index/
[junit4:junit4]   2> 4743 T582 oasc.SolrCore.initIndex WARNING [collection1] Solr index directory './org.apache.solr.cloud.BasicDistributedZkTest-1349966056692/jetty1/index' doesn't exist. Creating new index...
[junit4:junit4]   2> 4744 T582 oasc.CachingDirectoryFactory.get return new directory for /usr/home/hudson/hudson-slave/workspace/Lucene-Solr-Tests-4.x-java7/solr/build/solr-core/test/J0/./org.apache.solr.cloud.BasicDistributedZkTest-1349966056692/jetty1/index forceNew:false
[junit4:junit4]   2> 4777 T582 oasc.SolrDeletionPolicy.onCommit SolrDeletionPolicy.onCommit: commits:num=1
[junit4:junit4]   2> 		commit{dir=/usr/home/hudson/hudson-slave/workspace/Lucene-Solr-Tests-4.x-java7/solr/build/solr-core/test/J0/org.apache.solr.cloud.BasicDistributedZkTest-1349966056692/jetty1/index,segFN=segments_1,generation=1,filenames=[segments_1]
[junit4:junit4]   2> 4777 T582 oasc.SolrDeletionPolicy.updateCommits newest commit = 1
[junit4:junit4]   2> 4778 T582 oasc.SolrCore.initWriters created xml: solr.XMLResponseWriter
[junit4:junit4]   2> 4781 T582 oasup.UpdateRequestProcessorChain.init inserting DistributedUpdateProcessorFactory into updateRequestProcessorChain "dedupe"
[junit4:junit4]   2> 4781 T582 oasup.UpdateRequestProcessorChain.init inserting DistributedUpdateProcessorFactory into updateRequestProcessorChain "dedupe-allfields"
[junit4:junit4]   2> 4782 T582 oasup.UpdateRequestProcessorChain.init inserting DistributedUpdateProcessorFactory into updateRequestProcessorChain "stored_sig"
[junit4:junit4]   2> 4783 T582 oasup.UpdateRequestProcessorChain.init inserting DistributedUpdateProcessorFactory into updateRequestProcessorChain "uniq-fields"
[junit4:junit4]   2> 4783 T582 oasup.UpdateRequestProcessorChain.init inserting DistributedUpdateProcessorFactory into updateRequestProcessorChain "distrib-dup-test-chain-implicit"
[junit4:junit4]   2> 4784 T582 oasc.RequestHandlers.initHandlersFromConfig adding lazy requestHandler: solr.ReplicationHandler
[junit4:junit4]   2> 4785 T582 oasc.RequestHandlers.initHandlersFromConfig created /replication: solr.ReplicationHandler
[junit4:junit4]   2> 4785 T582 oasc.RequestHandlers.initHandlersFromConfig created standard: solr.StandardRequestHandler
[junit4:junit4]   2> 4786 T582 oasc.RequestHandlers.initHandlersFromConfig created /get: solr.RealTimeGetHandler
[junit4:junit4]   2> 4787 T582 oasc.RequestHandlers.initHandlersFromConfig created dismax: solr.SearchHandler
[junit4:junit4]   2> 4788 T582 oasc.RequestHandlers.initHandlersFromConfig created mock: org.apache.solr.core.MockQuerySenderListenerReqHandler
[junit4:junit4]   2> 4788 T582 oasc.RequestHandlers.initHandlersFromConfig created /admin/: org.apache.solr.handler.admin.AdminHandlers
[junit4:junit4]   2> 4789 T582 oasc.RequestHandlers.initHandlersFromConfig created defaults: solr.StandardRequestHandler
[junit4:junit4]   2> 4790 T582 oasc.RequestHandlers.initHandlersFromConfig adding lazy requestHandler: solr.StandardRequestHandler
[junit4:junit4]   2> 4790 T582 oasc.RequestHandlers.initHandlersFromConfig created lazy: solr.StandardRequestHandler
[junit4:junit4]   2> 4791 T582 oasc.RequestHandlers.initHandlersFromConfig created /update: solr.UpdateRequestHandler
[junit4:junit4]   2> 4792 T582 oasc.RequestHandlers.initHandlersFromConfig created /terms: org.apache.solr.handler.component.SearchHandler
[junit4:junit4]   2> 4792 T582 oasc.RequestHandlers.initHandlersFromConfig created spellCheckCompRH: org.apache.solr.handler.component.SearchHandler
[junit4:junit4]   2> 4793 T582 oasc.RequestHandlers.initHandlersFromConfig created spellCheckCompRH_Direct: org.apache.solr.handler.component.SearchHandler
[junit4:junit4]   2> 4794 T582 oasc.RequestHandlers.initHandlersFromConfig created spellCheckWithWordbreak: org.apache.solr.handler.component.SearchHandler
[junit4:junit4]   2> 4795 T582 oasc.RequestHandlers.initHandlersFromConfig created spellCheckWithWordbreak_Direct: org.apache.solr.handler.component.SearchHandler
[junit4:junit4]   2> 4795 T582 oasc.RequestHandlers.initHandlersFromConfig created spellCheckCompRH1: org.apache.solr.handler.component.SearchHandler
[junit4:junit4]   2> 4796 T582 oasc.RequestHandlers.initHandlersFromConfig created tvrh: org.apache.solr.handler.component.SearchHandler
[junit4:junit4]   2> 4797 T582 oasc.RequestHandlers.initHandlersFromConfig created /mlt: solr.MoreLikeThisHandler
[junit4:junit4]   2> 4798 T582 oasc.RequestHandlers.initHandlersFromConfig created /debug/dump: solr.DumpRequestHandler
[junit4:junit4]   2> 4811 T582 oashl.XMLLoader.init xsltCacheLifetimeSeconds=60
[junit4:junit4]   2> 4815 T582 oasc.SolrCore.initDeprecatedSupport WARNING solrconfig.xml uses deprecated <admin/gettableFiles>, Please update your config to use the ShowFileRequestHandler.
[junit4:junit4]   2> 4817 T582 oasc.SolrCore.initDeprecatedSupport WARNING adding ShowFileRequestHandler with hidden files: [SCHEMA.XML, OLD_SYNONYMS.TXT, STOPWORDS.TXT, PROTWORDS.TXT, OPEN-EXCHANGE-RATES.JSON, SYNONYMS.TXT, CURRENCY.XML, MAPPING-ISOLATIN1ACCENT.TXT]
[junit4:junit4]   2> 4821 T582 oass.SolrIndexSearcher.<init> Opening Searcher@4c882a54 main
[junit4:junit4]   2> 4823 T582 oasu.CommitTracker.<init> Hard AutoCommit: disabled
[junit4:junit4]   2> 4823 T582 oasu.CommitTracker.<init> Soft AutoCommit: disabled
[junit4:junit4]   2> 4824 T582 oashc.SpellCheckComponent.inform Initializing spell checkers
[junit4:junit4]   2> 4832 T582 oass.DirectSolrSpellChecker.init init: {name=direct,classname=DirectSolrSpellChecker,field=lowerfilt,minQueryLength=3}
[junit4:junit4]   2> 4885 T617 oasc.SolrCore.registerSearcher [collection1] Registered new searcher Searcher@4c882a54 main{StandardDirectoryReader(segments_1:1)}
[junit4:junit4]   2> 4991 T603 oascc.ZkStateReader.updateClusterState Updating cloud state from ZooKeeper... 
[junit4:junit4]   2> 5017 T602 oascc.ZkStateReader$2.process A cluster state change has occurred - updating...
[junit4:junit4]   2> 5017 T616 oascc.ZkStateReader$2.process A cluster state change has occurred - updating...
[junit4:junit4]   2> 5394 T582 oasc.CoreContainer.register registering core: collection1
[junit4:junit4]   2> 5394 T582 oasc.ZkController.register Register shard - core:collection1 address:http://127.0.0.1:15306/solr shardId:shard1
[junit4:junit4]   2> 5396 T582 oascc.SolrZkClient.makePath makePath: /collections/collection1/leader_elect/shard1/election
[junit4:junit4]   2> 5414 T587 oazs.PrepRequestProcessor.pRequest Got user-level KeeperException when processing sessionid:0x13a503f4e5d0003 type:delete cxid:0x43 zxid:0xfffffffffffffffe txntype:unknown reqpath:n/a Error Path:/solr/collections/collection1/leaders Error:KeeperErrorCode = NoNode for /solr/collections/collection1/leaders
[junit4:junit4]   2> 5415 T582 oasc.ShardLeaderElectionContext.runLeaderProcess Running the leader process.
[junit4:junit4]   2> 5416 T587 oazs.PrepRequestProcessor.pRequest Got user-level KeeperException when processing sessionid:0x13a503f4e5d0003 type:create cxid:0x44 zxid:0xfffffffffffffffe txntype:unknown reqpath:n/a Error Path:/solr/overseer Error:KeeperErrorCode = NodeExists for /solr/overseer
[junit4:junit4]   2> 5424 T582 oasc.ShardLeaderElectionContext.waitForReplicasToComeUp Enough replicas found to continue.
[junit4:junit4]   2> 5424 T582 oasc.ShardLeaderElectionContext.runLeaderProcess I may be the new leader - try and sync
[junit4:junit4]   2> 5425 T582 oasc.SyncStrategy.sync Sync replicas to http://127.0.0.1:15306/solr/collection1/
[junit4:junit4]   2> 5426 T582 oasc.SyncStrategy.syncReplicas Sync Success - now sync replicas to me
[junit4:junit4]   2> 5426 T582 oasc.SyncStrategy.syncToMe http://127.0.0.1:15306/solr/collection1/ has no replicas
[junit4:junit4]   2> 5427 T582 oasc.ShardLeaderElectionContext.runLeaderProcess I am the new leader: http://127.0.0.1:15306/solr/collection1/
[junit4:junit4]   2> 5427 T582 oascc.SolrZkClient.makePath makePath: /collections/collection1/leaders/shard1
[junit4:junit4]   2> 5433 T587 oazs.PrepRequestProcessor.pRequest Got user-level KeeperException when processing sessionid:0x13a503f4e5d0003 type:create cxid:0x4e zxid:0xfffffffffffffffe txntype:unknown reqpath:n/a Error Path:/solr/overseer Error:KeeperErrorCode = NodeExists for /solr/overseer
[junit4:junit4]   2> 5523 T603 oascc.ZkStateReader.updateClusterState Updating cloud state from ZooKeeper... 
[junit4:junit4]   2> 5540 T616 oascc.ZkStateReader$2.process A cluster state change has occurred - updating...
[junit4:junit4]   2> 5540 T602 oascc.ZkStateReader$2.process A cluster state change has occurred - updating...
[junit4:junit4]   2> 5545 T582 oasc.ZkController.register We are http://127.0.0.1:15306/solr/collection1/ and leader is http://127.0.0.1:15306/solr/collection1/
[junit4:junit4]   2> 5545 T582 oasc.ZkController.register No LogReplay needed for core=collection1 baseURL=http://127.0.0.1:15306/solr
[junit4:junit4]   2> 5546 T582 oasc.ZkController.checkRecovery I am the leader, no recovery necessary
[junit4:junit4]   2> 5550 T582 oascc.ZkStateReader.updateClusterState Updating cloud state from ZooKeeper... 
[junit4:junit4]   2> 5552 T582 oass.SolrDispatchFilter.init user.dir=/usr/home/hudson/hudson-slave/workspace/Lucene-Solr-Tests-4.x-java7/solr/build/solr-core/test/J0
[junit4:junit4]   2> 5552 T582 oass.SolrDispatchFilter.init SolrDispatchFilter.init() done
[junit4:junit4]   2> 5553 T582 oascsi.HttpClientUtil.createClient Creating new http client, config:maxConnections=128&maxConnectionsPerHost=32&followRedirects=false
[junit4:junit4]   2> 5726 T582 oejs.Server.doStart jetty-8.1.2.v20120308
[junit4:junit4]   2> 5729 T582 oejs.AbstractConnector.doStart Started SocketConnector@0.0.0.0:43029
[junit4:junit4]   2> 5729 T582 oasc.SolrResourceLoader.locateSolrHome JNDI not configured for solr (NoInitialContextEx)
[junit4:junit4]   2> 5730 T582 oasc.SolrResourceLoader.locateSolrHome using system property solr.solr.home: /usr/home/hudson/hudson-slave/workspace/Lucene-Solr-Tests-4.x-java7/solr/build/solr-core/test/J0/./solrtest-jetty2-1349966062255
[junit4:junit4]   2> 5730 T582 oasc.SolrResourceLoader.<init> new SolrResourceLoader for deduced Solr Home: '/usr/home/hudson/hudson-slave/workspace/Lucene-Solr-Tests-4.x-java7/solr/build/solr-core/test/J0/./solrtest-jetty2-1349966062255/'
[junit4:junit4]   2> 5772 T582 oass.SolrDispatchFilter.init SolrDispatchFilter.init()
[junit4:junit4]   2> 5773 T582 oasc.SolrResourceLoader.locateSolrHome JNDI not configured for solr (NoInitialContextEx)
[junit4:junit4]   2> 5773 T582 oasc.SolrResourceLoader.locateSolrHome using system property solr.solr.home: /usr/home/hudson/hudson-slave/workspace/Lucene-Solr-Tests-4.x-java7/solr/build/solr-core/test/J0/./solrtest-jetty2-1349966062255
[junit4:junit4]   2> 5773 T582 oasc.CoreContainer$Initializer.initialize looking for solr.xml: /usr/home/hudson/hudson-slave/workspace/Lucene-Solr-Tests-4.x-java7/solr/build/solr-core/test/J0/./solrtest-jetty2-1349966062255/solr.xml
[junit4:junit4]   2> 5774 T582 oasc.CoreContainer.<init> New CoreContainer 2103107748
[junit4:junit4]   2> 5775 T582 oasc.CoreContainer.load Loading CoreContainer using Solr Home: '/usr/home/hudson/hudson-slave/workspace/Lucene-Solr-Tests-4.x-java7/solr/build/solr-core/test/J0/./solrtest-jetty2-1349966062255/'
[junit4:junit4]   2> 5775 T582 oasc.SolrResourceLoader.<init> new SolrResourceLoader for directory: '/usr/home/hudson/hudson-slave/workspace/Lucene-Solr-Tests-4.x-java7/solr/build/solr-core/test/J0/./solrtest-jetty2-1349966062255/'
[junit4:junit4]   2> 5807 T582 oasc.CoreContainer.load Registering Log Listener
[junit4:junit4]   2> 5823 T582 oasc.CoreContainer.initZooKeeper Zookeeper client=127.0.0.1:31220/solr
[junit4:junit4]   2> 5823 T582 oaz.ZooKeeper.<init> Initiating client connection, connectString=127.0.0.1:31220/solr sessionTimeout=5000 watcher=org.apache.solr.common.cloud.ConnectionManager@5c3214c0
[junit4:junit4]   2> 5824 T627 oaz.ClientCnxn$SendThread.startConnect Opening socket connection to server /127.0.0.1:31220
[junit4:junit4]   2> 5824 T582 oascc.ConnectionManager.waitForConnected Waiting for client to connect to ZooKeeper
[junit4:junit4]   2> 5826 T627 oaz.ClientCnxn$SendThread.primeConnection Socket connection established to localhost/127.0.0.1:31220, initiating session
[junit4:junit4]   2> 5826 T584 oazs.NIOServerCnxn$Factory.run Accepted socket connection from /140.211.11.196:61585
[junit4:junit4]   2> 5827 T584 oazs.NIOServerCnxn.readConnectRequest Client attempting to establish new session at /140.211.11.196:61585
[junit4:junit4]   2> 5830 T586 oazs.NIOServerCnxn.finishSessionInit Established session 0x13a503f4e5d0004 with negotiated timeout 5000 for client /140.211.11.196:61585
[junit4:junit4]   2> 5830 T627 oaz.ClientCnxn$SendThread.readConnectResult Session establishment complete on server localhost/127.0.0.1:31220, sessionid = 0x13a503f4e5d0004, negotiated timeout = 5000
[junit4:junit4]   2> 5830 T628 oascc.ConnectionManager.process Watcher org.apache.solr.common.cloud.ConnectionManager@5c3214c0 name:ZooKeeperConnection Watcher:127.0.0.1:31220/solr got event WatchedEvent state:SyncConnected type:None path:null path:null type:None
[junit4:junit4]   2> 5830 T582 oascc.ConnectionManager.waitForConnected Client is connected to ZooKeeper
[junit4:junit4]   2> 5831 T587 oazs.PrepRequestProcessor.pRequest Got user-level KeeperException when processing sessionid:0x13a503f4e5d0004 type:create cxid:0x1 zxid:0xfffffffffffffffe txntype:unknown reqpath:n/a Error Path:/solr/overseer Error:KeeperErrorCode = NodeExists for /solr/overseer
[junit4:junit4]   2> 5844 T587 oazs.PrepRequestProcessor.pRequest Got user-level KeeperException when processing sessionid:0x13a503f4e5d0004 type:create cxid:0x2 zxid:0xfffffffffffffffe txntype:unknown reqpath:n/a Error Path:/solr/overseer Error:KeeperErrorCode = NodeExists for /solr/overseer
[junit4:junit4]   2> 5846 T582 oasc.ZkController.createEphemeralLiveNode Register node as live in ZooKeeper:/live_nodes/127.0.0.1:43029_solr
[junit4:junit4]   2> 5846 T587 oazs.PrepRequestProcessor.pRequest Got user-level KeeperException when processing sessionid:0x13a503f4e5d0004 type:delete cxid:0x4 zxid:0xfffffffffffffffe txntype:unknown reqpath:n/a Error Path:/solr/live_nodes/127.0.0.1:43029_solr Error:KeeperErrorCode = NoNode for /solr/live_nodes/127.0.0.1:43029_solr
[junit4:junit4]   2> 5848 T582 oascc.SolrZkClient.makePath makePath: /live_nodes/127.0.0.1:43029_solr
[junit4:junit4]   2> 5856 T616 oascc.ZkStateReader$3.process Updating live nodes
[junit4:junit4]   2> 5856 T602 oascc.ZkStateReader$3.process Updating live nodes
[junit4:junit4]   2> 5857 T582 oashc.HttpShardHandlerFactory.getParameter Setting socketTimeout to: 0
[junit4:junit4]   2> 5858 T582 oashc.HttpShardHandlerFactory.getParameter Setting urlScheme to: http://
[junit4:junit4]   2> 5858 T582 oashc.HttpShardHandlerFactory.getParameter Setting connTimeout to: 0
[junit4:junit4]   2> 5858 T582 oashc.HttpShardHandlerFactory.getParameter Setting maxConnectionsPerHost to: 20
[junit4:junit4]   2> 5859 T582 oashc.HttpShardHandlerFactory.getParameter Setting corePoolSize to: 0
[junit4:junit4]   2> 5859 T582 oashc.HttpShardHandlerFactory.getParameter Setting maximumPoolSize to: 2147483647
[junit4:junit4]   2> 5860 T582 oashc.HttpShardHandlerFactory.getParameter Setting maxThreadIdleTime to: 5
[junit4:junit4]   2> 5860 T582 oashc.HttpShardHandlerFactory.getParameter Setting sizeOfQueue to: -1
[junit4:junit4]   2> 5861 T582 oashc.HttpShardHandlerFactory.getParameter Setting fairnessPolicy to: false
[junit4:junit4]   2> 5861 T582 oascsi.HttpClientUtil.createClient Creating new http client, config:maxConnectionsPerHost=20&maxConnections=10000&socketTimeout=0&connTimeout=0&retry=false
[junit4:junit4]   2> 5881 T582 oascc.ZkStateReader.createClusterStateWatchersAndUpdate Updating cluster state from ZooKeeper... 
[junit4:junit4]   2> 5888 T582 oasc.CoreContainer.create Creating SolrCore 'collection1' using instanceDir: /usr/home/hudson/hudson-slave/workspace/Lucene-Solr-Tests-4.x-java7/solr/build/solr-core/test/J0/./solrtest-jetty2-1349966062255/collection1
[junit4:junit4]   2> 5888 T582 oasc.ZkController.createCollectionZkNode Check for collection zkNode:collection1
[junit4:junit4]   2> 5889 T582 oasc.ZkController.createCollectionZkNode Collection zkNode exists
[junit4:junit4]   2> 5890 T582 oasc.ZkController.readConfigName Load collection config from:/collections/collection1
[junit4:junit4]   2> 5892 T582 oasc.SolrResourceLoader.<init> new SolrResourceLoader for directory: '/usr/home/hudson/hudson-slave/workspace/Lucene-Solr-Tests-4.x-java7/solr/build/solr-core/test/J0/./solrtest-jetty2-1349966062255/collection1/'
[junit4:junit4]   2> 5893 T582 oasc.SolrResourceLoader.replaceClassLoader Adding 'file:/usr/home/hudson/hudson-slave/workspace/Lucene-Solr-Tests-4.x-java7/solr/build/solr-core/test/J0/solrtest-jetty2-1349966062255/collection1/lib/README' to classloader
[junit4:junit4]   2> 5894 T582 oasc.SolrResourceLoader.replaceClassLoader Adding 'file:/usr/home/hudson/hudson-slave/workspace/Lucene-Solr-Tests-4.x-java7/solr/build/solr-core/test/J0/solrtest-jetty2-1349966062255/collection1/lib/classes/' to classloader
[junit4:junit4]   2> 5945 T582 oasc.SolrConfig.<init> Using Lucene MatchVersion: LUCENE_41
[junit4:junit4]   2> 6016 T582 oasc.SolrConfig.<init> Loaded SolrConfig: solrconfig.xml
[junit4:junit4]   2> 6090 T603 oascc.ZkStateReader.updateClusterState Updating cloud state from ZooKeeper... 
[junit4:junit4]   2> 6104 T602 oascc.ZkStateReader$2.process A cluster state change has occurred - updating...
[junit4:junit4]   2> 6104 T616 oascc.ZkStateReader$2.process A cluster state change has occurred - updating...
[junit4:junit4]   2> 6118 T628 oascc.ZkStateReader$2.process A cluster state change has occurred - updating...
[junit4:junit4]   2> 6118 T582 oass.IndexSchema.readSchema Reading Solr Schema
[junit4:junit4]   2> 6125 T582 oass.IndexSchema.readSchema Schema name=test
[junit4:junit4]   2> 6751 T582 oass.OpenExchangeRatesOrgProvider.init Initialized with rates=open-exchange-rates.json, refreshInterval=1440.
[junit4:junit4]   2> 6763 T582 oass.IndexSchema.readSchema default search field in schema is text
[junit4:junit4]   2> 6767 T582 oass.IndexSchema.readSchema unique key field: id
[junit4:junit4]   2> 6785 T582 oass.FileExchangeRateProvider.reload Reloading exchange rates from file currency.xml
[junit4:junit4]   2> 6791 T582 oass.FileExchangeRateProvider.reload Reloading exchange rates from file currency.xml
[junit4:junit4]   2> 6796 T582 oass.OpenExchangeRatesOrgProvider.reload Reloading exchange rates from open-exchange-rates.json
[junit4:junit4]   2> 6798 T582 oass.OpenExchangeRatesOrgProvider.reload Reloading exchange rates from open-exchange-rates.json
[junit4:junit4]   2> 6800 T582 oasc.SolrCore.<init> [collection1] Opening new SolrCore at /usr/home/hudson/hudson-slave/workspace/Lucene-Solr-Tests-4.x-java7/solr/build/solr-core/test/J0/./solrtest-jetty2-1349966062255/collection1/, dataDir=./org.apache.solr.cloud.BasicDistributedZkTest-1349966056692/jetty2/
[junit4:junit4]   2> 6801 T582 oasc.JmxMonitoredMap.<init> JMX monitoring is enabled. Adding Solr mbeans to JMX Server: com.sun.jmx.mbeanserver.JmxMBeanServer@4748c8a0
[junit4:junit4]   2> 6802 T582 oasc.SolrCore.getNewIndexDir New index directory detected: old=null new=./org.apache.solr.cloud.BasicDistributedZkTest-1349966056692/jetty2/index/
[junit4:junit4]   2> 6803 T582 oasc.SolrCore.initIndex WARNING [collection1] Solr index directory './org.apache.solr.cloud.BasicDistributedZkTest-1349966056692/jetty2/index' doesn't exist. Creating new index...
[junit4:junit4]   2> 6804 T582 oasc.CachingDirectoryFactory.get return new directory for /usr/home/hudson/hudson-slave/workspace/Lucene-Solr-Tests-4.x-java7/solr/build/solr-core/test/J0/./org.apache.solr.cloud.BasicDistributedZkTest-1349966056692/jetty2/index forceNew:false
[junit4:junit4]   2> 6810 T582 oasc.SolrDeletionPolicy.onCommit SolrDeletionPolicy.onCommit: commits:num=1
[junit4:junit4]   2> 		commit{dir=/usr/home/hudson/hudson-slave/workspace/Lucene-Solr-Tests-4.x-java7/solr/build/solr-core/test/J0/org.apache.solr.cloud.BasicDistributedZkTest-1349966056692/jetty2/index,segFN=segments_1,generation=1,filenames=[segments_1]
[junit4:junit4]   2> 6811 T582 oasc.SolrDeletionPolicy.updateCommits newest commit = 1
[junit4:junit4]   2> 6812 T582 oasc.SolrCore.initWriters created xml: solr.XMLResponseWriter
[junit4:junit4]   2> 6814 T582 oasup.UpdateRequestProcessorChain.init inserting DistributedUpdateProcessorFactory into updateRequestProcessorChain "dedupe"
[junit4:junit4]   2> 6815 T582 oasup.UpdateRequestProcessorChain.init inserting DistributedUpdateProcessorFactory into updateRequestProcessorChain "dedupe-allfields"
[junit4:junit4]   2> 6816 T582 oasup.UpdateRequestProcessorChain.init inserting DistributedUpdateProcessorFactory into updateRequestProcessorChain "stored_sig"
[junit4:junit4]   2> 6816 T582 oasup.UpdateRequestProcessorChain.init inserting DistributedUpdateProcessorFactory into updateRequestProcessorChain "uniq-fields"
[junit4:junit4]   2> 6817 T582 oasup.UpdateRequestProcessorChain.init inserting DistributedUpdateProcessorFactory into updateRequestProcessorChain "distrib-dup-test-chain-implicit"
[junit4:junit4]   2> 6817 T582 oasc.RequestHandlers.initHandlersFromConfig adding lazy requestHandler: solr.ReplicationHandler
[junit4:junit4]   2> 6818 T582 oasc.RequestHandlers.initHandlersFromConfig created /replication: solr.ReplicationHandler
[junit4:junit4]   2> 6819 T582 oasc.RequestHandlers.initHandlersFromConfig created standard: solr.StandardRequestHandler
[junit4:junit4]   2> 6820 T582 oasc.RequestHandlers.initHandlersFromConfig created /get: solr.RealTimeGetHandler
[junit4:junit4]   2> 6820 T582 oasc.RequestHandlers.initHandlersFromConfig created dismax: solr.SearchHandler
[junit4:junit4]   2> 6821 T582 oasc.RequestHandlers.initHandlersFromConfig created mock: org.apache.solr.core.MockQuerySenderListenerReqHandler
[junit4:junit4]   2> 6822 T582 oasc.RequestHandlers.initHandlersFromConfig created /admin/: org.apache.solr.handler.admin.AdminHandlers
[junit4:junit4]   2> 6823 T582 oasc.RequestHandlers.initHandlersFromConfig created defaults: solr.StandardRequestHandler
[junit4:junit4]   2> 6823 T582 oasc.RequestHandlers.initHandlersFromConfig adding lazy requestHandler: solr.StandardRequestHandler
[junit4:junit4]   2> 6824 T582 oasc.RequestHandlers.initHandlersFromConfig created lazy: solr.StandardRequestHandler
[junit4:junit4]   2> 6824 T582 oasc.RequestHandlers.initHandlersFromConfig created /update: solr.UpdateRequestHandler
[junit4:junit4]   2> 6825 T582 oasc.RequestHandlers.initHandlersFromConfig created /terms: org.apache.solr.handler.component.SearchHandler
[junit4:junit4]   2> 6826 T582 oasc.RequestHandlers.initHandlersFromConfig created spellCheckCompRH: org.apache.solr.handler.component.SearchHandler
[junit4:junit4]   2> 6827 T582 oasc.RequestHandlers.initHandlersFromConfig created spellCheckCompRH_Direct: org.apache.solr.handler.component.SearchHandler
[junit4:junit4]   2> 6827 T582 oasc.RequestHandlers.initHandlersFromConfig created spellCheckWithWordbreak: org.apache.solr.handler.component.SearchHandler
[junit4:junit4]   2> 6828 T582 oasc.RequestHandlers.initHandlersFromConfig created spellCheckWithWordbreak_Direct: org.apache.solr.handler.component.SearchHandler
[junit4:junit4]   2> 6829 T582 oasc.RequestHandlers.initHandlersFromConfig created spellCheckCompRH1: org.apache.solr.handler.component.SearchHandler
[junit4:junit4]   2> 6830 T582 oasc.RequestHandlers.initHandlersFromConfig created tvrh: org.apache.solr.handler.component.SearchHandler
[junit4:junit4]   2> 6830 T582 oasc.RequestHandlers.initHandlersFromConfig created /mlt: solr.MoreLikeThisHandler
[junit4:junit4]   2> 6831 T582 oasc.RequestHandlers.initHandlersFromConfig created /debug/dump: solr.DumpRequestHandler
[junit4:junit4]   2> 6844 T582 oashl.XMLLoader.init xsltCacheLifetimeSeconds=60
[junit4:junit4]   2> 6849 T582 oasc.SolrCore.initDeprecatedSupport WARNING solrconfig.xml uses deprecated <admin/gettableFiles>, Please update your config to use the ShowFileRequestHandler.
[junit4:junit4]   2> 6851 T582 oasc.SolrCore.initDeprecatedSupport WARNING adding ShowFileRequestHandler with hidden files: [SCHEMA.XML, OLD_SYNONYMS.TXT, STOPWORDS.TXT, PROTWORDS.TXT, OPEN-EXCHANGE-RATES.JSON, SYNONYMS.TXT, CURRENCY.XML, MAPPING-ISOLATIN1ACCENT.TXT]
[junit4:junit4]   2> 6855 T582 oass.SolrIndexSearcher.<init> Opening Searcher@694fa96e main
[junit4:junit4]   2> 6856 T582 oasu.CommitTracker.<init> Hard AutoCommit: disabled
[junit4:junit4]   2> 6857 T582 oasu.CommitTracker.<init> Soft AutoCommit: disabled
[junit4:junit4]   2> 6858 T582 oashc.SpellCheckComponent.inform Initializing spell checkers
[junit4:junit4]   2> 6866 T582 oass.DirectSolrSpellChecker.init init: {name=direct,classname=DirectSolrSpellChecker,field=lowerfilt,minQueryLength=3}
[junit4:junit4]   2> 6918 T629 oasc.SolrCore.registerSearcher [collection1] Registered new searcher Searcher@694fa96e main{StandardDirectoryReader(segments_1:1)}
[junit4:junit4]   2> 7113 T603 oascc.ZkStateReader.updateClusterState Updating cloud state from ZooKeeper... 
[junit4:junit4]   2> 7127 T628 oascc.ZkStateReader$2.process A cluster state change has occurred - updating...
[junit4:junit4]   2> 7127 T616 oascc.ZkStateReader$2.process A cluster state change has occurred - updating...
[junit4:junit4]   2> 7127 T602 oascc.ZkStateReader$2.process A cluster state change has occurred - updating...
[junit4:junit4]   2> 7426 T582 oasc.CoreContainer.register registering core: collection1
[junit4:junit4]   2> 7426 T582 oasc.ZkController.register Register shard - core:collection1 address:http://127.0.0.1:43029/solr shardId:shard2
[junit4:junit4]   2> 7427 T582 oascc.SolrZkClient.makePath makePath: /collections/collection1/leader_elect/shard2/election
[junit4:junit4]   2> 7444 T587 oazs.PrepRequestProcessor.pRequest Got user-level KeeperException when processing sessionid:0x13a503f4e5d0004 type:delete cxid:0x42 zxid:0xfffffffffffffffe txntype:unknown reqpath:n/a Error Path:/solr/collections/collection1/leaders/shard2 Error:KeeperErrorCode = NoNode for /solr/collections/collection1/leaders/shard2
[junit4:junit4]   2> 7445 T582 oasc.ShardLeaderElectionContext.runLeaderProcess Running the leader process.
[junit4:junit4]   2> 7445 T587 oazs.PrepRequestProcessor.pRequest Got user-level KeeperException when processing sessionid:0x13a503f4e5d0004 type:create cxid:0x43 zxid:0xfffffffffffffffe txntype:unknown reqpath:n/a Error Path:/solr/overseer Error:KeeperErrorCode = NodeExists for /solr/overseer
[junit4:junit4]   2> 7456 T582 oasc.ShardLeaderElectionContext.waitForReplicasToComeUp Enough replicas found to continue.
[junit4:junit4]   2> 7456 T582 oasc.ShardLeaderElectionContext.runLeaderProcess I may be the new leader - try and sync
[junit4:junit4]   2> 7456 T582 oasc.SyncStrategy.sync Sync replicas to http://127.0.0.1:43029/solr/collection1/
[junit4:junit4]   2> 7457 T582 oasc.SyncStrategy.syncReplicas Sync Success - now sync replicas to me
[junit4:junit4]   2> 7457 T582 oasc.SyncStrategy.syncToMe http://127.0.0.1:43029/solr/collection1/ has no replicas
[junit4:junit4]   2> 7458 T582 oasc.ShardLeaderElectionContext.runLeaderProcess I am the new leader: http://127.0.0.1:43029/solr/collection1/
[junit4:junit4]   2> 7458 T582 oascc.SolrZkClient.makePath makePath: /collections/collection1/leaders/shard2
[junit4:junit4]   2> 7462 T587 oazs.PrepRequestProcessor.pRequest Got user-level KeeperException when processing sessionid:0x13a503f4e5d0004 type:create cxid:0x4c zxid:0xfffffffffffffffe txntype:unknown reqpath:n/a Error Path:/solr/overseer Error:KeeperErrorCode = NodeExists for /solr/overseer
[junit4:junit4]   2> 7633 T603 oascc.ZkStateReader.updateClusterState Updating cloud state from ZooKeeper... 
[junit4:junit4]   2> 7751 T616 oascc.ZkStateReader$2.process A cluster state change has occurred - updating...
[junit4:junit4]   2> 7751 T602 oascc.ZkStateReader$2.process A cluster state change has occurred - updating...
[junit4:junit4]   2> 7751 T628 oascc.ZkStateReader$2.process A cluster state change has occurred - updating...
[junit4:junit4]   2> 7771 T582 oasc.ZkController.register We are http://127.0.0.1:43029/solr/collection1/ and leader is http://127.0.0.1:43029/solr/collection1/
[junit4:junit4]   2> 7771 T582 oasc.ZkController.register No LogReplay needed for core=collection1 baseURL=http://127.0.0.1:43029/solr
[junit4:junit4]   2> 7772 T582 oasc.ZkController.checkRecovery I am the leader, no recovery necessary
[junit4:junit4]   2> 7828 T582 oascc.ZkStateReader.updateClusterState Updating cloud state from ZooKeeper... 
[junit4:junit4]   2> 7829 T582 oass.SolrDispatchFilter.init user.dir=/usr/home/hudson/hudson-slave/workspace/Lucene-Solr-Tests-4.x-java7/solr/build/solr-core/test/J0
[junit4:junit4]   2> 7830 T582 oass.SolrDispatchFilter.init SolrDispatchFilter.init() done
[junit4:junit4]   2> 7830 T582 oascsi.HttpClientUtil.createClient Creating new http client, config:maxConnections=128&maxConnectionsPerHost=32&followRedirects=false
[junit4:junit4]   2> 8006 T582 oejs.Server.doStart jetty-8.1.2.v20120308
[junit4:junit4]   2> 8009 T582 oejs.AbstractConnector.doStart Started SocketConnector@0.0.0.0:11120
[junit4:junit4]   2> 8009 T582 oasc.SolrResourceLoader.locateSolrHome JNDI not configured for solr (NoInitialContextEx)
[junit4:junit4]   2> 8010 T582 oasc.SolrResourceLoader.locateSolrHome using system property solr.solr.home: /usr/home/hudson/hudson-slave/workspace/Lucene-Solr-Tests-4.x-java7/solr/build/solr-core/test/J0/./solrtest-jetty3-1349966064535
[junit4:junit4]   2> 8010 T582 oasc.SolrResourceLoader.<init> new SolrResourceLoader for deduced Solr Home: '/usr/home/hudson/hudson-slave/workspace/Lucene-Solr-Tests-4.x-java7/solr/build/solr-core/test/J0/./solrtest-jetty3-1349966064535/'
[junit4:junit4]   2> 8052 T582 oass.SolrDispatchFilter.init SolrDispatchFilter.init()
[junit4:junit4]   2> 8052 T582 oasc.SolrResourceLoader.locateSolrHome JNDI not configured for solr (NoInitialContextEx)
[junit4:junit4]   2> 8053 T582 oasc.SolrResourceLoader.locateSolrHome using system property solr.solr.home: /usr/home/hudson/hudson-slave/workspace/Lucene-Solr-Tests-4.x-java7/solr/build/solr-core/test/J0/./solrtest-jetty3-1349966064535
[junit4:junit4]   2> 8053 T582 oasc.CoreContainer$Initializer.initialize looking for solr.xml: /usr/home/hudson/hudson-slave/workspace/Lucene-Solr-Tests-4.x-java7/solr/build/solr-core/test/J0/./solrtest-jetty3-1349966064535/solr.xml
[junit4:junit4]   2> 8053 T582 oasc.CoreContainer.<init> New CoreContainer 659109999
[junit4:junit4]   2> 8054 T582 oasc.CoreContainer.load Loading CoreContainer using Solr Home: '/usr/home/hudson/hudson-slave/workspace/Lucene-Solr-Tests-4.x-java7/solr/build/solr-core/test/J0/./solrtest-jetty3-1349966064535/'
[junit4:junit4]   2> 8055 T582 oasc.SolrResourceLoader.<init> new SolrResourceLoader for directory: '/usr/home/hudson/hudson-slave/workspace/Lucene-Solr-Tests-4.x-java7/solr/build/solr-core/test/J0/./solrtest-jetty3-1349966064535/'
[junit4:junit4]   2> 8087 T582 oasc.CoreContainer.load Registering Log Listener
[junit4:junit4]   2> 8102 T582 oasc.CoreContainer.initZooKeeper Zookeeper client=127.0.0.1:31220/solr
[junit4:junit4]   2> 8103 T582 oaz.ZooKeeper.<init> Initiating client connection, connectString=127.0.0.1:31220/solr sessionTimeout=5000 watcher=org.apache.solr.common.cloud.ConnectionManager@7320cf8e
[junit4:junit4]   2> 8104 T639 oaz.ClientCnxn$SendThread.startConnect Opening socket connection to server /127.0.0.1:31220
[junit4:junit4]   2> 8104 T582 oascc.ConnectionManager.waitForConnected Waiting for client to connect to ZooKeeper
[junit4:junit4]   2> 8106 T639 oaz.ClientCnxn$SendThread.primeConnection Socket connection established to localhost/127.0.0.1:31220, initiating session
[junit4:junit4]   2> 8106 T584 oazs.NIOServerCnxn$Factory.run Accepted socket connection from /140.211.11.196:42640
[junit4:junit4]   2> 8107 T584 oazs.NIOServerCnxn.readConnectRequest Client attempting to establish new session at /140.211.11.196:42640
[junit4:junit4]   2> 8138 T586 oazs.NIOServerCnxn.finishSessionInit Established session 0x13a503f4e5d0005 with negotiated timeout 5000 for client /140.211.11.196:42640
[junit4:junit4]   2> 8138 T639 oaz.ClientCnxn$SendThread.readConnectResult Session establishment complete on server localhost/127.0.0.1:31220, sessionid = 0x13a503f4e5d0005, negotiated timeout = 5000
[junit4:junit4]   2> 8138 T640 oascc.ConnectionManager.process Watcher org.apache.solr.common.cloud.ConnectionManager@7320cf8e name:ZooKeeperConnection Watcher:127.0.0.1:31220/solr got event WatchedEvent state:SyncConnected type:None path:null path:null type:None
[junit4:junit4]   2> 8139 T582 oascc.ConnectionManager.waitForConnected Client is connected to ZooKeeper
[junit4:junit4]   2> 8140 T587 oazs.PrepRequestProcessor.pRequest Got user-level KeeperException when processing sessionid:0x13a503f4e5d0005 type:create cxid:0x1 zxid:0xfffffffffffffffe txntype:unknown reqpath:n/a Error Path:/solr/overseer Error:KeeperErrorCode = NodeExists for /solr/overseer
[junit4:junit4]   2> 8166 T587 oazs.PrepRequestProcessor.pRequest Got user-level KeeperException when processing sessionid:0x13a503f4e5d0005 type:create cxid:0x2 zxid:0xfffffffffffffffe txntype:unknown reqpath:n/a Error Path:/solr/overseer Error:KeeperErrorCode = NodeExists for /solr/overseer
[junit4:junit4]   2> 8168 T582 oasc.ZkController.createEphemeralLiveNode Register node as live in ZooKeeper:/live_nodes/127.0.0.1:11120_solr
[junit4:junit4]   2> 8169 T587 oazs.PrepRequestProcessor.pRequest Got user-level KeeperException when processing sessionid:0x13a503f4e5d0005 type:delete cxid:0x4 zxid:0xfffffffffffffffe txntype:unknown reqpath:n/a Error Path:/solr/live_nodes/127.0.0.1:11120_solr Error:KeeperErrorCode = NoNode for /solr/live_nodes/127.0.0.1:11120_solr
[junit4:junit4]   2> 8181 T582 oascc.SolrZkClient.makePath makePath: /live_nodes/127.0.0.1:11120_solr
[junit4:junit4]   2> 8184 T628 oascc.ZkStateReader$3.process Updating live nodes
[junit4:junit4]   2> 8184 T616 oascc.ZkStateReader$3.process Updating live nodes
[junit4:junit4]   2> 8184 T602 oascc.ZkStateReader$3.process Updating live nodes
[junit4:junit4]   2> 8185 T582 oashc.HttpShardHandlerFactory.getParameter Setting socketTimeout to: 0
[junit4:junit4]   2> 8186 T582 oashc.HttpShardHandlerFactory.getParameter Setting urlScheme to: http://
[junit4:junit4]   2> 8186 T582 oashc.HttpShardHandlerFactory.getParameter Setting connTimeout to: 0
[junit4:junit4]   2> 8187 T582 oashc.HttpShardHandlerFactory.getParameter Setting maxConnectionsPerHost to: 20
[junit4:junit4]   2> 8187 T582 oashc.HttpShardHandlerFactory.getParameter Setting corePoolSize to: 0
[junit4:junit4]   2> 8187 T582 oashc.HttpShardHandlerFactory.getParameter Setting maximumPoolSize to: 2147483647
[junit4:junit4]   2> 8188 T582 oashc.HttpShardHandlerFactory.getParameter Setting maxThreadIdleTime to: 5
[junit4:junit4]   2> 8188 T582 oashc.HttpShardHandlerFactory.getParameter Setting sizeOfQueue to: -1
[junit4:junit4]   2> 8189 T582 oashc.HttpShardHandlerFactory.getParameter Setting fairnessPolicy to: false
[junit4:junit4]   2> 8189 T582 oascsi.HttpClientUtil.createClient Creating new http client, config:maxConnectionsPerHost=20&maxConnections=10000&socketTimeout=0&connTimeout=0&retry=false
[junit4:junit4]   2> 8210 T582 oascc.ZkStateReader.createClusterStateWatchersAndUpdate Updating cluster state from ZooKeeper... 
[junit4:junit4]   2> 8217 T582 oasc.CoreContainer.create Creating SolrCore 'collection1' using instanceDir: /usr/home/hudson/hudson-slave/workspace/Lucene-Solr-Tests-4.x-java7/solr/build/solr-core/test/J0/./solrtest-jetty3-1349966064535/collection1
[junit4:junit4]   2> 8217 T582 oasc.ZkController.createCollectionZkNode Check for collection zkNode:collection1
[junit4:junit4]   2> 8218 T582 oasc.ZkController.createCollectionZkNode Collection zkNode exists
[junit4:junit4]   2> 8219 T582 oasc.ZkController.readConfigName Load collection config from:/collections/collection1
[junit4:junit4]   2> 8221 T582 oasc.SolrResourceLoader.<init> new SolrResourceLoader for directory: '/usr/home/hudson/hudson-slave/workspace/Lucene-Solr-Tests-4.x-java7/solr/build/solr-core/test/J0/./solrtest-jetty3-1349966064535/collection1/'
[junit4:junit4]   2> 8222 T582 oasc.SolrResourceLoader.replaceClassLoader Adding 'file:/usr/home/hudson/hudson-slave/workspace/Lucene-Solr-Tests-4.x-java7/solr/build/solr-core/test/J0/solrtest-jetty3-1349966064535/collection1/lib/classes/' to classloader
[junit4:junit4]   2> 8223 T582 oasc.SolrResourceLoader.replaceClassLoader Adding 'file:/usr/home/hudson/hudson-slave/workspace/Lucene-Solr-Tests-4.x-java7/solr/build/solr-core/test/J0/solrtest-jetty3-1349966064535/collection1/lib/README' to classloader
[junit4:junit4]   2> 8273 T582 oasc.SolrConfig.<init> Using Lucene MatchVersion: LUCENE_41
[junit4:junit4]   2> 8330 T603 oascc.ZkStateReader.updateClusterState Updating cloud state from ZooKeeper... 
[junit4:junit4]   2> 8345 T640 oascc.ZkStateReader$2.process A cluster state change has occurred - updating...
[junit4:junit4]   2> 8345 T602 oascc.ZkStateReader$2.process A cluster state change has occurred - updating...
[junit4:junit4]   2> 8345 T616 oascc.ZkStateReader$2.process A cluster state change has occurred - updating...
[junit4:junit4]   2> 8345 T628 oascc.ZkStateReader$2.process A cluster state change has occurred - updating...
[junit4:junit4]   2> 8346 T582 oasc.SolrConfig.<init> Loaded SolrConfig: solrconfig.xml
[junit4:junit4]   2> 8448 T582 oass.IndexSchema.readSchema Reading Solr Schema
[junit4:junit4]   2> 8454 T582 oass.IndexSchema.readSchema Schema name=test
[junit4:junit4]   2> 9071 T582 oass.OpenExchangeRatesOrgProvider.init Initialized with rates=open-exchange-rates.json, refreshInterval=1440.
[junit4:junit4]   2> 9083 T582 oass.IndexSchema.readSchema default search field in schema is text
[junit4:junit4]   2> 9087 T582 oass.IndexSchema.readSchema unique key field: id
[junit4:junit4]   2> 9104 T582 oass.FileExchangeRateProvider.reload Reloading exchange rates from file currency.xml
[junit4:junit4]   2> 9110 T582 oass.FileExchangeRateProvider.reload Reloading exchange rates from file currency.xml
[junit4:junit4]   2> 9115 T582 oass.OpenExchangeRatesOrgProvider.reload Reloading exchange rates from open-exchange-rates.json
[junit4:junit4]   2> 9117 T582 oass.OpenExchangeRatesOrgProvider.reload Reloading exchange rates from open-exchange-rates.json
[junit4:junit4]   2> 9119 T582 oasc.SolrCore.<init> [collection1] Opening new SolrCore at /usr/home/hudson/hudson-slave/workspace/Lucene-Solr-Tests-4.x-java7/solr/build/solr-core/test/J0/./solrtest-jetty3-1349966064535/collection1/, dataDir=./org.apache.solr.cloud.BasicDistributedZkTest-1349966056692/jetty3/
[junit4:junit4]   2> 9120 T582 oasc.JmxMonitoredMap.<init> JMX monitoring is enabled. Adding Solr mbeans to JMX Server: com.sun.jmx.mbeanserver.JmxMBeanServer@4748c8a0
[junit4:junit4]   2> 9121 T582 oasc.SolrCore.getNewIndexDir New index directory detected: old=null new=./org.apache.solr.cloud.BasicDistributedZkTest-1349966056692/jetty3/index/
[junit4:junit4]   2> 9122 T582 oasc.SolrCore.initIndex WARNING [collection1] Solr index directory './org.apache.solr.cloud.BasicDistributedZkTest-1349966056692/jetty3/index' doesn't exist. Creating new index...
[junit4:junit4]   2> 9123 T582 oasc.CachingDirectoryFactory.get return new directory for /usr/home/hudson/hudson-slave/workspace/Lucene-Solr-Tests-4.x-java7/solr/build/solr-core/test/J0/./org.apache.solr.cloud.BasicDistributedZkTest-1349966056692/jetty3/index forceNew:false
[junit4:junit4]   2> 9156 T582 oasc.SolrDeletionPolicy.onCommit SolrDeletionPolicy.onCommit: commits:num=1
[junit4:junit4]   2> 		commit{dir=/usr/home/hudson/hudson-slave/workspace/Lucene-Solr-Tests-4.x-java7/solr/build/solr-core/test/J0/org.apache.solr.cloud.BasicDistributedZkTest-1349966056692/jetty3/index,segFN=segments_1,generation=1,filenames=[segments_1]
[junit4:junit4]   2> 9157 T582 oasc.SolrDeletionPolicy.updateCommits newest commit = 1
[junit4:junit4]   2> 9158 T582 oasc.SolrCore.initWriters created xml: solr.XMLResponseWriter
[junit4:junit4]   2> 9160 T582 oasup.UpdateRequestProcessorChain.init inserting DistributedUpdateProcessorFactory into updateRequestProcessorChain "dedupe"
[junit4:junit4]   2> 9161 T582 oasup.UpdateRequestProcessorChain.init inserting DistributedUpdateProcessorFactory into updateRequestProcessorChain "dedupe-allfields"
[junit4:junit4]   2> 9162 T582 oasup.UpdateRequestProcessorChain.init inserting DistributedUpdateProcessorFactory into updateRequestProcessorChain "stored_sig"
[junit4:junit4]   2> 9162 T582 oasup.UpdateRequestProcessorChain.init inserting DistributedUpdateProcessorFactory into updateRequestProcessorChain "uniq-fields"
[junit4:junit4]   2> 9163 T582 oasup.UpdateRequestProcessorChain.init inserting DistributedUpdateProcessorFactory into updateRequestProcessorChain "distrib-dup-test-chain-implicit"
[junit4:junit4]   2> 9163 T582 oasc.RequestHandlers.initHandlersFromConfig adding lazy requestHandler: solr.ReplicationHandler
[junit4:junit4]   2> 9164 T582 oasc.RequestHandlers.initHandlersFromConfig created /replication: solr.ReplicationHandler
[junit4:junit4]   2> 9165 T582 oasc.RequestHandlers.initHandlersFromConfig created standard: solr.StandardRequestHandler
[junit4:junit4]   2> 9166 T582 oasc.RequestHandlers.initHandlersFromConfig created /get: solr.RealTimeGetHandler
[junit4:junit4]   2> 9166 T582 oasc.RequestHandlers.initHandlersFromConfig created dismax: solr.SearchHandler
[junit4:junit4]   2> 9167 T582 oasc.RequestHandlers.initHandlersFromConfig created mock: org.apache.solr.core.MockQuerySenderListenerReqHandler
[junit4:junit4]   2> 9168 T582 oasc.RequestHandlers.initHandlersFromConfig created /admin/: org.apache.solr.handler.admin.AdminHandlers
[junit4:junit4]   2> 9169 T582 oasc.RequestHandlers.initHandlersFromConfig created defaults: solr.StandardRequestHandler
[junit4:junit4]   2> 9169 T582 oasc.RequestHandlers.initHandlersFromConfig adding lazy requestHandler: solr.StandardRequestHandler
[junit4:junit4]   2> 9170 T582 oasc.RequestHandlers.initHandlersFromConfig created lazy: solr.StandardRequestHandler
[junit4:junit4]   2> 9170 T582 oasc.RequestHandlers.initHandlersFromConfig created /update: solr.UpdateRequestHandler
[junit4:junit4]   2> 9171 T582 oasc.RequestHandlers.initHandlersFromConfig created /terms: org.apache.solr.handler.component.SearchHandler
[junit4:junit4]   2> 9172 T582 oasc.RequestHandlers.initHandlersFromConfig created spellCheckCompRH: org.apache.solr.handler.component.SearchHandler
[junit4:junit4]   2> 9173 T582 oasc.RequestHandlers.initHandlersFromConfig created spellCheckCompRH_Direct: org.apache.solr.handler.component.SearchHandler
[junit4:junit4]   2> 9173 T582 oasc.RequestHandlers.initHandlersFromConfig created spellCheckWithWordbreak: org.apache.solr.handler.component.SearchHandler
[junit4:junit4]   2> 9174 T582 oasc.RequestHandlers.initHandlersFromConfig created spellCheckWithWordbreak_Direct: org.apache.solr.handler.component.SearchHandler
[junit4:junit4]   2> 9175 T582 oasc.RequestHandlers.initHandlersFromConfig created spellCheckCompRH1: org.apache.solr.handler.component.SearchHandler
[junit4:junit4]   2> 9175 T582 oasc.RequestHandlers.initHandlersFromConfig created tvrh: org.apache.solr.handler.component.SearchHandler
[junit4:junit4]   2> 9176 T582 oasc.RequestHandlers.initHandlersFromConfig created /mlt: solr.MoreLikeThisHandler
[junit4:junit4]   2> 9177 T582 oasc.RequestHandlers.initHandlersFromConfig created /debug/dump: solr.DumpRequestHandler
[junit4:junit4]   2> 9190 T582 oashl.XMLLoader.init xsltCacheLifetimeSeconds=60
[junit4:junit4]   2> 9195 T582 oasc.SolrCore.initDeprecatedSupport WARNING solrconfig.xml uses deprecated <admin/gettableFiles>, Please update your config to use the ShowFileRequestHandler.
[junit4:junit4]   2> 9196 T582 oasc.SolrCore.initDeprecatedSupport WARNING adding ShowFileRequestHandler with hidden files: [SCHEMA.XML, OLD_SYNONYMS.TXT, STOPWORDS.TXT, PROTWORDS.TXT, OPEN-EXCHANGE-RATES.JSON, SYNONYMS.TXT, CURRENCY.XML, MAPPING-ISOLATIN1ACCENT.TXT]
[junit4:junit4]   2> 9200 T582 oass.SolrIndexSearcher.<init> Opening Searcher@39c5bedd main
[junit4:junit4]   2> 9202 T582 oasu.CommitTracker.<init> Hard AutoCommit: disabled
[junit4:junit4]   2> 9202 T582 oasu.CommitTracker.<init> Soft AutoCommit: disabled
[junit4:junit4]   2> 9203 T582 oashc.SpellCheckComponent.inform Initializing spell checkers
[junit4:junit4]   2> 9211 T582 oass.DirectSolrSpellChecker.init init: {name=direct,classname=DirectSolrSpellChecker,field=lowerfilt,minQueryLength=3}
[junit4:junit4]   2> 9271 T641 oasc.SolrCore.registerSearcher [collection1] Registered new searcher Searcher@39c5bedd main{StandardDirectoryReader(segments_1:1)}
[junit4:junit4]   2> 9354 T603 oascc.ZkStateReader.updateClusterState Updating cloud state from ZooKeeper... 
[junit4:junit4]   2> 9367 T640 oascc.ZkStateReader$2.process A cluster state change has occurred - updating...
[junit4:junit4]   2> 9368 T602 oascc.ZkStateReader$2.process A cluster state change has occurred - updating...
[junit4:junit4]   2> 9368 T616 oascc.ZkStateReader$2.process A cluster state change has occurred - updating...
[junit4:junit4]   2> 9368 T628 oascc.ZkStateReader$2.process A cluster state change has occurred - updating...
[junit4:junit4]   2> 9780 T582 oasc.CoreContainer.register registering core: collection1
[junit4:junit4]   2> 9780 T582 oasc.ZkController.register Register shard - core:collection1 address:http://127.0.0.1:11120/solr shardId:shard1
[junit4:junit4]   2> 9787 T582 oasc.ZkController.register We are http://127.0.0.1:11120/solr/collection1/ and leader is http://127.0.0.1:15306/solr/collection1/
[junit4:junit4]   2> 9787 T582 oasc.ZkController.register No LogReplay needed for core=collection1 baseURL=http://127.0.0.1:11120/solr
[junit4:junit4]   2> 9787 T582 oasc.ZkController.checkRecovery Core needs to recover:collection1
[junit4:junit4]   2> 9788 T582 oasu.DefaultSolrCoreState.doRecovery Running recovery - first canceling any ongoing recovery
[junit4:junit4]   2> ASYNC  NEW_CORE C83 name=collection1 org.apache.solr.core.SolrCore@44c92656 url=http://127.0.0.1:11120/solr/collection1 node=127.0.0.1:11120_solr
[junit4:junit4]   2> 9796 T642 C83 P11120 oasc.RecoveryStrategy.run Starting recovery process.  core=collection1 recoveringAfterStartup=true
[junit4:junit4]   2> 9796 T582 oascc.ZkStateReader.updateClusterState Updating cloud state from ZooKeeper... 
[junit4:junit4]   2> 10045 T642 C83 P11120 oasc.RecoveryStrategy.doRecovery ###### startupVersions=[]
[junit4:junit4]   2> 10046 T582 oass.SolrDispatchFilter.init user.dir=/usr/home/hudson/hudson-slave/workspace/Lucene-Solr-Tests-4.x-java7/solr/build/solr-core/test/J0
[junit4:junit4]   2> 10047 T582 oass.SolrDispatchFilter.init SolrDispatchFilter.init() done
[junit4:junit4]   2> 10047 T642 C83 P11120 oasc.RecoveryStrategy.doRecovery Attempting to PeerSync from http://127.0.0.1:15306/solr/collection1/ core=collection1 - recoveringAfterStartup=true
[junit4:junit4]   2> 10047 T582 oascsi.HttpClientUtil.createClient Creating new http client, config:maxConnections=128&maxConnectionsPerHost=32&followRedirects=false
[junit4:junit4]   2> 10048 T603 oascc.ZkStateReader.updateClusterState Updating cloud state from ZooKeeper... 
[junit4:junit4]   2> 10057 T642 C83 P11120 oascsi.HttpClientUtil.createClient Creating new http client, config:maxConnectionsPerHost=20&maxConnections=10000&connTimeout=30000&socketTimeout=30000&retry=false
[junit4:junit4]   2> 10063 T640 oascc.ZkStateReader$2.process A cluster state change has occurred - updating...
[junit4:junit4]   2> 10063 T602 oascc.ZkStateReader$2.process A cluster state change has occurred - updating...
[junit4:junit4]   2> 10063 T616 oascc.ZkStateReader$2.process A cluster state change has occurred - updating...
[junit4:junit4]   2> 10063 T628 oascc.ZkStateReader$2.process A cluster state change has occurred - updating...
[junit4:junit4]   2> 10068 T582 oaz.ZooKeeper.<init> Initiating client connection, connectString=127.0.0.1:31220/solr sessionTimeout=10000 watcher=org.apache.solr.common.cloud.ConnectionManager@300311fb
[junit4:junit4]   2> 10069 T643 oaz.ClientCnxn$SendThread.startConnect Opening socket connection to server /127.0.0.1:31220
[junit4:junit4]   2> 10068 T582 oascc.ConnectionManager.waitForConnected Waiting for client to connect to ZooKeeper
[junit4:junit4]   2> 10070 T643 oaz.ClientCnxn$SendThread.primeConnection Socket connection established to localhost/127.0.0.1:31220, initiating session
[junit4:junit4]   2> 10070 T584 oazs.NIOServerCnxn$Factory.run Accepted socket connection from /140.211.11.196:61679
[junit4:junit4]   2> 10070 T584 oazs.NIOServerCnxn.readConnectRequest Client attempting to establish new session at /140.211.11.196:61679
[junit4:junit4]   2> 10072 T586 oazs.NIOServerCnxn.finishSessionInit Established session 0x13a503f4e5d0006 with negotiated timeout 10000 for client /140.211.11.196:61679
[junit4:junit4]   2> 10072 T643 oaz.ClientCnxn$SendThread.readConnectResult Session establishment complete on server localhost/127.0.0.1:31220, sessionid = 0x13a503f4e5d0006, negotiated timeout = 10000
[junit4:junit4]   2> 10072 T644 oascc.ConnectionManager.process Watcher org.apache.solr.common.cloud.ConnectionManager@300311fb name:ZooKeeperConnection Watcher:127.0.0.1:31220/solr got event WatchedEvent state:SyncConnected type:None path:null path:null type:None
[junit4:junit4]   2> 10072 T582 oascc.ConnectionManager.waitForConnected Client is connected to ZooKeeper
[junit4:junit4]   2> 10074 T582 oascc.ZkStateReader.createClusterStateWatchersAndUpdate Updating cluster state from ZooKeeper... 
[junit4:junit4]   2>  C83_STATE=coll:collection1 core:collection1 props:{shard=shard1, roles=null, state=recovering, core=collection1, collection=collection1, node_name=127.0.0.1:11120_solr, base_url=http://127.0.0.1:11120/solr}
[junit4:junit4]   2> 10076 T642 C83 P11120 oasu.PeerSync.sync PeerSync: core=collection1 url=http://127.0.0.1:11120/solr START replicas=[http://127.0.0.1:15306/solr/collection1/] nUpdates=100
[junit4:junit4]   2> 10077 T642 C83 P11120 oasu.PeerSync.sync WARNING no frame of reference to tell of we've missed updates
[junit4:junit4]   2> 10078 T642 C83 P11120 oasc.RecoveryStrategy.doRecovery PeerSync Recovery was not successful - trying replication. core=collection1
[junit4:junit4]   2> 10079 T642 C83 P11120 oasc.RecoveryStrategy.doRecovery Starting Replication Recovery. core=collection1
[junit4:junit4]   2> 10079 T582 oasc.ChaosMonkey.monkeyLog monkey: init - expire sessions:true cause connection loss:true
[junit4:junit4]   2> 10079 T642 C83 P11120 oascsi.HttpClientUtil.createClient Creating new http client, config:maxConnections=128&maxConnectionsPerHost=32&followRedirects=false
[junit4:junit4]   2> 10080 T582 oascsi.HttpClientUtil.createClient Creating new http client, config:
[junit4:junit4]   2> ASYNC  NEW_CORE C84 name=collection1 org.apache.solr.core.SolrCore@304b8655 url=http://127.0.0.1:15306/solr/collection1 node=127.0.0.1:15306_solr
[junit4:junit4]   2> 10089 T608 C84 P15306 REQ /get {distrib=false&qt=/get&wt=javabin&version=2&getVersions=100} status=0 QTime=1 
[junit4:junit4]   2> 10097 T582 oascc.ZkStateReader.updateClusterState Updating cloud state from ZooKeeper... 
[junit4:junit4]   2> 10099 T582 oasc.AbstractDistribZkTestBase.waitForRecoveriesToFinish Wait for recoveries to finish - collection: collection1 failOnTimeout:true timeout (sec):1800
[junit4:junit4]   2> 10100 T582 oascc.ZkStateReader.updateClusterState Updating cloud state from ZooKeeper... 
[junit4:junit4]   2> 11103 T582 oascc.ZkStateReader.updateClusterState Updating cloud state from ZooKeeper... 
[junit4:junit4]   2> 12105 T582 oascc.ZkStateReader.updateClusterState Updating cloud state from ZooKeeper... 
[junit4:junit4]   2> 12111 T642 C83 P11120 oasc.RecoveryStrategy.doRecovery Begin buffering updates. core=collection1
[junit4:junit4]   2> 12111 T642 C83 P11120 oasu.UpdateLog.bufferUpdates Starting to buffer updates. FSUpdateLog{state=ACTIVE, tlog=null}
[junit4:junit4]   2> 12111 T642 C83 P11120 oasc.RecoveryStrategy.replicate Attempting to replicate from http://127.0.0.1:15306/solr/collection1/. core=collection1
[junit4:junit4]   2> 12111 T642 C83 P11120 oascsi.HttpClientUtil.createClient Creating new http client, config:maxConnections=128&maxConnectionsPerHost=32&followRedirects=false
[junit4:junit4]   2> 12138 T610 C84 P15306 oascsi.HttpClientUtil.createClient Creating new http client, config:maxConnections=500&maxConnectionsPerHost=16
[junit4:junit4]   2> 12152 T610 C84 P15306 oasu.DirectUpdateHandler2.commit start commit{flags=0,_version_=0,optimize=false,openSearcher=true,waitSearcher=true,expungeDeletes=false,softCommit=false}
[junit4:junit4]   2> 12157 T610 C84 P15306 oasc.SolrDeletionPolicy.onInit SolrDeletionPolicy.onInit: commits:num=1
[junit4:junit4]   2> 		commit{dir=/usr/home/hudson/hudson-slave/workspace/Lucene-Solr-Tests-4.x-java7/solr/build/solr-core/test/J0/org.apache.solr.cloud.BasicDistributedZkTest-1349966056692/jetty1/index,segFN=segments_1,generation=1,filenames=[segments_1]
[junit4:junit4]   2> 12157 T610 C84 P15306 oasc.SolrDeletionPolicy.updateCommits newest commit = 1
[junit4:junit4]   2> 12159 T610 C84 P15306 oass.SolrIndexSearcher.<init> Opening Searcher@54956148 main
[junit4:junit4]   2> 12159 T610 C84 P15306 oasu.DirectUpdateHandler2.commit end_commit_flush
[junit4:junit4]   2> 12161 T617 oasc.SolrCore.registerSearcher [collection1] Registered new searcher Searcher@54956148 main{StandardDirectoryReader(segments_1:1)}
[junit4:junit4]   2> 12161 T610 C84 P15306 /update {waitSearcher=true&commit=true&commit_end_point=true&wt=javabin&softCommit=false&version=2} {commit=} 0 36
[junit4:junit4]   2> 12216 T642 C83 P11120 oash.ReplicationHandler.inform Commits will be reserved for  10000
[junit4:junit4]   2> 12217 T642 C83 P11120 oascsi.HttpClientUtil.createClient Creating new http client, config:connTimeout=5000&socketTimeout=20000&allowCompression=false&maxConnections=10000&maxConnectionsPerHost=10000
[junit4:junit4]   2> 12305 T642 C83 P11120 oash.SnapPuller.<init>  No value set for 'pollInterval'. Timer Task not started.
[junit4:junit4]   2> 12308 T611 C84 P15306 oash.ReplicationHandler.inform Commits will be reserved for  10000
[junit4:junit4]   2> 12308 T611 C84 P15306 REQ /replication {command=indexversion&wt=javabin&qt=/replication&version=2} status=0 QTime=1 
[junit4:junit4]   2> 12314 T642 C83 P11120 oasc.SolrDeletionPolicy.onInit SolrDeletionPolicy.onInit: commits:num=1
[junit4:junit4]   2> 		commit{dir=/usr/home/hudson/hudson-slave/workspace/Lucene-Solr-Tests-4.x-java7/solr/build/solr-core/test/J0/org.apache.solr.cloud.BasicDistributedZkTest-1349966056692/jetty3/index,segFN=segments_1,generation=1,filenames=[segments_1]
[junit4:junit4]   2> 12314 T642 C83 P11120 oasc.SolrDeletionPolicy.updateCommits newest commit = 1
[junit4:junit4]   2> 12315 T642 C83 P11120 oasu.DirectUpdateHandler2.commit start commit{flags=0,_version_=0,optimize=false,openSearcher=true,waitSearcher=true,expungeDeletes=false,softCommit=false}
[junit4:junit4]   2> 12334 T642 C83 P11120 oasc.SolrDeletionPolicy.onCommit SolrDeletionPolicy.onCommit: commits:num=2
[junit4:junit4]   2> 		commit{dir=/usr/home/hudson/hudson-slave/workspace/Lucene-Solr-Tests-4.x-java7/solr/build/solr-core/test/J0/org.apache.solr.cloud.BasicDistributedZkTest-1349966056692/jetty3/index,segFN=segments_1,generation=1,filenames=[segments_1]
[junit4:junit4]   2> 		commit{dir=/usr/home/hudson/hudson-slave/workspace/Lucene-Solr-Tests-4.x-java7/solr/build/solr-core/test/J0/org.apache.solr.cloud.BasicDistributedZkTest-1349966056692/jetty3/index,segFN=segments_2,generation=2,filenames=[segments_2]
[junit4:junit4]   2> 12335 T642 C83 P11120 oasc.SolrDeletionPolicy.updateCommits newest commit = 2
[junit4:junit4]   2> 12338 T642 C83 P11120 oass.SolrIndexSearcher.<init> Opening Searcher@58b097b7 main
[junit4:junit4]   2> 12338 T642 C83 P11120 oasu.DirectUpdateHandler2.commit end_commit_flush
[junit4:junit4]   2> 12340 T641 oasc.SolrCore.registerSearcher [collection1] Registered new searcher Searcher@58b097b7 main{StandardDirectoryReader(segments_2:2)}
[junit4:junit4]   2> 12340 T642 C83 P11120 oasc.RecoveryStrategy.replay No replay needed. core=collection1
[junit4:junit4]   2> 12341 T642 C83 P11120 oasc.RecoveryStrategy.doRecovery Replication Recovery was successful - registering as Active. core=collection1
[junit4:junit4]   2> 12343 T642 C83 P11120 oasc.RecoveryStrategy.doRecovery Finished recovery process. core=collection1
[junit4:junit4]   2> 12583 T603 oascc.ZkStateReader.updateClusterState Updating cloud state from ZooKeeper... 
[junit4:junit4]   2> 12599 T640 oascc.ZkStateReader$2.process A cluster state change has occurred - updating...
[junit4:junit4]   2> 12599 T616 oascc.ZkStateReader$2.process A cluster state change has occurred - updating...
[junit4:junit4]   2> 12599 T602 oascc.ZkStateReader$2.process A cluster state change has occurred - updating...
[junit4:junit4]   2> 12599 T628 oascc.ZkStateReader$2.process A cluster state change has occurred - updating...
[junit4:junit4]   2> 12599 T644 oascc.ZkStateReader$2.process A cluster state change has occurred - updating...
[junit4:junit4]   2> 13108 T582 oascc.ZkStateReader.updateClusterState Updating cloud state from ZooKeeper... 
[junit4:junit4]   2> ASYNC  NEW_CORE C85 name=collection1 org.apache.solr.core.SolrCore@12cf4e3f url=http://127.0.0.1:16008/solr/collection1 node=127.0.0.1:16008_solr
[junit4:junit4]   2> 13132 T594 C85 P16008 oasc.SolrDeletionPolicy.onInit SolrDeletionPolicy.onInit: commits:num=1
[junit4:junit4]   2> 		commit{dir=/usr/home/hudson/hudson-slave/workspace/Lucene-Solr-Tests-4.x-java7/solr/build/solr-core/test/J0/org.apache.solr.cloud.BasicDistributedZkTest-1349966056692/control/data/index,segFN=segments_1,generation=1,filenames=[segments_1]
[junit4:junit4]   2> 13133 T594 C85 P16008 oasc.SolrDeletionPolicy.updateCommits newest commit = 1
[junit4:junit4]   2> 13135 T594 C85 P16008 oass.SolrIndexSearcher.<init> Opening Searcher@7a8c7410 realtime
[junit4:junit4]   2> 13135 T594 C85 P16008 /update {wt=javabin&version=2} {deleteByQuery=*:* (-1415542021622333440)} 0 12
[junit4:junit4]   2> 13136 T582 oaz.ZooKeeper.<init> Initiating client connection, connectString=127.0.0.1:31220/solr sessionTimeout=10000 watcher=org.apache.solr.common.cloud.ConnectionManager@1b18054b
[junit4:junit4]   2> 13137 T646 oaz.ClientCnxn$SendThread.startConnect Opening socket connection to server /127.0.0.1:31220
[junit4:junit4]   2> 13137 T582 oascc.ConnectionManager.waitForConnected Waiting for client to connect to ZooKeeper
[junit4:junit4]   2> 13139 T646 oaz.ClientCnxn$SendThread.primeConnection Socket connection established to localhost/127.0.0.1:31220, initiating session
[junit4:junit4]   2> 13139 T584 oazs.NIOServerCnxn$Factory.run Accepted socket connection from /140.211.11.196:19955
[junit4:junit4]   2> 13139 T584 oazs.NIOServerCnxn.readConnectRequest Client attempting to establish new session at /140.211.11.196:19955
[junit4:junit4]   2> 13145 T586 oazs.NIOServerCnxn.finishSessionInit Established session 0x13a503f4e5d0007 with negotiated timeout 10000 for client /140.211.11.196:19955
[junit4:junit4]   2> 13145 T646 oaz.ClientCnxn$SendThread.readConnectResult Session establishment complete on server localhost/127.0.0.1:31220, sessionid = 0x13a503f4e5d0007, negotiated timeout = 10000
[junit4:junit4]   2> 13146 T647 oascc.ConnectionManager.process Watcher org.apache.solr.common.cloud.ConnectionManager@1b18054b name:ZooKeeperConnection Watcher:127.0.0.1:31220/solr got event WatchedEvent state:SyncConnected type:None path:null path:null type:None
[junit4:junit4]   2> 13146 T582 oascc.ConnectionManager.waitForConnected Client is connected to ZooKeeper
[junit4:junit4]   2> 13147 T582 oascc.ZkStateReader.createClusterStateWatchersAndUpdate Updating cluster state from ZooKeeper... 
[junit4:junit4]   2> 13165 T612 C84 P15306 oass.SolrIndexSearcher.<init> Opening Searcher@6b4907a6 realtime
[junit4:junit4]   2>  C83_STATE=coll:collection1 core:collection1 props:{shard=shard1, roles=null, state=active, core=collection1, collection=collection1, node_name=127.0.0.1:11120_solr, base_url=http://127.0.0.1:11120/solr}
[junit4:junit4]   2> 13202 T632 C83 P11120 oass.SolrIndexSearcher.<init> Opening Searcher@4cd92ce3 realtime
[junit4:junit4]   2> 13203 T632 C83 P11120 REQ /update {update.distrib=FROMLEADER&_version_=-1415542021659033600&update.from=http://127.0.0.1:15306/solr/collection1/&wt=javabin&version=2} status=0 QTime=3 
[junit4:junit4]   2> ASYNC  NEW_CORE C86 name=collection1 org.apache.solr.core.SolrCore@4dd01993 url=http://127.0.0.1:43029/solr/collection1 node=127.0.0.1:43029_solr
[junit4:junit4]   2> 13204 T620 C86 P43029 oasc.SolrDeletionPolicy.onInit SolrDeletionPolicy.onInit: commits:num=1
[junit4:junit4]   2> 		commit{dir=/usr/home/hudson/hudson-slave/workspace/Lucene-Solr-Tests-4.x-java7/solr/build/solr-core/test/J0/org.apache.solr.cloud.BasicDistributedZkTest-1349966056692/jetty2/index,segFN=segments_1,generation=1,filenames=[segments_1]
[junit4:junit4]   2> 13205 T620 C86 P43029 oasc.SolrDeletionPolicy.updateCommits newest commit = 1
[junit4:junit4]   2> 13207 T620 C86 P43029 oass.SolrIndexSearcher.<init> Opening Searcher@177a1bfc realtime
[junit4:junit4]   2> 13207 T620 C86 P43029 REQ /update {update.distrib=TOLEADER&wt=javabin&version=2} status=0 QTime=8 
[junit4:junit4]   2> 13208 T612 C84 P15306 /update {wt=javabin&version=2} {deleteByQuery=*:* (-1415542021659033600)} 0 57
[junit4:junit4]   2> 13221 T594 C85 P16008 /update {wt=javabin&version=2} {add=[1 (1415542021715656704)]} 0 5
[junit4:junit4]   2> 13244 T632 C83 P11120 REQ /update {distrib.from=http://127.0.0.1:15306/solr/collection1/&update.distrib=FROMLEADER&wt=javabin&version=2} status=0 QTime=4 
[junit4:junit4]   2> 13245 T612 C84 P15306 /update {wt=javabin&version=2} {add=[1 (1415542021724045312)]} 0 21
[junit4:junit4]   2> 13250 T594 C85 P16008 /update {wt=javabin&version=2} {add=[2 (1415542021749211136)]} 0 2
[junit4:junit4]   2> 13265 T620 C86 P43029 REQ /update {distrib.from=http://127.0.0.1:15306/solr/collection1/&update.distrib=TOLEADER&wt=javabin&version=2} status=0 QTime=4 
[junit4:junit4]   2> 13266 T612 C84 P15306 /update {wt=javabin&version=2} {add=[2]} 0 13
[junit4:junit4]   2> 13271 T594 C85 P16008 /update {wt=javabin&version=2} {add=[3 (1415542021771231232)]} 0 2
[junit4:junit4]   2> 13280 T620 C86 P43029 REQ /update {distrib.from=http://127.0.0.1:15306/solr/collection1/&update.distrib=TOLEADER&wt=javabin&version=2} status=0 QTime=3 
[junit4:junit4]   2> 13281 T612 C84 P15306 /update {wt=javabin&version=2} {add=[3]} 0 7
[junit4:junit4]   2> 13286 T594 C85 P16008 /update {wt=javabin&version=2} {add=[4 (1415542021786959872)]} 0 2
[junit4:junit4]   2> 13295 T632 C83 P11120 REQ /update {distrib.from=http://127.0.0.1:15306/solr/collection1/&update.distrib=FROMLEADER&wt=javabin&version=2} status=0 QTime=2 
[junit4:junit4]   2> 13296 T612 C84 P15306 /update {wt=javabin&version=2} {add=[4 (1415542021792202752)]} 0 7
[junit4:junit4]   2> 13301 T594 C85 P16008 /update {wt=javabin&version=2} {add=[5 (1415542021802688512)]} 0 2
[junit4:junit4]   2> 13309 T620 C86 P43029 REQ /update {distrib.from=http://127.0.0.1:15306/solr/collection1/&update.distrib=TOLEADER&wt=javabin&version=2} status=0 QTime=2 
[junit4:junit4]   2> 13310 T612 C84 P15306 /update {wt=javabin&version=2} {add=[5]} 0 6
[junit4:junit4]   2> 13315 T594 C85 P16008 /update {wt=javabin&version=2} {add=[6 (1415542021817368576)]} 0 2
[junit4:junit4]   2> 13323 T620 C86 P43029 REQ /update {distrib.from=http://127.0.0.1:15306/solr/collection1/&update.distrib=TOLEADER&wt=javabin&version=2} status=0 QTime=2 
[junit4:junit4]   2> 13324 T612 C84 P15306 /update {wt=javabin&version=2} {add=[6]} 0 6
[junit4:junit4]   2> 13329 T594 C85 P16008 /update {wt=javabin&version=2} {add=[7 (1415542021832048640)]} 0 2
[junit4:junit4]   2> 13337 T620 C86 P43029 REQ /update {distrib.from=http://127.0.0.1:15306/solr/collection1/&update.distrib=TOLEADER&wt=javabin&version=2} status=0 QTime=2 
[junit4:junit4]   2> 13338 T612 C84 P15306 /update {wt=javabin&version=2} {add=[7]} 0 6
[junit4:junit4]   2> 13343 T594 C85 P16008 /update {wt=javabin&version=2} {add=[8 (1415542021846728704)]} 0 2
[junit4:junit4]   2> 13352 T632 C83 P11120 REQ /update {distrib.from=http://127.0.0.1:15306/solr/collection1/&update.distrib=FROMLEADER&wt=javabin&version=2} status=0 QTime=2 
[junit4:junit4]   2> 13353 T612 C84 P15306 /update {wt=javabin&version=2} {add=[8 (1415542021851971584)]} 0 7
[junit4:junit4]   2> 13358 T594 C85 P16008 /update {wt=javabin&version=2} {add=[9 (1415542021862457344)]} 0 2
[junit4:junit4]   2> 13363 T621 C86 P43029 /update {wt=javabin&version=2} {add=[9 (1415542021866651648)]} 0 2
[junit4:junit4]   2> 13386 T594 C85 P16008 /update {wt=javabin&version=2} {add=[10 (1415542021872943104)]} 0 20
[junit4:junit4]   2> 13397 T632 C83 P11120 REQ /update {distrib.from=http://127.0.0.1:15306/solr/collection1/&update.distrib=FROMLEADER&wt=javabin&version=2} status=0 QTime=2 
[junit4:junit4]   2> 13398 T612 C84 P15306 /update {wt=javabin&version=2} {add=[10 (1415542021898108928)]} 0 8
[junit4:junit4]   2> 13405 T594 C85 P16008 /update {wt=javabin&version=2} {add=[11 (1415542021909643264)]} 0 4
[junit4:junit4]   2> 13414 T632 C83 P11120 REQ /update {distrib.from=http://127.0.0.1:15306/solr/collection1/&update.distrib=FROMLEADER&wt=javabin&version=2} status=0 QTime=2 
[junit4:junit4]   2> 13415 T612 C84 P15306 /update {wt=javabin&version=2} {add=[11 (1415542021916983296)]} 0 7
[junit4:junit4]   2> 13420 T594 C85 P16008 /update {wt=javabin&version=2} {add=[12 (1415542021927469056)]} 0 2
[junit4:junit4]   2> 13433 T632 C83 P11120 REQ /update {distrib.from=http://127.0.0.1:15306/solr/collection1/&update.distrib=FROMLEADER&wt=javabin&version=2} status=0 QTime=3 
[junit4:junit4]   2> 13433 T613 C84 P15306 REQ /update {distrib.from=http://127.0.0.1:43029/solr/collection1/&update.distrib=TOLEADER&wt=javabin&version=2} status=0 QTime=7 
[junit4:junit4]   2> 13434 T621 C86 P43029 /update {wt=javabin&version=2} {add=[12]} 0 11
[junit4:junit4]   2> 13439 T594 C85 P16008 /update {wt=javabin&version=2} {add=[13 (1415542021947392000)]} 0 2
[junit4:junit4]   2> 13452 T632 C83 P11120 REQ /update {distrib.from=http://127.0.0.1:15306/solr/collection1/&update.distrib=FROMLEADER&wt=javabin&version=2} status=0 QTime=2 
[junit4:junit4]   2> 13453 T613 C84 P15306 REQ /update {distrib.from=http://127.0.0.1:43029/solr/collection1/&update.distrib=TOLEADER&wt=javabin&version=2} status=0 QTime=8 
[junit4:junit4]   2> 13454 T621 C86 P43029 /update {wt=javabin&version=2} {add=[13]} 0 12
[junit4:junit4]   2> 13459 T594 C85 P16008 /update {wt=javabin&version=2} {add=[14 (1415542021968363520)]} 0 2
[junit4:junit4]   2> 13471 T632 C83 P11120 REQ /update {distrib.from=http://127.0.0.1:15306/solr/collection1/&update.distrib=FROMLEADER&wt=javabin&version=2} status=0 QTime=2 
[junit4:junit4]   2> 13472 T613 C84 P15306 REQ /update {distrib.from=http://127.0.0.1:43029/solr/collection1/&update.distrib=TOLEADER&wt=javabin&version=2} status=0 QTime=7 
[junit4:junit4]   2> 13472 T621 C86 P43029 /update {wt=javabin&version=2} {add=[14]} 0 10
[junit4:junit4]   2> 13478 T594 C85 P16008 /update {wt=javabin&version=2} {add=[15 (1415542021988286464)]} 0 2
[junit4:junit4]   2> 13487 T632 C83 P11120 REQ /update {distrib.from=http://127.0.0.1:15306/solr/collection1/&update.distrib=FROMLEADER&wt=javabin&version=2} status=0 QTime=2 
[junit4:junit4]   2> 13488 T612 C84 P15306 /update {wt=javabin&version=2} {add=[15 (1415542021993529344)]} 0 7
[junit4:junit4]   2> 13493 T594 C85 P16008 /update {wt=javabin&version=2} {add=[16 (1415542022004015104)]} 0 2
[junit4:junit4]   2> 13540 T632 C83 P11120 REQ /update {distrib.from=http://127.0.0.1:15306/solr/collection1/&update.distrib=FROMLEADER&wt=javabin&version=2} status=0 QTime=21 
[junit4:junit4]   2> 13541 T612 C84 P15306 /update {wt=javabin&version=2} {add=[16 (1415542022009257984)]} 0 45
[junit4:junit4]   2> 13549 T594 C85 P16008 /update {wt=javabin&version=2} {add=[17 (1415542022060638208)]} 0 5
[junit4:junit4]   2> 13557 T621 C86 P43029 /update {wt=javabin&version=2} {add=[17 (1415542022069026816)]} 0 5
[junit4:junit4]   2> 13562 T594 C85 P16008 /update {wt=javabin&version=2} {add=[100 (1415542022076366848)]} 0 2
[junit4:junit4]   2> 13574 T632 C83 P11120 REQ /update {distrib.from=http://127.0.0.1:15306/solr/collection1/&update.distrib=FROMLEADER&wt=javabin&version=2} status=0 QTime=3 
[junit4:junit4]   2> 13575 T612 C84 P15306 /update {wt=javabin&version=2} {add=[100 (1415542022081609728)]} 0 10
[junit4:junit4]   2> 13580 T594 C85 P16008 /update {wt=javabin&version=2} {add=[101 (1415542022095241216)]} 0 2
[junit4:junit4]   2> 13592 T632 C83 P11120 REQ /update {distrib.from=http://127.0.0.1:15306/solr/collection1/&update.distrib=FROMLEADER&wt=javabin&version=2} status=0 QTime=2 
[junit4:junit4]   2> 13593 T613 C84 P15306 REQ /update {distrib.from=http://127.0.0.1:43029/solr/collection1/&update.distrib=TOLEADER&wt=javabin&version=2} status=0 QTime=7 
[junit4:junit4]   2> 13593 T621 C86 P43029 /update {wt=javabin&version=2} {add=[101]} 0 10
[junit4:junit4]   2> 13616 T594 C85 P16008 /update {wt=javabin&version=2} {add=[102 (1415542022114115584)]} 0 20
[junit4:junit4]   2> 13625 T632 C83 P11120 REQ /update {distrib.from=http://127.0.0.1:15306/solr/collection1/&update.distrib=FROMLEADER&wt=javabin&version=2} status=0 QTime=2 
[junit4:junit4]   2> 13626 T612 C84 P15306 /update {wt=javabin&version=2} {add=[102 (1415542022138232832)]} 0 7
[junit4:junit4]   2> 13632 T594 C85 P16008 /update {wt=javabin&version=2} {add=[103 (1415542022148718592)]} 0 3
[junit4:junit4]   2> 13637 T621 C86 P43029 /update {wt=javabin&version=2} {add=[103 (1415542022155010048)]} 0 2
[junit4:junit4]   2> 13642 T594 C85 P16008 /update {wt=javabin&version=2} {add=[104 (1415542022160252928)]} 0 2
[junit4:junit4]   2> 13650 T620 C86 P43029 REQ /update {distrib.from=http://127.0.0.1:15306/solr/collection1/&update.distrib=TOLEADER&wt=javabin&version=2} status=0 QTime=2 
[junit4:junit4]   2> 13651 T612 C84 P15306 /update {wt=javabin&version=2} {add=[104]} 0 6
[junit4:junit4]   2> 13656 T594 C85 P16008 /update {wt=javabin&version=2} {add=[105 (1415542022173884416)]} 0 2
[junit4:junit4]   2> 13679 T621 C86 P43029 /update {wt=javabin&version=2} {add=[105 (1415542022180175872)]} 0 20
[junit4:junit4]   2> 13684 T594 C85 P16008 /update {wt=javabin&version=2} {add=[106 (1415542022204293120)]} 0 2
[junit4:junit4]   2> 13693 T620 C86 P43029 REQ /update {distrib.from=http://127.0.0.1:15306/solr/collection1/&update.distrib=TOLEADER&wt=javabin&version=2} status=0 QTime=3 
[junit4:junit4]   2> 13694 T612 C84 P15306 /update {wt=javabin&version=2} {add=[106]} 0 7
[junit4:junit4]   2> 13700 T594 C85 P16008 /update {wt=javabin&version=2} {add=[107 (1415542022221070336)]} 0 2
[junit4:junit4]   2> 13713 T632 C83 P11120 REQ /update {distrib.from=http://127.0.0.1:15306/solr/collection1/&update.distrib=FROMLEADER&wt=javabin&version=2} status=0 QTime=2 
[junit4:junit4]   2> 13714 T613 C84 P15306 REQ /update {distrib.from=http://127.0.0.1:43029/solr/collection1/&update.distrib=TOLEADER&wt=javabin&version=2} status=0 QTime=8 
[junit4:junit4]   2> 13715 T621 C86 P43029 /update {wt=javabin&version=2} {add=[107]} 0 12
[junit4:junit4]   2> 13720 T594 C85 P16008 /update {wt=javabin&version=2} {add=[108 (1415542022240993280)]} 0 2
[junit4:junit4]   2> 13734 T632 C83 P11120 REQ /update {distrib.from=http://127.0.0.1:15306/solr/collection1/&update.distrib=FROMLEADER&wt=javabin&version=2} status=0 QTime=2 
[junit4:junit4]   2> 13735 T613 C84 P15306 REQ /update {distrib.from=http://127.0.0.1:43029/solr/collection1/&update.distrib=TOLEADER&wt=javabin&version=2} status=0 QTime=9 
[junit4:junit4]   2> 13735 T621 C86 P43029 /update {wt=javabin&version=2} {add=[108]} 0 12
[junit4:junit4]   2> 13741 T594 C85 P16008 /update {wt=javabin&version=2} {add=[109 (1415542022264061952)]} 0 2
[junit4:junit4]   2> 13754 T632 C83 P11120 REQ /update {distrib.from=http://127.0.0.1:15306/solr/collection1/&update.distrib=FROMLEADER&wt=javabin&version=2} status=0 QTime=2 
[junit4:junit4]   2> 13755 T613 C84 P15306 REQ /update {distrib.from=http://127.0.0.1:43029/solr/collection1/&update.distrib=TOLEADER&wt=javabin&version=2} status=0 QTime=7 
[junit4:junit4]   2> 13756 T621 C86 P43029 /update {wt=javabin&version=2} {add=[109]} 0 11
[junit4:junit4]   2> 13761 T594 C85 P16008 /update {wt=javabin&version=2} {add=[110 (1415542022285033472)]} 0 2
[junit4:junit4]   2> 13773 T632 C83 P11120 REQ /update {distrib.from=http://127.0.0.1:15306/solr/collection1/&update.distrib=FROMLEADER&wt=javabin&version=2} status=0 QTime=2 
[junit4:junit4]   2> 13774 T613 C84 P15306 REQ /update {distrib.from=http://127.0.0.1:43029/solr/collection1/&update.distrib=TOLEADER&wt=javabin&version=2} status=0 QTime=7 
[junit4:junit4]   2> 13775 T621 C86 P43029 /update {wt=javabin&version=2} {add=[110]} 0 11
[junit4:junit4]   2> 13780 T594 C85 P16008 /update {wt=javabin&version=2} {add=[111 (1415542022304956416)]} 0 2
[junit4:junit4]   2> 13789 T632 C83 P11120 REQ /update {distrib.from=http://127.0.0.1:15306/solr/collection1/&update.distrib=FROMLEADER&wt=javabin&version=2} status=0 QTime=2 
[junit4:junit4]   2> 13790 T612 C84 P15306 /update {wt=javabin&version=2} {add=[111 (1415542022310199296)]} 0 7
[junit4:junit4]   2> 13817 T594 C85 P16008 /update {wt=javabin&version=2} {add=[112 (1415542022320685056)]} 0 24
[junit4:junit4]   2> 13825 T620 C86 P43029 REQ /update {distrib.from=http://127.0.0.1:15306/solr/collection1/&update.distrib=TOLEADER&wt=javabin&version=2} status=0 QTime=2 
[junit4:junit4]   2> 13826 T612 C84 P15306 /update {wt=javabin&version=2} {add=[112]} 0 6
[junit4:junit4]   2> 13833 T594 C85 P16008 /update {wt=javabin&version=2} {add=[113 (1415542022358433792)]} 0 4
[junit4:junit4]   2> 13842 T632 C83 P11120 REQ /update {distrib.from=http://127.0.0.1:15306/solr/collection1/&update.distrib=FROMLEADER&wt=javabin&version=2} status=0 QTime=2 
[junit4:junit4]   2> 13843 T612 C84 P15306 /update {wt=javabin&version=2} {add=[113 (1415542022364725248)]} 0 7
[junit4:junit4]   2> 13848 T594 C85 P16008 /update {wt=javabin&version=2} {add=[114 (1415542022376259584)]} 0 2
[junit4:junit4]   2> 13896 T632 C83 P11120 REQ /update {distrib.from=http://127.0.0.1:15306/solr/collection1/&update.distrib=FROMLEADER&wt=javabin&version=2} status=0 QTime=18 
[junit4:junit4]   2> 13897 T613 C84 P15306 REQ /update {distrib.from=http://127.0.0.1:43029/solr/collection1/&update.distrib=TOLEADER&wt=javabin&version=2} status=0 QTime=43 
[junit4:junit4]   2> 13898 T621 C86 P43029 /update {wt=javabin&version=2} {add=[114]} 0 47
[junit4:junit4]   2> 13903 T594 C85 P16008 /update {wt=javabin&version=2} {add=[115 (1415542022433931264)]} 0 2
[junit4:junit4]   2> 13908 T621 C86 P43029 /update {wt=javabin&version=2} {add=[115 (1415542022438125568)]} 0 2
[junit4:junit4]   2> 13913 T594 C85 P16008 /update {wt=javabin&version=2} {add=[116 (1415542022444417024)]} 0 2
[junit4:junit4]   2> 13921 T620 C86 P43029 REQ /update {distrib.from=http://127.0.0.1:15306/solr/collection1/&update.distrib=TOLEADER&wt=javabin&version=2} status=0 QTime=2 
[junit4:junit4]   2> 13922 T612 C84 P15306 /update {wt=javabin&version=2} {add=[116]} 0 6
[junit4:junit4]   2> 13927 T594 C85 P16008 /update {wt=javabin&version=2} {add=[117 (1415542022458048512)]} 0 2
[junit4:junit4]   2> 13935 T620 C86 P43029 REQ /update {distrib.from=http://127.0.0.1:15306/solr/collection1/&update.distrib=TOLEADER&wt=javabin&version=2} status=0 QTime=2 
[junit4:junit4]   2> 13936 T612 C84 P15306 /update {wt=javabin&version=2} {add=[117]} 0 6
[junit4:junit4]   2> 13941 T594 C85 P16008 /update {wt=javabin&version=2} {add=[118 (1415542022472728576)]} 0 2
[junit4:junit4]   2> 13952 T632 C83 P11120 REQ /update {distrib.from=http://127.0.0.1:15306/solr/collection1/&update.distrib=FROMLEADER&wt=javabin&version=2} status=0 QTime=3 
[junit4:junit4]   2> 13953 T612 C84 P15306 /update {wt=javabin&version=2} {add=[118 (1415542022479020032)]} 0 9
[junit4:junit4]   2> 13958 T594 C85 P16008 /update {wt=javabin&version=2} {add=[119 (1415542022491602944)]} 0 2
[junit4:junit4]   2> 13963 T621 C86 P43029 /update {wt=javabin&version=2} {add=[119 (1415542022496845824)]} 0 2
[junit4:junit4]   2> 13968 T594 C85 P16008 /update {wt=javabin&version=2} {add=[120 (1415542022501040128)]} 0 2
[junit4:junit4]   2> 13973 T621 C86 P43029 /update {wt=javabin&version=2} {add=[120 (1415542022507331584)]} 0 2
[junit4:junit4]   2> 13978 T594 C85 P16008 /update {wt=javabin&version=2} {add=[121 (1415542022511525888)]} 0 2
[junit4:junit4]   2> 13983 T621 C86 P43029 /update {wt=javabin&version=2} {add=[121 (1415542022517817344)]} 0 2
[junit4:junit4]   2> 14004 T594 C85 P16008 /update {wt=javabin&version=2} {add=[122 (1415542022522011648)]} 0 18
[junit4:junit4]   2> 14013 T632 C83 P11120 REQ /update {distrib.from=http://127.0.0.1:15306/solr/collection1/&update.distrib=FROMLEADER&wt=javabin&version=2} status=0 QTime=2 
[junit4:junit4]   2> 14014 T612 C84 P15306 /update {wt=javabin&version=2} {add=[122 (1415542022545080320)]} 0 7
[junit4:junit4]   2> 14020 T594 C85 P16008 /update {wt=javabin&version=2} {add=[123 (1415542022554517504)]} 0 3
[junit4:junit4]   2> 14029 T632 C83 P11120 REQ /update {distrib.from=http://127.0.0.1:15306/solr/collection1/&update.distrib=FROMLEADER&wt=javabin&version=2} status=0 QTime=2 
[junit4:junit4]   2> 14030 T612 C84 P15306 /update {wt=javabin&version=2} {add=[123 (1415542022561857536)]} 0 7
[junit4:junit4]   2> 14035 T594 C85 P16008 /update {wt=javabin&version=2} {add=[124 (1415542022571294720)]} 0 2
[junit4:junit4]   2> 14043 T632 C83 P11120 REQ /update {distrib.from=http://127.0.0.1:15306/solr/collection1/&update.distrib=FROMLEADER&wt=javabin&version=2} status=0 QTime=2 
[junit4:junit4]   2> 14044 T612 C84 P15306 /update {wt=javabin&version=2} {add=[124 (1415542022575489024)]} 0 7
[junit4:junit4]   2> 14049 T594 C85 P16008 /update {wt=javabin&version=2} {add=[125 (1415542022585974784)]} 0 2
[junit4:junit4]   2> 14057 T632 C83 P11120 REQ /update {distrib.from=http://127.0.0.1:15306/solr/collection1/&update.distrib=FROMLEADER&wt=javabin&version=2} status=0 QTime=2 
[junit4:junit4]   2> 14058 T612 C84 P15306 /update {wt=javabin&version=2} {add=[125 (1415542022591217664)]} 0 7
[junit4:junit4]   2> 14063 T594 C85 P16008 /update {wt=javabin&version=2} {add=[126 (1415542022601703424)]} 0 2
[junit4:junit4]   2> 14072 T620 C86 P43029 REQ /update {distrib.from=http://127.0.0.1:15306/solr/collection1/&update.distrib=TOLEADER&wt=javabin&version=2} status=0 QTime=3 
[junit4:junit4]   2> 14073 T612 C84 P15306 /update {wt=javabin&version=2} {add=[126]} 0 7
[junit4:junit4]   2> 14078 T594 C85 P16008 /update {wt=javabin&version=2} {add=[127 (1415542022616383488)]} 0 2
[junit4:junit4]   2> 14113 T620 C86 P43029 REQ /update {distrib.from=http://127.0.0.1:15306/solr/collection1/&update.distrib=TOLEADER&wt=javabin&version=2} status=0 QTime=29 
[junit4:junit4]   2> 14114 T612 C84 P15306 /update {wt=javabin&version=2} {add=[127]} 0 33
[junit4:junit4]   2> 14120 T594 C85 P16008 /update {wt=javabin&version=2} {add=[128 (1415542022660423680)]} 0 2
[junit4:junit4]   2> 14131 T620 C86 P43029 REQ /update {distrib.from=http://127.0.0.1:15306/solr/collection1/&update.distrib=TOLEADER&wt=javabin&version=2} status=0 QTime=5 
[junit4:junit4]   2> 14132 T612 C84 P15306 /update {wt=javabin&version=2} {add=[128]} 0 9
[junit4:junit4]   2> 14137 T594 C85 P16008 /update {wt=javabin&version=2} {add=[129 (1415542022679298048)]} 0 2
[junit4:junit4]   2> 14146 T632 C83 P11120 REQ /update {distrib.from=http://127.0.0.1:15306/solr/collection1/&update.distrib=FROMLEADER&wt=javabin&version=2} status=0 QTime=2 
[junit4:junit4]   2> 14147 T612 C84 P15306 /update {wt=javabin&version=2} {add=[129 (1415542022684540928)]} 0 7
[junit4:junit4]   2> 14152 T594 C85 P16008 /update {wt=javabin&version=2} {add=[130 (1415542022695026688)]} 0 2
[junit4:junit4]   2> 14157 T621 C86 P43029 /update {wt=javabin&version=2} {add=[130 (1415542022700269568)]} 0 2
[junit4:junit4]   2> 14162 T594 C85 P16008 /update {wt=javabin&version=2} {add=[131 (1415542022705512448)]} 0 2
[junit4:junit4]   2> 14171 T620 C86 P43029 REQ /update {distrib.from=http://127.0.0.1:15306/solr/collection1/&update.distrib=TOLEADER&wt=javabin&version=2} status=0 QTime=2 
[junit4:junit4]   2> 14172 T612 C84 P15306 /update {wt=javabin&version=2} {add=[131]} 0 7
[junit4:junit4]   2> 14195 T594 C85 P16008 /update {wt=javabin&version=2} {add=[132 (1415542022722289664)]} 0 19
[junit4:junit4]   2> 14204 T632 C83 P11120 REQ /update {distrib.from=http://127.0.0.1:15306/solr/collection1/&update.distrib=FROMLEADER&wt=javabin&version=2} status=0 QTime=2 
[junit4:junit4]   2> 14205 T612 C84 P15306 /update {wt=javabin&version=2} {add=[132 (1415542022745358336)]} 0 7
[junit4:junit4]   2> 14211 T594 C85 P16008 /update {wt=javabin&version=2} {add=[133 (1415542022755844096)]} 0 3
[junit4:junit4]   2> 14225 T632 C83 P11120 REQ /update {distrib.from=http://127.0.0.1:15306/solr/collection1/&update.distrib=FROMLEADER&wt=javabin&version=2} status=0 QTime=2 
[junit4:junit4]   2> 14226 T613 C84 P15306 REQ /update {distrib.from=http://127.0.0.1:43029/solr/collection1/&update.distrib=TOLEADER&wt=javabin&version=2} status=0 QTime=7 
[junit4:junit4]   2> 14227 T621 C86 P43029 /update {wt=javabin&version=2} {add=[133]} 0 13
[junit4:junit4]   2> 14232 T594 C85 P16008 /update {wt=javabin&version=2} {add=[134 (1415542022777864192)]} 0 2
[junit4:junit4]   2> 14236 T621 C86 P43029 /update {wt=javabin&version=2} {add=[134 (1415542022783107072)]} 0 2
[junit4:junit4]   2> 14240 T594 C85 P16008 /update {wt=javabin&version=2} {add=[135 (1415542022787301376)]} 0 1
[junit4:junit4]   2> 14249 T632 C83 P11120 REQ /update {distrib.from=http://127.0.0.1:15306/solr/collection1/&update.distrib=FROMLEADER&wt=javabin&version=2} status=0 QTime=2 
[junit4:junit4]   2> 14249 T612 C84 P15306 /update {wt=javabin&version=2} {add=[135 (1415542022792544256)]} 0 6
[junit4:junit4]   2> 14254 T594 C85 P16008 /update {wt=javabin&version=2} {add=[136 (1415542022800932864)]} 0 2
[junit4:junit4]   2> 14258 T621 C86 P43029 /update {wt=javabin&version=2} {add=[136 (1415542022806175744)]} 0 2
[junit4:junit4]   2> 14262 T594 C85 P16008 /update {wt=javabin&version=2} {add=[137 (1415542022810370048)]} 0 1
[junit4:junit4]   2> 14270 T620 C86 P43029 REQ /update {distrib.from=http://127.0.0.1:15306/solr/collection1/&update.distrib=TOLEADER&wt=javabin&version=2} status=0 QTime=2 
[junit4:junit4]   2> 14270 T612 C84 P15306 /update {wt=javabin&version=2} {add=[137]} 0 5
[junit4:junit4]   2> 14275 T594 C85 P16008 /update {wt=javabin&version=2} {add=[138 (1415542022824001536)]} 0 2
[junit4:junit4]   2> 14323 T632 C83 P11120 REQ /update {distrib.from=http://127.0.0.1:15306/solr/collection1/&update.distrib=FROMLEADER&wt=javabin&version=2} status=0 QTime=18 
[junit4:junit4]   2> 14324 T613 C84 P15306 REQ /update {distrib.from=http://127.0.0.1:43029/solr/collection1/&update.distrib=TOLEADER&wt=javabin&version=2} status=0 QTime=43 
[junit4:junit4]   2> 14325 T621 C86 P43029 /update {wt=javabin&version=2} {add=[138]} 0 47
[junit4:junit4]   2> 14331 T594 C85 P16008 /update {wt=javabin&version=2} {add=[139 (1415542022881673216)]} 0 3
[junit4:junit4]   2> 14336 T621 C86 P43029 /update {wt=javabin&version=2} {add=[139 (1415542022886916096)]} 0 2
[junit4:junit4]   2> 14340 T594 C85 P16008 /update {wt=javabin&version=2} {add=[140 (1415542022892158976)]} 0 1
[junit4:junit4]   2> 14344 T621 C86 P43029 /update {wt=javabin&version=2} {add=[140 (1415542022896353280)]} 0 1
[junit4:junit4]   2> 14349 T594 C85 P16008 /update {wt=javabin&version=2} {add=[141 (1415542022901596160)]} 0 1
[junit4:junit4]   2> 14354 T621 C86 P43029 /update {wt=javabin&version=2} {add=[141 (1415542022906839040)]} 0 2
[junit4:junit4]   2> 14374 T594 C85 P16008 /update {wt=javabin&version=2} {add=[142 (1415542022911033344)]} 0 17
[junit4:junit4]   2> 14397 T620 C86 P43029 REQ /update {distrib.from=http://127.0.0.1:15306/solr/collection1/&update.distrib=TOLEADER&wt=javabin&version=2} status=0 QTime=17 
[junit4:junit4]   2> 14398 T612 C84 P15306 /update {wt=javabin&version=2} {add=[142]} 0 21
[junit4:junit4]   2> 14404 T594 C85 P16008 /update {wt=javabin&version=2} {add=[143 (1415542022958219264)]} 0 3
[junit4:junit4]   2> 14411 T621 C86 P43029 /update {wt=javabin&version=2} {add=[143 (1415542022963462144)]} 0 4
[junit4:junit4]   2> 14416 T594 C85 P16008 /update {wt=javabin&version=2} {add=[144 (1415542022971850752)]} 0 2
[junit4:junit4]   2> 14424 T620 C86 P43029 REQ /update {distrib.from=http://127.0.0.1:15306/solr/collection1/&update.distrib=TOLEADER&wt=javabin&version=2} status=0 QTime=2 
[junit4:junit4]   2> 14424 T612 C84 P15306 /update {wt=javabin&version=2} {add=[144]} 0 5
[junit4:junit4]   2> 14429 T594 C85 P16008 /update {wt=javabin&version=2} {add=[145 (1415542022985482240)]} 0 2
[junit4:junit4]   2> 14434 T621 C86 P43029 /update {wt=javabin&version=2} {add=[145 (1415542022990725120)]} 0 2
[junit4:junit4]   2> 14439 T594 C85 P16008 /update {wt=javabin&version=2} {add=[146 (1415542022994919424)]} 0 2
[junit4:junit4]   2> 14452 T632 C83 P11120 REQ /update {distrib.from=http://127.0.0.1:15306/solr/collection1/&update.distrib=FROMLEADER&wt=javabin&version=2} status=0 QTime=3 
[junit4:junit4]   2> 14453 T613 C84 P15306 REQ /update {distrib.from=http://127.0.0.1:43029/solr/collection1/&update.distrib=TOLEADER&wt=javabin&version=2} status=0 QTime=9 
[junit4:junit4]   2> 14454 T621 C86 P43029 /update {wt=javabin&version=2} {add=[146]} 0 13
[junit4:junit4]   2> 14459 T594 C85 P16008 /update {wt=javabin&version=2} {add=[147 (1415542023016939520)]} 0 2
[junit4:junit4]   2> 14466 T620 C86 P43029 REQ /update {distrib.from=http://127.0.0.1:15306/solr/collection1/&update.distrib=TOLEADER&wt=javabin&version=2} status=0 QTime=1 
[junit4:junit4]   2> 14467 T612 C84 P15306 /update {wt=javabin&version=2} {add=[147]} 0 5
[junit4:junit4]   2> 14472 T594 C85 P16008 /update {wt=javabin&version=2} {add=[148 (1415542023030571008)]} 0 2
[junit4:junit4]   2> 14484 T632 C83 P11120 REQ /update {distrib.from=http://127.0.0.1:15306/solr/collection1/&update.distrib=FROMLEADER&wt=javabin&version=2} status=0 QTime=1 
[junit4:junit4]   2> 14484 T613 C84 P15306 REQ /update {distrib.from=http://127.0.0.1:43029/solr/collection1/&update.distrib=TOLEADER&wt=javabin&version=2} status=0 QTime=7 
[junit4:junit4]   2> 14485 T621 C86 P43029 /update {wt=javabin&version=2} {add=[148]} 0 11
[junit4:junit4]   2> 14490 T594 C85 P16008 /update {wt=javabin&version=2} {add=[149 (1415542023049445376)]} 0 2
[junit4:junit4]   2> 14494 T621 C86 P43029 /update {wt=javabin&version=2} {add=[149 (1415542023053639680)]} 0 1
[junit4:junit4]   2> 14497 T594 C85 P16008 oasu.DirectUpdateHandler2.commit start commit{flags=0,_version_=0,optimize=false,openSearcher=true,waitSearcher=true,expungeDeletes=false,softCommit=false}
[junit4:junit4]   2> 14660 T594 C85 P16008 oasc.SolrDeletionPolicy.onCommit SolrDeletionPolicy.onCommit: commits:num=2
[junit4:junit4]   2> 		commit{dir=/usr/home/hudson/hudson-slave/workspace/Lucene-Solr-Tests-4.x-java7/solr/build/solr-core/test/J0/org.apache.solr.cloud.BasicDistributedZkTest-1349966056692/control/data/index,segFN=segments_1,generation=1,filenames=[segments_1]
[junit4:junit4]   2> 		commit{dir=/usr/home/hudson/hudson-slave/workspace/Lucene-Solr-Tests-4.x-java7/solr/build/solr-core/test/J0/org.apache.solr.cloud.BasicDistributedZkTest-1349966056692/control/data/index,segFN=segments_2,generation=2,filenames=[_5_nrm.cfe, _5_Memory_0.ram, _6_Asserting_0.frq, _3.fdt, _0_Lucene40_0.prx, _0_Pulsing40_0.frq, _1_Asserting_0.tim, _3_Lucene40_0.frq, _1_Asserting_0.tip, _5_Pulsing40_0.tip, _5_Pulsing40_0.tim, _4_Asserting_0.frq, _0_Lucene40_0.tim, _0_Pulsing40_0.tim, _0_Memory_0.ram, _2.fdt, _3_Pulsing40_0.tip, _2.fdx, _3_Pulsing40_0.tim, _0_Lucene40_0.tip, _2_Asserting_0.tim, _1.fdx, _0_Asserting_0.frq, _2_Asserting_0.tip, _5_nrm.cfs, _1.fdt, _2_Lucene40_0.prx, _3.si, _6.fdt, _6_Memory_0.ram, _2.si, _0_Asserting_0.tim, _3_Pulsing40_0.frq, _2_Pulsing40_0.tim, _0_Asserting_0.tip, _6.fdx, _2_Pulsing40_0.tip, _4_Asserting_0.tip, _3.fnm, _4_Pulsing40_0.prx, _1_Memory_0.ram, _2_nrm.cfe, _4_Asserting_0.prx, _5_Pulsing40_0.frq, _5_Lucene40_0.tim, _5_Lucene40_0.tip, _0_Lucene40_0.frq, _4_Asserting_0.tim, _0_Pulsing40_0.tip, _2_nrm.cfs, _3_Lucene40_0.tip, _3_Lucene40_0.tim, _6_Asserting_0.prx, _1_Lucene40_0.frq, _1_Asserting_0.frq, _2.fnm, _3.fdx, _4_Pulsing40_0.tip, _4_Pulsing40_0.tim, _5_Pulsing40_0.prx, _1_Asserting_0.prx, _2_Lucene40_0.frq, _1.si, _6.si, _6.fnm, _5_Lucene40_0.prx, _1_Lucene40_0.tim, _3_nrm.cfe, _5.fdt, _6_Lucene40_0.tim, _1_Pulsing40_0.tip, _6_Pulsing40_0.frq, _6_Lucene40_0.tip, _1_Pulsing40_0.tim, _4.fnm, _4_nrm.cfe, _0_Pulsing40_0.prx, _1.fnm, _1_Lucene40_0.tip, _1_Pulsing40_0.frq, _0_Asserting_0.prx, _4.fdx, _2_Lucene40_0.tip, _3_Asserting_0.prx, _6_Pulsing40_0.tim, _1_Pulsing40_0.prx, _6_Pulsing40_0.tip, _2_Asserting_0.prx, _2_Lucene40_0.tim, _2_Pulsing40_0.prx, _5_Lucene40_0.frq, _0.fnm, _5_Asserting_0.tim, _6_Lucene40_0.frq, _2_Pulsing40_0.frq, _1_Lucene40_0.prx, _5.si, _3_nrm.cfs, _6_Pulsing40_0.prx, _4_Memory_0.ram, _4_nrm.cfs, _4_Lucene40_0.frq, _5_Asserting_0.tip, _6_Lucene40_0.prx, _5_Asserting_0.prx, _6_Asserting_0.tim, _6_Asserting_0.tip, _6_nrm.cfs, _5_Asserting_0.frq, _2_Asserting_0.frq, _3_Lucene40_0.prx, _4_Lucene40_0.tip, _2_Memory_0.ram, _0.si, _3_Memory_0.ram, _4_Lucene40_0.tim, _4_Lucene40_0.prx, _1_nrm.cfs, _5.fnm, _6_nrm.cfe, _0_nrm.cfs, _4.fdt, _4.si, _1_nrm.cfe, _3_Asserting_0.frq, _3_Pulsing40_0.prx, _4_Pulsing40_0.frq, _3_Asserting_0.tim, _3_Asserting_0.tip, _0_nrm.cfe, _5.fdx, segments_2, _0.fdx, _0.fdt]
[junit4:junit4]   2> 14662 T594 C85 P16008 oasc.SolrDeletionPolicy.updateCommits newest commit = 2
[junit4:junit4]   2> 14673 T594 C85 P16008 oass.SolrIndexSearcher.<init> Opening Searcher@3ac3cd28 main
[junit4:junit4]   2> 14674 T594 C85 P16008 oasu.DirectUpdateHandler2.commit end_commit_flush
[junit4:junit4]   2> 14677 T605 oasc.SolrCore.registerSearcher [collection1] Registered new searcher Searcher@3ac3cd28 main{StandardDirectoryReader(segments_2:15:nrt _0(4.1):C10 _1(4.1):C10 _2(4.1):C10 _3(4.1):C10 _4(4.1):C10 _5(4.1):C10 _6(4.1):C7)}
[junit4:junit4]   2> 14678 T594 C85 P16008 /update {waitSearcher=true&wt=javabin&commit=true&softCommit=false&version=2} {commit=} 0 181
[junit4:junit4]   2> 14681 T612 C84 P15306 oasu.DirectUpdateHandler2.commit start commit{flags=0,_version_=0,optimize=false,openSearcher=true,waitSearcher=true,expungeDeletes=false,softCommit=false}
[junit4:junit4]   2> 14865 T612 C84 P15306 oasc.SolrDeletionPolicy.onCommit SolrDeletionPolicy.onCommit: commits:num=2
[junit4:junit4]   2> 		commit{dir=/usr/home/hudson/hudson-slave/workspace/Lucene-Solr-Tests-4.x-java7/solr/build/solr-core/test/J0/org.apache.solr.cloud.BasicDistributedZkTest-1349966056692/jetty1/index,segFN=segments_1,generation=1,filenames=[segments_1]
[junit4:junit4]   2> 		commit{dir=/usr/home/hudson/hudson-slave/workspace/Lucene-Solr-Tests-4.x-java7/solr/build/solr-core/test/J0/org.apache.solr.cloud.BasicDistributedZkTest-1349966056692/jetty1/index,segFN=segments_2,generation=2,filenames=[_3_nrm.cfe, _1_Lucene40_0.tim, _1_Pulsing40_0.tip, _1_Pulsing40_0.tim, _3.fdt, _0_Pulsing40_0.prx, _0_Lucene40_0.prx, _0_Pulsing40_0.frq, _1.fnm, _1_Lucene40_0.tip, _0_Asserting_0.prx, _1_Pulsing40_0.frq, _1_Asserting_0.tim, _2_Lucene40_0.tip, _3_Lucene40_0.frq, _3_Asserting_0.prx, _1_Asserting_0.tip, _1_Pulsing40_0.prx, _2_Asserting_0.prx, _2_Lucene40_0.tim, _2_Pulsing40_0.prx, _0_Lucene40_0.tim, _0.fnm, _0_Pulsing40_0.tim, _0_Memory_0.ram, _3_Pulsing40_0.tip, _2.fdt, _2.fdx, _3_Pulsing40_0.tim, _2_Pulsing40_0.frq, _0_Lucene40_0.tip, _1_Lucene40_0.prx, _3_nrm.cfs, _1.fdx, _2_Asserting_0.tim, _0_Asserting_0.frq, _2_Asserting_0.tip, _1.fdt, _2_Lucene40_0.prx, _3.si, _3_Pulsing40_0.frq, _0_Asserting_0.tim, _2.si, _2_Pulsing40_0.tim, _0_Asserting_0.tip, _2_Pulsing40_0.tip, _3.fnm, _2_nrm.cfe, _1_Memory_0.ram, _0_Lucene40_0.frq, _2_Asserting_0.frq, _3_Lucene40_0.prx, _0_Pulsing40_0.tip, _2_Memory_0.ram, _3_Memory_0.ram, _2_nrm.cfs, _0.si, _3_Lucene40_0.tip, _1_nrm.cfs, _3_Lucene40_0.tim, _1_Lucene40_0.frq, _1_Asserting_0.frq, _0_nrm.cfs, _1_nrm.cfe, _2.fnm, _3_Asserting_0.frq, _3.fdx, _3_Pulsing40_0.prx, _3_Asserting_0.tim, _3_Asserting_0.tip, _2_Lucene40_0.frq, _1_Asserting_0.prx, _1.si, _0_nrm.cfe, segments_2, _0.fdx, _0.fdt]
[junit4:junit4]   2> 14866 T612 C84 P15306 oasc.SolrDeletionPolicy.updateCommits newest commit = 2
[junit4:junit4]   2> 14875 T612 C84 P15306 oass.SolrIndexSearcher.<init> Opening Searcher@5271e6cf main
[junit4:junit4]   2> 14876 T612 C84 P15306 oasu.DirectUpdateHandler2.commit end_commit_flush
[junit4:junit4]   2> 14878 T617 oasc.SolrCore.registerSearcher [collection1] Registered new searcher Searcher@5271e6cf main{StandardDirectoryReader(segments_2:9:nrt _0(4.1):C10 _1(4.1):C10 _2(4.1):C10 _3(4.1):C2)}
[junit4:junit4]   2> 14878 T612 C84 P15306 oasu.SolrCmdDistributor.distribCommit Distrib commit to:[StdNode: http://127.0.0.1:11120/solr/collection1/, StdNode: http://127.0.0.1:43029/solr/collection1/]
[junit4:junit4]   2> 14882 T632 C83 P11120 oasu.DirectUpdateHandler2.commit start commit{flags=0,_version_=0,optimize=false,openSearcher=true,waitSearcher=true,expungeDeletes=false,softCommit=false}
[junit4:junit4]   2> 14882 T620 C86 P43029 oasu.DirectUpdateHandler2.commit start commit{flags=0,_version_=0,optimize=false,openSearcher=true,waitSearcher=true,expungeDeletes=false,softCommit=false}
[junit4:junit4]   2> 15178 T632 C83 P11120 oasc.SolrDeletionPolicy.onCommit SolrDeletionPolicy.onCommit: commits:num=2
[junit4:junit4]   2> 		commit{dir=/usr/home/hudson/hudson-slave/workspace/Lucene-Solr-Tests-4.x-java7/solr/build/solr-core/test/J0/org.apache.solr.cloud.BasicDistributedZkTest-1349966056692/jetty3/index,segFN=segments_2,generation=2,filenames=[segments_2]
[junit4:junit4]   2> 		commit{dir=/usr/home/hudson/hudson-slave/workspace/Lucene-Solr-Tests-4.x-java7/solr/build/solr-core/test/J0/org.apache.solr.cloud.BasicDistributedZkTest-1349966056692/jetty3/index,segFN=segments_3,generation=3,filenames=[_3_nrm.cfe, _1_Lucene40_0.tim, _1_Pulsing40_0.tip, _1_Pulsing40_0.tim, _3.fdt, _0_Pulsing40_0.prx, _0_Lucene40_0.prx, _0_Pulsing40_0.frq, _1.fnm, _1_Lucene40_0.tip, _0_Asserting_0.prx, _1_Pulsing40_0.frq, _1_Asserting_0.tim, _2_Lucene40_0.tip, _3_Lucene40_0.frq, _3_Asserting_0.prx, _1_Asserting_0.tip, _1_Pulsing40_0.prx, _2_Asserting_0.prx, _2_Lucene40_0.tim, _2_Pulsing40_0.prx, _0_Lucene40_0.tim, _0.fnm, _0_Pulsing40_0.tim, _0_Memory_0.ram, _3_Pulsing40_0.tip, _2.fdt, _2.fdx, _3_Pulsing40_0.tim, _2_Pulsing40_0.frq, _0_Lucene40_0.tip, _1_Lucene40_0.prx, _3_nrm.cfs, _1.fdx, _2_Asserting_0.tim, _0_Asserting_0.frq, _2_Asserting_0.tip, _1.fdt, _2_Lucene40_0.prx, _3.si, _3_Pulsing40_0.frq, _0_Asserting_0.tim, _2.si, _2_Pulsing40_0.tim, _0_Asserting_0.tip, _2_Pulsing40_0.tip, _3.fnm, _2_nrm.cfe, _1_Memory_0.ram, _0_Lucene40_0.frq, _2_Asserting_0.frq, _3_Lucene40_0.prx, _0_Pulsing40_0.tip, _2_Memory_0.ram, _3_Memory_0.ram, _2_nrm.cfs, _0.si, _3_Lucene40_0.tip, _1_nrm.cfs, _3_Lucene40_0.tim, _1_Lucene40_0.frq, _1_Asserting_0.frq, _0_nrm.cfs, _1_nrm.cfe, _2.fnm, _3_Asserting_0.frq, _3.fdx, _3_Pulsing40_0.prx, _3_Asserting_0.tim, _3_Asserting_0.tip, _2_Lucene40_0.frq, _1_Asserting_0.prx, _1.si, _0_nrm.cfe, _0.fdx, _0.fdt, segments_3]
[junit4:junit4]   2> 15178 T620 C86 P43029 oasc.SolrDeletionPolicy.onCommit SolrDeletionPolicy.onCommit: commits:num=2
[junit4:junit4]   2> 		commit{dir=/usr/home/hudson/hudson-slave/workspace/Lucene-Solr-Tests-4.x-java7/solr/build/solr-core/test/J0/org.apache.solr.cloud.BasicDistributedZkTest-1349966056692/jetty2/index,segFN=segments_1,generation=1,filenames=[segments_1]
[junit4:junit4]   2> 		commit{dir=/usr/home/hudson/hudson-slave/workspace/Lucene-Solr-Tests-4.x-java7/solr/build/solr-core/test/J0/org.apache.solr.cloud.BasicDistributedZkTest-1349966056692/jetty2/index,segFN=segments_2,generation=2,filenames=[_3_nrm.cfe, _1_Lucene40_0.tim, _1_Pulsing40_0.tip, _1_Pulsing40_0.tim, _3.fdt, _0_Lucene40_0.prx, _0_Pulsing40_0.prx, _0_Pulsing40_0.frq, _1.fnm, _1_Lucene40_0.tip, _0_Asserting_0.prx, _1_Pulsing40_0.frq, _1_Asserting_0.tim, _2_Lucene40_0.tip, _3_Lucene40_0.frq, _3_Asserting_0.prx, _1_Asserting_0.tip, _1_Pulsing40_0.prx, _2_Asserting_0.prx, _2_Lucene40_0.tim, _2_Pulsing40_0.prx, _0_Lucene40_0.tim, _0.fnm, _0_Pulsing40_0.tim, _0_Memory_0.ram, _3_Pulsing40_0.tip, _2.fdt, _2.fdx, _3_Pulsing40_0.tim, _2_Pulsing40_0.frq, _0_Lucene40_0.tip, _1_Lucene40_0.prx, _3_nrm.cfs, _1.fdx, _2_Asserting_0.tim, _0_Asserting_0.frq, _2_Asserting_0.tip, _1.fdt, _2_Lucene40_0.prx, _3.si, _3_Pulsing40_0.frq, _0_Asserting_0.tim, _2.si, _2_Pulsing40_0.tim, _0_Asserting_0.tip, _2_Pulsing40_0.tip, _3.fnm, _2_nrm.cfe, _1_Memory_0.ram, _0_Lucene40_0.frq, _2_Asserting_0.frq, _3_Lucene40_0.prx, _0_Pulsing40_0.tip, _2_Memory_0.ram, _3_Memory_0.ram, _2_nrm.cfs, _0.si, _3_Lucene40_0.tip, _1_nrm.cfs, _3_Lucene40_0.tim, _1_Lucene40_0.frq, _1_Asserting_0.frq, _0_nrm.cfs, _1_nrm.cfe, _2.fnm, _3_Asserting_0.frq, _3.fdx, _3_Pulsing40_0.prx, _3_Asserting_0.tim, _3_Asserting_0.tip, _2_Lucene40_0.frq, _1_Asserting_0.prx, _1.si, _0_nrm.cfe, segments_2, _0.fdx, _0.fdt]
[junit4:junit4]   2> 15179 T620 C86 P43029 oasc.SolrDeletionPolicy.updateCommits newest commit = 2
[junit4:junit4]   2> 15179 T632 C83 P11120 oasc.SolrDeletionPolicy.updateCommits newest commit = 3
[junit4:junit4]   2> 15191 T632 C83 P11120 oass.SolrIndexSearcher.<init> Opening Searcher@682f9009 main
[junit4:junit4]   2> 15191 T620 C86 P43029 oass.SolrIndexSearcher.<init> Opening Searcher@6a3f5058 main
[junit4:junit4]   2> 15192 T632 C83 P11120 oasu.DirectUpdateHandler2.commit end_commit_flush
[junit4:junit4]   2> 15192 T620 C86 P43029 oasu.DirectUpdateHandler2.commit end_commit_flush
[junit4:junit4]   2> 15192 T629 oasc.JmxMonitoredMap.put WARNING Failed to register info bean: searcher javax.management.InstanceAlreadyExistsException: solr/collection1:type=searcher,id=org.apache.solr.search.SolrIndexSearcher
[junit4:junit4]   2> 	at com.sun.jmx.mbeanserver.Repository.addMBean(Repository.java:437)
[junit4:junit4]   2> 	at com.sun.jmx.interceptor.DefaultMBeanServerInterceptor.registerWithRepository(DefaultMBeanServerInterceptor.java:1898)
[junit4:junit4]   2> 	at com.sun.jmx.interceptor.DefaultMBeanServerInterceptor.registerDynamicMBean(DefaultMBeanServerInterceptor.java:966)
[junit4:junit4]   2> 	at com.sun.jmx.interceptor.DefaultMBeanServerInterceptor.registerObject(DefaultMBeanServerInterceptor.java:900)
[junit4:junit4]   2> 	at com.sun.jmx.interceptor.DefaultMBeanServerInterceptor.registerMBean(DefaultMBeanServerInterceptor.java:324)
[junit4:junit4]   2> 	at com.sun.jmx.mbeanserver.JmxMBeanServer.registerMBean(JmxMBeanServer.java:512)
[junit4:junit4]   2> 	at org.apache.solr.core.JmxMonitoredMap.put(JmxMonitoredMap.java:140)
[junit4:junit4]   2> 	at org.apache.solr.core.JmxMonitoredMap.put(JmxMonitoredMap.java:51)
[junit4:junit4]   2> 	at org.apache.solr.search.SolrIndexSearcher.register(SolrIndexSearcher.java:242)
[junit4:junit4]   2> 	at org.apache.solr.core.SolrCore.registerSearcher(SolrCore.java:1691)
[junit4:junit4]   2> 	at org.apache.solr.core.SolrCore.access$000(SolrCore.java:124)
[junit4:junit4]   2> 	at org.apache.solr.core.SolrCore$7.call(SolrCore.java:1568)
[junit4:junit4]   2> 	at java.util.concurrent.FutureTask$Sync.innerRun(FutureTask.java:334)
[junit4:junit4]   2> 	at java.util.concurrent.FutureTask.run(FutureTask.java:166)
[junit4:junit4]   2> 	at java.util.concurrent.ThreadPoolExecutor.runWorker(ThreadPoolExecutor.java:1110)
[junit4:junit4]   2> 	at java.util.concurrent.ThreadPoolExecutor$Worker.run(ThreadPoolExecutor.java:603)
[junit4:junit4]   2> 	at java.lang.Thread.run(Thread.java:722)
[junit4:junit4]   2> 
[junit4:junit4]   2> 15193 T641 oasc.SolrCore.registerSearcher [collection1] Registered new searcher Searcher@682f9009 main{StandardDirectoryReader(segments_3:10:nrt _0(4.1):C10 _1(4.1):C10 _2(4.1):C10 _3(4.1):C2)}
[junit4:junit4]   2> 15194 T632 C83 P11120 /update {waitSearcher=true&commit=true&commit_end_point=true&expungeDeletes=false&wt=javabin&softCommit=false&version=2} {commit=} 0 312
[junit4:junit4]   2> 15194 T629 oasc.SolrCore.registerSearcher [collection1] Registered new searcher Searcher@6a3f5058 main{StandardDirectoryReader(segments_2:9:nrt _0(4.1):C10 _1(4.1):C10 _2(4.1):C10 _3(4.1):C5)}
[junit4:junit4]   2> 15195 T620 C86 P43029 /update {waitSearcher=true&commit=true&commit_end_point=true&expungeDeletes=false&wt=javabin&softCommit=false&version=2} {commit=} 0 313
[junit4:junit4]   2> 15196 T612 C84 P15306 /update {waitSearcher=true&wt=javabin&commit=true&softCommit=false&version=2} {commit=} 0 515
[junit4:junit4]   2> 15201 T594 C85 P16008 REQ /select {distrib=false&sort=n_ti1+desc&wt=javabin&q=*:*&version=2} hits=67 status=0 QTime=2 
[junit4:junit4]   2> 15205 T582 oascsi.HttpClientUtil.createClient Creating new http client, config:
[junit4:junit4]   2> 15215 T582 oaz.ZooKeeper.<init> Initiating client connection, connectString=127.0.0.1:31220/solr sessionTimeout=10000 watcher=org.apache.solr.common.cloud.ConnectionManager@73a29d67
[junit4:junit4]   2> 15216 T651 oaz.ClientCnxn$SendThread.startConnect Opening socket connection to server /127.0.0.1:31220
[junit4:junit4]   2> 15216 T582 oascc.ConnectionManager.waitForConnected Waiting for client to connect to ZooKeeper
[junit4:junit4]   2> 15218 T651 oaz.ClientCnxn$SendThread.primeConnection Socket connection established to localhost/127.0.0.1:31220, initiating session
[junit4:junit4]   2> 15218 T584 oazs.NIOServerCnxn$Factory.run Accepted socket connection from /140.211.11.196:30984
[junit4:junit4]   2> 15218 T584 oazs.NIOServerCnxn.readConnectRequest Client attempting to establish new session at /140.211.11.196:30984
[junit4:junit4]   2> 15220 T586 oazs.NIOServerCnxn.finishSessionInit Established session 0x13a503f4e5d0008 with negotiated timeout 10000 for client /140.211.11.196:30984
[junit4:junit4]   2> 15220 T651 oaz.ClientCnxn$SendThread.readConnectResult Session establishment complete on server localhost/127.0.0.1:31220, sessionid = 0x13a503f4e5d0008, negotiated timeout = 10000
[junit4:junit4]   2> 15220 T652 oascc.ConnectionManager.process Watcher org.apache.solr.common.cloud.ConnectionManager@73a29d67 name:ZooKeeperConnection Watcher:127.0.0.1:31220/solr got event WatchedEvent state:SyncConnected type:None path:null path:null type:None
[junit4:junit4]   2> 15220 T582 oascc.ConnectionManager.waitForConnected Client is connected to ZooKeeper
[junit4:junit4]   2> 15221 T582 oascc.ZkStateReader.createClusterStateWatchersAndUpdate Updating cluster state from ZooKeeper... 
[junit4:junit4]   2> 15235 T634 C83 P11120 REQ /select {sort=n_ti1+desc&distrib=false&wt=javabin&rows=10&version=2&fl=id&shard.url=127.0.0.1:15306/solr/collection1/|127.0.0.1:11120/solr/collection1/&NOW=1349966071917&start=0&q=*:*&isShard=true&fsv=true} hits=32 status=0 QTime=1 
[junit4:junit4]   2> 15235 T622 C86 P43029 REQ /select {sort=n_ti1+desc&distrib=false&wt=javabin&rows=10&version=2&fl=id&shard.url=127.0.0.1:43029/solr/collection1/&NOW=1349966071917&start=0&q=*:*&isShard=true&fsv=true} hits=35 status=0 QTime=1 
[junit4:junit4]   2> 15251 T622 C86 P43029 REQ /select {shard.url=127.0.0.1:43029/solr/collection1/&NOW=1349966071917&q=*:*&ids=143,128,149,140&distrib=false&isShard=true&wt=javabin&version=2} status=0 QTime=1 
[junit4:junit4]   2> 15252 T634 C83 P11120 REQ /select {shard.url=127.0.0.1:15306/solr/collection1/|127.0.0.1:11120/solr/collection1/&NOW=1349966071917&q=*:*&ids=125,10,132,123,16,11&distrib=false&isShard=true&wt=javabin&version=2} status=0 QTime=2 
[junit4:junit4]   2> 15254 T633 C83 P11120 REQ /select {sort=n_ti1+desc&wt=javabin&q=*:*&version=2} hits=67 status=0 QTime=24 
[junit4:junit4]   2> 15265 T594 C85 P16008 REQ /select {distrib=false&sort=n_ti1+asc&wt=javabin&q=*:*&version=2} hits=67 status=0 QTime=1 
[junit4:junit4]   2> 15273 T624 C86 P43029 REQ /select {sort=n_ti1+asc&distrib=false&wt=javabin&rows=10&version=2&fl=id&shard.url=127.0.0.1:43029/solr/collection1/&NOW=1349966071957&start=0&q=*:*&isShard=true&fsv=true} hits=35 status=0 QTime=0 
[junit4:junit4]   2> 15274 T614 C84 P15306 REQ /select {sort=n_ti1+asc&distrib=false&wt=javabin&rows=10&version=2&fl=id&shard.url=127.0.0.1:15306/solr/collection1/|127.0.0.1:11120/solr/collection1/&NOW=1349966071957&start=0&q=*:*&isShard=true&fsv=true} hits=32 status=0 QTime=1 
[junit4:junit4]   2> 15280 T614 C84 P15306 REQ /select {shard.url=127.0.0.1:15306/solr/collection1/|127.0.0.1:11120/solr/collection1/&NOW=1349966071957&q=*:*&ids=135,109,4&distrib=false&isShard=true&wt=javabin&version=2} status=0 QTime=1 
[junit4:junit4]   2> 15281 T624 C86 P43029 REQ /select {shard.url=127.0.0.1:43029/solr/collection1/&NOW=1349966071957&q=*:*&ids=144,2,115,5,105,9,131&distrib=false&isShard=true&wt=javabin&version=2} status=0 QTime=2 
[junit4:junit4]   2> 15284 T623 C86 P43029 REQ /select {sort=n_ti1+asc&wt=javabin&q=*:*&version=2} hits=67 status=0 QTime=14 
[junit4:junit4]   2> 15291 T594 C85 P16008 REQ /select {distrib=false&sort=n_f1+desc&wt=javabin&q=*:*&version=2} hits=67 status=0 QTime=2 
[junit4:junit4]   2> 15298 T609 C84 P15306 REQ /select {sort=n_f1+desc&distrib=false&collection=collection1&wt=javabin&rows=10&version=2&NOW=1349966071982&shard.url=127.0.0.1:15306/solr/collection1/|127.0.0.1:11120/solr/collection1/&fl=id&start=0&q=*:*&isShard=true&fsv=true} hits=32 status=0 QTime=1 
[junit4:junit4]   2> 15300 T622 C86 P43029 REQ /select {sort=n_f1+desc&distrib=false&collection=collection1&wt=javabin&rows=10&version=2&NOW=1349966071982&shard.url=127.0.0.1:43029/solr/collection1/&fl=id&start=0&q=*:*&isShard=true&fsv=true} hits=35 status=0 QTime=2 
[junit4:junit4]   2> 15305 T609 C84 P15306 REQ /select {shard.url=127.0.0.1:15306/solr/collection1/|127.0.0.1:11120/solr/collection1/&NOW=1349966071982&q=*:*&ids=114,146,124,129&distrib=false&collection=collection1&isShard=true&wt=javabin&version=2} status=0 QTime=1 
[junit4:junit4]   2> 15306 T622 C86 P43029 REQ /select {shard.url=127.0.0.1:43029/solr/collection1/&NOW=1349966071982&q=*:*&ids=116,3,126,147,139,17&distrib=false&collection=collection1&isShard=true&wt=javabin&version=2} status=0 QTime=2 
[junit4:junit4]   2> 15308 T635 C83 P11120 REQ /select {collection=collection1&sort=n_f1+desc&wt=javabin&q=*:*&version=2} hits=67 status=0 QTime=13 
[junit4:junit4]   2> 15314 T594 C85 P16008 REQ /select {distrib=false&sort=n_f1+asc&wt=javabin&q=*:*&version=2} hits=67 status=0 QTime=1 
[junit4:junit4]   2> 15325 T625 C86 P43029 REQ /select {sort=n_f1+asc&distrib=false&collection=collection1&wt=javabin&rows=10&version=2&NOW=1349966072006&shard.url=127.0.0.1:43029/solr/collection1/&fl=id&start=0&q=*:*&isShard=true&fsv=true} hits=35 status=0 QTime=1 
[junit4:junit4]   2> 15325 T636 C83 P11120 REQ /select {sort=n_f1+asc&distrib=false&collection=collection1&wt=javabin&rows=10&version=2&NOW=1349966072006&shard.url=127.0.0.1:15306/solr/collection1/|127.0.0.1:11120/solr/collection1/&fl=id&start=0&q=*:*&isShard=true&fsv=true} hits=32 status=0 QTime=1 
[junit4:junit4]   2> 15332 T636 C83 P11120 REQ /select {shard.url=127.0.0.1:15306/solr/collection1/|127.0.0.1:11120/solr/collection1/&NOW=1349966072006&q=*:*&ids=10,108,8,101&distrib=false&collection=collection1&isShard=true&wt=javabin&version=2} status=0 QTime=2 
[junit4:junit4]   2> 15333 T625 C86 P43029 REQ /select {shard.url=127.0.0.1:43029/solr/collection1/&NOW=1349966072006&q=*:*&ids=143,7,137,106,120,130&distrib=false&collection=collection1&isShard=true&wt=javabin&version=2} status=0 QTime=2 
[junit4:junit4]   2> 15337 T612 C84 P15306 REQ /select {collection=collection1&sort=n_f1+asc&wt=javabin&q=*:*&version=2} hits=67 status=0 QTime=18 
[junit4:junit4]   2> 15344 T594 C85 P16008 REQ /select {distrib=false&sort=n_tf1+desc&wt=javabin&q=*:*&version=2} hits=67 status=0 QTime=2 
[junit4:junit4]   2> 15352 T637 C83 P11120 REQ /select {sort=n_tf1+desc&distrib=false&wt=javabin&rows=10&version=2&fl=id&shard.url=127.0.0.1:15306/solr/collection1/|127.0.0.1:11120/solr/collection1/&NOW=1349966072035&start=0&q=*:*&isShard=true&fsv=true} hits=32 status=0 QTime=1 
[junit4:junit4]   2> 15352 T624 C86 P43029 REQ /select {sort=n_tf1+desc&distrib=false&wt=javabin&rows=10&version=2&fl=id&shard.url=127.0.0.1:43029/solr/collection1/&NOW=1349966072035&start=0&q=*:*&isShard=true&fsv=true} hits=35 status=0 QTime=1 
[junit4:junit4]   2> 15357 T637 C83 P11120 REQ /select {shard.url=127.0.0.1:15306/solr/collection1/|127.0.0.1:11120/solr/collection1/&NOW=1349966072035&q=*:*&ids=8,12&distrib=false&isShard=true&wt=javabin&version=2} status=0 QTime=1 
[junit4:junit4]   2> 15358 T624 C86 P43029 REQ /select {shard.url=127.0.0.1:43029/solr/collection1/&NOW=1349966072035&q=*:*&ids=116,3,144,128,106,104,120,140&distrib=false&isShard=true&wt=javabin&version=2} status=0 QTime=2 
[junit4:junit4]   2> 15362 T621 C86 P43029 REQ /select {sort=n_tf1+desc&wt=javabin&q=*:*&version=2} hits=67 status=0 QTime=14 
[junit4:junit4]   2> 15369 T594 C85 P16008 REQ /select {distrib=false&sort=n_tf1+asc&wt=javabin&q=*:*&version=2} hits=67 status=0 QTime=1 
[junit4:junit4]   2> 15377 T659 C84 P15306 REQ /select {sort=n_tf1+asc&distrib=false&wt=javabin&rows=10&version=2&fl=id&shard.url=127.0.0.1:15306/solr/collection1/|127.0.0.1:11120/solr/collection1/&NOW=1349966072060&start=0&q=*:*&isShard=true&fsv=true} hits=32 status=0 QTime=1 
[junit4:junit4]   2> 15377 T625 C86 P43029 REQ /select {sort=n_tf1+asc&distrib=false&wt=javabin&rows=10&version=2&fl=id&shard.url=127.0.0.1:43029/solr/collection1/&NOW=1349966072060&start=0&q=*:*&isShard=true&fsv=true} hits=35 status=0 QTime=0 
[junit4:junit4]   2> 15384 T659 C84 P15306 REQ /select {shard.url=127.0.0.1:15306/solr/collection1/|127.0.0.1:11120/solr/collection1/&NOW=1349966072060&q=*:*&ids=135,148,123,16,101&distrib=false&isShard=true&wt=javabin&version=2} status=0 QTime=2 
[junit4:junit4]   2> 15384 T625 C86 P43029 REQ /select {shard.url=127.0.0.1:43029/solr/collection1/&NOW=1349966072060&q=*:*&ids=143,136,137,130,119&distrib=false&isShard=true&wt=javabin&version=2} status=0 QTime=2 
[junit4:junit4]   2> 15387 T610 C84 P15306 REQ /select {sort=n_tf1+asc&wt=javabin&q=*:*&version=2} hits=67 status=0 QTime=14 
[junit4:junit4]   2> 15394 T594 C85 P16008 REQ /select {distrib=false&sort=n_d1+desc&wt=javabin&q=*:*&version=2} hits=67 status=0 QTime=2 
[junit4:junit4]   2> 15403 T622 C86 P43029 REQ /select {sort=n_d1+desc&distrib=false&wt=javabin&rows=10&version=2&fl=id&shard.url=127.0.0.1:43029/solr/collection1/&NOW=1349966072085&start=0&q=*:*&isShard=true&fsv=true} hits=35 status=0 QTime=2 
[junit4:junit4]   2> 15403 T609 C84 P15306 REQ /select {sort=n_d1+desc&distrib=false&wt=javabin&rows=10&version=2&fl=id&shard.url=127.0.0.1:15306/solr/collection1/|127.0.0.1:11120/solr/collection1/&NOW=1349966072085&start=0&q=*:*&isShard=true&fsv=true} hits=32 status=0 QTime=2 
[junit4:junit4]   2> 15408 T609 C84 P15306 REQ /select {shard.url=127.0.0.1:15306/solr/collection1/|127.0.0.1:11120/solr/collection1/&NOW=1349966072085&q=*:*&ids=114,101,11&distrib=false&isShard=true&wt=javabin&version=2} status=0 QTime=1 
[junit4:junit4]   2> 15409 T622 C86 P43029 REQ /select {shard.url=127.0.0.1:43029/solr/collection1/&NOW=1349966072085&q=*:*&ids=3,115,121,7,112,139,104&distrib=false&isShard=true&wt=javabin&version=2} status=0 QTime=2 
[junit4:junit4]   2> 15413 T635 C83 P11120 REQ /select {sort=n_d1+desc&wt=javabin&q=*:*&version=2} hits=67 status=0 QTime=15 
[junit4:junit4]   2> 15420 T594 C85 P16008 REQ /select {distrib=false&sort=n_d1+asc&wt=javabin&q=*:*&version=2} hits=67 status=0 QTime=1 
[junit4:junit4]   2> 15429 T659 C84 P15306 REQ /select {sort=n_d1+asc&distrib=false&collection=collection1&wt=javabin&rows=10&version=2&NOW=1349966072112&shard.url=127.0.0.1:15306/solr/collection1/|127.0.0.1:11120/solr/collection1/&fl=id&start=0&q=*:*&isShard=true&fsv=true} hits=32 status=0 QTime=1 
[junit4:junit4]   2> 15429 T625 C86 P43029 REQ /select {sort=n_d1+asc&distrib=false&collection=collection1&wt=javabin&rows=10&version=2&fl=id&shard.url=127.0.0.1:43029/solr/collection1/&NOW=1349966072112&start=0&q=*:*&isShard=true&fsv=true} hits=35 status=0 QTime=1 
[junit4:junit4]   2> 15435 T625 C86 P43029 REQ /select {shard.url=127.0.0.1:43029/solr/collection1/&NOW=1349966072112&q=*:*&ids=134,6,137,9&distrib=false&collection=collection1&isShard=true&wt=javabin&version=2} status=0 QTime=1 
[junit4:junit4]   2> 15436 T659 C84 P15306 REQ /select {shard.url=127.0.0.1:15306/solr/collection1/|127.0.0.1:11120/solr/collection1/&NOW=1349966072112&q=*:*&ids=135,113,148,16,129,13&distrib=false&collection=collection1&isShard=true&wt=javabin&version=2} status=0 QTime=2 
[junit4:junit4]   2> 15439 T610 C84 P15306 REQ /select {collection=collection1&sort=n_d1+asc&wt=javabin&q=*:*&version=2} hits=67 status=0 QTime=14 
[junit4:junit4]   2> 15446 T594 C85 P16008 REQ /select {distrib=false&sort=n_td1+desc&wt=javabin&q=*:*&version=2} hits=67 status=0 QTime=2 
[junit4:junit4]   2> 15456 T637 C83 P11120 REQ /select {sort=n_td1+desc&distrib=false&wt=javabin&rows=10&version=2&fl=id&shard.url=127.0.0.1:15306/solr/collection1/|127.0.0.1:11120/solr/collection1/&NOW=1349966072138&start=0&q=*:*&isShard=true&fsv=true} hits=32 status=0 QTime=2 
[junit4:junit4]   2> 15456 T624 C86 P43029 REQ /select {sort=n_td1+desc&distrib=false&wt=javabin&rows=10&version=2&fl=id&shard.url=127.0.0.1:43029/solr/collection1/&NOW=1349966072138&start=0&q=*:*&isShard=true&fsv=true} hits=35 status=0 QTime=2 
[junit4:junit4]   2> 15461 T637 C83 P11120 REQ /select {shard.url=127.0.0.1:15306/solr/collection1/|127.0.0.1:11120/solr/collection1/&NOW=1349966072138&q=*:*&ids=113,148,102,129&distrib=false&isShard=true&wt=javabin&version=2} status=0 QTime=1 
[junit4:junit4]   2> 15462 T624 C86 P43029 REQ /select {shard.url=127.0.0.1:43029/solr/collection1/&NOW=1349966072138&q=*:*&ids=145,112,121,136,17,131&distrib=false&isShard=true&wt=javabin&version=2} status=0 QTime=2 
[junit4:junit4]   2> 15466 T621 C86 P43029 REQ /select {sort=n_td1+desc&wt=javabin&q=*:*&version=2} hits=67 status=0 QTime=15 
[junit4:junit4]   2> 15473 T594 C85 P16008 REQ /select {distrib=false&sort=n_td1+asc&wt=javabin&q=*:*&version=2} hits=67 status=0 QTime=1 
[junit4:junit4]   2> 15482 T625 C86 P43029 REQ /select {sort=n_td1+asc&distrib=false&collection=collection1&wt=javabin&rows=10&version=2&fl=id&shard.url=127.0.0.1:43029/solr/collection1/&NOW=1349966072165&start=0&q=*:*&isShard=true&fsv=true} hits=35 status=0 QTime=1 
[junit4:junit4]   2> 15482 T659 C84 P15306 REQ /select {sort=n_td1+asc&distrib=false&collection=collection1&wt=javabin&rows=10&version=2&fl=id&shard.url=127.0.0.1:15306/solr/collection1/|127.0.0.1:11120/solr/collection1/&NOW=1349966072165&start=0&q=*:*&isShard=true&fsv=true} hits=32 status=0 QTime=1 
[junit4:junit4]   2> 15487 T625 C86 P43029 REQ /select {shard.url=127.0.0.1:43029/solr/collection1/&NOW=1349966072165&q=*:*&ids=128,137&distrib=false&collection=collection1&isShard=true&wt=javabin&version=2} status=0 QTime=0 
[junit4:junit4]   2> 15488 T659 C84 P15306 REQ /select {shard.url=127.0.0.1:15306/solr/collection1/|127.0.0.1:11120/solr/collection1/&NOW=1349966072165&q=*:*&ids=125,114,146,122,15,16,100,12&distrib=false&collection=collection1&isShard=true&wt=javabin&version=2} status=0 QTime=2 
[junit4:junit4]   2> 15491 T610 C84 P15306 REQ /select {collection=collection1&sort=n_td1+asc&wt=javabin&q=*:*&version=2} hits=67 status=0 QTime=13 
[junit4:junit4]   2> 15499 T594 C85 P16008 REQ /select {distrib=false&sort=n_l1+desc&wt=javabin&q=*:*&version=2} hits=67 status=0 QTime=2 
[junit4:junit4]   2> 15508 T636 C83 P11120 REQ /select {sort=n_l1+desc&distrib=false&wt=javabin&rows=10&version=2&fl=id&shard.url=127.0.0.1:15306/solr/collection1/|127.0.0.1:11120/solr/collection1/&NOW=1349966072191&start=0&q=*:*&isShard=true&fsv=true} hits=32 status=0 QTime=1 
[junit4:junit4]   2> 15509 T625 C86 P43029 REQ /select {sort=n_l1+desc&distrib=false&wt=javabin&rows=10&version=2&fl=id&shard.url=127.0.0.1:43029/solr/collection1/&NOW=1349966072191&start=0&q=*:*&isShard=true&fsv=true} hits=35 status=0 QTime=2 
[junit4:junit4]   2> 15515 T636 C83 P11120 REQ /select {shard.url=127.0.0.1:15306/solr/collection1/|127.0.0.1:11120/solr/collection1/&NOW=1349966072191&q=*:*&ids=125,138,113,122,100,12&distrib=false&isShard=true&wt=javabin&version=2} status=0 QTime=2 
[junit4:junit4]   2> 15515 T625 C86 P43029 REQ /select {shard.url=127.0.0.1:43029/solr/collection1/&NOW=1349966072191&q=*:*&ids=145,147,105,140&distrib=false&isShard=true&wt=javabin&version=2} status=0 QTime=2 
[junit4:junit4]   2> 15517 T610 C84 P15306 REQ /select {sort=n_l1+desc&wt=javabin&q=*:*&version=2} hits=67 status=0 QTime=13 
[junit4:junit4]   2> 15524 T594 C85 P16008 REQ /select {distrib=false&sort=n_l1+asc&wt=javabin&q=*:*&version=2} hits=67 status=0 QTime=1 
[junit4:junit4]   2> 15533 T624 C86 P43029 REQ /select {sort=n_l1+asc&distrib=false&wt=javabin&rows=10&version=2&fl=id&shard.url=127.0.0.1:43029/solr/collection1/&NOW=1349966072216&start=0&q=*:*&isShard=true&fsv=true} hits=35 status=0 QTime=1 
[junit4:junit4]   2> 15534 T614 C84 P15306 REQ /select {sort=n_l1+asc&distrib=false&wt=javabin&rows=10&version=2&fl=id&shard.url=127.0.0.1:15306/solr/collection1/|127.0.0.1:11120/solr/collection1/&NOW=1349966072216&start=0&q=*:*&isShard=true&fsv=true} hits=32 status=0 QTime=2 
[junit4:junit4]   2> 15540 T614 C84 P15306 REQ /select {shard.url=127.0.0.1:15306/solr/collection1/|127.0.0.1:11120/solr/collection1/&NOW=1349966072216&q=*:*&ids=135,10,102&distrib=false&isShard=true&wt=javabin&version=2} status=0 QTime=2 
[junit4:junit4]   2> 15540 T624 C86 P43029 REQ /select {shard.url=127.0.0.1:43029/solr/collection1/&NOW=1349966072216&q=*:*&ids=116,134,143,117,2,119,141&distrib=false&isShard=true&wt=javabin&version=2} status=0 QTime=2 
[junit4:junit4]   2> 15542 T623 C86 P43029 REQ /select {sort=n_l1+asc&wt=javabin&q=*:*&version=2} hits=67 status=0 QTime=13 
[junit4:junit4]   2> 15551 T594 C85 P16008 REQ /select {distrib=false&sort=n_tl1+desc&wt=javabin&q=*:*&version=2} hits=67 status=0 QTime=2 
[junit4:junit4]   2> 15561 T609 C84 P15306 REQ /select {sort=n_tl1+desc&distrib=false&collection=collection1&wt=javabin&rows=10&version=2&fl=id&shard.url=127.0.0.1:15306/solr/collection1/|127.0.0.1:11120/solr/collection1/&NOW=1349966072243&start=0&q=*:*&isShard=true&fsv=true} hits=32 status=0 QTime=2 
[junit4:junit4]   2> 15561 T622 C86 P43029 REQ /select {sort=n_tl1+desc&distrib=false&collection=collection1&wt=javabin&rows=10&version=2&fl=id&shard.url=127.0.0.1:43029/solr/collection1/&NOW=1349966072243&start=0&q=*:*&isShard=true&fsv=true} hits=35 status=0 QTime=2 
[junit4:junit4]   2> 15567 T622 C86 P43029 REQ /select {shard.url=127.0.0.1:43029/solr/collection1/&NOW=1349966072243&q=*:*&ids=3,145,136,131&distrib=false&collection=collection1&isShard=true&wt=javabin&version=2} status=0 QTime=2 
[junit4:junit4]   2> 15567 T609 C84 P15306 REQ /select {shard.url=127.0.0.1:15306/solr/collection1/|127.0.0.1:11120/solr/collection1/&NOW=1349966072243&q=*:*&ids=10,146,138,113,8,16&distrib=false&collection=collection1&isShard=true&wt=javabin&version=2} status=0 QTime=2 
[junit4:junit4]   2> 15570 T633 C83 P11120 REQ /select {collection=collection1&sort=n_tl1+desc&wt=javabin&q=*:*&version=2} hits=67 status=0 QTime=14 
[junit4:junit4]   2> 15577 T594 C85 P16008 REQ /select {distrib=false&sort=n_tl1+asc&wt=javabin&q=*:*&version=2} hits=67 status=0 QTime=1 
[junit4:junit4]   2> 15586 T622 C86 P43029 REQ /select {sort=n_tl1+asc&distrib=false&wt=javabin&rows=10&version=2&fl=id&shard.url=127.0.0.1:43029/solr/collection1/&NOW=1349966072269&start=0&q=*:*&isShard=true&fsv=true} hits=35 status=0 QTime=1 
[junit4:junit4]   2> 15586 T634 C83 P11120 REQ /select {sort=n_tl1+asc&distrib=false&wt=javabin&rows=10&version=2&fl=id&shard.url=127.0.0.1:15306/solr/collection1/|127.0.0.1:11120/solr/collection1/&NOW=1349966072269&start=0&q=*:*&isShard=true&fsv=true} hits=32 status=0 QTime=1 
[junit4:junit4]   2> 15592 T634 C83 P11120 REQ /select {shard.url=127.0.0.1:15306/solr/collection1/|127.0.0.1:11120/solr/collection1/&NOW=1349966072269&q=*:*&ids=122,4,107,13&distrib=false&isShard=true&wt=javabin&version=2} status=0 QTime=1 
[junit4:junit4]   2> 15592 T622 C86 P43029 REQ /select {shard.url=127.0.0.1:43029/solr/collection1/&NOW=1349966072269&q=*:*&ids=116,127,6,5,9,130&distrib=false&isShard=true&wt=javabin&version=2} status=0 QTime=2 
[junit4:junit4]   2> 15594 T635 C83 P11120 REQ /select {sort=n_tl1+asc&wt=javabin&q=*:*&version=2} hits=67 status=0 QTime=12 
[junit4:junit4]   2> 15602 T594 C85 P16008 REQ /select {distrib=false&sort=n_dt1+desc&wt=javabin&q=*:*&version=2} hits=67 status=0 QTime=2 
[junit4:junit4]   2> 15610 T634 C83 P11120 REQ /select {sort=n_dt1+desc&distrib=false&wt=javabin&rows=10&version=2&fl=id&shard.url=127.0.0.1:15306/solr/collection1/|127.0.0.1:11120/solr/collection1/&NOW=1349966072293&start=0&q=*:*&isShard=true&fsv=true} hits=32 status=0 QTime=1 
[junit4:junit4]   2> 15611 T622 C86 P43029 REQ /select {sort=n_dt1+desc&distrib=false&wt=javabin&rows=10&version=2&fl=id&shard.url=127.0.0.1:43029/solr/collection1/&NOW=1349966072293&start=0&q=*:*&isShard=true&fsv=true} hits=35 status=0 QTime=2 
[junit4:junit4]   2> 15617 T622 C86 P43029 REQ /select {shard.url=127.0.0.1:43029/solr/collection1/&NOW=1349966072293&q=*:*&ids=147,106,105,141&distrib=false&isShard=true&wt=javabin&version=2} status=0 QTime=2 
[junit4:junit4]   2> 15617 T634 C83 P11120 REQ /select {shard.url=127.0.0.1:15306/solr/collection1/|127.0.0.1:11120/solr/collection1/&NOW=1349966072293&q=*:*&ids=125,135,113,109,148,14&distrib=false&isShard=true&wt=javabin&version=2} status=0 QTime=1 
[junit4:junit4]   2> 15620 T635 C83 P11120 REQ /select {sort=n_dt1+desc&wt=javabin&q=*:*&version=2} hits=67 status=0 QTime=14 
[junit4:junit4]   2> 15627 T594 C85 P16008 REQ /select {distrib=false&sort=n_dt1+asc&wt=javabin&q=*:*&version=2} hits=67 status=0 QTime=1 
[junit4:junit4]   2> 15635 T624 C86 P43029 REQ /select {sort=n_dt1+asc&distrib=false&wt=javabin&rows=10&version=2&fl=id&shard.url=127.0.0.1:43029/solr/collection1/&NOW=1349966072318&start=0&q=*:*&isShard=true&fsv=true} hits=35 status=0 QTime=1 
[junit4:junit4]   2> 15635 T637 C83 P11120 REQ /select {sort=n_dt1+asc&distrib=false&wt=javabin&rows=10&version=2&fl=id&shard.url=127.0.0.1:15306/solr/collection1/|127.0.0.1:11120/solr/collection1/&NOW=1349966072318&start=0&q=*:*&isShard=true&fsv=true} hits=32 status=0 QTime=1 
[junit4:junit4]   2> 15640 T637 C83 P11120 REQ /select {shard.url=127.0.0.1:15306/solr/collection1/|127.0.0.1:11120/solr/collection1/&NOW=1349966072318&q=*:*&ids=132,118,12&distrib=false&isShard=true&wt=javabin&version=2} status=0 QTime=1 
[junit4:junit4]   2> 15641 T624 C86 P43029 REQ /select {shard.url=127.0.0.1:43029/solr/collection1/&NOW=1349966072318&q=*:*&ids=116,126,139,6,5,130,142&distrib=false&isShard=true&wt=javabin&version=2} status=0 QTime=2 
[junit4:junit4]   2> 15644 T623 C86 P43029 REQ /select {sort=n_dt1+asc&wt=javabin&q=*:*&version=2} hits=67 status=0 QTime=13 
[junit4:junit4]   2> 15655 T594 C85 P16008 REQ /select {distrib=false&sort=n_tdt1+desc&wt=javabin&q=*:*&version=2} hits=67 status=0 QTime=2 
[junit4:junit4]   2> 15665 T625 C86 P43029 REQ /select {sort=n_tdt1+desc&distrib=false&wt=javabin&rows=10&version=2&fl=id&shard.url=127.0.0.1:43029/solr/collection1/&NOW=1349966072347&start=0&q=*:*&isShard=true&fsv=true} hits=35 status=0 QTime=1 
[junit4:junit4]   2> 15666 T636 C83 P11120 REQ /select {sort=n_tdt1+desc&distrib=false&wt=javabin&rows=10&version=2&fl=id&shard.url=127.0.0.1:15306/solr/collection1/|127.0.0.1:11120/solr/collection1/&NOW=1349966072347&start=0&q=*:*&isShard=true&fsv=true} hits=32 status=0 QTime=2 
[junit4:junit4]   2> 15672 T636 C83 P11120 REQ /select {shard.url=127.0.0.1:15306/solr/collection1/|127.0.0.1:11120/solr/collection1/&NOW=1349966072347&q=*:*&ids=132,1,4,129,100&distrib=false&isShard=true&wt=javabin&version=2} status=0 QTime=2 
[junit4:junit4]   2> 15672 T625 C86 P43029 REQ /select {shard.url=127.0.0.1:43029/solr/collection1/&NOW=1349966072347&q=*:*&ids=2,128,9,140,142&distrib=false&isShard=true&wt=javabin&version=2} status=0 QTime=2 
[junit4:junit4]   2> 15677 T612 C84 P15306 REQ /select {sort=n_tdt1+desc&wt=javabin&q=*:*&version=2} hits=67 status=0 QTime=17 
[junit4:junit4]   2> 15688 T594 C85 P16008 REQ /select {distrib=false&sort=n_tdt1+asc&wt=javabin&q=*:*&version=2} hits=67 status=0 QTime=1 
[junit4:junit4]   2> 15696 T636 C83 P11120 REQ /select {sort=n_tdt1+asc&distrib=false&collection=collection1&wt=javabin&rows=10&version=2&fl=id&shard.url=127.0.0.1:15306/solr/collection1/|127.0.0.1:11120/solr/collection1/&NOW=1349966072379&start=0&q=*:*&isShard=true&fsv=true} hits=32 status=0 QTime=1 
[junit4:junit4]   2> 15696 T625 C86 P43029 REQ /select {sort=n_tdt1+asc&distrib=false&collection=collection1&wt=javabin&rows=10&version=2&fl=id&shard.url=127.0.0.1:43029/solr/collection1/&NOW=1349966072379&start=0&q=*:*&isShard=true&fsv=true} hits=35 status=0 QTime=1 
[junit4:junit4]   2> 15702 T625 C86 P43029 REQ /select {shard.url=127.0.0.1:43029/solr/collection1/&NOW=1349966072379&q=*:*&ids=7,121,136,17,104,131&distrib=false&collection=collection1&isShard=true&wt=javabin&version=2} status=0 QTime=2 
[junit4:junit4]   2> 15702 T636 C83 P11120 REQ /select {shard.url=127.0.0.1:15306/solr/collection1/|127.0.0.1:11120/solr/collection1/&NOW=1349966072379&q=*:*&ids=113,107,118,11&distrib=false&collection=collection1&isShard=true&wt=javabin&version=2} status=0 QTime=2 
[junit4:junit4]   2> 15705 T612 C84 P15306 REQ /select {collection=collection1&sort=n_tdt1+asc&wt=javabin&q=*:*&version=2} hits=67 status=0 QTime=13 
[junit4:junit4]   2> 15717 T594 C85 P16008 REQ /select {distrib=false&sort=a_si+desc&wt=javabin&q=*:*&version=2} hits=67 status=0 QTime=1 
[junit4:junit4]   2> 15726 T625 C86 P43029 REQ /select {sort=a_si+desc&distrib=false&collection=collection1&wt=javabin&rows=10&version=2&fl=id&shard.url=127.0.0.1:43029/solr/collection1/&NOW=1349966072409&start=0&q=*:*&isShard=true&fsv=true} hits=35 status=0 QTime=1 
[junit4:junit4]   2> 15726 T659 C84 P15306 REQ /select {sort=a_si+desc&distrib=false&collection=collection1&wt=javabin&rows=10&version=2&fl=id&shard.url=127.0.0.1:15306/solr/collection1/|127.0.0.1:11120/solr/collection1/&NOW=1349966072409&start=0&q=*:*&isShard=true&fsv=true} hits=32 status=0 QTime=1 
[junit4:junit4]   2> 15732 T625 C86 P43029 REQ /select {shard.url=127.0.0.1:43029/solr/collection1/&NOW=1349966072409&q

[...truncated too long message...]

ests.method=testDistribSearch -Dtests.seed=C3264DB7ABB9D8A6 -Dtests.multiplier=3 -Dtests.slow=true -Dtests.locale=es_NI -Dtests.timezone=America/Montreal -Dtests.file.encoding=ISO-8859-1
[junit4:junit4] FAILURE  568s J0 | BasicDistributedZkTest.testDistribSearch <<<
[junit4:junit4]    > Throwable #1: java.lang.AssertionError: some core start times did not change on reload
[junit4:junit4]    > 	at __randomizedtesting.SeedInfo.seed([C3264DB7ABB9D8A6:42C0C3AFDCE6B89A]:0)
[junit4:junit4]    > 	at org.junit.Assert.fail(Assert.java:93)
[junit4:junit4]    > 	at org.junit.Assert.assertTrue(Assert.java:43)
[junit4:junit4]    > 	at org.apache.solr.cloud.BasicDistributedZkTest.testCollectionsAPI(BasicDistributedZkTest.java:442)
[junit4:junit4]    > 	at org.apache.solr.cloud.BasicDistributedZkTest.doTest(BasicDistributedZkTest.java:331)
[junit4:junit4]    > 	at org.apache.solr.BaseDistributedSearchTestCase.testDistribSearch(BaseDistributedSearchTestCase.java:695)
[junit4:junit4]    > 	at sun.reflect.NativeMethodAccessorImpl.invoke0(Native Method)
[junit4:junit4]    > 	at sun.reflect.NativeMethodAccessorImpl.invoke(NativeMethodAccessorImpl.java:57)
[junit4:junit4]    > 	at sun.reflect.DelegatingMethodAccessorImpl.invoke(DelegatingMethodAccessorImpl.java:43)
[junit4:junit4]    > 	at java.lang.reflect.Method.invoke(Method.java:601)
[junit4:junit4]    > 	at com.carrotsearch.randomizedtesting.RandomizedRunner.invoke(RandomizedRunner.java:1559)
[junit4:junit4]    > 	at com.carrotsearch.randomizedtesting.RandomizedRunner.access$600(RandomizedRunner.java:79)
[junit4:junit4]    > 	at com.carrotsearch.randomizedtesting.RandomizedRunner$6.evaluate(RandomizedRunner.java:737)
[junit4:junit4]    > 	at com.carrotsearch.randomizedtesting.RandomizedRunner$7.evaluate(RandomizedRunner.java:773)
[junit4:junit4]    > 	at com.carrotsearch.randomizedtesting.RandomizedRunner$8.evaluate(RandomizedRunner.java:787)
[junit4:junit4]    > 	at com.carrotsearch.randomizedtesting.rules.SystemPropertiesRestoreRule$1.evaluate(SystemPropertiesRestoreRule.java:53)
[junit4:junit4]    > 	at org.apache.lucene.util.TestRuleSetupTeardownChained$1.evaluate(TestRuleSetupTeardownChained.java:50)
[junit4:junit4]    > 	at org.apache.lucene.util.TestRuleFieldCacheSanity$1.evaluate(TestRuleFieldCacheSanity.java:51)
[junit4:junit4]    > 	at org.apache.lucene.util.AbstractBeforeAfterRule$1.evaluate(AbstractBeforeAfterRule.java:45)
[junit4:junit4]    > 	at com.carrotsearch.randomizedtesting.rules.SystemPropertiesInvariantRule$1.evaluate(SystemPropertiesInvariantRule.java:55)
[junit4:junit4]    > 	at org.apache.lucene.util.TestRuleThreadAndTestName$1.evaluate(TestRuleThreadAndTestName.java:48)
[junit4:junit4]    > 	at org.apache.lucene.util.TestRuleIgnoreAfterMaxFailures$1.evaluate(TestRuleIgnoreAfterMaxFailures.java:70)
[junit4:junit4]    > 	at org.apache.lucene.util.TestRuleMarkFailure$1.evaluate(TestRuleMarkFailure.java:48)
[junit4:junit4]    > 	at com.carrotsearch.randomizedtesting.rules.StatementAdapter.evaluate(StatementAdapter.java:36)
[junit4:junit4]    > 	at com.carrotsearch.randomizedtesting.ThreadLeakControl$StatementRunner.run(ThreadLeakControl.java:358)
[junit4:junit4]    > 	at com.carrotsearch.randomizedtesting.ThreadLeakControl.forkTimeoutingTask(ThreadLeakControl.java:782)
[junit4:junit4]    > 	at com.carrotsearch.randomizedtesting.ThreadLeakControl$3.evaluate(ThreadLeakControl.java:442)
[junit4:junit4]    > 	at com.carrotsearch.randomizedtesting.RandomizedRunner.runSingleTest(RandomizedRunner.java:746)
[junit4:junit4]    > 	at com.carrotsearch.randomizedtesting.RandomizedRunner$3.evaluate(RandomizedRunner.java:648)
[junit4:junit4]    > 	at com.carrotsearch.randomizedtesting.RandomizedRunner$4.evaluate(RandomizedRunner.java:682)
[junit4:junit4]    > 	at com.carrotsearch.randomizedtesting.RandomizedRunner$5.evaluate(RandomizedRunner.java:693)
[junit4:junit4]    > 	at com.carrotsearch.randomizedtesting.rules.StatementAdapter.evaluate(StatementAdapter.java:36)
[junit4:junit4]    > 	at com.carrotsearch.randomizedtesting.rules.SystemPropertiesRestoreRule$1.evaluate(SystemPropertiesRestoreRule.java:53)
[junit4:junit4]    > 	at org.apache.lucene.util.AbstractBeforeAfterRule$1.evaluate(AbstractBeforeAfterRule.java:45)
[junit4:junit4]    > 	at org.apache.lucene.util.TestRuleStoreClassName$1.evaluate(TestRuleStoreClassName.java:42)
[junit4:junit4]    > 	at com.carrotsearch.randomizedtesting.rules.SystemPropertiesInvariantRule$1.evaluate(SystemPropertiesInvariantRule.java:55)
[junit4:junit4]    > 	at com.carrotsearch.randomizedtesting.rules.NoShadowingOrOverridesOnMethodsRule$1.evaluate(NoShadowingOrOverridesOnMethodsRule.java:39)
[junit4:junit4]    > 	at com.carrotsearch.randomizedtesting.rules.NoShadowingOrOverridesOnMethodsRule$1.evaluate(NoShadowingOrOverridesOnMethodsRule.java:39)
[junit4:junit4]    > 	at com.carrotsearch.randomizedtesting.rules.StatementAdapter.evaluate(StatementAdapter.java:36)
[junit4:junit4]    > 	at org.apache.lucene.util.TestRuleAssertionsRequired$1.evaluate(TestRuleAssertionsRequired.java:43)
[junit4:junit4]    > 	at org.apache.lucene.util.TestRuleMarkFailure$1.evaluate(TestRuleMarkFailure.java:48)
[junit4:junit4]    > 	at org.apache.lucene.util.TestRuleIgnoreAfterMaxFailures$1.evaluate(TestRuleIgnoreAfterMaxFailures.java:70)
[junit4:junit4]    > 	at org.apache.lucene.util.TestRuleIgnoreTestSuites$1.evaluate(TestRuleIgnoreTestSuites.java:55)
[junit4:junit4]    > 	at com.carrotsearch.randomizedtesting.rules.StatementAdapter.evaluate(StatementAdapter.java:36)
[junit4:junit4]    > 	at com.carrotsearch.randomizedtesting.ThreadLeakControl$StatementRunner.run(ThreadLeakControl.java:358)
[junit4:junit4]    > 	at java.lang.Thread.run(Thread.java:722)
[junit4:junit4]   2> 568004 T582 oas.SolrTestCaseJ4.deleteCore ###deleteCore
[junit4:junit4]   2> NOTE: test params are: codec=Lucene40: {n_f1=PostingsFormat(name=Asserting), foo_b=PostingsFormat(name=Memory doPackFST= false), cat=Lucene40(minBlockSize=87 maxBlockSize=196), foo_d=Pulsing40(freqCutoff=10 minBlockSize=87 maxBlockSize=196), foo_f=PostingsFormat(name=Memory doPackFST= false), n_tl1=PostingsFormat(name=Asserting), n_d1=Lucene40(minBlockSize=87 maxBlockSize=196), rnd_b=Pulsing40(freqCutoff=10 minBlockSize=87 maxBlockSize=196), intDefault=Lucene40(minBlockSize=87 maxBlockSize=196), n_td1=PostingsFormat(name=Asserting), timestamp=Lucene40(minBlockSize=87 maxBlockSize=196), id=Pulsing40(freqCutoff=10 minBlockSize=87 maxBlockSize=196), range_facet_sl=PostingsFormat(name=Memory doPackFST= false), range_facet_si=PostingsFormat(name=Asserting), oddField_s=PostingsFormat(name=Memory doPackFST= false), sequence_i=PostingsFormat(name=Memory doPackFST= false), name=Pulsing40(freqCutoff=10 minBlockSize=87 maxBlockSize=196), foo_i=PostingsFormat(name=Asserting), regex_dup_B_s=Lucene40(minBlockSize=87 maxBlockSize=196), multiDefault=PostingsFormat(name=Asserting), n_tf1=Lucene40(minBlockSize=87 maxBlockSize=196), n_dt1=PostingsFormat(name=Asserting), genre_s=PostingsFormat(name=Memory doPackFST= false), author_t=PostingsFormat(name=Asserting), n_ti1=Pulsing40(freqCutoff=10 minBlockSize=87 maxBlockSize=196), range_facet_l=Lucene40(minBlockSize=87 maxBlockSize=196), text=PostingsFormat(name=Memory doPackFST= false), _version_=Lucene40(minBlockSize=87 maxBlockSize=196), val_i=Pulsing40(freqCutoff=10 minBlockSize=87 maxBlockSize=196), SubjectTerms_mfacet=Lucene40(minBlockSize=87 maxBlockSize=196), series_t=PostingsFormat(name=Asserting), a_t=Lucene40(minBlockSize=87 maxBlockSize=196), n_tdt1=Lucene40(minBlockSize=87 maxBlockSize=196), regex_dup_A_s=PostingsFormat(name=Memory doPackFST= false), price=PostingsFormat(name=Memory doPackFST= false), other_tl1=Lucene40(minBlockSize=87 maxBlockSize=196), n_l1=Lucene40(minBlockSize=87 maxBlockSize=196), a_si=PostingsFormat(name=Asserting), inStock=PostingsFormat(name=Memory doPackFST= false)}, sim=DefaultSimilarity, locale=es_NI, timezone=America/Montreal
[junit4:junit4]   2> NOTE: FreeBSD 9.0-RELEASE amd64/Oracle Corporation 1.7.0_06 (64-bit)/cpus=16,threads=1,free=222406168,total=347078656
[junit4:junit4]   2> NOTE: All tests run in this JVM: [TestSolr4Spatial, TestCollationField, DistributedSpellCheckComponentTest, TestLuceneMatchVersion, ClusterStateTest, FieldAnalysisRequestHandlerTest, CircularListTest, SuggesterWFSTTest, BinaryUpdateRequestHandlerTest, TestReload, ResourceLoaderTest, TestStressVersions, SearchHandlerTest, TestPseudoReturnFields, TestFastWriter, PluginInfoTest, CurrencyFieldTest, TestNumberUtils, TestBinaryResponseWriter, TestElisionMultitermQuery, SpellCheckCollatorTest, RequestHandlersTest, TestQueryTypes, TestRandomFaceting, SortByFunctionTest, TestLMDirichletSimilarityFactory, TestConfig, MoreLikeThisHandlerTest, TestFaceting, DateMathParserTest, DirectUpdateHandlerOptimizeTest, SampleTest, CopyFieldTest, SolrPluginUtilsTest, TestExtendedDismaxParser, BasicDistributedZkTest]
[junit4:junit4] Completed on J0 in 568.27s, 1 test, 1 failure <<< FAILURES!

[...truncated 379 lines...]
BUILD FAILED
/usr/home/hudson/hudson-slave/workspace/Lucene-Solr-Tests-4.x-java7/build.xml:38: The following error occurred while executing this line:
/usr/home/hudson/hudson-slave/workspace/Lucene-Solr-Tests-4.x-java7/solr/build.xml:180: The following error occurred while executing this line:
/usr/home/hudson/hudson-slave/workspace/Lucene-Solr-Tests-4.x-java7/lucene/module-build.xml:61: The following error occurred while executing this line:
/usr/home/hudson/hudson-slave/workspace/Lucene-Solr-Tests-4.x-java7/lucene/common-build.xml:1143: The following error occurred while executing this line:
/usr/home/hudson/hudson-slave/workspace/Lucene-Solr-Tests-4.x-java7/lucene/common-build.xml:816: There were test failures: 231 suites, 960 tests, 1 failure, 21 ignored (3 assumptions)

Total time: 34 minutes 59 seconds
Build step 'Invoke Ant' marked build as failure
Archiving artifacts
Recording test results
Email was triggered for: Failure
Sending email for trigger: Failure



Mime
View raw message