lucene-dev mailing list archives

Site index · List index
Message view « Date » · « Thread »
Top « Date » · « Thread »
From Apache Jenkins Server <jenk...@builds.apache.org>
Subject [JENKINS] Lucene-Solr-Tests-4.x-Java6 - Build # 821 - Still Failing
Date Tue, 30 Oct 2012 11:19:44 GMT
Build: https://builds.apache.org/job/Lucene-Solr-Tests-4.x-Java6/821/

4 tests failed.
FAILED:  junit.framework.TestSuite.org.apache.solr.cloud.RecoveryZkTest

Error Message:
8 threads leaked from SUITE scope at org.apache.solr.cloud.RecoveryZkTest:     1) Thread[id=79, name=qtp64462389-79 Acceptor1 SelectChannelConnector@0.0.0.0:61401, state=BLOCKED, group=TGRP-RecoveryZkTest]         at sun.nio.ch.ServerSocketChannelImpl.accept(ServerSocketChannelImpl.java:147)         at org.eclipse.jetty.server.nio.SelectChannelConnector.accept(SelectChannelConnector.java:104)         at org.eclipse.jetty.server.AbstractConnector$Acceptor.run(AbstractConnector.java:933)         at org.eclipse.jetty.util.thread.QueuedThreadPool.runJob(QueuedThreadPool.java:599)         at org.eclipse.jetty.util.thread.QueuedThreadPool$3.run(QueuedThreadPool.java:534)         at java.lang.Thread.run(Thread.java:679)    2) Thread[id=81, name=qtp64462389-81 Acceptor3 SelectChannelConnector@0.0.0.0:61401, state=RUNNABLE, group=TGRP-RecoveryZkTest]         at sun.nio.ch.ServerSocketChannelImpl.accept0(Native Method)         at sun.nio.ch.ServerSocketChannelImpl.accept(ServerSocketChannelImpl.java:163)         at org.eclipse.jetty.server.nio.SelectChannelConnector.accept(SelectChannelConnector.java:104)         at org.eclipse.jetty.server.AbstractConnector$Acceptor.run(AbstractConnector.java:933)         at org.eclipse.jetty.util.thread.QueuedThreadPool.runJob(QueuedThreadPool.java:599)         at org.eclipse.jetty.util.thread.QueuedThreadPool$3.run(QueuedThreadPool.java:534)         at java.lang.Thread.run(Thread.java:679)    3) Thread[id=80, name=qtp64462389-80 Acceptor2 SelectChannelConnector@0.0.0.0:61401, state=BLOCKED, group=TGRP-RecoveryZkTest]         at sun.nio.ch.ServerSocketChannelImpl.accept(ServerSocketChannelImpl.java:147)         at org.eclipse.jetty.server.nio.SelectChannelConnector.accept(SelectChannelConnector.java:104)         at org.eclipse.jetty.server.AbstractConnector$Acceptor.run(AbstractConnector.java:933)         at org.eclipse.jetty.util.thread.QueuedThreadPool.runJob(QueuedThreadPool.java:599)         at org.eclipse.jetty.util.thread.QueuedThreadPool$3.run(QueuedThreadPool.java:534)         at java.lang.Thread.run(Thread.java:679)    4) Thread[id=78, name=qtp64462389-78 Acceptor0 SelectChannelConnector@0.0.0.0:61401, state=BLOCKED, group=TGRP-RecoveryZkTest]         at sun.nio.ch.ServerSocketChannelImpl.accept(ServerSocketChannelImpl.java:147)         at org.eclipse.jetty.server.nio.SelectChannelConnector.accept(SelectChannelConnector.java:104)         at org.eclipse.jetty.server.AbstractConnector$Acceptor.run(AbstractConnector.java:933)         at org.eclipse.jetty.util.thread.QueuedThreadPool.runJob(QueuedThreadPool.java:599)         at org.eclipse.jetty.util.thread.QueuedThreadPool$3.run(QueuedThreadPool.java:534)         at java.lang.Thread.run(Thread.java:679)    5) Thread[id=169, name=qtp411693457-169 Acceptor2 SelectChannelConnector@0.0.0.0:13544, state=BLOCKED, group=TGRP-RecoveryZkTest]         at sun.nio.ch.ServerSocketChannelImpl.accept(ServerSocketChannelImpl.java:147)         at org.eclipse.jetty.server.nio.SelectChannelConnector.accept(SelectChannelConnector.java:104)         at org.eclipse.jetty.server.AbstractConnector$Acceptor.run(AbstractConnector.java:933)         at org.eclipse.jetty.util.thread.QueuedThreadPool.runJob(QueuedThreadPool.java:599)         at org.eclipse.jetty.util.thread.QueuedThreadPool$3.run(QueuedThreadPool.java:534)         at java.lang.Thread.run(Thread.java:679)    6) Thread[id=167, name=qtp411693457-167 Acceptor0 SelectChannelConnector@0.0.0.0:13544, state=RUNNABLE, group=TGRP-RecoveryZkTest]         at sun.nio.ch.ServerSocketChannelImpl.accept0(Native Method)         at sun.nio.ch.ServerSocketChannelImpl.accept(ServerSocketChannelImpl.java:163)         at org.eclipse.jetty.server.nio.SelectChannelConnector.accept(SelectChannelConnector.java:104)         at org.eclipse.jetty.server.AbstractConnector$Acceptor.run(AbstractConnector.java:933)         at org.eclipse.jetty.util.thread.QueuedThreadPool.runJob(QueuedThreadPool.java:599)         at org.eclipse.jetty.util.thread.QueuedThreadPool$3.run(QueuedThreadPool.java:534)         at java.lang.Thread.run(Thread.java:679)    7) Thread[id=168, name=qtp411693457-168 Acceptor1 SelectChannelConnector@0.0.0.0:13544, state=BLOCKED, group=TGRP-RecoveryZkTest]         at sun.nio.ch.ServerSocketChannelImpl.accept(ServerSocketChannelImpl.java:147)         at org.eclipse.jetty.server.nio.SelectChannelConnector.accept(SelectChannelConnector.java:104)         at org.eclipse.jetty.server.AbstractConnector$Acceptor.run(AbstractConnector.java:933)         at org.eclipse.jetty.util.thread.QueuedThreadPool.runJob(QueuedThreadPool.java:599)         at org.eclipse.jetty.util.thread.QueuedThreadPool$3.run(QueuedThreadPool.java:534)         at java.lang.Thread.run(Thread.java:679)    8) Thread[id=170, name=qtp411693457-170 Acceptor3 SelectChannelConnector@0.0.0.0:13544, state=BLOCKED, group=TGRP-RecoveryZkTest]         at sun.nio.ch.ServerSocketChannelImpl.accept(ServerSocketChannelImpl.java:147)         at org.eclipse.jetty.server.nio.SelectChannelConnector.accept(SelectChannelConnector.java:104)         at org.eclipse.jetty.server.AbstractConnector$Acceptor.run(AbstractConnector.java:933)         at org.eclipse.jetty.util.thread.QueuedThreadPool.runJob(QueuedThreadPool.java:599)         at org.eclipse.jetty.util.thread.QueuedThreadPool$3.run(QueuedThreadPool.java:534)         at java.lang.Thread.run(Thread.java:679)

Stack Trace:
com.carrotsearch.randomizedtesting.ThreadLeakError: 8 threads leaked from SUITE scope at org.apache.solr.cloud.RecoveryZkTest: 
   1) Thread[id=79, name=qtp64462389-79 Acceptor1 SelectChannelConnector@0.0.0.0:61401, state=BLOCKED, group=TGRP-RecoveryZkTest]
        at sun.nio.ch.ServerSocketChannelImpl.accept(ServerSocketChannelImpl.java:147)
        at org.eclipse.jetty.server.nio.SelectChannelConnector.accept(SelectChannelConnector.java:104)
        at org.eclipse.jetty.server.AbstractConnector$Acceptor.run(AbstractConnector.java:933)
        at org.eclipse.jetty.util.thread.QueuedThreadPool.runJob(QueuedThreadPool.java:599)
        at org.eclipse.jetty.util.thread.QueuedThreadPool$3.run(QueuedThreadPool.java:534)
        at java.lang.Thread.run(Thread.java:679)
   2) Thread[id=81, name=qtp64462389-81 Acceptor3 SelectChannelConnector@0.0.0.0:61401, state=RUNNABLE, group=TGRP-RecoveryZkTest]
        at sun.nio.ch.ServerSocketChannelImpl.accept0(Native Method)
        at sun.nio.ch.ServerSocketChannelImpl.accept(ServerSocketChannelImpl.java:163)
        at org.eclipse.jetty.server.nio.SelectChannelConnector.accept(SelectChannelConnector.java:104)
        at org.eclipse.jetty.server.AbstractConnector$Acceptor.run(AbstractConnector.java:933)
        at org.eclipse.jetty.util.thread.QueuedThreadPool.runJob(QueuedThreadPool.java:599)
        at org.eclipse.jetty.util.thread.QueuedThreadPool$3.run(QueuedThreadPool.java:534)
        at java.lang.Thread.run(Thread.java:679)
   3) Thread[id=80, name=qtp64462389-80 Acceptor2 SelectChannelConnector@0.0.0.0:61401, state=BLOCKED, group=TGRP-RecoveryZkTest]
        at sun.nio.ch.ServerSocketChannelImpl.accept(ServerSocketChannelImpl.java:147)
        at org.eclipse.jetty.server.nio.SelectChannelConnector.accept(SelectChannelConnector.java:104)
        at org.eclipse.jetty.server.AbstractConnector$Acceptor.run(AbstractConnector.java:933)
        at org.eclipse.jetty.util.thread.QueuedThreadPool.runJob(QueuedThreadPool.java:599)
        at org.eclipse.jetty.util.thread.QueuedThreadPool$3.run(QueuedThreadPool.java:534)
        at java.lang.Thread.run(Thread.java:679)
   4) Thread[id=78, name=qtp64462389-78 Acceptor0 SelectChannelConnector@0.0.0.0:61401, state=BLOCKED, group=TGRP-RecoveryZkTest]
        at sun.nio.ch.ServerSocketChannelImpl.accept(ServerSocketChannelImpl.java:147)
        at org.eclipse.jetty.server.nio.SelectChannelConnector.accept(SelectChannelConnector.java:104)
        at org.eclipse.jetty.server.AbstractConnector$Acceptor.run(AbstractConnector.java:933)
        at org.eclipse.jetty.util.thread.QueuedThreadPool.runJob(QueuedThreadPool.java:599)
        at org.eclipse.jetty.util.thread.QueuedThreadPool$3.run(QueuedThreadPool.java:534)
        at java.lang.Thread.run(Thread.java:679)
   5) Thread[id=169, name=qtp411693457-169 Acceptor2 SelectChannelConnector@0.0.0.0:13544, state=BLOCKED, group=TGRP-RecoveryZkTest]
        at sun.nio.ch.ServerSocketChannelImpl.accept(ServerSocketChannelImpl.java:147)
        at org.eclipse.jetty.server.nio.SelectChannelConnector.accept(SelectChannelConnector.java:104)
        at org.eclipse.jetty.server.AbstractConnector$Acceptor.run(AbstractConnector.java:933)
        at org.eclipse.jetty.util.thread.QueuedThreadPool.runJob(QueuedThreadPool.java:599)
        at org.eclipse.jetty.util.thread.QueuedThreadPool$3.run(QueuedThreadPool.java:534)
        at java.lang.Thread.run(Thread.java:679)
   6) Thread[id=167, name=qtp411693457-167 Acceptor0 SelectChannelConnector@0.0.0.0:13544, state=RUNNABLE, group=TGRP-RecoveryZkTest]
        at sun.nio.ch.ServerSocketChannelImpl.accept0(Native Method)
        at sun.nio.ch.ServerSocketChannelImpl.accept(ServerSocketChannelImpl.java:163)
        at org.eclipse.jetty.server.nio.SelectChannelConnector.accept(SelectChannelConnector.java:104)
        at org.eclipse.jetty.server.AbstractConnector$Acceptor.run(AbstractConnector.java:933)
        at org.eclipse.jetty.util.thread.QueuedThreadPool.runJob(QueuedThreadPool.java:599)
        at org.eclipse.jetty.util.thread.QueuedThreadPool$3.run(QueuedThreadPool.java:534)
        at java.lang.Thread.run(Thread.java:679)
   7) Thread[id=168, name=qtp411693457-168 Acceptor1 SelectChannelConnector@0.0.0.0:13544, state=BLOCKED, group=TGRP-RecoveryZkTest]
        at sun.nio.ch.ServerSocketChannelImpl.accept(ServerSocketChannelImpl.java:147)
        at org.eclipse.jetty.server.nio.SelectChannelConnector.accept(SelectChannelConnector.java:104)
        at org.eclipse.jetty.server.AbstractConnector$Acceptor.run(AbstractConnector.java:933)
        at org.eclipse.jetty.util.thread.QueuedThreadPool.runJob(QueuedThreadPool.java:599)
        at org.eclipse.jetty.util.thread.QueuedThreadPool$3.run(QueuedThreadPool.java:534)
        at java.lang.Thread.run(Thread.java:679)
   8) Thread[id=170, name=qtp411693457-170 Acceptor3 SelectChannelConnector@0.0.0.0:13544, state=BLOCKED, group=TGRP-RecoveryZkTest]
        at sun.nio.ch.ServerSocketChannelImpl.accept(ServerSocketChannelImpl.java:147)
        at org.eclipse.jetty.server.nio.SelectChannelConnector.accept(SelectChannelConnector.java:104)
        at org.eclipse.jetty.server.AbstractConnector$Acceptor.run(AbstractConnector.java:933)
        at org.eclipse.jetty.util.thread.QueuedThreadPool.runJob(QueuedThreadPool.java:599)
        at org.eclipse.jetty.util.thread.QueuedThreadPool$3.run(QueuedThreadPool.java:534)
        at java.lang.Thread.run(Thread.java:679)
	at __randomizedtesting.SeedInfo.seed([20E679A9BD29B952]:0)


FAILED:  junit.framework.TestSuite.org.apache.solr.cloud.RecoveryZkTest

Error Message:
There are still zombie threads that couldn't be terminated:    1) Thread[id=79, name=qtp64462389-79 Acceptor1 SelectChannelConnector@0.0.0.0:61401, state=BLOCKED, group=TGRP-RecoveryZkTest]         at sun.nio.ch.ServerSocketChannelImpl.accept(ServerSocketChannelImpl.java:147)         at org.eclipse.jetty.server.nio.SelectChannelConnector.accept(SelectChannelConnector.java:104)         at org.eclipse.jetty.server.AbstractConnector$Acceptor.run(AbstractConnector.java:933)         at org.eclipse.jetty.util.thread.QueuedThreadPool.runJob(QueuedThreadPool.java:599)         at org.eclipse.jetty.util.thread.QueuedThreadPool$3.run(QueuedThreadPool.java:534)         at java.lang.Thread.run(Thread.java:679)    2) Thread[id=81, name=qtp64462389-81 Acceptor3 SelectChannelConnector@0.0.0.0:61401, state=RUNNABLE, group=TGRP-RecoveryZkTest]         at sun.nio.ch.ServerSocketChannelImpl.accept0(Native Method)         at sun.nio.ch.ServerSocketChannelImpl.accept(ServerSocketChannelImpl.java:163)         at org.eclipse.jetty.server.nio.SelectChannelConnector.accept(SelectChannelConnector.java:104)         at org.eclipse.jetty.server.AbstractConnector$Acceptor.run(AbstractConnector.java:933)         at org.eclipse.jetty.util.thread.QueuedThreadPool.runJob(QueuedThreadPool.java:599)         at org.eclipse.jetty.util.thread.QueuedThreadPool$3.run(QueuedThreadPool.java:534)         at java.lang.Thread.run(Thread.java:679)    3) Thread[id=80, name=qtp64462389-80 Acceptor2 SelectChannelConnector@0.0.0.0:61401, state=BLOCKED, group=TGRP-RecoveryZkTest]         at sun.nio.ch.ServerSocketChannelImpl.accept(ServerSocketChannelImpl.java:147)         at org.eclipse.jetty.server.nio.SelectChannelConnector.accept(SelectChannelConnector.java:104)         at org.eclipse.jetty.server.AbstractConnector$Acceptor.run(AbstractConnector.java:933)         at org.eclipse.jetty.util.thread.QueuedThreadPool.runJob(QueuedThreadPool.java:599)         at org.eclipse.jetty.util.thread.QueuedThreadPool$3.run(QueuedThreadPool.java:534)         at java.lang.Thread.run(Thread.java:679)    4) Thread[id=78, name=qtp64462389-78 Acceptor0 SelectChannelConnector@0.0.0.0:61401, state=BLOCKED, group=TGRP-RecoveryZkTest]         at sun.nio.ch.ServerSocketChannelImpl.accept(ServerSocketChannelImpl.java:147)         at org.eclipse.jetty.server.nio.SelectChannelConnector.accept(SelectChannelConnector.java:104)         at org.eclipse.jetty.server.AbstractConnector$Acceptor.run(AbstractConnector.java:933)         at org.eclipse.jetty.util.thread.QueuedThreadPool.runJob(QueuedThreadPool.java:599)         at org.eclipse.jetty.util.thread.QueuedThreadPool$3.run(QueuedThreadPool.java:534)         at java.lang.Thread.run(Thread.java:679)    5) Thread[id=169, name=qtp411693457-169 Acceptor2 SelectChannelConnector@0.0.0.0:13544, state=BLOCKED, group=TGRP-RecoveryZkTest]         at sun.nio.ch.ServerSocketChannelImpl.accept(ServerSocketChannelImpl.java:147)         at org.eclipse.jetty.server.nio.SelectChannelConnector.accept(SelectChannelConnector.java:104)         at org.eclipse.jetty.server.AbstractConnector$Acceptor.run(AbstractConnector.java:933)         at org.eclipse.jetty.util.thread.QueuedThreadPool.runJob(QueuedThreadPool.java:599)         at org.eclipse.jetty.util.thread.QueuedThreadPool$3.run(QueuedThreadPool.java:534)         at java.lang.Thread.run(Thread.java:679)    6) Thread[id=167, name=qtp411693457-167 Acceptor0 SelectChannelConnector@0.0.0.0:13544, state=RUNNABLE, group=TGRP-RecoveryZkTest]         at sun.nio.ch.ServerSocketChannelImpl.accept0(Native Method)         at sun.nio.ch.ServerSocketChannelImpl.accept(ServerSocketChannelImpl.java:163)         at org.eclipse.jetty.server.nio.SelectChannelConnector.accept(SelectChannelConnector.java:104)         at org.eclipse.jetty.server.AbstractConnector$Acceptor.run(AbstractConnector.java:933)         at org.eclipse.jetty.util.thread.QueuedThreadPool.runJob(QueuedThreadPool.java:599)         at org.eclipse.jetty.util.thread.QueuedThreadPool$3.run(QueuedThreadPool.java:534)         at java.lang.Thread.run(Thread.java:679)    7) Thread[id=168, name=qtp411693457-168 Acceptor1 SelectChannelConnector@0.0.0.0:13544, state=BLOCKED, group=TGRP-RecoveryZkTest]         at sun.nio.ch.ServerSocketChannelImpl.accept(ServerSocketChannelImpl.java:147)         at org.eclipse.jetty.server.nio.SelectChannelConnector.accept(SelectChannelConnector.java:104)         at org.eclipse.jetty.server.AbstractConnector$Acceptor.run(AbstractConnector.java:933)         at org.eclipse.jetty.util.thread.QueuedThreadPool.runJob(QueuedThreadPool.java:599)         at org.eclipse.jetty.util.thread.QueuedThreadPool$3.run(QueuedThreadPool.java:534)         at java.lang.Thread.run(Thread.java:679)    8) Thread[id=170, name=qtp411693457-170 Acceptor3 SelectChannelConnector@0.0.0.0:13544, state=BLOCKED, group=TGRP-RecoveryZkTest]         at sun.nio.ch.ServerSocketChannelImpl.accept(ServerSocketChannelImpl.java:147)         at org.eclipse.jetty.server.nio.SelectChannelConnector.accept(SelectChannelConnector.java:104)         at org.eclipse.jetty.server.AbstractConnector$Acceptor.run(AbstractConnector.java:933)         at org.eclipse.jetty.util.thread.QueuedThreadPool.runJob(QueuedThreadPool.java:599)         at org.eclipse.jetty.util.thread.QueuedThreadPool$3.run(QueuedThreadPool.java:534)         at java.lang.Thread.run(Thread.java:679)

Stack Trace:
com.carrotsearch.randomizedtesting.ThreadLeakError: There are still zombie threads that couldn't be terminated:
   1) Thread[id=79, name=qtp64462389-79 Acceptor1 SelectChannelConnector@0.0.0.0:61401, state=BLOCKED, group=TGRP-RecoveryZkTest]
        at sun.nio.ch.ServerSocketChannelImpl.accept(ServerSocketChannelImpl.java:147)
        at org.eclipse.jetty.server.nio.SelectChannelConnector.accept(SelectChannelConnector.java:104)
        at org.eclipse.jetty.server.AbstractConnector$Acceptor.run(AbstractConnector.java:933)
        at org.eclipse.jetty.util.thread.QueuedThreadPool.runJob(QueuedThreadPool.java:599)
        at org.eclipse.jetty.util.thread.QueuedThreadPool$3.run(QueuedThreadPool.java:534)
        at java.lang.Thread.run(Thread.java:679)
   2) Thread[id=81, name=qtp64462389-81 Acceptor3 SelectChannelConnector@0.0.0.0:61401, state=RUNNABLE, group=TGRP-RecoveryZkTest]
        at sun.nio.ch.ServerSocketChannelImpl.accept0(Native Method)
        at sun.nio.ch.ServerSocketChannelImpl.accept(ServerSocketChannelImpl.java:163)
        at org.eclipse.jetty.server.nio.SelectChannelConnector.accept(SelectChannelConnector.java:104)
        at org.eclipse.jetty.server.AbstractConnector$Acceptor.run(AbstractConnector.java:933)
        at org.eclipse.jetty.util.thread.QueuedThreadPool.runJob(QueuedThreadPool.java:599)
        at org.eclipse.jetty.util.thread.QueuedThreadPool$3.run(QueuedThreadPool.java:534)
        at java.lang.Thread.run(Thread.java:679)
   3) Thread[id=80, name=qtp64462389-80 Acceptor2 SelectChannelConnector@0.0.0.0:61401, state=BLOCKED, group=TGRP-RecoveryZkTest]
        at sun.nio.ch.ServerSocketChannelImpl.accept(ServerSocketChannelImpl.java:147)
        at org.eclipse.jetty.server.nio.SelectChannelConnector.accept(SelectChannelConnector.java:104)
        at org.eclipse.jetty.server.AbstractConnector$Acceptor.run(AbstractConnector.java:933)
        at org.eclipse.jetty.util.thread.QueuedThreadPool.runJob(QueuedThreadPool.java:599)
        at org.eclipse.jetty.util.thread.QueuedThreadPool$3.run(QueuedThreadPool.java:534)
        at java.lang.Thread.run(Thread.java:679)
   4) Thread[id=78, name=qtp64462389-78 Acceptor0 SelectChannelConnector@0.0.0.0:61401, state=BLOCKED, group=TGRP-RecoveryZkTest]
        at sun.nio.ch.ServerSocketChannelImpl.accept(ServerSocketChannelImpl.java:147)
        at org.eclipse.jetty.server.nio.SelectChannelConnector.accept(SelectChannelConnector.java:104)
        at org.eclipse.jetty.server.AbstractConnector$Acceptor.run(AbstractConnector.java:933)
        at org.eclipse.jetty.util.thread.QueuedThreadPool.runJob(QueuedThreadPool.java:599)
        at org.eclipse.jetty.util.thread.QueuedThreadPool$3.run(QueuedThreadPool.java:534)
        at java.lang.Thread.run(Thread.java:679)
   5) Thread[id=169, name=qtp411693457-169 Acceptor2 SelectChannelConnector@0.0.0.0:13544, state=BLOCKED, group=TGRP-RecoveryZkTest]
        at sun.nio.ch.ServerSocketChannelImpl.accept(ServerSocketChannelImpl.java:147)
        at org.eclipse.jetty.server.nio.SelectChannelConnector.accept(SelectChannelConnector.java:104)
        at org.eclipse.jetty.server.AbstractConnector$Acceptor.run(AbstractConnector.java:933)
        at org.eclipse.jetty.util.thread.QueuedThreadPool.runJob(QueuedThreadPool.java:599)
        at org.eclipse.jetty.util.thread.QueuedThreadPool$3.run(QueuedThreadPool.java:534)
        at java.lang.Thread.run(Thread.java:679)
   6) Thread[id=167, name=qtp411693457-167 Acceptor0 SelectChannelConnector@0.0.0.0:13544, state=RUNNABLE, group=TGRP-RecoveryZkTest]
        at sun.nio.ch.ServerSocketChannelImpl.accept0(Native Method)
        at sun.nio.ch.ServerSocketChannelImpl.accept(ServerSocketChannelImpl.java:163)
        at org.eclipse.jetty.server.nio.SelectChannelConnector.accept(SelectChannelConnector.java:104)
        at org.eclipse.jetty.server.AbstractConnector$Acceptor.run(AbstractConnector.java:933)
        at org.eclipse.jetty.util.thread.QueuedThreadPool.runJob(QueuedThreadPool.java:599)
        at org.eclipse.jetty.util.thread.QueuedThreadPool$3.run(QueuedThreadPool.java:534)
        at java.lang.Thread.run(Thread.java:679)
   7) Thread[id=168, name=qtp411693457-168 Acceptor1 SelectChannelConnector@0.0.0.0:13544, state=BLOCKED, group=TGRP-RecoveryZkTest]
        at sun.nio.ch.ServerSocketChannelImpl.accept(ServerSocketChannelImpl.java:147)
        at org.eclipse.jetty.server.nio.SelectChannelConnector.accept(SelectChannelConnector.java:104)
        at org.eclipse.jetty.server.AbstractConnector$Acceptor.run(AbstractConnector.java:933)
        at org.eclipse.jetty.util.thread.QueuedThreadPool.runJob(QueuedThreadPool.java:599)
        at org.eclipse.jetty.util.thread.QueuedThreadPool$3.run(QueuedThreadPool.java:534)
        at java.lang.Thread.run(Thread.java:679)
   8) Thread[id=170, name=qtp411693457-170 Acceptor3 SelectChannelConnector@0.0.0.0:13544, state=BLOCKED, group=TGRP-RecoveryZkTest]
        at sun.nio.ch.ServerSocketChannelImpl.accept(ServerSocketChannelImpl.java:147)
        at org.eclipse.jetty.server.nio.SelectChannelConnector.accept(SelectChannelConnector.java:104)
        at org.eclipse.jetty.server.AbstractConnector$Acceptor.run(AbstractConnector.java:933)
        at org.eclipse.jetty.util.thread.QueuedThreadPool.runJob(QueuedThreadPool.java:599)
        at org.eclipse.jetty.util.thread.QueuedThreadPool$3.run(QueuedThreadPool.java:534)
        at java.lang.Thread.run(Thread.java:679)
	at __randomizedtesting.SeedInfo.seed([20E679A9BD29B952]:0)


FAILED:  junit.framework.TestSuite.org.apache.solr.servlet.NoCacheHeaderTest

Error Message:
4 threads leaked from SUITE scope at org.apache.solr.servlet.NoCacheHeaderTest:     1) Thread[id=15, name=qtp1668782213-15 Acceptor3 SelectChannelConnector@0.0.0.0:14366, state=BLOCKED, group=TGRP-NoCacheHeaderTest]         at sun.nio.ch.ServerSocketChannelImpl.accept(ServerSocketChannelImpl.java:147)         at org.eclipse.jetty.server.nio.SelectChannelConnector.accept(SelectChannelConnector.java:104)         at org.eclipse.jetty.server.AbstractConnector$Acceptor.run(AbstractConnector.java:933)         at org.eclipse.jetty.util.thread.QueuedThreadPool.runJob(QueuedThreadPool.java:599)         at org.eclipse.jetty.util.thread.QueuedThreadPool$3.run(QueuedThreadPool.java:534)         at java.lang.Thread.run(Thread.java:679)    2) Thread[id=20, name=qtp1668782213-20 Acceptor1 SelectChannelConnector@0.0.0.0:14366, state=BLOCKED, group=TGRP-NoCacheHeaderTest]         at sun.nio.ch.ServerSocketChannelImpl.accept(ServerSocketChannelImpl.java:147)         at org.eclipse.jetty.server.nio.SelectChannelConnector.accept(SelectChannelConnector.java:104)         at org.eclipse.jetty.server.AbstractConnector$Acceptor.run(AbstractConnector.java:933)         at org.eclipse.jetty.util.thread.QueuedThreadPool.runJob(QueuedThreadPool.java:599)         at org.eclipse.jetty.util.thread.QueuedThreadPool$3.run(QueuedThreadPool.java:534)         at java.lang.Thread.run(Thread.java:679)    3) Thread[id=22, name=qtp1668782213-22 Acceptor2 SelectChannelConnector@0.0.0.0:14366, state=BLOCKED, group=TGRP-NoCacheHeaderTest]         at sun.nio.ch.ServerSocketChannelImpl.accept(ServerSocketChannelImpl.java:147)         at org.eclipse.jetty.server.nio.SelectChannelConnector.accept(SelectChannelConnector.java:104)         at org.eclipse.jetty.server.AbstractConnector$Acceptor.run(AbstractConnector.java:933)         at org.eclipse.jetty.util.thread.QueuedThreadPool.runJob(QueuedThreadPool.java:599)         at org.eclipse.jetty.util.thread.QueuedThreadPool$3.run(QueuedThreadPool.java:534)         at java.lang.Thread.run(Thread.java:679)    4) Thread[id=21, name=qtp1668782213-21 Acceptor0 SelectChannelConnector@0.0.0.0:14366, state=RUNNABLE, group=TGRP-NoCacheHeaderTest]         at sun.nio.ch.ServerSocketChannelImpl.accept0(Native Method)         at sun.nio.ch.ServerSocketChannelImpl.accept(ServerSocketChannelImpl.java:163)         at org.eclipse.jetty.server.nio.SelectChannelConnector.accept(SelectChannelConnector.java:104)         at org.eclipse.jetty.server.AbstractConnector$Acceptor.run(AbstractConnector.java:933)         at org.eclipse.jetty.util.thread.QueuedThreadPool.runJob(QueuedThreadPool.java:599)         at org.eclipse.jetty.util.thread.QueuedThreadPool$3.run(QueuedThreadPool.java:534)         at java.lang.Thread.run(Thread.java:679)

Stack Trace:
com.carrotsearch.randomizedtesting.ThreadLeakError: 4 threads leaked from SUITE scope at org.apache.solr.servlet.NoCacheHeaderTest: 
   1) Thread[id=15, name=qtp1668782213-15 Acceptor3 SelectChannelConnector@0.0.0.0:14366, state=BLOCKED, group=TGRP-NoCacheHeaderTest]
        at sun.nio.ch.ServerSocketChannelImpl.accept(ServerSocketChannelImpl.java:147)
        at org.eclipse.jetty.server.nio.SelectChannelConnector.accept(SelectChannelConnector.java:104)
        at org.eclipse.jetty.server.AbstractConnector$Acceptor.run(AbstractConnector.java:933)
        at org.eclipse.jetty.util.thread.QueuedThreadPool.runJob(QueuedThreadPool.java:599)
        at org.eclipse.jetty.util.thread.QueuedThreadPool$3.run(QueuedThreadPool.java:534)
        at java.lang.Thread.run(Thread.java:679)
   2) Thread[id=20, name=qtp1668782213-20 Acceptor1 SelectChannelConnector@0.0.0.0:14366, state=BLOCKED, group=TGRP-NoCacheHeaderTest]
        at sun.nio.ch.ServerSocketChannelImpl.accept(ServerSocketChannelImpl.java:147)
        at org.eclipse.jetty.server.nio.SelectChannelConnector.accept(SelectChannelConnector.java:104)
        at org.eclipse.jetty.server.AbstractConnector$Acceptor.run(AbstractConnector.java:933)
        at org.eclipse.jetty.util.thread.QueuedThreadPool.runJob(QueuedThreadPool.java:599)
        at org.eclipse.jetty.util.thread.QueuedThreadPool$3.run(QueuedThreadPool.java:534)
        at java.lang.Thread.run(Thread.java:679)
   3) Thread[id=22, name=qtp1668782213-22 Acceptor2 SelectChannelConnector@0.0.0.0:14366, state=BLOCKED, group=TGRP-NoCacheHeaderTest]
        at sun.nio.ch.ServerSocketChannelImpl.accept(ServerSocketChannelImpl.java:147)
        at org.eclipse.jetty.server.nio.SelectChannelConnector.accept(SelectChannelConnector.java:104)
        at org.eclipse.jetty.server.AbstractConnector$Acceptor.run(AbstractConnector.java:933)
        at org.eclipse.jetty.util.thread.QueuedThreadPool.runJob(QueuedThreadPool.java:599)
        at org.eclipse.jetty.util.thread.QueuedThreadPool$3.run(QueuedThreadPool.java:534)
        at java.lang.Thread.run(Thread.java:679)
   4) Thread[id=21, name=qtp1668782213-21 Acceptor0 SelectChannelConnector@0.0.0.0:14366, state=RUNNABLE, group=TGRP-NoCacheHeaderTest]
        at sun.nio.ch.ServerSocketChannelImpl.accept0(Native Method)
        at sun.nio.ch.ServerSocketChannelImpl.accept(ServerSocketChannelImpl.java:163)
        at org.eclipse.jetty.server.nio.SelectChannelConnector.accept(SelectChannelConnector.java:104)
        at org.eclipse.jetty.server.AbstractConnector$Acceptor.run(AbstractConnector.java:933)
        at org.eclipse.jetty.util.thread.QueuedThreadPool.runJob(QueuedThreadPool.java:599)
        at org.eclipse.jetty.util.thread.QueuedThreadPool$3.run(QueuedThreadPool.java:534)
        at java.lang.Thread.run(Thread.java:679)
	at __randomizedtesting.SeedInfo.seed([20E679A9BD29B952]:0)


FAILED:  junit.framework.TestSuite.org.apache.solr.servlet.NoCacheHeaderTest

Error Message:
There are still zombie threads that couldn't be terminated:    1) Thread[id=15, name=qtp1668782213-15 Acceptor3 SelectChannelConnector@0.0.0.0:14366, state=BLOCKED, group=TGRP-NoCacheHeaderTest]         at sun.nio.ch.ServerSocketChannelImpl.accept(ServerSocketChannelImpl.java:147)         at org.eclipse.jetty.server.nio.SelectChannelConnector.accept(SelectChannelConnector.java:104)         at org.eclipse.jetty.server.AbstractConnector$Acceptor.run(AbstractConnector.java:933)         at org.eclipse.jetty.util.thread.QueuedThreadPool.runJob(QueuedThreadPool.java:599)         at org.eclipse.jetty.util.thread.QueuedThreadPool$3.run(QueuedThreadPool.java:534)         at java.lang.Thread.run(Thread.java:679)    2) Thread[id=20, name=qtp1668782213-20 Acceptor1 SelectChannelConnector@0.0.0.0:14366, state=BLOCKED, group=TGRP-NoCacheHeaderTest]         at sun.nio.ch.ServerSocketChannelImpl.accept(ServerSocketChannelImpl.java:147)         at org.eclipse.jetty.server.nio.SelectChannelConnector.accept(SelectChannelConnector.java:104)         at org.eclipse.jetty.server.AbstractConnector$Acceptor.run(AbstractConnector.java:933)         at org.eclipse.jetty.util.thread.QueuedThreadPool.runJob(QueuedThreadPool.java:599)         at org.eclipse.jetty.util.thread.QueuedThreadPool$3.run(QueuedThreadPool.java:534)         at java.lang.Thread.run(Thread.java:679)    3) Thread[id=22, name=qtp1668782213-22 Acceptor2 SelectChannelConnector@0.0.0.0:14366, state=BLOCKED, group=TGRP-NoCacheHeaderTest]         at sun.nio.ch.ServerSocketChannelImpl.accept(ServerSocketChannelImpl.java:147)         at org.eclipse.jetty.server.nio.SelectChannelConnector.accept(SelectChannelConnector.java:104)         at org.eclipse.jetty.server.AbstractConnector$Acceptor.run(AbstractConnector.java:933)         at org.eclipse.jetty.util.thread.QueuedThreadPool.runJob(QueuedThreadPool.java:599)         at org.eclipse.jetty.util.thread.QueuedThreadPool$3.run(QueuedThreadPool.java:534)         at java.lang.Thread.run(Thread.java:679)    4) Thread[id=21, name=qtp1668782213-21 Acceptor0 SelectChannelConnector@0.0.0.0:14366, state=RUNNABLE, group=TGRP-NoCacheHeaderTest]         at sun.nio.ch.ServerSocketChannelImpl.accept0(Native Method)         at sun.nio.ch.ServerSocketChannelImpl.accept(ServerSocketChannelImpl.java:163)         at org.eclipse.jetty.server.nio.SelectChannelConnector.accept(SelectChannelConnector.java:104)         at org.eclipse.jetty.server.AbstractConnector$Acceptor.run(AbstractConnector.java:933)         at org.eclipse.jetty.util.thread.QueuedThreadPool.runJob(QueuedThreadPool.java:599)         at org.eclipse.jetty.util.thread.QueuedThreadPool$3.run(QueuedThreadPool.java:534)         at java.lang.Thread.run(Thread.java:679)

Stack Trace:
com.carrotsearch.randomizedtesting.ThreadLeakError: There are still zombie threads that couldn't be terminated:
   1) Thread[id=15, name=qtp1668782213-15 Acceptor3 SelectChannelConnector@0.0.0.0:14366, state=BLOCKED, group=TGRP-NoCacheHeaderTest]
        at sun.nio.ch.ServerSocketChannelImpl.accept(ServerSocketChannelImpl.java:147)
        at org.eclipse.jetty.server.nio.SelectChannelConnector.accept(SelectChannelConnector.java:104)
        at org.eclipse.jetty.server.AbstractConnector$Acceptor.run(AbstractConnector.java:933)
        at org.eclipse.jetty.util.thread.QueuedThreadPool.runJob(QueuedThreadPool.java:599)
        at org.eclipse.jetty.util.thread.QueuedThreadPool$3.run(QueuedThreadPool.java:534)
        at java.lang.Thread.run(Thread.java:679)
   2) Thread[id=20, name=qtp1668782213-20 Acceptor1 SelectChannelConnector@0.0.0.0:14366, state=BLOCKED, group=TGRP-NoCacheHeaderTest]
        at sun.nio.ch.ServerSocketChannelImpl.accept(ServerSocketChannelImpl.java:147)
        at org.eclipse.jetty.server.nio.SelectChannelConnector.accept(SelectChannelConnector.java:104)
        at org.eclipse.jetty.server.AbstractConnector$Acceptor.run(AbstractConnector.java:933)
        at org.eclipse.jetty.util.thread.QueuedThreadPool.runJob(QueuedThreadPool.java:599)
        at org.eclipse.jetty.util.thread.QueuedThreadPool$3.run(QueuedThreadPool.java:534)
        at java.lang.Thread.run(Thread.java:679)
   3) Thread[id=22, name=qtp1668782213-22 Acceptor2 SelectChannelConnector@0.0.0.0:14366, state=BLOCKED, group=TGRP-NoCacheHeaderTest]
        at sun.nio.ch.ServerSocketChannelImpl.accept(ServerSocketChannelImpl.java:147)
        at org.eclipse.jetty.server.nio.SelectChannelConnector.accept(SelectChannelConnector.java:104)
        at org.eclipse.jetty.server.AbstractConnector$Acceptor.run(AbstractConnector.java:933)
        at org.eclipse.jetty.util.thread.QueuedThreadPool.runJob(QueuedThreadPool.java:599)
        at org.eclipse.jetty.util.thread.QueuedThreadPool$3.run(QueuedThreadPool.java:534)
        at java.lang.Thread.run(Thread.java:679)
   4) Thread[id=21, name=qtp1668782213-21 Acceptor0 SelectChannelConnector@0.0.0.0:14366, state=RUNNABLE, group=TGRP-NoCacheHeaderTest]
        at sun.nio.ch.ServerSocketChannelImpl.accept0(Native Method)
        at sun.nio.ch.ServerSocketChannelImpl.accept(ServerSocketChannelImpl.java:163)
        at org.eclipse.jetty.server.nio.SelectChannelConnector.accept(SelectChannelConnector.java:104)
        at org.eclipse.jetty.server.AbstractConnector$Acceptor.run(AbstractConnector.java:933)
        at org.eclipse.jetty.util.thread.QueuedThreadPool.runJob(QueuedThreadPool.java:599)
        at org.eclipse.jetty.util.thread.QueuedThreadPool$3.run(QueuedThreadPool.java:534)
        at java.lang.Thread.run(Thread.java:679)
	at __randomizedtesting.SeedInfo.seed([20E679A9BD29B952]:0)




Build Log:
[...truncated 7658 lines...]
[junit4:junit4] Suite: org.apache.solr.servlet.NoCacheHeaderTest
[junit4:junit4]   2> 190 T12 oas.SolrTestCaseJ4.initCore ####initCore
[junit4:junit4]   2> Creating dataDir: /usr/home/hudson/hudson-slave/workspace/Lucene-Solr-Tests-4.x-Java6/solr/build/solr-core/test/J0/./solrtest-NoCacheHeaderTest-1351595860535
[junit4:junit4]   2> 195 T12 oas.SolrTestCaseJ4.initCore ####initCore end
[junit4:junit4]   2> 817 T12 oejs.Server.doStart jetty-8.1.2.v20120308
[junit4:junit4]   2> 1189 T12 oejs.AbstractConnector.doStart Started SelectChannelConnector@0.0.0.0:14366
[junit4:junit4]   2> 1395 T12 oasc.SolrResourceLoader.locateSolrHome JNDI not configured for solr (NoInitialContextEx)
[junit4:junit4]   2> 1396 T12 oasc.SolrResourceLoader.locateSolrHome using system property solr.solr.home: /usr/home/hudson/hudson-slave/workspace/Lucene-Solr-Tests-4.x-Java6/solr/build/solr-core/test-files/solr
[junit4:junit4]   2> 1396 T12 oasc.SolrResourceLoader.<init> new SolrResourceLoader for deduced Solr Home: '/usr/home/hudson/hudson-slave/workspace/Lucene-Solr-Tests-4.x-Java6/solr/build/solr-core/test-files/solr/'
[junit4:junit4]   2> 1960 T12 oass.SolrDispatchFilter.init SolrDispatchFilter.init()
[junit4:junit4]   2> 1963 T12 oasc.SolrResourceLoader.locateSolrHome JNDI not configured for solr (NoInitialContextEx)
[junit4:junit4]   2> 1964 T12 oasc.SolrResourceLoader.locateSolrHome using system property solr.solr.home: /usr/home/hudson/hudson-slave/workspace/Lucene-Solr-Tests-4.x-Java6/solr/build/solr-core/test-files/solr
[junit4:junit4]   2> 1992 T12 oasc.CoreContainer$Initializer.initialize looking for solr.xml: /usr/home/hudson/hudson-slave/workspace/Lucene-Solr-Tests-4.x-Java6/solr/build/solr-core/test-files/solr/solr.xml
[junit4:junit4]   2> 1996 T12 oasc.CoreContainer.<init> New CoreContainer 1833717089
[junit4:junit4]   2> 1997 T12 oasc.CoreContainer.load Loading CoreContainer using Solr Home: '/usr/home/hudson/hudson-slave/workspace/Lucene-Solr-Tests-4.x-Java6/solr/build/solr-core/test-files/solr/'
[junit4:junit4]   2> 1998 T12 oasc.SolrResourceLoader.<init> new SolrResourceLoader for directory: '/usr/home/hudson/hudson-slave/workspace/Lucene-Solr-Tests-4.x-Java6/solr/build/solr-core/test-files/solr/'
[junit4:junit4]   2> 2062 T12 oasc.CoreContainer.load Registering Log Listener
[junit4:junit4]   2> 2134 T12 oasc.CoreContainer.create Creating SolrCore 'collection1' using instanceDir: /usr/home/hudson/hudson-slave/workspace/Lucene-Solr-Tests-4.x-Java6/solr/build/solr-core/test-files/solr/collection1
[junit4:junit4]   2> 2135 T12 oasc.SolrResourceLoader.<init> new SolrResourceLoader for directory: '/usr/home/hudson/hudson-slave/workspace/Lucene-Solr-Tests-4.x-Java6/solr/build/solr-core/test-files/solr/collection1/'
[junit4:junit4]   2> 2136 T12 oasc.SolrResourceLoader.replaceClassLoader Adding 'file:/usr/home/hudson/hudson-slave/workspace/Lucene-Solr-Tests-4.x-Java6/solr/build/solr-core/test-files/solr/collection1/lib/classes/' to classloader
[junit4:junit4]   2> 2137 T12 oasc.SolrResourceLoader.replaceClassLoader Adding 'file:/usr/home/hudson/hudson-slave/workspace/Lucene-Solr-Tests-4.x-Java6/solr/build/solr-core/test-files/solr/collection1/lib/README' to classloader
[junit4:junit4]   2> 2201 T12 oasc.SolrConfig.<init> Using Lucene MatchVersion: LUCENE_41
[junit4:junit4]   2> 2331 T12 oasc.SolrConfig.<init> Loaded SolrConfig: solr/collection1/conf/solrconfig-nocache.xml
[junit4:junit4]   2> 2360 T12 oass.IndexSchema.readSchema Reading Solr Schema
[junit4:junit4]   2> 2418 T12 oass.IndexSchema.readSchema Schema name=test
[junit4:junit4]   2> 4614 T12 oass.OpenExchangeRatesOrgProvider.init Initialized with rates=open-exchange-rates.json, refreshInterval=1440.
[junit4:junit4]   2> 4646 T12 oass.IndexSchema.readSchema default search field in schema is text
[junit4:junit4]   2> 4650 T12 oass.IndexSchema.readSchema unique key field: id
[junit4:junit4]   2> 5057 T12 oass.FileExchangeRateProvider.reload Reloading exchange rates from file currency.xml
[junit4:junit4]   2> 5072 T12 oass.FileExchangeRateProvider.reload Reloading exchange rates from file currency.xml
[junit4:junit4]   2> 5077 T12 oass.OpenExchangeRatesOrgProvider.reload Reloading exchange rates from open-exchange-rates.json
[junit4:junit4]   2> 5096 T12 oass.OpenExchangeRatesOrgProvider.reload Reloading exchange rates from open-exchange-rates.json
[junit4:junit4]   2> 5204 T12 oasc.SolrCore.<init> [collection1] Opening new SolrCore at /usr/home/hudson/hudson-slave/workspace/Lucene-Solr-Tests-4.x-Java6/solr/build/solr-core/test-files/solr/collection1/, dataDir=/usr/home/hudson/hudson-slave/workspace/Lucene-Solr-Tests-4.x-Java6/solr/build/solr-core/test/J0/solrtest-NoCacheHeaderTest-1351595860535/
[junit4:junit4]   2> 5205 T12 oasc.SolrCore.<init> JMX monitoring not detected for core: collection1
[junit4:junit4]   2> 5262 T12 oasc.SolrCore.getNewIndexDir New index directory detected: old=null new=/usr/home/hudson/hudson-slave/workspace/Lucene-Solr-Tests-4.x-Java6/solr/build/solr-core/test/J0/solrtest-NoCacheHeaderTest-1351595860535/index/
[junit4:junit4]   2> 5263 T12 oasc.SolrCore.initIndex WARNING [collection1] Solr index directory '/usr/home/hudson/hudson-slave/workspace/Lucene-Solr-Tests-4.x-Java6/solr/build/solr-core/test/J0/solrtest-NoCacheHeaderTest-1351595860535/index' doesn't exist. Creating new index...
[junit4:junit4]   2> 5344 T12 oasc.CachingDirectoryFactory.get return new directory for /usr/home/hudson/hudson-slave/workspace/Lucene-Solr-Tests-4.x-Java6/solr/build/solr-core/test/J0/solrtest-NoCacheHeaderTest-1351595860535/index forceNew:false
[junit4:junit4]   2> 5746 T12 oasc.SolrDeletionPolicy.onCommit SolrDeletionPolicy.onCommit: commits:num=1
[junit4:junit4]   2> 		commit{dir=BaseDirectoryWrapper(org.apache.lucene.store.RAMDirectory@6a2d0483 lockFactory=org.apache.lucene.store.NativeFSLockFactory@4f549ceb),segFN=segments_1,generation=1,filenames=[segments_1]
[junit4:junit4]   2> 5747 T12 oasc.SolrDeletionPolicy.updateCommits newest commit = 1
[junit4:junit4]   2> 6750 T12 oasc.RequestHandlers.initHandlersFromConfig created standard: solr.StandardRequestHandler
[junit4:junit4]   2> 6823 T12 oass.SolrIndexSearcher.<init> Opening Searcher@1f5fa713 main
[junit4:junit4]   2> 6824 T12 oass.SolrIndexSearcher.getIndexDir WARNING WARNING: Directory impl does not support setting indexDir: org.apache.lucene.store.BaseDirectoryWrapper
[junit4:junit4]   2> 6905 T12 oasu.CommitTracker.<init> Hard AutoCommit: disabled
[junit4:junit4]   2> 6906 T12 oasu.CommitTracker.<init> Soft AutoCommit: disabled
[junit4:junit4]   2> 7032 T12 oashc.HttpShardHandlerFactory.getParameter Setting socketTimeout to: 0
[junit4:junit4]   2> 7033 T12 oashc.HttpShardHandlerFactory.getParameter Setting urlScheme to: http://
[junit4:junit4]   2> 7033 T12 oashc.HttpShardHandlerFactory.getParameter Setting connTimeout to: 0
[junit4:junit4]   2> 7034 T12 oashc.HttpShardHandlerFactory.getParameter Setting maxConnectionsPerHost to: 20
[junit4:junit4]   2> 7034 T12 oashc.HttpShardHandlerFactory.getParameter Setting corePoolSize to: 0
[junit4:junit4]   2> 7035 T12 oashc.HttpShardHandlerFactory.getParameter Setting maximumPoolSize to: 2147483647
[junit4:junit4]   2> 7035 T12 oashc.HttpShardHandlerFactory.getParameter Setting maxThreadIdleTime to: 5
[junit4:junit4]   2> 7036 T12 oashc.HttpShardHandlerFactory.getParameter Setting sizeOfQueue to: -1
[junit4:junit4]   2> 7036 T12 oashc.HttpShardHandlerFactory.getParameter Setting fairnessPolicy to: false
[junit4:junit4]   2> 7078 T12 oascsi.HttpClientUtil.createClient Creating new http client, config:maxConnectionsPerHost=20&maxConnections=10000&socketTimeout=0&connTimeout=0&retry=false
[junit4:junit4]   2> 7554 T12 oasc.CoreContainer.register registering core: collection1
[junit4:junit4]   2> 7554 T27 oasc.SolrCore.registerSearcher [collection1] Registered new searcher Searcher@1f5fa713 main{StandardDirectoryReader(segments_1:1)}
[junit4:junit4]   2> 7555 T12 oass.SolrDispatchFilter.init user.dir=/usr/home/hudson/hudson-slave/workspace/Lucene-Solr-Tests-4.x-Java6/solr/build/solr-core/test/J0
[junit4:junit4]   2> 7556 T12 oass.SolrDispatchFilter.init SolrDispatchFilter.init() done
[junit4:junit4]   2> 7557 T12 oas.SolrJettyTestBase.createJetty Jetty Assigned Port#14366
[junit4:junit4]   2> 7565 T12 oas.SolrTestCaseJ4.setUp ###Starting testLastModified
[junit4:junit4]   2> 7594 T12 oascsi.HttpClientUtil.createClient Creating new http client, config:maxConnections=128&maxConnectionsPerHost=32&followRedirects=false
[junit4:junit4]   2> ASYNC  NEW_CORE C0 name=collection1 org.apache.solr.core.SolrCore@58b45130
[junit4:junit4]   2> 9421 T23 C0 REQ [collection1] webapp=/solr path=/select params={qt=standard&q=solr} hits=0 status=0 QTime=514 
[junit4:junit4]   2> 9662 T24 C0 REQ [collection1] webapp=/solr path=/select params={qt=standard&q=solr} hits=0 status=0 QTime=1 
[junit4:junit4]   2> 9675 T26 C0 REQ [collection1] webapp=/solr path=/select params={qt=standard&q=solr} hits=0 status=0 QTime=1 
[junit4:junit4]   2> 9680 T23 C0 REQ [collection1] webapp=/solr path=/select params={qt=standard&q=solr} hits=0 status=0 QTime=1 
[junit4:junit4]   2> 9684 T24 C0 REQ [collection1] webapp=/solr path=/select params={qt=standard&q=solr} hits=0 status=0 QTime=1 
[junit4:junit4]   2> 9688 T26 C0 REQ [collection1] webapp=/solr path=/select params={qt=standard&q=solr} hits=0 status=0 QTime=1 
[junit4:junit4]   2> 9692 T23 C0 REQ [collection1] webapp=/solr path=/select params={qt=standard&q=solr} hits=0 status=0 QTime=1 
[junit4:junit4]   2> 9696 T24 C0 REQ [collection1] webapp=/solr path=/select params={qt=standard&q=solr} hits=0 status=0 QTime=1 
[junit4:junit4]   2> 9700 T26 C0 REQ [collection1] webapp=/solr path=/select params={qt=standard&q=solr} hits=0 status=0 QTime=1 
[junit4:junit4]   2> 9704 T23 C0 REQ [collection1] webapp=/solr path=/select params={qt=standard&q=solr} hits=0 status=0 QTime=1 
[junit4:junit4]   2> 9705 T12 oas.SolrTestCaseJ4.tearDown ###Ending testLastModified
[junit4:junit4]   2> 9722 T12 oas.SolrTestCaseJ4.setUp ###Starting testEtag
[junit4:junit4]   2> 9726 T24 C0 REQ [collection1] webapp=/solr path=/select params={qt=standard&q=solr} hits=0 status=0 QTime=1 
[junit4:junit4]   2> 9730 T26 C0 REQ [collection1] webapp=/solr path=/select params={qt=standard&q=solr} hits=0 status=0 QTime=1 
[junit4:junit4]   2> 9734 T23 C0 REQ [collection1] webapp=/solr path=/select params={qt=standard&q=solr} hits=0 status=0 QTime=1 
[junit4:junit4]   2> 9738 T24 C0 REQ [collection1] webapp=/solr path=/select params={qt=standard&q=solr} hits=0 status=0 QTime=1 
[junit4:junit4]   2> 9742 T26 C0 REQ [collection1] webapp=/solr path=/select params={qt=standard&q=solr} hits=0 status=0 QTime=1 
[junit4:junit4]   2> 9746 T23 C0 REQ [collection1] webapp=/solr path=/select params={qt=standard&q=solr} hits=0 status=0 QTime=1 
[junit4:junit4]   2> 9750 T24 C0 REQ [collection1] webapp=/solr path=/select params={qt=standard&q=solr} hits=0 status=0 QTime=1 
[junit4:junit4]   2> 9754 T26 C0 REQ [collection1] webapp=/solr path=/select params={qt=standard&q=solr} hits=0 status=0 QTime=1 
[junit4:junit4]   2> 9758 T23 C0 REQ [collection1] webapp=/solr path=/select params={qt=standard&q=solr} hits=0 status=0 QTime=1 
[junit4:junit4]   2> 9762 T24 C0 REQ [collection1] webapp=/solr path=/select params={qt=standard&q=solr} hits=0 status=0 QTime=1 
[junit4:junit4]   2> 9763 T12 oas.SolrTestCaseJ4.tearDown ###Ending testEtag
[junit4:junit4]   2> 9779 T12 oas.SolrTestCaseJ4.setUp ###Starting testCacheControl
[junit4:junit4]   2> 9783 T26 C0 REQ [collection1] webapp=/solr path=/select params={qt=standard&q=solr} hits=0 status=0 QTime=1 
[junit4:junit4]   2> 9787 T23 C0 REQ [collection1] webapp=/solr path=/select params={qt=standard&q=solr} hits=0 status=0 QTime=1 
[junit4:junit4]   2> 9796 T24 C0 REQ [collection1] webapp=/solr path=/select params={q=solr&qt=standard} hits=0 status=0 QTime=0 
[junit4:junit4]   2> 9797 T12 oas.SolrTestCaseJ4.tearDown ###Ending testCacheControl
[junit4:junit4]   2> 9847 T12 oasc.CoreContainer.shutdown Shutting down CoreContainer instance=1833717089
[junit4:junit4]   2> 9848 T12 oasc.SolrCore.close [collection1]  CLOSING SolrCore org.apache.solr.core.SolrCore@58b45130
[junit4:junit4]   2> 9848 T12 oasu.DirectUpdateHandler2.close closing DirectUpdateHandler2{commits=0,autocommits=0,soft autocommits=0,optimizes=0,rollbacks=0,expungeDeletes=0,docsPending=0,adds=0,deletesById=0,deletesByQuery=0,errors=0,cumulative_adds=0,cumulative_deletesById=0,cumulative_deletesByQuery=0,cumulative_errors=0}
[junit4:junit4]   2> 9849 T12 oasc.SolrCore.decrefSolrCoreState Closing SolrCoreState
[junit4:junit4]   2> 9850 T12 oasu.DefaultSolrCoreState.closeIndexWriter SolrCoreState ref count has reached 0 - closing IndexWriter
[junit4:junit4]   2> 9851 T12 oasu.DefaultSolrCoreState.closeIndexWriter closing IndexWriter with IndexWriterCloser
[junit4:junit4]   2> 9856 T12 oasc.SolrCore.closeSearcher [collection1] Closing main searcher on request.
[junit4:junit4]   2> 9980 T12 oejsh.ContextHandler.doStop stopped o.e.j.s.ServletContextHandler{/solr,null}
[junit4:junit4]   2> 10082 T12 oejut.QueuedThreadPool.doStop WARNING 4 threads could not be stopped
[junit4:junit4]   2> 10082 T12 oas.SolrTestCaseJ4.deleteCore ###deleteCore
[junit4:junit4]   2> 10114 T11 ccr.ThreadLeakControl.checkThreadLeaks WARNING Will linger awaiting termination of 4 leaked thread(s).
[junit4:junit4]   2> 30232 T11 ccr.ThreadLeakControl.checkThreadLeaks SEVERE 4 threads leaked from SUITE scope at org.apache.solr.servlet.NoCacheHeaderTest: 
[junit4:junit4]   2> 	   1) Thread[id=15, name=qtp1668782213-15 Acceptor3 SelectChannelConnector@0.0.0.0:14366, state=BLOCKED, group=TGRP-NoCacheHeaderTest]
[junit4:junit4]   2> 	        at sun.nio.ch.ServerSocketChannelImpl.accept(ServerSocketChannelImpl.java:147)
[junit4:junit4]   2> 	        at org.eclipse.jetty.server.nio.SelectChannelConnector.accept(SelectChannelConnector.java:104)
[junit4:junit4]   2> 	        at org.eclipse.jetty.server.AbstractConnector$Acceptor.run(AbstractConnector.java:933)
[junit4:junit4]   2> 	        at org.eclipse.jetty.util.thread.QueuedThreadPool.runJob(QueuedThreadPool.java:599)
[junit4:junit4]   2> 	        at org.eclipse.jetty.util.thread.QueuedThreadPool$3.run(QueuedThreadPool.java:534)
[junit4:junit4]   2> 	        at java.lang.Thread.run(Thread.java:679)
[junit4:junit4]   2> 	   2) Thread[id=20, name=qtp1668782213-20 Acceptor1 SelectChannelConnector@0.0.0.0:14366, state=BLOCKED, group=TGRP-NoCacheHeaderTest]
[junit4:junit4]   2> 	        at sun.nio.ch.ServerSocketChannelImpl.accept(ServerSocketChannelImpl.java:147)
[junit4:junit4]   2> 	        at org.eclipse.jetty.server.nio.SelectChannelConnector.accept(SelectChannelConnector.java:104)
[junit4:junit4]   2> 	        at org.eclipse.jetty.server.AbstractConnector$Acceptor.run(AbstractConnector.java:933)
[junit4:junit4]   2> 	        at org.eclipse.jetty.util.thread.QueuedThreadPool.runJob(QueuedThreadPool.java:599)
[junit4:junit4]   2> 	        at org.eclipse.jetty.util.thread.QueuedThreadPool$3.run(QueuedThreadPool.java:534)
[junit4:junit4]   2> 	        at java.lang.Thread.run(Thread.java:679)
[junit4:junit4]   2> 	   3) Thread[id=22, name=qtp1668782213-22 Acceptor2 SelectChannelConnector@0.0.0.0:14366, state=BLOCKED, group=TGRP-NoCacheHeaderTest]
[junit4:junit4]   2> 	        at sun.nio.ch.ServerSocketChannelImpl.accept(ServerSocketChannelImpl.java:147)
[junit4:junit4]   2> 	        at org.eclipse.jetty.server.nio.SelectChannelConnector.accept(SelectChannelConnector.java:104)
[junit4:junit4]   2> 	        at org.eclipse.jetty.server.AbstractConnector$Acceptor.run(AbstractConnector.java:933)
[junit4:junit4]   2> 	        at org.eclipse.jetty.util.thread.QueuedThreadPool.runJob(QueuedThreadPool.java:599)
[junit4:junit4]   2> 	        at org.eclipse.jetty.util.thread.QueuedThreadPool$3.run(QueuedThreadPool.java:534)
[junit4:junit4]   2> 	        at java.lang.Thread.run(Thread.java:679)
[junit4:junit4]   2> 	   4) Thread[id=21, name=qtp1668782213-21 Acceptor0 SelectChannelConnector@0.0.0.0:14366, state=RUNNABLE, group=TGRP-NoCacheHeaderTest]
[junit4:junit4]   2> 	        at sun.nio.ch.ServerSocketChannelImpl.accept0(Native Method)
[junit4:junit4]   2> 	        at sun.nio.ch.ServerSocketChannelImpl.accept(ServerSocketChannelImpl.java:163)
[junit4:junit4]   2> 	        at org.eclipse.jetty.server.nio.SelectChannelConnector.accept(SelectChannelConnector.java:104)
[junit4:junit4]   2> 	        at org.eclipse.jetty.server.AbstractConnector$Acceptor.run(AbstractConnector.java:933)
[junit4:junit4]   2> 	        at org.eclipse.jetty.util.thread.QueuedThreadPool.runJob(QueuedThreadPool.java:599)
[junit4:junit4]   2> 	        at org.eclipse.jetty.util.thread.QueuedThreadPool$3.run(QueuedThreadPool.java:534)
[junit4:junit4]   2> 	        at java.lang.Thread.run(Thread.java:679)
[junit4:junit4]   2> 30233 T11 ccr.ThreadLeakControl.tryToInterruptAll Starting to interrupt leaked threads:
[junit4:junit4]   2> 	   1) Thread[id=15, name=qtp1668782213-15 Acceptor3 SelectChannelConnector@0.0.0.0:14366, state=BLOCKED, group=TGRP-NoCacheHeaderTest]
[junit4:junit4]   2> 	   2) Thread[id=20, name=qtp1668782213-20 Acceptor1 SelectChannelConnector@0.0.0.0:14366, state=BLOCKED, group=TGRP-NoCacheHeaderTest]
[junit4:junit4]   2> 	   3) Thread[id=22, name=qtp1668782213-22 Acceptor2 SelectChannelConnector@0.0.0.0:14366, state=BLOCKED, group=TGRP-NoCacheHeaderTest]
[junit4:junit4]   2> 	   4) Thread[id=21, name=qtp1668782213-21 Acceptor0 SelectChannelConnector@0.0.0.0:14366, state=RUNNABLE, group=TGRP-NoCacheHeaderTest]
[junit4:junit4]   2> 33277 T11 ccr.ThreadLeakControl.tryToInterruptAll SEVERE There are still zombie threads that couldn't be terminated:
[junit4:junit4]   2> 	   1) Thread[id=15, name=qtp1668782213-15 Acceptor3 SelectChannelConnector@0.0.0.0:14366, state=BLOCKED, group=TGRP-NoCacheHeaderTest]
[junit4:junit4]   2> 	        at sun.nio.ch.ServerSocketChannelImpl.accept(ServerSocketChannelImpl.java:147)
[junit4:junit4]   2> 	        at org.eclipse.jetty.server.nio.SelectChannelConnector.accept(SelectChannelConnector.java:104)
[junit4:junit4]   2> 	        at org.eclipse.jetty.server.AbstractConnector$Acceptor.run(AbstractConnector.java:933)
[junit4:junit4]   2> 	        at org.eclipse.jetty.util.thread.QueuedThreadPool.runJob(QueuedThreadPool.java:599)
[junit4:junit4]   2> 	        at org.eclipse.jetty.util.thread.QueuedThreadPool$3.run(QueuedThreadPool.java:534)
[junit4:junit4]   2> 	        at java.lang.Thread.run(Thread.java:679)
[junit4:junit4]   2> 	   2) Thread[id=20, name=qtp1668782213-20 Acceptor1 SelectChannelConnector@0.0.0.0:14366, state=BLOCKED, group=TGRP-NoCacheHeaderTest]
[junit4:junit4]   2> 	        at sun.nio.ch.ServerSocketChannelImpl.accept(ServerSocketChannelImpl.java:147)
[junit4:junit4]   2> 	        at org.eclipse.jetty.server.nio.SelectChannelConnector.accept(SelectChannelConnector.java:104)
[junit4:junit4]   2> 	        at org.eclipse.jetty.server.AbstractConnector$Acceptor.run(AbstractConnector.java:933)
[junit4:junit4]   2> 	        at org.eclipse.jetty.util.thread.QueuedThreadPool.runJob(QueuedThreadPool.java:599)
[junit4:junit4]   2> 	        at org.eclipse.jetty.util.thread.QueuedThreadPool$3.run(QueuedThreadPool.java:534)
[junit4:junit4]   2> 	        at java.lang.Thread.run(Thread.java:679)
[junit4:junit4]   2> 	   3) Thread[id=22, name=qtp1668782213-22 Acceptor2 SelectChannelConnector@0.0.0.0:14366, state=BLOCKED, group=TGRP-NoCacheHeaderTest]
[junit4:junit4]   2> 	        at sun.nio.ch.ServerSocketChannelImpl.accept(ServerSocketChannelImpl.java:147)
[junit4:junit4]   2> 	        at org.eclipse.jetty.server.nio.SelectChannelConnector.accept(SelectChannelConnector.java:104)
[junit4:junit4]   2> 	        at org.eclipse.jetty.server.AbstractConnector$Acceptor.run(AbstractConnector.java:933)
[junit4:junit4]   2> 	        at org.eclipse.jetty.util.thread.QueuedThreadPool.runJob(QueuedThreadPool.java:599)
[junit4:junit4]   2> 	        at org.eclipse.jetty.util.thread.QueuedThreadPool$3.run(QueuedThreadPool.java:534)
[junit4:junit4]   2> 	        at java.lang.Thread.run(Thread.java:679)
[junit4:junit4]   2> 	   4) Thread[id=21, name=qtp1668782213-21 Acceptor0 SelectChannelConnector@0.0.0.0:14366, state=RUNNABLE, group=TGRP-NoCacheHeaderTest]
[junit4:junit4]   2> 	        at sun.nio.ch.ServerSocketChannelImpl.accept0(Native Method)
[junit4:junit4]   2> 	        at sun.nio.ch.ServerSocketChannelImpl.accept(ServerSocketChannelImpl.java:163)
[junit4:junit4]   2> 	        at org.eclipse.jetty.server.nio.SelectChannelConnector.accept(SelectChannelConnector.java:104)
[junit4:junit4]   2> 	        at org.eclipse.jetty.server.AbstractConnector$Acceptor.run(AbstractConnector.java:933)
[junit4:junit4]   2> 	        at org.eclipse.jetty.util.thread.QueuedThreadPool.runJob(QueuedThreadPool.java:599)
[junit4:junit4]   2> 	        at org.eclipse.jetty.util.thread.QueuedThreadPool$3.run(QueuedThreadPool.java:534)
[junit4:junit4]   2> 	        at java.lang.Thread.run(Thread.java:679)
[junit4:junit4]   2> NOTE: test params are: codec=SimpleText, sim=RandomSimilarityProvider(queryNorm=false,coord=crazy): {}, locale=en_SG, timezone=Brazil/East
[junit4:junit4]   2> NOTE: FreeBSD 9.0-RELEASE amd64/Sun Microsystems Inc. 1.6.0_32 (64-bit)/cpus=16,threads=5,free=73647552,total=253886464
[junit4:junit4]   2> NOTE: All tests run in this JVM: [SystemInfoHandlerTest, NoCacheHeaderTest]
[junit4:junit4]   2> NOTE: reproduce with: ant test  -Dtestcase=NoCacheHeaderTest -Dtests.seed=20E679A9BD29B952 -Dtests.multiplier=3 -Dtests.slow=true -Dtests.locale=en_SG -Dtests.timezone=Brazil/East -Dtests.file.encoding=US-ASCII
[junit4:junit4] ERROR   0.00s J0 | NoCacheHeaderTest (suite) <<<
[junit4:junit4]    > Throwable #1: com.carrotsearch.randomizedtesting.ThreadLeakError: 4 threads leaked from SUITE scope at org.apache.solr.servlet.NoCacheHeaderTest: 
[junit4:junit4]    >    1) Thread[id=15, name=qtp1668782213-15 Acceptor3 SelectChannelConnector@0.0.0.0:14366, state=BLOCKED, group=TGRP-NoCacheHeaderTest]
[junit4:junit4]    >         at sun.nio.ch.ServerSocketChannelImpl.accept(ServerSocketChannelImpl.java:147)
[junit4:junit4]    >         at org.eclipse.jetty.server.nio.SelectChannelConnector.accept(SelectChannelConnector.java:104)
[junit4:junit4]    >         at org.eclipse.jetty.server.AbstractConnector$Acceptor.run(AbstractConnector.java:933)
[junit4:junit4]    >         at org.eclipse.jetty.util.thread.QueuedThreadPool.runJob(QueuedThreadPool.java:599)
[junit4:junit4]    >         at org.eclipse.jetty.util.thread.QueuedThreadPool$3.run(QueuedThreadPool.java:534)
[junit4:junit4]    >         at java.lang.Thread.run(Thread.java:679)
[junit4:junit4]    >    2) Thread[id=20, name=qtp1668782213-20 Acceptor1 SelectChannelConnector@0.0.0.0:14366, state=BLOCKED, group=TGRP-NoCacheHeaderTest]
[junit4:junit4]    >         at sun.nio.ch.ServerSocketChannelImpl.accept(ServerSocketChannelImpl.java:147)
[junit4:junit4]    >         at org.eclipse.jetty.server.nio.SelectChannelConnector.accept(SelectChannelConnector.java:104)
[junit4:junit4]    >         at org.eclipse.jetty.server.AbstractConnector$Acceptor.run(AbstractConnector.java:933)
[junit4:junit4]    >         at org.eclipse.jetty.util.thread.QueuedThreadPool.runJob(QueuedThreadPool.java:599)
[junit4:junit4]    >         at org.eclipse.jetty.util.thread.QueuedThreadPool$3.run(QueuedThreadPool.java:534)
[junit4:junit4]    >         at java.lang.Thread.run(Thread.java:679)
[junit4:junit4]    >    3) Thread[id=22, name=qtp1668782213-22 Acceptor2 SelectChannelConnector@0.0.0.0:14366, state=BLOCKED, group=TGRP-NoCacheHeaderTest]
[junit4:junit4]    >         at sun.nio.ch.ServerSocketChannelImpl.accept(ServerSocketChannelImpl.java:147)
[junit4:junit4]    >         at org.eclipse.jetty.server.nio.SelectChannelConnector.accept(SelectChannelConnector.java:104)
[junit4:junit4]    >         at org.eclipse.jetty.server.AbstractConnector$Acceptor.run(AbstractConnector.java:933)
[junit4:junit4]    >         at org.eclipse.jetty.util.thread.QueuedThreadPool.runJob(QueuedThreadPool.java:599)
[junit4:junit4]    >         at org.eclipse.jetty.util.thread.QueuedThreadPool$3.run(QueuedThreadPool.java:534)
[junit4:junit4]    >         at java.lang.Thread.run(Thread.java:679)
[junit4:junit4]    >    4) Thread[id=21, name=qtp1668782213-21 Acceptor0 SelectChannelConnector@0.0.0.0:14366, state=RUNNABLE, group=TGRP-NoCacheHeaderTest]
[junit4:junit4]    >         at sun.nio.ch.ServerSocketChannelImpl.accept0(Native Method)
[junit4:junit4]    >         at sun.nio.ch.ServerSocketChannelImpl.accept(ServerSocketChannelImpl.java:163)
[junit4:junit4]    >         at org.eclipse.jetty.server.nio.SelectChannelConnector.accept(SelectChannelConnector.java:104)
[junit4:junit4]    >         at org.eclipse.jetty.server.AbstractConnector$Acceptor.run(AbstractConnector.java:933)
[junit4:junit4]    >         at org.eclipse.jetty.util.thread.QueuedThreadPool.runJob(QueuedThreadPool.java:599)
[junit4:junit4]    >         at org.eclipse.jetty.util.thread.QueuedThreadPool$3.run(QueuedThreadPool.java:534)
[junit4:junit4]    >         at java.lang.Thread.run(Thread.java:679)
[junit4:junit4]    > 	at __randomizedtesting.SeedInfo.seed([20E679A9BD29B952]:0)
[junit4:junit4]    > Throwable #2: com.carrotsearch.randomizedtesting.ThreadLeakError: There are still zombie threads that couldn't be terminated:
[junit4:junit4]    >    1) Thread[id=15, name=qtp1668782213-15 Acceptor3 SelectChannelConnector@0.0.0.0:14366, state=BLOCKED, group=TGRP-NoCacheHeaderTest]
[junit4:junit4]    >         at sun.nio.ch.ServerSocketChannelImpl.accept(ServerSocketChannelImpl.java:147)
[junit4:junit4]    >         at org.eclipse.jetty.server.nio.SelectChannelConnector.accept(SelectChannelConnector.java:104)
[junit4:junit4]    >         at org.eclipse.jetty.server.AbstractConnector$Acceptor.run(AbstractConnector.java:933)
[junit4:junit4]    >         at org.eclipse.jetty.util.thread.QueuedThreadPool.runJob(QueuedThreadPool.java:599)
[junit4:junit4]    >         at org.eclipse.jetty.util.thread.QueuedThreadPool$3.run(QueuedThreadPool.java:534)
[junit4:junit4]    >         at java.lang.Thread.run(Thread.java:679)
[junit4:junit4]    >    2) Thread[id=20, name=qtp1668782213-20 Acceptor1 SelectChannelConnector@0.0.0.0:14366, state=BLOCKED, group=TGRP-NoCacheHeaderTest]
[junit4:junit4]    >         at sun.nio.ch.ServerSocketChannelImpl.accept(ServerSocketChannelImpl.java:147)
[junit4:junit4]    >         at org.eclipse.jetty.server.nio.SelectChannelConnector.accept(SelectChannelConnector.java:104)
[junit4:junit4]    >         at org.eclipse.jetty.server.AbstractConnector$Acceptor.run(AbstractConnector.java:933)
[junit4:junit4]    >         at org.eclipse.jetty.util.thread.QueuedThreadPool.runJob(QueuedThreadPool.java:599)
[junit4:junit4]    >         at org.eclipse.jetty.util.thread.QueuedThreadPool$3.run(QueuedThreadPool.java:534)
[junit4:junit4]    >         at java.lang.Thread.run(Thread.java:679)
[junit4:junit4]    >    3) Thread[id=22, name=qtp1668782213-22 Acceptor2 SelectChannelConnector@0.0.0.0:14366, state=BLOCKED, group=TGRP-NoCacheHeaderTest]
[junit4:junit4]    >         at sun.nio.ch.ServerSocketChannelImpl.accept(ServerSocketChannelImpl.java:147)
[junit4:junit4]    >         at org.eclipse.jetty.server.nio.SelectChannelConnector.accept(SelectChannelConnector.java:104)
[junit4:junit4]    >         at org.eclipse.jetty.server.AbstractConnector$Acceptor.run(AbstractConnector.java:933)
[junit4:junit4]    >         at org.eclipse.jetty.util.thread.QueuedThreadPool.runJob(QueuedThreadPool.java:599)
[junit4:junit4]    >         at org.eclipse.jetty.util.thread.QueuedThreadPool$3.run(QueuedThreadPool.java:534)
[junit4:junit4]    >         at java.lang.Thread.run(Thread.java:679)
[junit4:junit4]    >    4) Thread[id=21, name=qtp1668782213-21 Acceptor0 SelectChannelConnector@0.0.0.0:14366, state=RUNNABLE, group=TGRP-NoCacheHeaderTest]
[junit4:junit4]    >         at sun.nio.ch.ServerSocketChannelImpl.accept0(Native Method)
[junit4:junit4]    >         at sun.nio.ch.ServerSocketChannelImpl.accept(ServerSocketChannelImpl.java:163)
[junit4:junit4]    >         at org.eclipse.jetty.server.nio.SelectChannelConnector.accept(SelectChannelConnector.java:104)
[junit4:junit4]    >         at org.eclipse.jetty.server.AbstractConnector$Acceptor.run(AbstractConnector.java:933)
[junit4:junit4]    >         at org.eclipse.jetty.util.thread.QueuedThreadPool.runJob(QueuedThreadPool.java:599)
[junit4:junit4]    >         at org.eclipse.jetty.util.thread.QueuedThreadPool$3.run(QueuedThreadPool.java:534)
[junit4:junit4]    >         at java.lang.Thread.run(Thread.java:679)
[junit4:junit4]    > 	at __randomizedtesting.SeedInfo.seed([20E679A9BD29B952]:0)
[junit4:junit4] Completed on J0 in 33.77s, 3 tests, 2 errors <<< FAILURES!

[...truncated 514 lines...]
[junit4:junit4] Suite: org.apache.solr.cloud.RecoveryZkTest
[junit4:junit4]   2> 3 T62 oas.SolrTestCaseJ4.setUp ###Starting testDistribSearch
[junit4:junit4]   2> Creating dataDir: /usr/home/hudson/hudson-slave/workspace/Lucene-Solr-Tests-4.x-Java6/solr/build/solr-core/test/J1/./solrtest-RecoveryZkTest-1351595889579
[junit4:junit4]   2> 9 T62 oasc.ZkTestServer.run STARTING ZK TEST SERVER
[junit4:junit4]   2> 124 T63 oaz.Environment.logEnv Server environment:zookeeper.version=3.3.6-1366786, built on 07/29/2012 06:22 GMT
[junit4:junit4]   2> 125 T63 oaz.Environment.logEnv Server environment:host.name=lucene.zones.apache.org
[junit4:junit4]   2> 125 T63 oaz.Environment.logEnv Server environment:java.version=1.6.0_32
[junit4:junit4]   2> 125 T63 oaz.Environment.logEnv Server environment:java.vendor=Sun Microsystems Inc.
[junit4:junit4]   2> 125 T63 oaz.Environment.logEnv Server environment:java.home=/usr/local/openjdk6/jre
[junit4:junit4]   2> 126 T63 oaz.Environment.logEnv Server environment:java.class.path=/usr/home/hudson/hudson-slave/workspace/Lucene-Solr-Tests-4.x-Java6/solr/build/solr-core/classes/test:/usr/home/hudson/hudson-slave/workspace/Lucene-Solr-Tests-4.x-Java6/solr/build/solr-test-framework/classes/java:/usr/home/hudson/hudson-slave/workspace/Lucene-Solr-Tests-4.x-Java6/solr/build/solr-core/test-files:/usr/home/hudson/hudson-slave/workspace/Lucene-Solr-Tests-4.x-Java6/lucene/build/test-framework/classes/java:/usr/home/hudson/hudson-slave/workspace/Lucene-Solr-Tests-4.x-Java6/lucene/build/codecs/classes/java:/usr/home/hudson/hudson-slave/workspace/Lucene-Solr-Tests-4.x-Java6/solr/build/solr-solrj/classes/java:/usr/home/hudson/hudson-slave/workspace/Lucene-Solr-Tests-4.x-Java6/solr/build/solr-core/classes/java:/usr/home/hudson/hudson-slave/workspace/Lucene-Solr-Tests-4.x-Java6/lucene/build/analysis/common/lucene-analyzers-common-4.1-SNAPSHOT.jar:/usr/home/hudson/hudson-slave/workspace/Lucene-Solr-Tests-4.x-Java6/lucene/build/analysis/kuromoji/lucene-analyzers-kuromoji-4.1-SNAPSHOT.jar:/usr/home/hudson/hudson-slave/workspace/Lucene-Solr-Tests-4.x-Java6/lucene/build/analysis/phonetic/lucene-analyzers-phonetic-4.1-SNAPSHOT.jar:/usr/home/hudson/hudson-slave/workspace/Lucene-Solr-Tests-4.x-Java6/lucene/build/highlighter/lucene-highlighter-4.1-SNAPSHOT.jar:/usr/home/hudson/hudson-slave/workspace/Lucene-Solr-Tests-4.x-Java6/lucene/build/memory/lucene-memory-4.1-SNAPSHOT.jar:/usr/home/hudson/hudson-slave/workspace/Lucene-Solr-Tests-4.x-Java6/lucene/build/misc/lucene-misc-4.1-SNAPSHOT.jar:/usr/home/hudson/hudson-slave/workspace/Lucene-Solr-Tests-4.x-Java6/lucene/build/spatial/lucene-spatial-4.1-SNAPSHOT.jar:/usr/home/hudson/hudson-slave/workspace/Lucene-Solr-Tests-4.x-Java6/lucene/build/suggest/lucene-suggest-4.1-SNAPSHOT.jar:/usr/home/hudson/hudson-slave/workspace/Lucene-Solr-Tests-4.x-Java6/lucene/build/grouping/lucene-grouping-4.1-SNAPSHOT.jar:/usr/home/hudson/hudson-slave/workspace/Lucene-Solr-Tests-4.x-Java6/lucene/build/queries/lucene-queries-4.1-SNAPSHOT.jar:/usr/home/hudson/hudson-slave/workspace/Lucene-Solr-Tests-4.x-Java6/lucene/build/queryparser/lucene-queryparser-4.1-SNAPSHOT.jar:/usr/home/hudson/hudson-slave/workspace/Lucene-Solr-Tests-4.x-Java6/solr/core/lib/commons-cli-1.2.jar:/usr/home/hudson/hudson-slave/workspace/Lucene-Solr-Tests-4.x-Java6/solr/core/lib/commons-codec-1.7.jar:/usr/home/hudson/hudson-slave/workspace/Lucene-Solr-Tests-4.x-Java6/solr/core/lib/commons-fileupload-1.2.1.jar:/usr/home/hudson/hudson-slave/workspace/Lucene-Solr-Tests-4.x-Java6/solr/core/lib/commons-lang-2.6.jar:/usr/home/hudson/hudson-slave/workspace/Lucene-Solr-Tests-4.x-Java6/solr/core/lib/easymock-2.2.jar:/usr/home/hudson/hudson-slave/workspace/Lucene-Solr-Tests-4.x-Java6/solr/core/lib/guava-r05.jar:/usr/home/hudson/hudson-slave/workspace/Lucene-Solr-Tests-4.x-Java6/solr/core/lib/javax.servlet-api-3.0.1.jar:/usr/home/hudson/hudson-slave/workspace/Lucene-Solr-Tests-4.x-Java6/solr/core/lib/spatial4j-0.3.jar:/usr/home/hudson/hudson-slave/workspace/Lucene-Solr-Tests-4.x-Java6/solr/solrj/lib/commons-io-2.1.jar:/usr/home/hudson/hudson-slave/workspace/Lucene-Solr-Tests-4.x-Java6/solr/solrj/lib/httpclient-4.1.3.jar:/usr/home/hudson/hudson-slave/workspace/Lucene-Solr-Tests-4.x-Java6/solr/solrj/lib/httpcore-4.1.4.jar:/usr/home/hudson/hudson-slave/workspace/Lucene-Solr-Tests-4.x-Java6/solr/solrj/lib/httpmime-4.1.3.jar:/usr/home/hudson/hudson-slave/workspace/Lucene-Solr-Tests-4.x-Java6/solr/solrj/lib/jcl-over-slf4j-1.6.4.jar:/usr/home/hudson/hudson-slave/workspace/Lucene-Solr-Tests-4.x-Java6/solr/solrj/lib/log4j-over-slf4j-1.6.4.jar:/usr/home/hudson/hudson-slave/workspace/Lucene-Solr-Tests-4.x-Java6/solr/solrj/lib/slf4j-api-1.6.4.jar:/usr/home/hudson/hudson-slave/workspace/Lucene-Solr-Tests-4.x-Java6/solr/solrj/lib/slf4j-jdk14-1.6.4.jar:/usr/home/hudson/hudson-slave/workspace/Lucene-Solr-Tests-4.x-Java6/solr/solrj/lib/wstx-asl-3.2.7.jar:/usr/home/hudson/hudson-slave/workspace/Lucene-Solr-Tests-4.x-Java6/solr/solrj/lib/zookeeper-3.3.6.jar:/usr/home/hudson/hudson-slave/workspace/Lucene-Solr-Tests-4.x-Java6/solr/example/lib/jetty-continuation-8.1.2.v20120308.jar:/usr/home/hudson/hudson-slave/workspace/Lucene-Solr-Tests-4.x-Java6/solr/example/lib/jetty-deploy-8.1.2.v20120308.jar:/usr/home/hudson/hudson-slave/workspace/Lucene-Solr-Tests-4.x-Java6/solr/example/lib/jetty-http-8.1.2.v20120308.jar:/usr/home/hudson/hudson-slave/workspace/Lucene-Solr-Tests-4.x-Java6/solr/example/lib/jetty-io-8.1.2.v20120308.jar:/usr/home/hudson/hudson-slave/workspace/Lucene-Solr-Tests-4.x-Java6/solr/example/lib/jetty-jmx-8.1.2.v20120308.jar:/usr/home/hudson/hudson-slave/workspace/Lucene-Solr-Tests-4.x-Java6/solr/example/lib/jetty-security-8.1.2.v20120308.jar:/usr/home/hudson/hudson-slave/workspace/Lucene-Solr-Tests-4.x-Java6/solr/example/lib/jetty-server-8.1.2.v20120308.jar:/usr/home/hudson/hudson-slave/workspace/Lucene-Solr-Tests-4.x-Java6/solr/example/lib/jetty-servlet-8.1.2.v20120308.jar:/usr/home/hudson/hudson-slave/workspace/Lucene-Solr-Tests-4.x-Java6/solr/example/lib/jetty-util-8.1.2.v20120308.jar:/usr/home/hudson/hudson-slave/workspace/Lucene-Solr-Tests-4.x-Java6/solr/example/lib/jetty-webapp-8.1.2.v20120308.jar:/usr/home/hudson/hudson-slave/workspace/Lucene-Solr-Tests-4.x-Java6/solr/example/lib/jetty-xml-8.1.2.v20120308.jar:/usr/home/hudson/hudson-slave/workspace/Lucene-Solr-Tests-4.x-Java6/solr/example/lib/servlet-api-3.0.jar:/usr/home/hudson/hudson-slave/workspace/Lucene-Solr-Tests-4.x-Java6/solr/example/example-DIH/solr/db/lib/hsqldb-1.8.0.10.jar:/usr/home/hudson/hudson-slave/workspace/Lucene-Solr-Tests-4.x-Java6/lucene/build/core/classes/java:/usr/home/hudson/hudson-slave/workspace/Lucene-Solr-Tests-4.x-Java6/lucene/test-framework/lib/junit-4.10.jar:/usr/home/hudson/hudson-slave/workspace/Lucene-Solr-Tests-4.x-Java6/lucene/test-framework/lib/randomizedtesting-runner-2.0.4.jar:/home/hudson/hudson-slave/tools/Ant/ant-1.8.2/lib/ant-launcher.jar:/home/hudson/.ant/lib/ivy-2.2.0.jar:/home/hudson/hudson-slave/tools/Ant/ant-1.8.2/lib/ant-apache-regexp.jar:/home/hudson/hudson-slave/tools/Ant/ant-1.8.2/lib/ant-junit.jar:/home/hudson/hudson-slave/tools/Ant/ant-1.8.2/lib/ant-apache-bsf.jar:/home/hudson/hudson-slave/tools/Ant/ant-1.8.2/lib/ant-commons-net.jar:/home/hudson/hudson-slave/tools/Ant/ant-1.8.2/lib/ant-antlr.jar:/home/hudson/hudson-slave/tools/Ant/ant-1.8.2/lib/ant-apache-log4j.jar:/home/hudson/hudson-slave/tools/Ant/ant-1.8.2/lib/ant-commons-logging.jar:/home/hudson/hudson-slave/tools/Ant/ant-1.8.2/lib/ant-apache-xalan2.jar:/home/hudson/hudson-slave/tools/Ant/ant-1.8.2/lib/ant-apache-oro.jar:/home/hudson/hudson-slave/tools/Ant/ant-1.8.2/lib/ant-junit4.jar:/home/hudson/hudson-slave/tools/Ant/ant-1.8.2/lib/ant-netrexx.jar:/home/hudson/hudson-slave/tools/Ant/ant-1.8.2/lib/ant-swing.jar:/home/hudson/hudson-slave/tools/Ant/ant-1.8.2/lib/ant-javamail.jar:/home/hudson/hudson-slave/tools/Ant/ant-1.8.2/lib/ant-jsch.jar:/home/hudson/hudson-slave/tools/Ant/ant-1.8.2/lib/ant-jmf.jar:/home/hudson/hudson-slave/tools/Ant/ant-1.8.2/lib/ant.jar:/home/hudson/hudson-slave/tools/Ant/ant-1.8.2/lib/ant-apache-bcel.jar:/home/hudson/hudson-slave/tools/Ant/ant-1.8.2/lib/ant-jai.jar:/home/hudson/hudson-slave/tools/Ant/ant-1.8.2/lib/ant-testutil.jar:/home/hudson/hudson-slave/tools/Ant/ant-1.8.2/lib/ant-apache-resolver.jar:/home/hudson/hudson-slave/tools/Ant/ant-1.8.2/lib/ant-jdepend.jar:/usr/local/openjdk6/lib/tools.jar:/home/hudson/.ivy2/cache/com.carrotsearch.randomizedtesting/junit4-ant/jars/junit4-ant-2.0.4.jar
[junit4:junit4]   2> 127 T63 oaz.Environment.logEnv Server environment:java.library.path=/usr/local/openjdk6/jre/lib/amd64/server:/usr/local/openjdk6/jre/lib/amd64:/usr/local/openjdk6/jre/../lib/amd64:/usr/java/packages/lib/amd64:/lib:/usr/lib:/usr/local/lib
[junit4:junit4]   2> 127 T63 oaz.Environment.logEnv Server environment:java.io.tmpdir=.
[junit4:junit4]   2> 127 T63 oaz.Environment.logEnv Server environment:java.compiler=<NA>
[junit4:junit4]   2> 128 T63 oaz.Environment.logEnv Server environment:os.name=FreeBSD
[junit4:junit4]   2> 128 T63 oaz.Environment.logEnv Server environment:os.arch=amd64
[junit4:junit4]   2> 128 T63 oaz.Environment.logEnv Server environment:os.version=9.0-RELEASE
[junit4:junit4]   2> 128 T63 oaz.Environment.logEnv Server environment:user.name=hudson
[junit4:junit4]   2> 129 T63 oaz.Environment.logEnv Server environment:user.home=/home/hudson
[junit4:junit4]   2> 129 T63 oaz.Environment.logEnv Server environment:user.dir=/usr/home/hudson/hudson-slave/workspace/Lucene-Solr-Tests-4.x-Java6/solr/build/solr-core/test/J1
[junit4:junit4]   2> 179 T63 oazs.ZooKeeperServer.setTickTime tickTime set to 1000
[junit4:junit4]   2> 219 T63 oazs.NIOServerCnxn$Factory.<init> binding to port 0.0.0.0/0.0.0.0:0
[junit4:junit4]   2> 295 T63 oazsp.FileTxnSnapLog.save Snapshotting: 0
[junit4:junit4]   2> 317 T62 oasc.ZkTestServer.run start zk server on port:63131
[junit4:junit4]   2> 432 T62 oaz.Environment.logEnv Client environment:zookeeper.version=3.3.6-1366786, built on 07/29/2012 06:22 GMT
[junit4:junit4]   2> 433 T62 oaz.Environment.logEnv Client environment:host.name=lucene.zones.apache.org
[junit4:junit4]   2> 433 T62 oaz.Environment.logEnv Client environment:java.version=1.6.0_32
[junit4:junit4]   2> 434 T62 oaz.Environment.logEnv Client environment:java.vendor=Sun Microsystems Inc.
[junit4:junit4]   2> 434 T62 oaz.Environment.logEnv Client environment:java.home=/usr/local/openjdk6/jre
[junit4:junit4]   2> 434 T62 oaz.Environment.logEnv Client environment:java.class.path=/usr/home/hudson/hudson-slave/workspace/Lucene-Solr-Tests-4.x-Java6/solr/build/solr-core/classes/test:/usr/home/hudson/hudson-slave/workspace/Lucene-Solr-Tests-4.x-Java6/solr/build/solr-test-framework/classes/java:/usr/home/hudson/hudson-slave/workspace/Lucene-Solr-Tests-4.x-Java6/solr/build/solr-core/test-files:/usr/home/hudson/hudson-slave/workspace/Lucene-Solr-Tests-4.x-Java6/lucene/build/test-framework/classes/java:/usr/home/hudson/hudson-slave/workspace/Lucene-Solr-Tests-4.x-Java6/lucene/build/codecs/classes/java:/usr/home/hudson/hudson-slave/workspace/Lucene-Solr-Tests-4.x-Java6/solr/build/solr-solrj/classes/java:/usr/home/hudson/hudson-slave/workspace/Lucene-Solr-Tests-4.x-Java6/solr/build/solr-core/classes/java:/usr/home/hudson/hudson-slave/workspace/Lucene-Solr-Tests-4.x-Java6/lucene/build/analysis/common/lucene-analyzers-common-4.1-SNAPSHOT.jar:/usr/home/hudson/hudson-slave/workspace/Lucene-Solr-Tests-4.x-Java6/lucene/build/analysis/kuromoji/lucene-analyzers-kuromoji-4.1-SNAPSHOT.jar:/usr/home/hudson/hudson-slave/workspace/Lucene-Solr-Tests-4.x-Java6/lucene/build/analysis/phonetic/lucene-analyzers-phonetic-4.1-SNAPSHOT.jar:/usr/home/hudson/hudson-slave/workspace/Lucene-Solr-Tests-4.x-Java6/lucene/build/highlighter/lucene-highlighter-4.1-SNAPSHOT.jar:/usr/home/hudson/hudson-slave/workspace/Lucene-Solr-Tests-4.x-Java6/lucene/build/memory/lucene-memory-4.1-SNAPSHOT.jar:/usr/home/hudson/hudson-slave/workspace/Lucene-Solr-Tests-4.x-Java6/lucene/build/misc/lucene-misc-4.1-SNAPSHOT.jar:/usr/home/hudson/hudson-slave/workspace/Lucene-Solr-Tests-4.x-Java6/lucene/build/spatial/lucene-spatial-4.1-SNAPSHOT.jar:/usr/home/hudson/hudson-slave/workspace/Lucene-Solr-Tests-4.x-Java6/lucene/build/suggest/lucene-suggest-4.1-SNAPSHOT.jar:/usr/home/hudson/hudson-slave/workspace/Lucene-Solr-Tests-4.x-Java6/lucene/build/grouping/lucene-grouping-4.1-SNAPSHOT.jar:/usr/home/hudson/hudson-slave/workspace/Lucene-Solr-Tests-4.x-Java6/lucene/build/queries/lucene-queries-4.1-SNAPSHOT.jar:/usr/home/hudson/hudson-slave/workspace/Lucene-Solr-Tests-4.x-Java6/lucene/build/queryparser/lucene-queryparser-4.1-SNAPSHOT.jar:/usr/home/hudson/hudson-slave/workspace/Lucene-Solr-Tests-4.x-Java6/solr/core/lib/commons-cli-1.2.jar:/usr/home/hudson/hudson-slave/workspace/Lucene-Solr-Tests-4.x-Java6/solr/core/lib/commons-codec-1.7.jar:/usr/home/hudson/hudson-slave/workspace/Lucene-Solr-Tests-4.x-Java6/solr/core/lib/commons-fileupload-1.2.1.jar:/usr/home/hudson/hudson-slave/workspace/Lucene-Solr-Tests-4.x-Java6/solr/core/lib/commons-lang-2.6.jar:/usr/home/hudson/hudson-slave/workspace/Lucene-Solr-Tests-4.x-Java6/solr/core/lib/easymock-2.2.jar:/usr/home/hudson/hudson-slave/workspace/Lucene-Solr-Tests-4.x-Java6/solr/core/lib/guava-r05.jar:/usr/home/hudson/hudson-slave/workspace/Lucene-Solr-Tests-4.x-Java6/solr/core/lib/javax.servlet-api-3.0.1.jar:/usr/home/hudson/hudson-slave/workspace/Lucene-Solr-Tests-4.x-Java6/solr/core/lib/spatial4j-0.3.jar:/usr/home/hudson/hudson-slave/workspace/Lucene-Solr-Tests-4.x-Java6/solr/solrj/lib/commons-io-2.1.jar:/usr/home/hudson/hudson-slave/workspace/Lucene-Solr-Tests-4.x-Java6/solr/solrj/lib/httpclient-4.1.3.jar:/usr/home/hudson/hudson-slave/workspace/Lucene-Solr-Tests-4.x-Java6/solr/solrj/lib/httpcore-4.1.4.jar:/usr/home/hudson/hudson-slave/workspace/Lucene-Solr-Tests-4.x-Java6/solr/solrj/lib/httpmime-4.1.3.jar:/usr/home/hudson/hudson-slave/workspace/Lucene-Solr-Tests-4.x-Java6/solr/solrj/lib/jcl-over-slf4j-1.6.4.jar:/usr/home/hudson/hudson-slave/workspace/Lucene-Solr-Tests-4.x-Java6/solr/solrj/lib/log4j-over-slf4j-1.6.4.jar:/usr/home/hudson/hudson-slave/workspace/Lucene-Solr-Tests-4.x-Java6/solr/solrj/lib/slf4j-api-1.6.4.jar:/usr/home/hudson/hudson-slave/workspace/Lucene-Solr-Tests-4.x-Java6/solr/solrj/lib/slf4j-jdk14-1.6.4.jar:/usr/home/hudson/hudson-slave/workspace/Lucene-Solr-Tests-4.x-Java6/solr/solrj/lib/wstx-asl-3.2.7.jar:/usr/home/hudson/hudson-slave/workspace/Lucene-Solr-Tests-4.x-Java6/solr/solrj/lib/zookeeper-3.3.6.jar:/usr/home/hudson/hudson-slave/workspace/Lucene-Solr-Tests-4.x-Java6/solr/example/lib/jetty-continuation-8.1.2.v20120308.jar:/usr/home/hudson/hudson-slave/workspace/Lucene-Solr-Tests-4.x-Java6/solr/example/lib/jetty-deploy-8.1.2.v20120308.jar:/usr/home/hudson/hudson-slave/workspace/Lucene-Solr-Tests-4.x-Java6/solr/example/lib/jetty-http-8.1.2.v20120308.jar:/usr/home/hudson/hudson-slave/workspace/Lucene-Solr-Tests-4.x-Java6/solr/example/lib/jetty-io-8.1.2.v20120308.jar:/usr/home/hudson/hudson-slave/workspace/Lucene-Solr-Tests-4.x-Java6/solr/example/lib/jetty-jmx-8.1.2.v20120308.jar:/usr/home/hudson/hudson-slave/workspace/Lucene-Solr-Tests-4.x-Java6/solr/example/lib/jetty-security-8.1.2.v20120308.jar:/usr/home/hudson/hudson-slave/workspace/Lucene-Solr-Tests-4.x-Java6/solr/example/lib/jetty-server-8.1.2.v20120308.jar:/usr/home/hudson/hudson-slave/workspace/Lucene-Solr-Tests-4.x-Java6/solr/example/lib/jetty-servlet-8.1.2.v20120308.jar:/usr/home/hudson/hudson-slave/workspace/Lucene-Solr-Tests-4.x-Java6/solr/example/lib/jetty-util-8.1.2.v20120308.jar:/usr/home/hudson/hudson-slave/workspace/Lucene-Solr-Tests-4.x-Java6/solr/example/lib/jetty-webapp-8.1.2.v20120308.jar:/usr/home/hudson/hudson-slave/workspace/Lucene-Solr-Tests-4.x-Java6/solr/example/lib/jetty-xml-8.1.2.v20120308.jar:/usr/home/hudson/hudson-slave/workspace/Lucene-Solr-Tests-4.x-Java6/solr/example/lib/servlet-api-3.0.jar:/usr/home/hudson/hudson-slave/workspace/Lucene-Solr-Tests-4.x-Java6/solr/example/example-DIH/solr/db/lib/hsqldb-1.8.0.10.jar:/usr/home/hudson/hudson-slave/workspace/Lucene-Solr-Tests-4.x-Java6/lucene/build/core/classes/java:/usr/home/hudson/hudson-slave/workspace/Lucene-Solr-Tests-4.x-Java6/lucene/test-framework/lib/junit-4.10.jar:/usr/home/hudson/hudson-slave/workspace/Lucene-Solr-Tests-4.x-Java6/lucene/test-framework/lib/randomizedtesting-runner-2.0.4.jar:/home/hudson/hudson-slave/tools/Ant/ant-1.8.2/lib/ant-launcher.jar:/home/hudson/.ant/lib/ivy-2.2.0.jar:/home/hudson/hudson-slave/tools/Ant/ant-1.8.2/lib/ant-apache-regexp.jar:/home/hudson/hudson-slave/tools/Ant/ant-1.8.2/lib/ant-junit.jar:/home/hudson/hudson-slave/tools/Ant/ant-1.8.2/lib/ant-apache-bsf.jar:/home/hudson/hudson-slave/tools/Ant/ant-1.8.2/lib/ant-commons-net.jar:/home/hudson/hudson-slave/tools/Ant/ant-1.8.2/lib/ant-antlr.jar:/home/hudson/hudson-slave/tools/Ant/ant-1.8.2/lib/ant-apache-log4j.jar:/home/hudson/hudson-slave/tools/Ant/ant-1.8.2/lib/ant-commons-logging.jar:/home/hudson/hudson-slave/tools/Ant/ant-1.8.2/lib/ant-apache-xalan2.jar:/home/hudson/hudson-slave/tools/Ant/ant-1.8.2/lib/ant-apache-oro.jar:/home/hudson/hudson-slave/tools/Ant/ant-1.8.2/lib/ant-junit4.jar:/home/hudson/hudson-slave/tools/Ant/ant-1.8.2/lib/ant-netrexx.jar:/home/hudson/hudson-slave/tools/Ant/ant-1.8.2/lib/ant-swing.jar:/home/hudson/hudson-slave/tools/Ant/ant-1.8.2/lib/ant-javamail.jar:/home/hudson/hudson-slave/tools/Ant/ant-1.8.2/lib/ant-jsch.jar:/home/hudson/hudson-slave/tools/Ant/ant-1.8.2/lib/ant-jmf.jar:/home/hudson/hudson-slave/tools/Ant/ant-1.8.2/lib/ant.jar:/home/hudson/hudson-slave/tools/Ant/ant-1.8.2/lib/ant-apache-bcel.jar:/home/hudson/hudson-slave/tools/Ant/ant-1.8.2/lib/ant-jai.jar:/home/hudson/hudson-slave/tools/Ant/ant-1.8.2/lib/ant-testutil.jar:/home/hudson/hudson-slave/tools/Ant/ant-1.8.2/lib/ant-apache-resolver.jar:/home/hudson/hudson-slave/tools/Ant/ant-1.8.2/lib/ant-jdepend.jar:/usr/local/openjdk6/lib/tools.jar:/home/hudson/.ivy2/cache/com.carrotsearch.randomizedtesting/junit4-ant/jars/junit4-ant-2.0.4.jar
[junit4:junit4]   2> 435 T62 oaz.Environment.logEnv Client environment:java.library.path=/usr/local/openjdk6/jre/lib/amd64/server:/usr/local/openjdk6/jre/lib/amd64:/usr/local/openjdk6/jre/../lib/amd64:/usr/java/packages/lib/amd64:/lib:/usr/lib:/usr/local/lib
[junit4:junit4]   2> 435 T62 oaz.Environment.logEnv Client environment:java.io.tmpdir=.
[junit4:junit4]   2> 436 T62 oaz.Environment.logEnv Client environment:java.compiler=<NA>
[junit4:junit4]   2> 436 T62 oaz.Environment.logEnv Client environment:os.name=FreeBSD
[junit4:junit4]   2> 436 T62 oaz.Environment.logEnv Client environment:os.arch=amd64
[junit4:junit4]   2> 437 T62 oaz.Environment.logEnv Client environment:os.version=9.0-RELEASE
[junit4:junit4]   2> 437 T62 oaz.Environment.logEnv Client environment:user.name=hudson
[junit4:junit4]   2> 437 T62 oaz.Environment.logEnv Client environment:user.home=/home/hudson
[junit4:junit4]   2> 437 T62 oaz.Environment.logEnv Client environment:user.dir=/usr/home/hudson/hudson-slave/workspace/Lucene-Solr-Tests-4.x-Java6/solr/build/solr-core/test/J1
[junit4:junit4]   2> 445 T62 oaz.ZooKeeper.<init> Initiating client connection, connectString=127.0.0.1:63131 sessionTimeout=10000 watcher=org.apache.solr.common.cloud.ConnectionManager@1d78ff42
[junit4:junit4]   2> 485 T68 oaz.ClientCnxn$SendThread.startConnect Opening socket connection to server /127.0.0.1:63131
[junit4:junit4]   2> 485 T62 oascc.ConnectionManager.waitForConnected Waiting for client to connect to ZooKeeper
[junit4:junit4]   2> 489 T68 oaz.ClientCnxn$SendThread.primeConnection Socket connection established to localhost/127.0.0.1:63131, initiating session
[junit4:junit4]   2> 490 T64 oazs.NIOServerCnxn$Factory.run Accepted socket connection from /140.211.11.196:19039
[junit4:junit4]   2> 504 T64 oazs.NIOServerCnxn.readConnectRequest Client attempting to establish new session at /140.211.11.196:19039
[junit4:junit4]   2> 516 T66 oazsp.FileTxnLog.append Creating new log file: log.1
[junit4:junit4]   2> 543 T66 oazs.NIOServerCnxn.finishSessionInit Established session 0x13ab16494ff0000 with negotiated timeout 10000 for client /140.211.11.196:19039
[junit4:junit4]   2> 543 T68 oaz.ClientCnxn$SendThread.readConnectResult Session establishment complete on server localhost/127.0.0.1:63131, sessionid = 0x13ab16494ff0000, negotiated timeout = 10000
[junit4:junit4]   2> 551 T69 oascc.ConnectionManager.process Watcher org.apache.solr.common.cloud.ConnectionManager@1d78ff42 name:ZooKeeperConnection Watcher:127.0.0.1:63131 got event WatchedEvent state:SyncConnected type:None path:null path:null type:None
[junit4:junit4]   2> 551 T62 oascc.ConnectionManager.waitForConnected Client is connected to ZooKeeper
[junit4:junit4]   2> 554 T62 oascc.SolrZkClient.makePath makePath: /solr
[junit4:junit4]   2> 602 T67 oazs.PrepRequestProcessor.pRequest Processed session termination for sessionid: 0x13ab16494ff0000
[junit4:junit4]   2> 604 T69 oaz.ClientCnxn$EventThread.run EventThread shut down
[junit4:junit4]   2> 604 T62 oaz.ZooKeeper.close Session: 0x13ab16494ff0000 closed
[junit4:junit4]   2> 605 T64 oazs.NIOServerCnxn.closeSock Closed socket connection for client /140.211.11.196:19039 which had sessionid 0x13ab16494ff0000
[junit4:junit4]   2> 604 T62 oaz.ZooKeeper.<init> Initiating client connection, connectString=127.0.0.1:63131/solr sessionTimeout=10000 watcher=org.apache.solr.common.cloud.ConnectionManager@37fa350b
[junit4:junit4]   2> 606 T70 oaz.ClientCnxn$SendThread.startConnect Opening socket connection to server /127.0.0.1:63131
[junit4:junit4]   2> 606 T62 oascc.ConnectionManager.waitForConnected Waiting for client to connect to ZooKeeper
[junit4:junit4]   2> 607 T70 oaz.ClientCnxn$SendThread.primeConnection Socket connection established to localhost/127.0.0.1:63131, initiating session
[junit4:junit4]   2> 607 T64 oazs.NIOServerCnxn$Factory.run Accepted socket connection from /140.211.11.196:37431
[junit4:junit4]   2> 607 T64 oazs.NIOServerCnxn.readConnectRequest Client attempting to establish new session at /140.211.11.196:37431
[junit4:junit4]   2> 609 T66 oazs.NIOServerCnxn.finishSessionInit Established session 0x13ab16494ff0001 with negotiated timeout 10000 for client /140.211.11.196:37431
[junit4:junit4]   2> 609 T70 oaz.ClientCnxn$SendThread.readConnectResult Session establishment complete on server localhost/127.0.0.1:63131, sessionid = 0x13ab16494ff0001, negotiated timeout = 10000
[junit4:junit4]   2> 609 T71 oascc.ConnectionManager.process Watcher org.apache.solr.common.cloud.ConnectionManager@37fa350b name:ZooKeeperConnection Watcher:127.0.0.1:63131/solr got event WatchedEvent state:SyncConnected type:None path:null path:null type:None
[junit4:junit4]   2> 609 T62 oascc.ConnectionManager.waitForConnected Client is connected to ZooKeeper
[junit4:junit4]   2> 620 T62 oascc.SolrZkClient.makePath makePath: /collections/collection1
[junit4:junit4]   2> 625 T62 oascc.SolrZkClient.makePath makePath: /collections/collection1/shards
[junit4:junit4]   2> 633 T62 oascc.SolrZkClient.makePath makePath: /collections/control_collection
[junit4:junit4]   2> 636 T62 oascc.SolrZkClient.makePath makePath: /collections/control_collection/shards
[junit4:junit4]   2> 641 T62 oasc.AbstractZkTestCase.putConfig put /usr/home/hudson/hudson-slave/workspace/Lucene-Solr-Tests-4.x-Java6/solr/build/solr-core/test-files/solr/collection1/conf/solrconfig.xml to /configs/conf1/solrconfig.xml
[junit4:junit4]   2> 658 T62 oascc.SolrZkClient.makePath makePath: /configs/conf1/solrconfig.xml
[junit4:junit4]   2> 665 T62 oasc.AbstractZkTestCase.putConfig put /usr/home/hudson/hudson-slave/workspace/Lucene-Solr-Tests-4.x-Java6/solr/build/solr-core/test-files/solr/collection1/conf/schema.xml to /configs/conf1/schema.xml
[junit4:junit4]   2> 666 T62 oascc.SolrZkClient.makePath makePath: /configs/conf1/schema.xml
[junit4:junit4]   2> 773 T62 oasc.AbstractZkTestCase.putConfig put /usr/home/hudson/hudson-slave/workspace/Lucene-Solr-Tests-4.x-Java6/solr/build/solr-core/test-files/solr/collection1/conf/solrconfig.xml to /configs/conf1/solrconfig.xml
[junit4:junit4]   2> 774 T62 oascc.SolrZkClient.makePath makePath: /configs/conf1/solrconfig.xml
[junit4:junit4]   2> 787 T62 oasc.AbstractZkTestCase.putConfig put /usr/home/hudson/hudson-slave/workspace/Lucene-Solr-Tests-4.x-Java6/solr/build/solr-core/test-files/solr/collection1/conf/stopwords.txt to /configs/conf1/stopwords.txt
[junit4:junit4]   2> 788 T62 oascc.SolrZkClient.makePath makePath: /configs/conf1/stopwords.txt
[junit4:junit4]   2> 792 T62 oasc.AbstractZkTestCase.putConfig put /usr/home/hudson/hudson-slave/workspace/Lucene-Solr-Tests-4.x-Java6/solr/build/solr-core/test-files/solr/collection1/conf/protwords.txt to /configs/conf1/protwords.txt
[junit4:junit4]   2> 792 T62 oascc.SolrZkClient.makePath makePath: /configs/conf1/protwords.txt
[junit4:junit4]   2> 796 T62 oasc.AbstractZkTestCase.putConfig put /usr/home/hudson/hudson-slave/workspace/Lucene-Solr-Tests-4.x-Java6/solr/build/solr-core/test-files/solr/collection1/conf/currency.xml to /configs/conf1/currency.xml
[junit4:junit4]   2> 797 T62 oascc.SolrZkClient.makePath makePath: /configs/conf1/currency.xml
[junit4:junit4]   2> 801 T62 oasc.AbstractZkTestCase.putConfig put /usr/home/hudson/hudson-slave/workspace/Lucene-Solr-Tests-4.x-Java6/solr/build/solr-core/test-files/solr/collection1/conf/open-exchange-rates.json to /configs/conf1/open-exchange-rates.json
[junit4:junit4]   2> 801 T62 oascc.SolrZkClient.makePath makePath: /configs/conf1/open-exchange-rates.json
[junit4:junit4]   2> 805 T62 oasc.AbstractZkTestCase.putConfig put /usr/home/hudson/hudson-slave/workspace/Lucene-Solr-Tests-4.x-Java6/solr/build/solr-core/test-files/solr/collection1/conf/mapping-ISOLatin1Accent.txt to /configs/conf1/mapping-ISOLatin1Accent.txt
[junit4:junit4]   2> 806 T62 oascc.SolrZkClient.makePath makePath: /configs/conf1/mapping-ISOLatin1Accent.txt
[junit4:junit4]   2> 810 T62 oasc.AbstractZkTestCase.putConfig put /usr/home/hudson/hudson-slave/workspace/Lucene-Solr-Tests-4.x-Java6/solr/build/solr-core/test-files/solr/collection1/conf/old_synonyms.txt to /configs/conf1/old_synonyms.txt
[junit4:junit4]   2> 810 T62 oascc.SolrZkClient.makePath makePath: /configs/conf1/old_synonyms.txt
[junit4:junit4]   2> 814 T62 oasc.AbstractZkTestCase.putConfig put /usr/home/hudson/hudson-slave/workspace/Lucene-Solr-Tests-4.x-Java6/solr/build/solr-core/test-files/solr/collection1/conf/synonyms.txt to /configs/conf1/synonyms.txt
[junit4:junit4]   2> 815 T62 oascc.SolrZkClient.makePath makePath: /configs/conf1/synonyms.txt
[junit4:junit4]   2> 818 T67 oazs.PrepRequestProcessor.pRequest Processed session termination for sessionid: 0x13ab16494ff0001
[junit4:junit4]   2> 820 T71 oaz.ClientCnxn$EventThread.run EventThread shut down
[junit4:junit4]   2> 820 T62 oaz.ZooKeeper.close Session: 0x13ab16494ff0001 closed
[junit4:junit4]   2> 820 T64 oazs.NIOServerCnxn.closeSock Closed socket connection for client /140.211.11.196:37431 which had sessionid 0x13ab16494ff0001
[junit4:junit4]   2> 1353 T62 oejs.Server.doStart jetty-8.1.2.v20120308
[junit4:junit4]   2> 1586 T62 oejs.AbstractConnector.doStart Started SelectChannelConnector@0.0.0.0:61401
[junit4:junit4]   2> 1610 T62 oasc.SolrResourceLoader.locateSolrHome JNDI not configured for solr (NoInitialContextEx)
[junit4:junit4]   2> 1610 T62 oasc.SolrResourceLoader.locateSolrHome using system property solr.solr.home: /usr/home/hudson/hudson-slave/workspace/Lucene-Solr-Tests-4.x-Java6/solr/build/solr-core/test-files/solr
[junit4:junit4]   2> 1611 T62 oasc.SolrResourceLoader.<init> new SolrResourceLoader for deduced Solr Home: '/usr/home/hudson/hudson-slave/workspace/Lucene-Solr-Tests-4.x-Java6/solr/build/solr-core/test-files/solr/'
[junit4:junit4]   2> 1638 T62 oass.SolrDispatchFilter.init SolrDispatchFilter.init()
[junit4:junit4]   2> 1638 T62 oasc.SolrResourceLoader.locateSolrHome JNDI not configured for solr (NoInitialContextEx)
[junit4:junit4]   2> 1638 T62 oasc.SolrResourceLoader.locateSolrHome using system property solr.solr.home: /usr/home/hudson/hudson-slave/workspace/Lucene-Solr-Tests-4.x-Java6/solr/build/solr-core/test-files/solr
[junit4:junit4]   2> 1639 T62 oasc.CoreContainer$Initializer.initialize looking for solr.xml: /usr/home/hudson/hudson-slave/workspace/Lucene-Solr-Tests-4.x-Java6/solr/build/solr-core/test-files/solr/solr.xml
[junit4:junit4]   2> 1639 T62 oasc.CoreContainer.<init> New CoreContainer 2141355741
[junit4:junit4]   2> 1640 T62 oasc.CoreContainer.load Loading CoreContainer using Solr Home: '/usr/home/hudson/hudson-slave/workspace/Lucene-Solr-Tests-4.x-Java6/solr/build/solr-core/test-files/solr/'
[junit4:junit4]   2> 1640 T62 oasc.SolrResourceLoader.<init> new SolrResourceLoader for directory: '/usr/home/hudson/hudson-slave/workspace/Lucene-Solr-Tests-4.x-Java6/solr/build/solr-core/test-files/solr/'
[junit4:junit4]   2> 1660 T62 oasc.CoreContainer.load Registering Log Listener
[junit4:junit4]   2> 1672 T62 oasc.CoreContainer.initZooKeeper Zookeeper client=127.0.0.1:63131/solr
[junit4:junit4]   2> 1693 T62 oaz.ZooKeeper.<init> Initiating client connection, connectString=127.0.0.1:63131/solr sessionTimeout=5000 watcher=org.apache.solr.common.cloud.ConnectionManager@101b8d82
[junit4:junit4]   2> 1694 T82 oaz.ClientCnxn$SendThread.startConnect Opening socket connection to server /127.0.0.1:63131
[junit4:junit4]   2> 1694 T62 oascc.ConnectionManager.waitForConnected Waiting for client to connect to ZooKeeper
[junit4:junit4]   2> 1696 T82 oaz.ClientCnxn$SendThread.primeConnection Socket connection established to localhost/127.0.0.1:63131, initiating session
[junit4:junit4]   2> 1696 T64 oazs.NIOServerCnxn$Factory.run Accepted socket connection from /140.211.11.196:62446
[junit4:junit4]   2> 1696 T64 oazs.NIOServerCnxn.readConnectRequest Client attempting to establish new session at /140.211.11.196:62446
[junit4:junit4]   2> 1699 T66 oazs.NIOServerCnxn.finishSessionInit Established session 0x13ab16494ff0002 with negotiated timeout 5000 for client /140.211.11.196:62446
[junit4:junit4]   2> 1699 T82 oaz.ClientCnxn$SendThread.readConnectResult Session establishment complete on server localhost/127.0.0.1:63131, sessionid = 0x13ab16494ff0002, negotiated timeout = 5000
[junit4:junit4]   2> 1699 T83 oascc.ConnectionManager.process Watcher org.apache.solr.common.cloud.ConnectionManager@101b8d82 name:ZooKeeperConnection Watcher:127.0.0.1:63131/solr got event WatchedEvent state:SyncConnected type:None path:null path:null type:None
[junit4:junit4]   2> 1700 T62 oascc.ConnectionManager.waitForConnected Client is connected to ZooKeeper
[junit4:junit4]   2> 1716 T67 oazs.PrepRequestProcessor.pRequest Got user-level KeeperException when processing sessionid:0x13ab16494ff0002 type:create cxid:0x2 zxid:0xfffffffffffffffe txntype:unknown reqpath:n/a Error Path:/solr/overseer Error:KeeperErrorCode = NodeExists for /solr/overseer
[junit4:junit4]   2> 1724 T62 oascc.SolrZkClient.makePath makePath: /live_nodes
[junit4:junit4]   2> 1727 T62 oasc.ZkController.createEphemeralLiveNode Register node as live in ZooKeeper:/live_nodes/127.0.0.1:61401_solr
[junit4:junit4]   2> 1731 T67 oazs.PrepRequestProcessor.pRequest Got user-level KeeperException when processing sessionid:0x13ab16494ff0002 type:delete cxid:0x7 zxid:0xfffffffffffffffe txntype:unknown reqpath:n/a Error Path:/solr/live_nodes/127.0.0.1:61401_solr Error:KeeperErrorCode = NoNode for /solr/live_nodes/127.0.0.1:61401_solr
[junit4:junit4]   2> 1732 T62 oascc.SolrZkClient.makePath makePath: /live_nodes/127.0.0.1:61401_solr
[junit4:junit4]   2> 1736 T62 oashc.HttpShardHandlerFactory.getParameter Setting socketTimeout to: 0
[junit4:junit4]   2> 1737 T62 oashc.HttpShardHandlerFactory.getParameter Setting urlScheme to: http://
[junit4:junit4]   2> 1737 T62 oashc.HttpShardHandlerFactory.getParameter Setting connTimeout to: 0
[junit4:junit4]   2> 1737 T62 oashc.HttpShardHandlerFactory.getParameter Setting maxConnectionsPerHost to: 20
[junit4:junit4]   2> 1738 T62 oashc.HttpShardHandlerFactory.getParameter Setting corePoolSize to: 0
[junit4:junit4]   2> 1738 T62 oashc.HttpShardHandlerFactory.getParameter Setting maximumPoolSize to: 2147483647
[junit4:junit4]   2> 1738 T62 oashc.HttpShardHandlerFactory.getParameter Setting maxThreadIdleTime to: 5
[junit4:junit4]   2> 1739 T62 oashc.HttpShardHandlerFactory.getParameter Setting sizeOfQueue to: -1
[junit4:junit4]   2> 1739 T62 oashc.HttpShardHandlerFactory.getParameter Setting fairnessPolicy to: false
[junit4:junit4]   2> 1739 T62 oascsi.HttpClientUtil.createClient Creating new http client, config:maxConnectionsPerHost=20&maxConnections=10000&socketTimeout=0&connTimeout=0&retry=false
[junit4:junit4]   2> 1750 T62 oascc.SolrZkClient.makePath makePath: /overseer_elect/election
[junit4:junit4]   2> 1766 T67 oazs.PrepRequestProcessor.pRequest Got user-level KeeperException when processing sessionid:0x13ab16494ff0002 type:delete cxid:0x15 zxid:0xfffffffffffffffe txntype:unknown reqpath:n/a Error Path:/solr/overseer_elect/leader Error:KeeperErrorCode = NoNode for /solr/overseer_elect/leader
[junit4:junit4]   2> 1767 T62 oascc.SolrZkClient.makePath makePath: /overseer_elect/leader
[junit4:junit4]   2> 1771 T62 oasc.Overseer.start Overseer (id=88578188241731586-127.0.0.1:61401_solr-n_0000000000) starting
[junit4:junit4]   2> 1771 T67 oazs.PrepRequestProcessor.pRequest Got user-level KeeperException when processing sessionid:0x13ab16494ff0002 type:create cxid:0x1a zxid:0xfffffffffffffffe txntype:unknown reqpath:n/a Error Path:/solr/overseer Error:KeeperErrorCode = NodeExists for /solr/overseer
[junit4:junit4]   2> 1786 T67 oazs.PrepRequestProcessor.pRequest Got user-level KeeperException when processing sessionid:0x13ab16494ff0002 type:create cxid:0x1b zxid:0xfffffffffffffffe txntype:unknown reqpath:n/a Error Path:/solr/overseer Error:KeeperErrorCode = NodeExists for /solr/overseer
[junit4:junit4]   2> 1787 T67 oazs.PrepRequestProcessor.pRequest Got user-level KeeperException when processing sessionid:0x13ab16494ff0002 type:create cxid:0x1c zxid:0xfffffffffffffffe txntype:unknown reqpath:n/a Error Path:/solr/overseer Error:KeeperErrorCode = NodeExists for /solr/overseer
[junit4:junit4]   2> 1792 T67 oazs.PrepRequestProcessor.pRequest Got user-level KeeperException when processing sessionid:0x13ab16494ff0002 type:create cxid:0x1d zxid:0xfffffffffffffffe txntype:unknown reqpath:n/a Error Path:/solr/overseer Error:KeeperErrorCode = NodeExists for /solr/overseer
[junit4:junit4]   2> 1800 T85 oasc.OverseerCollectionProcessor.run Process current queue of collection messages
[junit4:junit4]   2> 1811 T62 oascc.SolrZkClient.makePath makePath: /clusterstate.json
[junit4:junit4]   2> 1815 T62 oascc.ZkStateReader.createClusterStateWatchersAndUpdate Updating cluster state from ZooKeeper... 
[junit4:junit4]   2> 1831 T84 oasc.Overseer$ClusterStateUpdater.run Starting to work on the main queue
[junit4:junit4]   2> 1858 T62 oasc.CoreContainer.create Creating SolrCore 'collection1' using instanceDir: /usr/home/hudson/hudson-slave/workspace/Lucene-Solr-Tests-4.x-Java6/solr/build/solr-core/test-files/solr/collection1
[junit4:junit4]   2> 1859 T62 oasc.ZkController.createCollectionZkNode Check for collection zkNode:control_collection
[junit4:junit4]   2> 1860 T62 oasc.ZkController.createCollectionZkNode Collection zkNode exists
[junit4:junit4]   2> 1860 T62 oasc.ZkController.readConfigName Load collection config from:/collections/control_collection
[junit4:junit4]   2> 1862 T62 oasc.SolrResourceLoader.<init> new SolrResourceLoader for directory: '/usr/home/hudson/hudson-slave/workspace/Lucene-Solr-Tests-4.x-Java6/solr/build/solr-core/test-files/solr/collection1/'
[junit4:junit4]   2> 1863 T62 oasc.SolrResourceLoader.replaceClassLoader Adding 'file:/usr/home/hudson/hudson-slave/workspace/Lucene-Solr-Tests-4.x-Java6/solr/build/solr-core/test-files/solr/collection1/lib/classes/' to classloader
[junit4:junit4]   2> 1864 T62 oasc.SolrResourceLoader.replaceClassLoader Adding 'file:/usr/home/hudson/hudson-slave/workspace/Lucene-Solr-Tests-4.x-Java6/solr/build/solr-core/test-files/solr/collection1/lib/README' to classloader
[junit4:junit4]   2> 1916 T62 oasc.SolrConfig.<init> Using Lucene MatchVersion: LUCENE_41
[junit4:junit4]   2> 1976 T62 oasc.SolrConfig.<init> Loaded SolrConfig: solrconfig.xml
[junit4:junit4]   2> 2078 T62 oass.IndexSchema.readSchema Reading Solr Schema
[junit4:junit4]   2> 2089 T62 oass.IndexSchema.readSchema Schema name=test
[junit4:junit4]   2> 2521 T62 oass.OpenExchangeRatesOrgProvider.init Initialized with rates=open-exchange-rates.json, refreshInterval=1440.
[junit4:junit4]   2> 2530 T62 oass.IndexSchema.readSchema default search field in schema is text
[junit4:junit4]   2> 2533 T62 oass.IndexSchema.readSchema unique key field: id
[junit4:junit4]   2> 2551 T62 oass.FileExchangeRateProvider.reload Reloading exchange rates from file currency.xml
[junit4:junit4]   2> 2555 T62 oass.FileExchangeRateProvider.reload Reloading exchange rates from file currency.xml
[junit4:junit4]   2> 2559 T62 oass.OpenExchangeRatesOrgProvider.reload Reloading exchange rates from open-exchange-rates.json
[junit4:junit4]   2> 2561 T62 oass.OpenExchangeRatesOrgProvider.reload Reloading exchange rates from open-exchange-rates.json
[junit4:junit4]   2> 2564 T62 oasc.SolrCore.<init> [collection1] Opening new SolrCore at /usr/home/hudson/hudson-slave/workspace/Lucene-Solr-Tests-4.x-Java6/solr/build/solr-core/test-files/solr/collection1/, dataDir=./org.apache.solr.cloud.RecoveryZkTest-1351595889579/control/data/
[junit4:junit4]   2> 2567 T62 oasc.JmxMonitoredMap.<init> JMX monitoring is enabled. Adding Solr mbeans to JMX Server: com.sun.jmx.mbeanserver.JmxMBeanServer@2180b22e
[junit4:junit4]   2> 2591 T62 oasc.SolrCore.getNewIndexDir New index directory detected: old=null new=./org.apache.solr.cloud.RecoveryZkTest-1351595889579/control/data/index/
[junit4:junit4]   2> 2591 T62 oasc.SolrCore.initIndex WARNING [collection1] Solr index directory './org.apache.solr.cloud.RecoveryZkTest-1351595889579/control/data/index' doesn't exist. Creating new index...
[junit4:junit4]   2> 2592 T62 oasc.CachingDirectoryFactory.get return new directory for /usr/home/hudson/hudson-slave/workspace/Lucene-Solr-Tests-4.x-Java6/solr/build/solr-core/test/J1/./org.apache.solr.cloud.RecoveryZkTest-1351595889579/control/data/index forceNew:false
[junit4:junit4]   2> 2598 T62 oasc.SolrDeletionPolicy.onCommit SolrDeletionPolicy.onCommit: commits:num=1
[junit4:junit4]   2> 		commit{dir=NRTCachingDirectory(org.apache.lucene.store.NIOFSDirectory@/usr/home/hudson/hudson-slave/workspace/Lucene-Solr-Tests-4.x-Java6/solr/build/solr-core/test/J1/org.apache.solr.cloud.RecoveryZkTest-1351595889579/control/data/index lockFactory=org.apache.lucene.store.NativeFSLockFactory@720bffd; maxCacheMB=48.0 maxMergeSizeMB=4.0),segFN=segments_1,generation=1,filenames=[segments_1]
[junit4:junit4]   2> 2598 T62 oasc.SolrDeletionPolicy.updateCommits newest commit = 1
[junit4:junit4]   2> 2599 T62 oasc.SolrCore.initWriters created xml: solr.XMLResponseWriter
[junit4:junit4]   2> 2601 T62 oasup.UpdateRequestProcessorChain.init inserting DistributedUpdateProcessorFactory into updateRequestProcessorChain "dedupe"
[junit4:junit4]   2> 2601 T62 oasup.UpdateRequestProcessorChain.init inserting DistributedUpdateProcessorFactory into updateRequestProcessorChain "dedupe-allfields"
[junit4:junit4]   2> 2602 T62 oasup.UpdateRequestProcessorChain.init inserting DistributedUpdateProcessorFactory into updateRequestProcessorChain "stored_sig"
[junit4:junit4]   2> 2602 T62 oasup.UpdateRequestProcessorChain.init inserting DistributedUpdateProcessorFactory into updateRequestProcessorChain "uniq-fields"
[junit4:junit4]   2> 2603 T62 oasup.UpdateRequestProcessorChain.init inserting DistributedUpdateProcessorFactory into updateRequestProcessorChain "distrib-dup-test-chain-implicit"
[junit4:junit4]   2> 2603 T62 oasc.RequestHandlers.initHandlersFromConfig adding lazy requestHandler: solr.ReplicationHandler
[junit4:junit4]   2> 2604 T62 oasc.RequestHandlers.initHandlersFromConfig created /replication: solr.ReplicationHandler
[junit4:junit4]   2> 2604 T62 oasc.RequestHandlers.initHandlersFromConfig created standard: solr.StandardRequestHandler
[junit4:junit4]   2> 2605 T62 oasc.RequestHandlers.initHandlersFromConfig created /get: solr.RealTimeGetHandler
[junit4:junit4]   2> 2606 T62 oasc.RequestHandlers.initHandlersFromConfig created dismax: solr.SearchHandler
[junit4:junit4]   2> 2606 T62 oasc.RequestHandlers.initHandlersFromConfig created mock: org.apache.solr.core.MockQuerySenderListenerReqHandler
[junit4:junit4]   2> 2607 T62 oasc.RequestHandlers.initHandlersFromConfig created /admin/: org.apache.solr.handler.admin.AdminHandlers
[junit4:junit4]   2> 2607 T62 oasc.RequestHandlers.initHandlersFromConfig created defaults: solr.StandardRequestHandler
[junit4:junit4]   2> 2607 T62 oasc.RequestHandlers.initHandlersFromConfig adding lazy requestHandler: solr.StandardRequestHandler
[junit4:junit4]   2> 2608 T62 oasc.RequestHandlers.initHandlersFromConfig created lazy: solr.StandardRequestHandler
[junit4:junit4]   2> 2608 T62 oasc.RequestHandlers.initHandlersFromConfig created /update: solr.UpdateRequestHandler
[junit4:junit4]   2> 2609 T62 oasc.RequestHandlers.initHandlersFromConfig created /terms: org.apache.solr.handler.component.SearchHandler
[junit4:junit4]   2> 2609 T62 oasc.RequestHandlers.initHandlersFromConfig created spellCheckCompRH: org.apache.solr.handler.component.SearchHandler
[junit4:junit4]   2> 2610 T62 oasc.RequestHandlers.initHandlersFromConfig created spellCheckCompRH_Direct: org.apache.solr.handler.component.SearchHandler
[junit4:junit4]   2> 2611 T62 oasc.RequestHandlers.initHandlersFromConfig created spellCheckWithWordbreak: org.apache.solr.handler.component.SearchHandler
[junit4:junit4]   2> 2611 T62 oasc.RequestHandlers.initHandlersFromConfig created spellCheckWithWordbreak_Direct: org.apache.solr.handler.component.SearchHandler
[junit4:junit4]   2> 2612 T62 oasc.RequestHandlers.initHandlersFromConfig created spellCheckCompRH1: org.apache.solr.handler.component.SearchHandler
[junit4:junit4]   2> 2612 T62 oasc.RequestHandlers.initHandlersFromConfig created tvrh: org.apache.solr.handler.component.SearchHandler
[junit4:junit4]   2> 2613 T62 oasc.RequestHandlers.initHandlersFromConfig created /mlt: solr.MoreLikeThisHandler
[junit4:junit4]   2> 2613 T62 oasc.RequestHandlers.initHandlersFromConfig created /debug/dump: solr.DumpRequestHandler
[junit4:junit4]   2> 2618 T62 oashl.XMLLoader.init xsltCacheLifetimeSeconds=60
[junit4:junit4]   2> 2622 T62 oasc.SolrCore.initDeprecatedSupport WARNING solrconfig.xml uses deprecated <admin/gettableFiles>, Please update your config to use the ShowFileRequestHandler.
[junit4:junit4]   2> 2623 T62 oasc.SolrCore.initDeprecatedSupport WARNING adding ShowFileRequestHandler with hidden files: [SCHEMA.XML, OLD_SYNONYMS.TXT, STOPWORDS.TXT, PROTWORDS.TXT, OPEN-EXCHANGE-RATES.JSON, SYNONYMS.TXT, CURRENCY.XML, MAPPING-ISOLATIN1ACCENT.TXT]
[junit4:junit4]   2> 2627 T62 oass.SolrIndexSearcher.<init> Opening Searcher@d3bef50 main
[junit4:junit4]   2> 2644 T62 oasu.CommitTracker.<init> Hard AutoCommit: disabled
[junit4:junit4]   2> 2645 T62 oasu.CommitTracker.<init> Soft AutoCommit: disabled
[junit4:junit4]   2> 2645 T62 oashc.SpellCheckComponent.inform Initializing spell checkers
[junit4:junit4]   2> 2651 T62 oass.DirectSolrSpellChecker.init init: {name=direct,classname=DirectSolrSpellChecker,field=lowerfilt,minQueryLength=3}
[junit4:junit4]   2> 2707 T90 oasc.SolrCore.registerSearcher [collection1] Registered new searcher Searcher@d3bef50 main{StandardDirectoryReader(segments_1:1)}
[junit4:junit4]   2> 2711 T62 oasc.ZkController.publish numShards not found on descriptor - reading it from system property
[junit4:junit4]   2> 2712 T67 oazs.PrepRequestProcessor.pRequest Got user-level KeeperException when processing sessionid:0x13ab16494ff0002 type:create cxid:0x53 zxid:0xfffffffffffffffe txntype:unknown reqpath:n/a Error Path:/solr/overseer/queue Error:KeeperErrorCode = NoNode for /solr/overseer/queue
[junit4:junit4]   2> 2724 T62 oasc.CoreContainer.register registering core: collection1
[junit4:junit4]   2> 2724 T62 oasc.ZkController.register Register shard - core:collection1 address:http://127.0.0.1:61401/solr shardId:control_shard
[junit4:junit4]   2> 2734 T62 oascsi.HttpClientUtil.createClient Creating new http client, config:maxConnections=10000&maxConnectionsPerHost=20&connTimeout=30000&socketTimeout=30000&retry=false
[junit4:junit4]   2> 2744 T62 oascc.SolrZkClient.makePath makePath: /collections/control_collection/leader_elect/control_shard/election
[junit4:junit4]   2> 2763 T67 oazs.PrepRequestProcessor.pRequest Got user-level KeeperException when processing sessionid:0x13ab16494ff0002 type:delete cxid:0x62 zxid:0xfffffffffffffffe txntype:unknown reqpath:n/a Error Path:/solr/collections/control_collection/leaders Error:KeeperErrorCode = NoNode for /solr/collections/control_collection/leaders
[junit4:junit4]   2> 2764 T62 oasc.ShardLeaderElectionContext.runLeaderProcess Running the leader process.
[junit4:junit4]   2> 2765 T67 oazs.PrepRequestProcessor.pRequest Got user-level KeeperException when processing sessionid:0x13ab16494ff0002 type:create cxid:0x63 zxid:0xfffffffffffffffe txntype:unknown reqpath:n/a Error Path:/solr/overseer Error:KeeperErrorCode = NodeExists for /solr/overseer
[junit4:junit4]   2> 2838 T84 oascc.ZkStateReader.updateClusterState Updating cloud state from ZooKeeper... 
[junit4:junit4]   2> 2839 T84 oasc.Overseer$ClusterStateUpdater.updateState Update state numShards=null message={
[junit4:junit4]   2> 	  "operation":"state",
[junit4:junit4]   2> 	  "numShards":null,
[junit4:junit4]   2> 	  "shard":"control_shard",
[junit4:junit4]   2> 	  "roles":null,
[junit4:junit4]   2> 	  "state":"down",
[junit4:junit4]   2> 	  "core":"collection1",
[junit4:junit4]   2> 	  "collection":"control_collection",
[junit4:junit4]   2> 	  "node_name":"127.0.0.1:61401_solr",
[junit4:junit4]   2> 	  "base_url":"http://127.0.0.1:61401/solr"}
[junit4:junit4]   2> 2849 T67 oazs.PrepRequestProcessor.pRequest Got user-level KeeperException when processing sessionid:0x13ab16494ff0002 type:create cxid:0x6a zxid:0xfffffffffffffffe txntype:unknown reqpath:n/a Error Path:/solr/overseer/queue-work Error:KeeperErrorCode = NoNode for /solr/overseer/queue-work
[junit4:junit4]   2> 2879 T83 oascc.ZkStateReader$2.process A cluster state change has occurred - updating... (1)
[junit4:junit4]   2> 3273 T62 oasc.ShardLeaderElectionContext.waitForReplicasToComeUp Enough replicas found to continue.
[junit4:junit4]   2> 3274 T62 oasc.ShardLeaderElectionContext.runLeaderProcess I may be the new leader - try and sync
[junit4:junit4]   2> 3275 T62 oasc.SyncStrategy.sync Sync replicas to http://127.0.0.1:61401/solr/collection1/
[junit4:junit4]   2> 3275 T62 oasc.SyncStrategy.syncReplicas Sync Success - now sync replicas to me
[junit4:junit4]   2> 3276 T62 oasc.SyncStrategy.syncToMe http://127.0.0.1:61401/solr/collection1/ has no replicas
[junit4:junit4]   2> 3276 T62 oasc.ShardLeaderElectionContext.runLeaderProcess I am the new leader: http://127.0.0.1:61401/solr/collection1/
[junit4:junit4]   2> 3277 T62 oascc.SolrZkClient.makePath makePath: /collections/control_collection/leaders/control_shard
[junit4:junit4]   2> 3283 T67 oazs.PrepRequestProcessor.pRequest Got user-level KeeperException when processing sessionid:0x13ab16494ff0002 type:create cxid:0x88 zxid:0xfffffffffffffffe txntype:unknown reqpath:n/a Error Path:/solr/overseer Error:KeeperErrorCode = NodeExists for /solr/overseer
[junit4:junit4]   2> 3388 T84 oascc.ZkStateReader.updateClusterState Updating cloud state from ZooKeeper... 
[junit4:junit4]   2> 3408 T83 oascc.ZkStateReader$2.process A cluster state change has occurred - updating... (1)
[junit4:junit4]   2> 3448 T62 oasc.ZkController.register We are http://127.0.0.1:61401/solr/collection1/ and leader is http://127.0.0.1:61401/solr/collection1/
[junit4:junit4]   2> 3452 T62 oasc.ZkController.register No LogReplay needed for core=collection1 baseURL=http://127.0.0.1:61401/solr
[junit4:junit4]   2> 3453 T62 oasc.ZkController.checkRecovery I am the leader, no recovery necessary
[junit4:junit4]   2> 3453 T62 oasc.ZkController.publish numShards not found on descriptor - reading it from system property
[junit4:junit4]   2> 3457 T62 oascc.ZkStateReader.updateClusterState Updating cloud state from ZooKeeper... 
[junit4:junit4]   2> 3458 T62 oass.SolrDispatchFilter.init user.dir=/usr/home/hudson/hudson-slave/workspace/Lucene-Solr-Tests-4.x-Java6/solr/build/solr-core/test/J1
[junit4:junit4]   2> 3459 T62 oass.SolrDispatchFilter.init SolrDispatchFilter.init() done
[junit4:junit4]   2> 3532 T62 oascsi.HttpClientUtil.createClient Creating new http client, config:maxConnections=128&maxConnectionsPerHost=32&followRedirects=false
[junit4:junit4]   2> 3719 T62 oejs.Server.doStart jetty-8.1.2.v20120308
[junit4:junit4]   2> 3722 T62 oejs.AbstractConnector.doStart Started SelectChannelConnector@0.0.0.0:39828
[junit4:junit4]   2> 3723 T62 oasc.SolrResourceLoader.locateSolrHome JNDI not configured for solr (NoInitialContextEx)
[junit4:junit4]   2> 3724 T62 oasc.SolrResourceLoader.locateSolrHome using system property solr.solr.home: /usr/home/hudson/hudson-slave/workspace/Lucene-Solr-Tests-4.x-Java6/solr/build/solr-core/test/J1/./solrtest-jetty1-1351595893132
[junit4:junit4]   2> 3724 T62 oasc.SolrResourceLoader.<init> new SolrResourceLoader for deduced Solr Home: '/usr/home/hudson/hudson-slave/workspace/Lucene-Solr-Tests-4.x-Java6/solr/build/solr-core/test/J1/./solrtest-jetty1-1351595893132/'
[junit4:junit4]   2> 3760 T62 oass.SolrDispatchFilter.init SolrDispatchFilter.init()
[junit4:junit4]   2> 3761 T62 oasc.SolrResourceLoader.locateSolrHome JNDI not configured for solr (NoInitialContextEx)
[junit4:junit4]   2> 3761 T62 oasc.SolrResourceLoader.locateSolrHome using system property solr.solr.home: /usr/home/hudson/hudson-slave/workspace/Lucene-Solr-Tests-4.x-Java6/solr/build/solr-core/test/J1/./solrtest-jetty1-1351595893132
[junit4:junit4]   2> 3762 T62 oasc.CoreContainer$Initializer.initialize looking for solr.xml: /usr/home/hudson/hudson-slave/workspace/Lucene-Solr-Tests-4.x-Java6/solr/build/solr-core/test/J1/./solrtest-jetty1-1351595893132/solr.xml
[junit4:junit4]   2> 3762 T62 oasc.CoreContainer.<init> New CoreContainer 1029943554
[junit4:junit4]   2> 3763 T62 oasc.CoreContainer.load Loading CoreContainer using Solr Home: '/usr/home/hudson/hudson-slave/workspace/Lucene-Solr-Tests-4.x-Java6/solr/build/solr-core/test/J1/./solrtest-jetty1-1351595893132/'
[junit4:junit4]   2> 3764 T62 oasc.SolrResourceLoader.<init> new SolrResourceLoader for directory: '/usr/home/hudson/hudson-slave/workspace/Lucene-Solr-Tests-4.x-Java6/solr/build/solr-core/test/J1/./solrtest-jetty1-1351595893132/'
[junit4:junit4]   2> 3790 T62 oasc.CoreContainer.load Registering Log Listener
[junit4:junit4]   2> 3806 T62 oasc.CoreContainer.initZooKeeper Zookeeper client=127.0.0.1:63131/solr
[junit4:junit4]   2> 3806 T62 oaz.ZooKeeper.<init> Initiating client connection, connectString=127.0.0.1:63131/solr sessionTimeout=5000 watcher=org.apache.solr.common.cloud.ConnectionManager@b34bf3
[junit4:junit4]   2> 3807 T100 oaz.ClientCnxn$SendThread.startConnect Opening socket connection to server /127.0.0.1:63131
[junit4:junit4]   2> 3807 T62 oascc.ConnectionManager.waitForConnected Waiting for client to connect to ZooKeeper
[junit4:junit4]   2> 3809 T100 oaz.ClientCnxn$SendThread.primeConnection Socket connection established to localhost/127.0.0.1:63131, initiating session
[junit4:junit4]   2> 3809 T64 oazs.NIOServerCnxn$Factory.run Accepted socket connection from /140.211.11.196:18064
[junit4:junit4]   2> 3810 T64 oazs.NIOServerCnxn.readConnectRequest Client attempting to establish new session at /140.211.11.196:18064
[junit4:junit4]   2> 3815 T66 oazs.NIOServerCnxn.finishSessionInit Established session 0x13ab16494ff0003 with negotiated timeout 5000 for client /140.211.11.196:18064
[junit4:junit4]   2> 3816 T100 oaz.ClientCnxn$SendThread.readConnectResult Session establishment complete on server localhost/127.0.0.1:63131, sessionid = 0x13ab16494ff0003, negotiated timeout = 5000
[junit4:junit4]   2> 3816 T101 oascc.ConnectionManager.process Watcher org.apache.solr.common.cloud.ConnectionManager@b34bf3 name:ZooKeeperConnection Watcher:127.0.0.1:63131/solr got event WatchedEvent state:SyncConnected type:None path:null path:null type:None
[junit4:junit4]   2> 3816 T62 oascc.ConnectionManager.waitForConnected Client is connected to ZooKeeper
[junit4:junit4]   2> 3817 T67 oazs.PrepRequestProcessor.pRequest Got user-level KeeperException when processing sessionid:0x13ab16494ff0003 type:create cxid:0x1 zxid:0xfffffffffffffffe txntype:unknown reqpath:n/a Error Path:/solr/overseer Error:KeeperErrorCode = NodeExists for /solr/overseer
[junit4:junit4]   2> 3830 T67 oazs.PrepRequestProcessor.pRequest Got user-level KeeperException when processing sessionid:0x13ab16494ff0003 type:create cxid:0x2 zxid:0xfffffffffffffffe txntype:unknown reqpath:n/a Error Path:/solr/overseer Error:KeeperErrorCode = NodeExists for /solr/overseer
[junit4:junit4]   2> 3833 T62 oasc.ZkController.createEphemeralLiveNode Register node as live in ZooKeeper:/live_nodes/127.0.0.1:39828_solr
[junit4:junit4]   2> 3834 T67 oazs.PrepRequestProcessor.pRequest Got user-level KeeperException when processing sessionid:0x13ab16494ff0003 type:delete cxid:0x4 zxid:0xfffffffffffffffe txntype:unknown reqpath:n/a Error Path:/solr/live_nodes/127.0.0.1:39828_solr Error:KeeperErrorCode = NoNode for /solr/live_nodes/127.0.0.1:39828_solr
[junit4:junit4]   2> 3837 T62 oascc.SolrZkClient.makePath makePath: /live_nodes/127.0.0.1:39828_solr
[junit4:junit4]   2> 3845 T83 oascc.ZkStateReader$3.process Updating live nodes... (2)
[junit4:junit4]   2> 3846 T62 oashc.HttpShardHandlerFactory.getParameter Setting socketTimeout to: 0
[junit4:junit4]   2> 3846 T62 oashc.HttpShardHandlerFactory.getParameter Setting urlScheme to: http://
[junit4:junit4]   2> 3847 T62 oashc.HttpShardHandlerFactory.getParameter Setting connTimeout to: 0
[junit4:junit4]   2> 3847 T62 oashc.HttpShardHandlerFactory.getParameter Setting maxConnectionsPerHost to: 20
[junit4:junit4]   2> 3848 T62 oashc.HttpShardHandlerFactory.getParameter Setting corePoolSize to: 0
[junit4:junit4]   2> 3848 T62 oashc.HttpShardHandlerFactory.getParameter Setting maximumPoolSize to: 2147483647
[junit4:junit4]   2> 3849 T62 oashc.HttpShardHandlerFactory.getParameter Setting maxThreadIdleTime to: 5
[junit4:junit4]   2> 3849 T62 oashc.HttpShardHandlerFactory.getParameter Setting sizeOfQueue to: -1
[junit4:junit4]   2> 3850 T62 oashc.HttpShardHandlerFactory.getParameter Setting fairnessPolicy to: false
[junit4:junit4]   2> 3850 T62 oascsi.HttpClientUtil.createClient Creating new http client, config:maxConnectionsPerHost=20&maxConnections=10000&socketTimeout=0&connTimeout=0&retry=false
[junit4:junit4]   2> 3874 T62 oascc.ZkStateReader.createClusterStateWatchersAndUpdate Updating cluster state from ZooKeeper... 
[junit4:junit4]   2> 3881 T62 oasc.CoreContainer.create Creating SolrCore 'collection1' using instanceDir: /usr/home/hudson/hudson-slave/workspace/Lucene-Solr-Tests-4.x-Java6/solr/build/solr-core/test/J1/./solrtest-jetty1-1351595893132/collection1
[junit4:junit4]   2> 3881 T62 oasc.ZkController.createCollectionZkNode Check for collection zkNode:collection1
[junit4:junit4]   2> 3882 T62 oasc.ZkController.createCollectionZkNode Collection zkNode exists
[junit4:junit4]   2> 3883 T62 oasc.ZkController.readConfigName Load collection config from:/collections/collection1
[junit4:junit4]   2> 3885 T62 oasc.SolrResourceLoader.<init> new SolrResourceLoader for directory: '/usr/home/hudson/hudson-slave/workspace/Lucene-Solr-Tests-4.x-Java6/solr/build/solr-core/test/J1/./solrtest-jetty1-1351595893132/collection1/'
[junit4:junit4]   2> 3886 T62 oasc.SolrResourceLoader.replaceClassLoader Adding 'file:/usr/home/hudson/hudson-slave/workspace/Lucene-Solr-Tests-4.x-Java6/solr/build/solr-core/test/J1/solrtest-jetty1-1351595893132/collection1/lib/classes/' to classloader
[junit4:junit4]   2> 3887 T62 oasc.SolrResourceLoader.replaceClassLoader Adding 'file:/usr/home/hudson/hudson-slave/workspace/Lucene-Solr-Tests-4.x-Java6/solr/build/solr-core/test/J1/solrtest-jetty1-1351595893132/collection1/lib/README' to classloader
[junit4:junit4]   2> 3915 T84 oascc.ZkStateReader.updateClusterState Updating cloud state from ZooKeeper... 
[junit4:junit4]   2> 3916 T84 oasc.Overseer$ClusterStateUpdater.updateState Update state numShards=null message={
[junit4:junit4]   2> 	  "operation":"state",
[junit4:junit4]   2> 	  "numShards":null,
[junit4:junit4]   2> 	  "shard":"control_shard",
[junit4:junit4]   2> 	  "roles":null,
[junit4:junit4]   2> 	  "state":"active",
[junit4:junit4]   2> 	  "core":"collection1",
[junit4:junit4]   2> 	  "collection":"control_collection",
[junit4:junit4]   2> 	  "node_name":"127.0.0.1:61401_solr",
[junit4:junit4]   2> 	  "base_url":"http://127.0.0.1:61401/solr"}
[junit4:junit4]   2> 3930 T83 oascc.ZkStateReader$2.process A cluster state change has occurred - updating... (2)
[junit4:junit4]   2> 3930 T101 oascc.ZkStateReader$2.process A cluster state change has occurred - updating... (2)
[junit4:junit4]   2> 3947 T62 oasc.SolrConfig.<init> Using Lucene MatchVersion: LUCENE_41
[junit4:junit4]   2> 4024 T62 oasc.SolrConfig.<init> Loaded SolrConfig: solrconfig.xml
[junit4:junit4]   2> 4126 T62 oass.IndexSchema.readSchema Reading Solr Schema
[junit4:junit4]   2> 4140 T62 oass.IndexSchema.readSchema Schema name=test
[junit4:junit4]   2> 4832 T62 oass.OpenExchangeRatesOrgProvider.init Initialized with rates=open-exchange-rates.json, refreshInterval=1440.
[junit4:junit4]   2> 4864 T62 oass.IndexSchema.readSchema default search field in schema is text
[junit4:junit4]   2> 4870 T62 oass.IndexSchema.readSchema unique key field: id
[junit4:junit4]   2> 4901 T62 oass.FileExchangeRateProvider.reload Reloading exchange rates from file currency.xml
[junit4:junit4]   2> 4908 T62 oass.FileExchangeRateProvider.reload Reloading exchange rates from file currency.xml
[junit4:junit4]   2> 4914 T62 oass.OpenExchangeRatesOrgProvider.reload Reloading exchange rates from open-exchange-rates.json
[junit4:junit4]   2> 4917 T62 oass.OpenExchangeRatesOrgProvider.reload Reloading exchange rates from open-exchange-rates.json
[junit4:junit4]   2> 4919 T62 oasc.SolrCore.<init> [collection1] Opening new SolrCore at /usr/home/hudson/hudson-slave/workspace/Lucene-Solr-Tests-4.x-Java6/solr/build/solr-core/test/J1/./solrtest-jetty1-1351595893132/collection1/, dataDir=./org.apache.solr.cloud.RecoveryZkTest-1351595889579/jetty1/
[junit4:junit4]   2> 4920 T62 oasc.JmxMonitoredMap.<init> JMX monitoring is enabled. Adding Solr mbeans to JMX Server: com.sun.jmx.mbeanserver.JmxMBeanServer@2180b22e
[junit4:junit4]   2> 4922 T62 oasc.SolrCore.getNewIndexDir New index directory detected: old=null new=./org.apache.solr.cloud.RecoveryZkTest-1351595889579/jetty1/index/
[junit4:junit4]   2> 4923 T62 oasc.SolrCore.initIndex WARNING [collection1] Solr index directory './org.apache.solr.cloud.RecoveryZkTest-1351595889579/jetty1/index' doesn't exist. Creating new index...
[junit4:junit4]   2> 4924 T62 oasc.CachingDirectoryFactory.get return new directory for /usr/home/hudson/hudson-slave/workspace/Lucene-Solr-Tests-4.x-Java6/solr/build/solr-core/test/J1/./org.apache.solr.cloud.RecoveryZkTest-1351595889579/jetty1/index forceNew:false
[junit4:junit4]   2> 4931 T62 oasc.SolrDeletionPolicy.onCommit SolrDeletionPolicy.onCommit: commits:num=1
[junit4:junit4]   2> 		commit{dir=NRTCachingDirectory(org.apache.lucene.store.NIOFSDirectory@/usr/home/hudson/hudson-slave/workspace/Lucene-Solr-Tests-4.x-Java6/solr/build/solr-core/test/J1/org.apache.solr.cloud.RecoveryZkTest-1351595889579/jetty1/index lockFactory=org.apache.lucene.store.NativeFSLockFactory@24c3e952; maxCacheMB=48.0 maxMergeSizeMB=4.0),segFN=segments_1,generation=1,filenames=[segments_1]
[junit4:junit4]   2> 4932 T62 oasc.SolrDeletionPolicy.updateCommits newest commit = 1
[junit4:junit4]   2> 4933 T62 oasc.SolrCore.initWriters created xml: solr.XMLResponseWriter
[junit4:junit4]   2> 4936 T62 oasup.UpdateRequestProcessorChain.init inserting DistributedUpdateProcessorFactory into updateRequestProcessorChain "dedupe"
[junit4:junit4]   2> 4936 T62 oasup.UpdateRequestProcessorChain.init inserting DistributedUpdateProcessorFactory into updateRequestProcessorChain "dedupe-allfields"
[junit4:junit4]   2> 4937 T62 oasup.UpdateRequestProcessorChain.init inserting DistributedUpdateProcessorFactory into updateRequestProcessorChain "stored_sig"
[junit4:junit4]   2> 4937 T62 oasup.UpdateRequestProcessorChain.init inserting DistributedUpdateProcessorFactory into updateRequestProcessorChain "uniq-fields"
[junit4:junit4]   2> 4938 T62 oasup.UpdateRequestProcessorChain.init inserting DistributedUpdateProcessorFactory into updateRequestProcessorChain "distrib-dup-test-chain-implicit"
[junit4:junit4]   2> 4939 T62 oasc.RequestHandlers.initHandlersFromConfig adding lazy requestHandler: solr.ReplicationHandler
[junit4:junit4]   2> 4940 T62 oasc.RequestHandlers.initHandlersFromConfig created /replication: solr.ReplicationHandler
[junit4:junit4]   2> 4941 T62 oasc.RequestHandlers.initHandlersFromConfig created standard: solr.StandardRequestHandler
[junit4:junit4]   2> 4942 T62 oasc.RequestHandlers.initHandlersFromConfig created /get: solr.RealTimeGetHandler
[junit4:junit4]   2> 4942 T62 oasc.RequestHandlers.initHandlersFromConfig created dismax: solr.SearchHandler
[junit4:junit4]   2> 4943 T62 oasc.RequestHandlers.initHandlersFromConfig created mock: org.apache.solr.core.MockQuerySenderListenerReqHandler
[junit4:junit4]   2> 4944 T62 oasc.RequestHandlers.initHandlersFromConfig created /admin/: org.apache.solr.handler.admin.AdminHandlers
[junit4:junit4]   2> 4945 T62 oasc.RequestHandlers.initHandlersFromConfig created defaults: solr.StandardRequestHandler
[junit4:junit4]   2> 4945 T62 oasc.RequestHandlers.initHandlersFromConfig adding lazy requestHandler: solr.StandardRequestHandler
[junit4:junit4]   2> 4946 T62 oasc.RequestHandlers.initHandlersFromConfig created lazy: solr.StandardRequestHandler
[junit4:junit4]   2> 4947 T62 oasc.RequestHandlers.initHandlersFromConfig created /update: solr.UpdateRequestHandler
[junit4:junit4]   2> 4947 T62 oasc.RequestHandlers.initHandlersFromConfig created /terms: org.apache.solr.handler.component.SearchHandler
[junit4:junit4]   2> 4948 T62 oasc.RequestHandlers.initHandlersFromConfig created spellCheckCompRH: org.apache.solr.handler.component.SearchHandler
[junit4:junit4]   2> 4949 T62 oasc.RequestHandlers.initHandlersFromConfig created spellCheckCompRH_Direct: org.apache.solr.handler.component.SearchHandler
[junit4:junit4]   2> 4950 T62 oasc.RequestHandlers.initHandlersFromConfig created spellCheckWithWordbreak: org.apache.solr.handler.component.SearchHandler
[junit4:junit4]   2> 4951 T62 oasc.RequestHandlers.initHandlersFromConfig created spellCheckWithWordbreak_Direct: org.apache.solr.handler.component.SearchHandler
[junit4:junit4]   2> 4951 T62 oasc.RequestHandlers.initHandlersFromConfig created spellCheckCompRH1: org.apache.solr.handler.component.SearchHandler
[junit4:junit4]   2> 4952 T62 oasc.RequestHandlers.initHandlersFromConfig created tvrh: org.apache.solr.handler.component.SearchHandler
[junit4:junit4]   2> 4953 T62 oasc.RequestHandlers.initHandlersFromConfig created /mlt: solr.MoreLikeThisHandler
[junit4:junit4]   2> 4954 T62 oasc.RequestHandlers.initHandlersFromConfig created /debug/dump: solr.DumpRequestHandler
[junit4:junit4]   2> 4961 T62 oashl.XMLLoader.init xsltCacheLifetimeSeconds=60
[junit4:junit4]   2> 4966 T62 oasc.SolrCore.initDeprecatedSupport WARNING solrconfig.xml uses deprecated <admin/gettableFiles>, Please update your config to use the ShowFileRequestHandler.
[junit4:junit4]   2> 4968 T62 oasc.SolrCore.initDeprecatedSupport WARNING adding ShowFileRequestHandler with hidden files: [SCHEMA.XML, OLD_SYNONYMS.TXT, STOPWORDS.TXT, PROTWORDS.TXT, OPEN-EXCHANGE-RATES.JSON, SYNONYMS.TXT, CURRENCY.XML, MAPPING-ISOLATIN1ACCENT.TXT]
[junit4:junit4]   2> 4973 T62 oass.SolrIndexSearcher.<init> Opening Searcher@3768442e main
[junit4:junit4]   2> 4975 T62 oasu.CommitTracker.<init> Hard AutoCommit: disabled
[junit4:junit4]   2> 4975 T62 oasu.CommitTracker.<init> Soft AutoCommit: disabled
[junit4:junit4]   2> 4976 T62 oashc.SpellCheckComponent.inform Initializing spell checkers
[junit4:junit4]   2> 4986 T62 oass.DirectSolrSpellChecker.init init: {name=direct,classname=DirectSolrSpellChecker,field=lowerfilt,minQueryLength=3}
[junit4:junit4]   2> 5042 T105 oasc.SolrCore.registerSearcher [collection1] Registered new searcher Searcher@3768442e main{StandardDirectoryReader(segments_1:1)}
[junit4:junit4]   2> 5049 T62 oasc.ZkController.publish numShards not found on descriptor - reading it from system property
[junit4:junit4]   2> 5442 T84 oascc.ZkStateReader.updateClusterState Updating cloud state from ZooKeeper... 
[junit4:junit4]   2> 5443 T84 oasc.Overseer$ClusterStateUpdater.updateState Update state numShards=1 message={
[junit4:junit4]   2> 	  "operation":"state",
[junit4:junit4]   2> 	  "numShards":"1",
[junit4:junit4]   2> 	  "shard":null,
[junit4:junit4]   2> 	  "roles":null,
[junit4:junit4]   2> 	  "state":"down",
[junit4:junit4]   2> 	  "core":"collection1",
[junit4:junit4]   2> 	  "collection":"collection1",
[junit4:junit4]   2> 	  "node_name":"127.0.0.1:39828_solr",
[junit4:junit4]   2> 	  "base_url":"http://127.0.0.1:39828/solr"}
[junit4:junit4]   2> 5444 T84 oasc.Overseer$ClusterStateUpdater.createCollection Create collection collection1 with numShards 1
[junit4:junit4]   2> 5464 T101 oascc.ZkStateReader$2.process A cluster state change has occurred - updating... (2)
[junit4:junit4]   2> 5464 T83 oascc.ZkStateReader$2.process A cluster state change has occurred - updating... (2)
[junit4:junit4]   2> 5553 T62 oasc.CoreContainer.register registering core: collection1
[junit4:junit4]   2> 5553 T62 oasc.ZkController.register Register shard - core:collection1 address:http://127.0.0.1:39828/solr shardId:shard1
[junit4:junit4]   2> 5555 T62 oascc.SolrZkClient.makePath makePath: /collections/collection1/leader_elect/shard1/election
[junit4:junit4]   2> 5573 T67 oazs.PrepRequestProcessor.pRequest Got user-level KeeperException when processing sessionid:0x13ab16494ff0003 type:delete cxid:0x43 zxid:0xfffffffffffffffe txntype:unknown reqpath:n/a Error Path:/solr/collections/collection1/leaders Error:KeeperErrorCode = NoNode for /solr/collections/collection1/leaders
[junit4:junit4]   2> 5574 T62 oasc.ShardLeaderElectionContext.runLeaderProcess Running the leader process.
[junit4:junit4]   2> 5575 T67 oazs.PrepRequestProcessor.pRequest Got user-level KeeperException when processing sessionid:0x13ab16494ff0003 type:create cxid:0x44 zxid:0xfffffffffffffffe txntype:unknown reqpath:n/a Error Path:/solr/overseer Error:KeeperErrorCode = NodeExists for /solr/overseer
[junit4:junit4]   2> 5584 T62 oasc.ShardLeaderElectionContext.waitForReplicasToComeUp Enough replicas found to continue.
[junit4:junit4]   2> 5585 T62 oasc.ShardLeaderElectionContext.runLeaderProcess I may be the new leader - try and sync
[junit4:junit4]   2> 5585 T62 oasc.SyncStrategy.sync Sync replicas to http://127.0.0.1:39828/solr/collection1/
[junit4:junit4]   2> 5586 T62 oasc.SyncStrategy.syncReplicas Sync Success - now sync replicas to me
[junit4:junit4]   2> 5586 T62 oasc.SyncStrategy.syncToMe http://127.0.0.1:39828/solr/collection1/ has no replicas
[junit4:junit4]   2> 5586 T62 oasc.ShardLeaderElectionContext.runLeaderProcess I am the new leader: http://127.0.0.1:39828/solr/collection1/
[junit4:junit4]   2> 5587 T62 oascc.SolrZkClient.makePath makePath: /collections/collection1/leaders/shard1
[junit4:junit4]   2> 5592 T67 oazs.PrepRequestProcessor.pRequest Got user-level KeeperException when processing sessionid:0x13ab16494ff0003 type:create cxid:0x4e zxid:0xfffffffffffffffe txntype:unknown reqpath:n/a Error Path:/solr/overseer Error:KeeperErrorCode = NodeExists for /solr/overseer
[junit4:junit4]   2> 5970 T84 oascc.ZkStateReader.updateClusterState Updating cloud state from ZooKeeper... 
[junit4:junit4]   2> 5990 T83 oascc.ZkStateReader$2.process A cluster state change has occurred - updating... (2)
[junit4:junit4]   2> 5990 T101 oascc.ZkStateReader$2.process A cluster state change has occurred - updating... (2)
[junit4:junit4]   2> 6003 T62 oasc.ZkController.register We are http://127.0.0.1:39828/solr/collection1/ and leader is http://127.0.0.1:39828/solr/collection1/
[junit4:junit4]   2> 6003 T62 oasc.ZkController.register No LogReplay needed for core=collection1 baseURL=http://127.0.0.1:39828/solr
[junit4:junit4]   2> 6004 T62 oasc.ZkController.checkRecovery I am the leader, no recovery necessary
[junit4:junit4]   2> 6004 T62 oasc.ZkController.publish numShards not found on descriptor - reading it from system property
[junit4:junit4]   2> 6013 T62 oascc.ZkStateReader.updateClusterState Updating cloud state from ZooKeeper... 
[junit4:junit4]   2> 6014 T62 oass.SolrDispatchFilter.init user.dir=/usr/home/hudson/hudson-slave/workspace/Lucene-Solr-Tests-4.x-Java6/solr/build/solr-core/test/J1
[junit4:junit4]   2> 6014 T62 oass.SolrDispatchFilter.init SolrDispatchFilter.init() done
[junit4:junit4]   2> 6015 T62 oascsi.HttpClientUtil.createClient Creating new http client, config:maxConnections=128&maxConnectionsPerHost=32&followRedirects=false
[junit4:junit4]   2> 6130 T62 oejs.Server.doStart jetty-8.1.2.v20120308
[junit4:junit4]   2> 6133 T62 oejs.AbstractConnector.doStart Started SelectChannelConnector@0.0.0.0:13544
[junit4:junit4]   2> 6134 T62 oasc.SolrResourceLoader.locateSolrHome JNDI not configured for solr (NoInitialContextEx)
[junit4:junit4]   2> 6134 T62 oasc.SolrResourceLoader.locateSolrHome using system property solr.solr.home: /usr/home/hudson/hudson-slave/workspace/Lucene-Solr-Tests-4.x-Java6/solr/build/solr-core/test/J1/./solrtest-jetty2-1351595895600
[junit4:junit4]   2> 6134 T62 oasc.SolrResourceLoader.<init> new SolrResourceLoader for deduced Solr Home: '/usr/home/hudson/hudson-slave/workspace/Lucene-Solr-Tests-4.x-Java6/solr/build/solr-core/test/J1/./solrtest-jetty2-1351595895600/'
[junit4:junit4]   2> 6159 T62 oass.SolrDispatchFilter.init SolrDispatchFilter.init()
[junit4:junit4]   2> 6159 T62 oasc.SolrResourceLoader.locateSolrHome JNDI not configured for solr (NoInitialContextEx)
[junit4:junit4]   2> 6160 T62 oasc.SolrResourceLoader.locateSolrHome using system property solr.solr.home: /usr/home/hudson/hudson-slave/workspace/Lucene-Solr-Tests-4.x-Java6/solr/build/solr-core/test/J1/./solrtest-jetty2-1351595895600
[junit4:junit4]   2> 6160 T62 oasc.CoreContainer$Initializer.initialize looking for solr.xml: /usr/home/hudson/hudson-slave/workspace/Lucene-Solr-Tests-4.x-Java6/solr/build/solr-core/test/J1/./solrtest-jetty2-1351595895600/solr.xml
[junit4:junit4]   2> 6160 T62 oasc.CoreContainer.<init> New CoreContainer 1116940434
[junit4:junit4]   2> 6161 T62 oasc.CoreContainer.load Loading CoreContainer using Solr Home: '/usr/home/hudson/hudson-slave/workspace/Lucene-Solr-Tests-4.x-Java6/solr/build/solr-core/test/J1/./solrtest-jetty2-1351595895600/'
[junit4:junit4]   2> 6161 T62 oasc.SolrResourceLoader.<init> new SolrResourceLoader for directory: '/usr/home/hudson/hudson-slave/workspace/Lucene-Solr-Tests-4.x-Java6/solr/build/solr-core/test/J1/./solrtest-jetty2-1351595895600/'
[junit4:junit4]   2> 6179 T62 oasc.CoreContainer.load Registering Log Listener
[junit4:junit4]   2> 6189 T62 oasc.CoreContainer.initZooKeeper Zookeeper client=127.0.0.1:63131/solr
[junit4:junit4]   2> 6190 T62 oaz.ZooKeeper.<init> Initiating client connection, connectString=127.0.0.1:63131/solr sessionTimeout=5000 watcher=org.apache.solr.common.cloud.ConnectionManager@16881734
[junit4:junit4]   2> 6191 T115 oaz.ClientCnxn$SendThread.startConnect Opening socket connection to server /127.0.0.1:63131
[junit4:junit4]   2> 6191 T62 oascc.ConnectionManager.waitForConnected Waiting for client to connect to ZooKeeper
[junit4:junit4]   2> 6192 T115 oaz.ClientCnxn$SendThread.primeConnection Socket connection established to localhost/127.0.0.1:63131, initiating session
[junit4:junit4]   2> 6192 T64 oazs.NIOServerCnxn$Factory.run Accepted socket connection from /140.211.11.196:14685
[junit4:junit4]   2> 6193 T64 oazs.NIOServerCnxn.readConnectRequest Client attempting to establish new session at /140.211.11.196:14685
[junit4:junit4]   2> 6195 T66 oazs.NIOServerCnxn.finishSessionInit Established session 0x13ab16494ff0004 with negotiated timeout 5000 for client /140.211.11.196:14685
[junit4:junit4]   2> 6195 T115 oaz.ClientCnxn$SendThread.readConnectResult Session establishment complete on server localhost/127.0.0.1:63131, sessionid = 0x13ab16494ff0004, negotiated timeout = 5000
[junit4:junit4]   2> 6195 T116 oascc.ConnectionManager.process Watcher org.apache.solr.common.cloud.ConnectionManager@16881734 name:ZooKeeperConnection Watcher:127.0.0.1:63131/solr got event WatchedEvent state:SyncConnected type:None path:null path:null type:None
[junit4:junit4]   2> 6195 T62 oascc.ConnectionManager.waitForConnected Client is connected to ZooKeeper
[junit4:junit4]   2> 6196 T67 oazs.PrepRequestProcessor.pRequest Got user-level KeeperException when processing sessionid:0x13ab16494ff0004 type:create cxid:0x1 zxid:0xfffffffffffffffe txntype:unknown reqpath:n/a Error Path:/solr/overseer Error:KeeperErrorCode = NodeExists for /solr/overseer
[junit4:junit4]   2> 6211 T67 oazs.PrepRequestProcessor.pRequest Got user-level KeeperException when processing sessionid:0x13ab16494ff0004 type:create cxid:0x2 zxid:0xfffffffffffffffe txntype:unknown reqpath:n/a Error Path:/solr/overseer Error:KeeperErrorCode = NodeExists for /solr/overseer
[junit4:junit4]   2> 6212 T62 oasc.ZkController.createEphemeralLiveNode Register node as live in ZooKeeper:/live_nodes/127.0.0.1:13544_solr
[junit4:junit4]   2> 6213 T67 oazs.PrepRequestProcessor.pRequest Got user-level KeeperException when processing sessionid:0x13ab16494ff0004 type:delete cxid:0x4 zxid:0xfffffffffffffffe txntype:unknown reqpath:n/a Error Path:/solr/live_nodes/127.0.0.1:13544_solr Error:KeeperErrorCode = NoNode for /solr/live_nodes/127.0.0.1:13544_solr
[junit4:junit4]   2> 6219 T62 oascc.SolrZkClient.makePath makePath: /live_nodes/127.0.0.1:13544_solr
[junit4:junit4]   2> 6222 T83 oascc.ZkStateReader$3.process Updating live nodes... (3)
[junit4:junit4]   2> 6222 T101 oascc.ZkStateReader$3.process Updating live nodes... (3)
[junit4:junit4]   2> 6222 T62 oashc.HttpShardHandlerFactory.getParameter Setting socketTimeout to: 0
[junit4:junit4]   2> 6223 T62 oashc.HttpShardHandlerFactory.getParameter Setting urlScheme to: http://
[junit4:junit4]   2> 6223 T62 oashc.HttpShardHandlerFactory.getParameter Setting connTimeout to: 0
[junit4:junit4]   2> 6223 T62 oashc.HttpShardHandlerFactory.getParameter Setting maxConnectionsPerHost to: 20
[junit4:junit4]   2> 6224 T62 oashc.HttpShardHandlerFactory.getParameter Setting corePoolSize to: 0
[junit4:junit4]   2> 6224 T62 oashc.HttpShardHandlerFactory.getParameter Setting maximumPoolSize to: 2147483647
[junit4:junit4]   2> 6224 T62 oashc.HttpShardHandlerFactory.getParameter Setting maxThreadIdleTime to: 5
[junit4:junit4]   2> 6225 T62 oashc.HttpShardHandlerFactory.getParameter Setting sizeOfQueue to: -1
[junit4:junit4]   2> 6225 T62 oashc.HttpShardHandlerFactory.getParameter Setting fairnessPolicy to: false
[junit4:junit4]   2> 6225 T62 oascsi.HttpClientUtil.createClient Creating new http client, config:maxConnectionsPerHost=20&maxConnections=10000&socketTimeout=0&connTimeout=0&retry=false
[junit4:junit4]   2> 6239 T62 oascc.ZkStateReader.createClusterStateWatchersAndUpdate Updating cluster state from ZooKeeper... 
[junit4:junit4]   2> 6244 T62 oasc.CoreContainer.create Creating SolrCore 'collection1' using instanceDir: /usr/home/hudson/hudson-slave/workspace/Lucene-Solr-Tests-4.x-Java6/solr/build/solr-core/test/J1/./solrtest-jetty2-1351595895600/collection1
[junit4:junit4]   2> 6245 T62 oasc.ZkController.createCollectionZkNode Check for collection zkNode:collection1
[junit4:junit4]   2> 6246 T62 oasc.ZkController.createCollectionZkNode Collection zkNode exists
[junit4:junit4]   2> 6246 T62 oasc.ZkController.readConfigName Load collection config from:/collections/collection1
[junit4:junit4]   2> 6247 T62 oasc.SolrResourceLoader.<init> new SolrResourceLoader for directory: '/usr/home/hudson/hudson-slave/workspace/Lucene-Solr-Tests-4.x-Java6/solr/build/solr-core/test/J1/./solrtest-jetty2-1351595895600/collection1/'
[junit4:junit4]   2> 6248 T62 oasc.SolrResourceLoader.replaceClassLoader Adding 'file:/usr/home/hudson/hudson-slave/workspace/Lucene-Solr-Tests-4.x-Java6/solr/build/solr-core/test/J1/solrtest-jetty2-1351595895600/collection1/lib/classes/' to classloader
[junit4:junit4]   2> 6249 T62 oasc.SolrResourceLoader.replaceClassLoader Adding 'file:/usr/home/hudson/hudson-slave/workspace/Lucene-Solr-Tests-4.x-Java6/solr/build/solr-core/test/J1/solrtest-jetty2-1351595895600/collection1/lib/README' to classloader
[junit4:junit4]   2> 6285 T62 oasc.SolrConfig.<init> Using Lucene MatchVersion: LUCENE_41
[junit4:junit4]   2> 6335 T62 oasc.SolrConfig.<init> Loaded SolrConfig: solrconfig.xml
[junit4:junit4]   2> 6436 T62 oass.IndexSchema.readSchema Reading Solr Schema
[junit4:junit4]   2> 6447 T62 oass.IndexSchema.readSchema Schema name=test
[junit4:junit4]   2> 6507 T84 oascc.ZkStateReader.updateClusterState Updating cloud state from ZooKeeper... 
[junit4:junit4]   2> 6508 T84 oasc.Overseer$ClusterStateUpdater.updateState Update state numShards=1 message={
[junit4:junit4]   2> 	  "operation":"state",
[junit4:junit4]   2> 	  "numShards":"1",
[junit4:junit4]   2> 	  "shard":"shard1",
[junit4:junit4]   2> 	  "roles":null,
[junit4:junit4]   2> 	  "state":"active",
[junit4:junit4]   2> 	  "core":"collection1",
[junit4:junit4]   2> 	  "collection":"collection1",
[junit4:junit4]   2> 	  "node_name":"127.0.0.1:39828_solr",
[junit4:junit4]   2> 	  "base_url":"http://127.0.0.1:39828/solr"}
[junit4:junit4]   2> 6522 T116 oascc.ZkStateReader$2.process A cluster state change has occurred - updating... (3)
[junit4:junit4]   2> 6522 T83 oascc.ZkStateReader$2.process A cluster state change has occurred - updating... (3)
[junit4:junit4]   2> 6522 T101 oascc.ZkStateReader$2.process A cluster state change has occurred - updating... (3)
[junit4:junit4]   2> 7054 T62 oass.OpenExchangeRatesOrgProvider.init Initialized with rates=open-exchange-rates.json, refreshInterval=1440.
[junit4:junit4]   2> 7066 T62 oass.IndexSchema.readSchema default search field in schema is text
[junit4:junit4]   2> 7070 T62 oass.IndexSchema.readSchema unique key field: id
[junit4:junit4]   2> 7092 T62 oass.FileExchangeRateProvider.reload Reloading exchange rates from file currency.xml
[junit4:junit4]   2> 7098 T62 oass.FileExchangeRateProvider.reload Reloading exchange rates from file currency.xml
[junit4:junit4]   2> 7103 T62 oass.OpenExchangeRatesOrgProvider.reload Reloading exchange rates from open-exchange-rates.json
[junit4:junit4]   2> 7105 T62 oass.OpenExchangeRatesOrgProvider.reload Reloading exchange rates from open-exchange-rates.json
[junit4:junit4]   2> 7107 T62 oasc.SolrCore.<init> [collection1] Opening new SolrCore at /usr/home/hudson/hudson-slave/workspace/Lucene-Solr-Tests-4.x-Java6/solr/build/solr-core/test/J1/./solrtest-jetty2-1351595895600/collection1/, dataDir=./org.apache.solr.cloud.RecoveryZkTest-1351595889579/jetty2/
[junit4:junit4]   2> 7107 T62 oasc.JmxMonitoredMap.<init> JMX monitoring is enabled. Adding Solr mbeans to JMX Server: com.sun.jmx.mbeanserver.JmxMBeanServer@2180b22e
[junit4:junit4]   2> 7109 T62 oasc.SolrCore.getNewIndexDir New index directory detected: old=null new=./org.apache.solr.cloud.RecoveryZkTest-1351595889579/jetty2/index/
[junit4:junit4]   2> 7110 T62 oasc.SolrCore.initIndex WARNING [collection1] Solr index directory './org.apache.solr.cloud.RecoveryZkTest-1351595889579/jetty2/index' doesn't exist. Creating new index...
[junit4:junit4]   2> 7111 T62 oasc.CachingDirectoryFactory.get return new directory for /usr/home/hudson/hudson-slave/workspace/Lucene-Solr-Tests-4.x-Java6/solr/build/solr-core/test/J1/./org.apache.solr.cloud.RecoveryZkTest-1351595889579/jetty2/index forceNew:false
[junit4:junit4]   2> 7123 T62 oasc.SolrDeletionPolicy.onCommit SolrDeletionPolicy.onCommit: commits:num=1
[junit4:junit4]   2> 		commit{dir=NRTCachingDirectory(org.apache.lucene.store.NIOFSDirectory@/usr/home/hudson/hudson-slave/workspace/Lucene-Solr-Tests-4.x-Java6/solr/build/solr-core/test/J1/org.apache.solr.cloud.RecoveryZkTest-1351595889579/jetty2/index lockFactory=org.apache.lucene.store.NativeFSLockFactory@1976bf9e; maxCacheMB=48.0 maxMergeSizeMB=4.0),segFN=segments_1,generation=1,filenames=[segments_1]
[junit4:junit4]   2> 7123 T62 oasc.SolrDeletionPolicy.updateCommits newest commit = 1
[junit4:junit4]   2> 7124 T62 oasc.SolrCore.initWriters created xml: solr.XMLResponseWriter
[junit4:junit4]   2> 7127 T62 oasup.UpdateRequestProcessorChain.init inserting DistributedUpdateProcessorFactory into updateRequestProcessorChain "dedupe"
[junit4:junit4]   2> 7128 T62 oasup.UpdateRequestProcessorChain.init inserting DistributedUpdateProcessorFactory into updateRequestProcessorChain "dedupe-allfields"
[junit4:junit4]   2> 7128 T62 oasup.UpdateRequestProcessorChain.init inserting DistributedUpdateProcessorFactory into updateRequestProcessorChain "stored_sig"
[junit4:junit4]   2> 7129 T62 oasup.UpdateRequestProcessorChain.init inserting DistributedUpdateProcessorFactory into updateRequestProcessorChain "uniq-fields"
[junit4:junit4]   2> 7130 T62 oasup.UpdateRequestProcessorChain.init inserting DistributedUpdateProcessorFactory into updateRequestProcessorChain "distrib-dup-test-chain-implicit"
[junit4:junit4]   2> 7131 T62 oasc.RequestHandlers.initHandlersFromConfig adding lazy requestHandler: solr.ReplicationHandler
[junit4:junit4]   2> 7131 T62 oasc.RequestHandlers.initHandlersFromConfig created /replication: solr.ReplicationHandler
[junit4:junit4]   2> 7132 T62 oasc.RequestHandlers.initHandlersFromConfig created standard: solr.StandardRequestHandler
[junit4:junit4]   2> 7133 T62 oasc.RequestHandlers.initHandlersFromConfig created /get: solr.RealTimeGetHandler
[junit4:junit4]   2> 7134 T62 oasc.RequestHandlers.initHandlersFromConfig created dismax: solr.SearchHandler
[junit4:junit4]   2> 7135 T62 oasc.RequestHandlers.initHandlersFromConfig created mock: org.apache.solr.core.MockQuerySenderListenerReqHandler
[junit4:junit4]   2> 7136 T62 oasc.RequestHandlers.initHandlersFromConfig created /admin/: org.apache.solr.handler.admin.AdminHandlers
[junit4:junit4]   2> 7136 T62 oasc.RequestHandlers.initHandlersFromConfig created defaults: solr.StandardRequestHandler
[junit4:junit4]   2> 7137 T62 oasc.RequestHandlers.initHandlersFromConfig adding lazy requestHandler: solr.StandardRequestHandler
[junit4:junit4]   2> 7138 T62 oasc.RequestHandlers.initHandlersFromConfig created lazy: solr.StandardRequestHandler
[junit4:junit4]   2> 7138 T62 oasc.RequestHandlers.initHandlersFromConfig created /update: solr.UpdateRequestHandler
[junit4:junit4]   2> 7139 T62 oasc.RequestHandlers.initHandlersFromConfig created /terms: org.apache.solr.handler.component.SearchHandler
[junit4:junit4]   2> 7140 T62 oasc.RequestHandlers.initHandlersFromConfig created spellCheckCompRH: org.apache.solr.handler.component.SearchHandler
[junit4:junit4]   2> 7141 T62 oasc.RequestHandlers.initHandlersFromConfig created spellCheckCompRH_Direct: org.apache.solr.handler.component.SearchHandler
[junit4:junit4]   2> 7142 T62 oasc.RequestHandlers.initHandlersFromConfig created spellCheckWithWordbreak: org.apache.solr.handler.component.SearchHandler
[junit4:junit4]   2> 7143 T62 oasc.RequestHandlers.initHandlersFromConfig created spellCheckWithWordbreak_Direct: org.apache.solr.handler.component.SearchHandler
[junit4:junit4]   2> 7144 T62 oasc.RequestHandlers.initHandlersFromConfig created spellCheckCompRH1: org.apache.solr.handler.component.SearchHandler
[junit4:junit4]   2> 7144 T62 oasc.RequestHandlers.initHandlersFromConfig created tvrh: org.apache.solr.handler.component.SearchHandler
[junit4:junit4]   2> 7145 T62 oasc.RequestHandlers.initHandlersFromConfig created /mlt: solr.MoreLikeThisHandler
[junit4:junit4]   2> 7146 T62 oasc.RequestHandlers.initHandlersFromConfig created /debug/dump: solr.DumpRequestHandler
[junit4:junit4]   2> 7153 T62 oashl.XMLLoader.init xsltCacheLifetimeSeconds=60
[junit4:junit4]   2> 7158 T62 oasc.SolrCore.initDeprecatedSupport WARNING solrconfig.xml uses deprecated <admin/gettableFiles>, Please update your config to use the ShowFileRequestHandler.
[junit4:junit4]   2> 7160 T62 oasc.SolrCore.initDeprecatedSupport WARNING adding ShowFileRequestHandler with hidden files: [SCHEMA.XML, OLD_SYNONYMS.TXT, STOPWORDS.TXT, PROTWORDS.TXT, OPEN-EXCHANGE-RATES.JSON, SYNONYMS.TXT, CURRENCY.XML, MAPPING-ISOLATIN1ACCENT.TXT]
[junit4:junit4]   2> 7164 T62 oass.SolrIndexSearcher.<init> Opening Searcher@79ddd026 main
[junit4:junit4]   2> 7165 T62 oasu.CommitTracker.<init> Hard AutoCommit: disabled
[junit4:junit4]   2> 7166 T62 oasu.CommitTracker.<init> Soft AutoCommit: disabled
[junit4:junit4]   2> 7167 T62 oashc.SpellCheckComponent.inform Initializing spell checkers
[junit4:junit4]   2> 7175 T62 oass.DirectSolrSpellChecker.init init: {name=direct,classname=DirectSolrSpellChecker,field=lowerfilt,minQueryLength=3}
[junit4:junit4]   2> 7226 T121 oasc.SolrCore.registerSearcher [collection1] Registered new searcher Searcher@79ddd026 main{StandardDirectoryReader(segments_1:1)}
[junit4:junit4]   2> 7233 T62 oasc.ZkController.publish numShards not found on descriptor - reading it from system property
[junit4:junit4]   2> 7531 T84 oascc.ZkStateReader.updateClusterState Updating cloud state from ZooKeeper... 
[junit4:junit4]   2> 7533 T84 oasc.Overseer$ClusterStateUpdater.updateState Update state numShards=1 message={
[junit4:junit4]   2> 	  "operation":"state",
[junit4:junit4]   2> 	  "numShards":"1",
[junit4:junit4]   2> 	  "shard":null,
[junit4:junit4]   2> 	  "roles":null,
[junit4:junit4]   2> 	  "state":"down",
[junit4:junit4]   2> 	  "core":"collection1",
[junit4:junit4]   2> 	  "collection":"collection1",
[junit4:junit4]   2> 	  "node_name":"127.0.0.1:13544_solr",
[junit4:junit4]   2> 	  "base_url":"http://127.0.0.1:13544/solr"}
[junit4:junit4]   2> 7547 T83 oascc.ZkStateReader$2.process A cluster state change has occurred - updating... (3)
[junit4:junit4]   2> 7547 T101 oascc.ZkStateReader$2.process A cluster state change has occurred - updating... (3)
[junit4:junit4]   2> 7547 T116 oascc.ZkStateReader$2.process A cluster state change has occurred - updating... (3)
[junit4:junit4]   2> 7737 T62 oasc.CoreContainer.register registering core: collection1
[junit4:junit4]   2> 7737 T62 oasc.ZkController.register Register shard - core:collection1 address:http://127.0.0.1:13544/solr shardId:shard1
[junit4:junit4]   2> 7742 T62 oasc.ZkController.register We are http://127.0.0.1:13544/solr/collection1/ and leader is http://127.0.0.1:39828/solr/collection1/
[junit4:junit4]   2> 7743 T62 oasc.ZkController.register No LogReplay needed for core=collection1 baseURL=http://127.0.0.1:13544/solr
[junit4:junit4]   2> 7743 T62 oasc.ZkController.checkRecovery Core needs to recover:collection1
[junit4:junit4]   2> 7744 T62 oasu.DefaultSolrCoreState.doRecovery Running recovery - first canceling any ongoing recovery
[junit4:junit4]   2> ASYNC  NEW_CORE C11 name=collection1 org.apache.solr.core.SolrCore@229ff6d1 url=http://127.0.0.1:13544/solr/collection1 node=127.0.0.1:13544_solr
[junit4:junit4]   2> 7751 T122 C11 P13544 oasc.RecoveryStrategy.run Starting recovery process.  core=collection1 recoveringAfterStartup=true
[junit4:junit4]   2> 7752 T122 C11 P13544 oasc.RecoveryStrategy.doRecovery ###### startupVersions=[]
[junit4:junit4]   2> 7752 T62 oascc.ZkStateReader.updateClusterState Updating cloud state from ZooKeeper... 
[junit4:junit4]   2> 7752 T122 C11 P13544 oasc.ZkController.publish numShards not found on descriptor - reading it from system property
[junit4:junit4]   2> 7754 T62 oass.SolrDispatchFilter.init user.dir=/usr/home/hudson/hudson-slave/workspace/Lucene-Solr-Tests-4.x-Java6/solr/build/solr-core/test/J1
[junit4:junit4]   2> 7755 T122 C11 P13544 oasc.RecoveryStrategy.doRecovery Attempting to PeerSync from http://127.0.0.1:39828/solr/collection1/ core=collection1 - recoveringAfterStartup=true
[junit4:junit4]   2> 7755 T62 oass.SolrDispatchFilter.init SolrDispatchFilter.init() done
[junit4:junit4]   2> 7756 T62 oascsi.HttpClientUtil.createClient Creating new http client, config:maxConnections=128&maxConnectionsPerHost=32&followRedirects=false
[junit4:junit4]   2> 7765 T122 C11 P13544 oascsi.HttpClientUtil.createClient Creating new http client, config:maxConnectionsPerHost=20&maxConnections=10000&connTimeout=30000&socketTimeout=30000&retry=false
[junit4:junit4]   2> 7776 T62 oaz.ZooKeeper.<init> Initiating client connection, connectString=127.0.0.1:63131/solr sessionTimeout=10000 watcher=org.apache.solr.common.cloud.ConnectionManager@644b27ad
[junit4:junit4]   2> 7777 T123 oaz.ClientCnxn$SendThread.startConnect Opening socket connection to server /127.0.0.1:63131
[junit4:junit4]   2> 7777 T62 oascc.ConnectionManager.waitForConnected Waiting for client to connect to ZooKeeper
[junit4:junit4]   2> 7778 T123 oaz.ClientCnxn$SendThread.primeConnection Socket connection established to localhost/127.0.0.1:63131, initiating session
[junit4:junit4]   2> 7779 T64 oazs.NIOServerCnxn$Factory.run Accepted socket connection from /140.211.11.196:23942
[junit4:junit4]   2> 7779 T64 oazs.NIOServerCnxn.readConnectRequest Client attempting to establish new session at /140.211.11.196:23942
[junit4:junit4]   2> 7781 T66 oazs.NIOServerCnxn.finishSessionInit Established session 0x13ab16494ff0005 with negotiated timeout 10000 for client /140.211.11.196:23942
[junit4:junit4]   2> 7781 T123 oaz.ClientCnxn$SendThread.readConnectResult Session establishment complete on server localhost/127.0.0.1:63131, sessionid = 0x13ab16494ff0005, negotiated timeout = 10000
[junit4:junit4]   2> 7781 T124 oascc.ConnectionManager.process Watcher org.apache.solr.common.cloud.ConnectionManager@644b27ad name:ZooKeeperConnection Watcher:127.0.0.1:63131/solr got event WatchedEvent state:SyncConnected type:None path:null path:null type:None
[junit4:junit4]   2> 7782 T62 oascc.ConnectionManager.waitForConnected Client is connected to ZooKeeper
[junit4:junit4]   2> 7783 T62 oascc.ZkStateReader.createClusterStateWatchersAndUpdate Updating cluster state from ZooKeeper... 
[junit4:junit4]   2> 7783 T122 C11 P13544 oasu.PeerSync.sync PeerSync: core=collection1 url=http://127.0.0.1:13544/solr START replicas=[http://127.0.0.1:39828/solr/collection1/] nUpdates=100
[junit4:junit4]   2> 7790 T62 oasc.ChaosMonkey.monkeyLog monkey: init - expire sessions:true cause connection loss:true
[junit4:junit4]   2> 7800 T62 oascsi.HttpClientUtil.createClient Creating new http client, config:
[junit4:junit4]   2> 7801 T122 C11 P13544 oasu.PeerSync.sync WARNING no frame of reference to tell of we've missed updates
[junit4:junit4]   2> 7802 T122 C11 P13544 oasc.RecoveryStrategy.doRecovery PeerSync Recovery was not successful - trying replication. core=collection1
[junit4:junit4]   2> 7802 T122 C11 P13544 oasc.RecoveryStrategy.doRecovery Starting Replication Recovery. core=collection1
[junit4:junit4]   2> 7802 T122 C11 P13544 oascsi.HttpClientUtil.createClient Creating new http client, config:maxConnections=128&maxConnectionsPerHost=32&followRedirects=false
[junit4:junit4]   2> 7846 T62 oascc.ZkStateReader.updateClusterState Updating cloud state from ZooKeeper... 
[junit4:junit4]   2> 8053 T84 oascc.ZkStateReader.updateClusterState Updating cloud state from ZooKeeper... 
[junit4:junit4]   2> 8054 T84 oasc.Overseer$ClusterStateUpdater.updateState Update state numShards=1 message={
[junit4:junit4]   2> 	  "operation":"state",
[junit4:junit4]   2> 	  "numShards":"1",
[junit4:junit4]   2> 	  "shard":"shard1",
[junit4:junit4]   2> 	  "roles":null,
[junit4:junit4]   2> 	  "state":"recovering",
[junit4:junit4]   2> 	  "core":"collection1",
[junit4:junit4]   2> 	  "collection":"collection1",
[junit4:junit4]   2> 	  "node_name":"127.0.0.1:13544_solr",
[junit4:junit4]   2> 	  "base_url":"http://127.0.0.1:13544/solr"}
[junit4:junit4]   2> 8069 T83 oascc.ZkStateReader$2.process A cluster state change has occurred - updating... (3)
[junit4:junit4]   2> 8069 T101 oascc.ZkStateReader$2.process A cluster state change has occurred - updating... (3)
[junit4:junit4]   2> 8069 T124 oascc.ZkStateReader$2.process A cluster state change has occurred - updating... (3)
[junit4:junit4]   2> 8069 T116 oascc.ZkStateReader$2.process A cluster state change has occurred - updating... (3)
[junit4:junit4]   2> ASYNC  NEW_CORE C12 name=collection1 org.apache.solr.core.SolrCore@63acd9bf url=http://127.0.0.1:39828/solr/collection1 node=127.0.0.1:39828_solr
[junit4:junit4]   2> 9284 T102 C12 P39828 REQ /get {distrib=false&qt=/get&wt=javabin&version=2&getVersions=100} status=0 QTime=18 
[junit4:junit4]   2> ASYNC  NEW_CORE C13 name=collection1 org.apache.solr.core.SolrCore@3f1a2258 url=http://127.0.0.1:61401/solr/collection1 node=127.0.0.1:61401_solr
[junit4:junit4]   2> 9355 T88 C13 P61401 oascsi.HttpClientUtil.createClient Creating new http client, config:maxConnections=500&maxConnectionsPerHost=16
[junit4:junit4]   2> 9422 T88 C13 P61401 oasc.SolrDeletionPolicy.onInit SolrDeletionPolicy.onInit: commits:num=1
[junit4:junit4]   2> 		commit{dir=NRTCachingDirectory(org.apache.lucene.store.NIOFSDirectory@/usr/home/hudson/hudson-slave/workspace/Lucene-Solr-Tests-4.x-Java6/solr/build/solr-core/test/J1/org.apache.solr.cloud.RecoveryZkTest-1351595889579/control/data/index lockFactory=org.apache.lucene.store.NativeFSLockFactory@720bffd; maxCacheMB=48.0 maxMergeSizeMB=4.0),segFN=segments_1,generation=1,filenames=[segments_1]
[junit4:junit4]   2> 9423 T88 C13 P61401 oasc.SolrDeletionPolicy.updateCommits newest commit = 1
[junit4:junit4]   2> 9516 T88 C13 P61401 /update {wt=javabin&version=2} {add=[1 (1417251021381435393)]} 0 179
[junit4:junit4]   2> 9522 T89 C13 P61401 /update {wt=javabin&version=2} {add=[10001 (1417251021381435392)]} 0 185
[junit4:junit4]   2> 9522 T126 oaz.ZooKeeper.<init> Initiating client connection, connectString=127.0.0.1:63131/solr sessionTimeout=10000 watcher=org.apache.solr.common.cloud.ConnectionManager@4c27d525
[junit4:junit4]   2> 9524 T126 oascc.ConnectionManager.waitForConnected Waiting for client to connect to ZooKeeper
[junit4:junit4]   2> 9524 T129 oaz.ClientCnxn$SendThread.startConnect Opening socket connection to server /127.0.0.1:63131
[junit4:junit4]   2> 9526 T129 oaz.ClientCnxn$SendThread.primeConnection Socket connection established to localhost/127.0.0.1:63131, initiating session
[junit4:junit4]   2> 9526 T64 oazs.NIOServerCnxn$Factory.run Accepted socket connection from /140.211.11.196:32678
[junit4:junit4]   2> 9527 T64 oazs.NIOServerCnxn.readConnectRequest Client attempting to establish new session at /140.211.11.196:32678
[junit4:junit4]   2> 9529 T66 oazs.NIOServerCnxn.finishSessionInit Established session 0x13ab16494ff0006 with negotiated timeout 10000 for client /140.211.11.196:32678
[junit4:junit4]   2> 9529 T129 oaz.ClientCnxn$SendThread.readConnectResult Session establishment complete on server localhost/127.0.0.1:63131, sessionid = 0x13ab16494ff0006, negotiated timeout = 10000
[junit4:junit4]   2> 9530 T130 oascc.ConnectionManager.process Watcher org.apache.solr.common.cloud.ConnectionManager@4c27d525 name:ZooKeeperConnection Watcher:127.0.0.1:63131/solr got event WatchedEvent state:SyncConnected type:None path:null path:null type:None
[junit4:junit4]   2> 9530 T126 oascc.ConnectionManager.waitForConnected Client is connected to ZooKeeper
[junit4:junit4]   2> 9531 T126 oascc.ZkStateReader.createClusterStateWatchersAndUpdate Updating cluster state from ZooKeeper... 
[junit4:junit4]   2> 9559 T103 C12 P39828 oasc.SolrDeletionPolicy.onInit SolrDeletionPolicy.onInit: commits:num=1
[junit4:junit4]   2> 		commit{dir=NRTCachingDirectory(org.apache.lucene.store.NIOFSDirectory@/usr/home/hudson/hudson-slave/workspace/Lucene-Solr-Tests-4.x-Java6/solr/build/solr-core/test/J1/org.apache.solr.cloud.RecoveryZkTest-1351595889579/jetty1/index lockFactory=org.apache.lucene.store.NativeFSLockFactory@24c3e952; maxCacheMB=48.0 maxMergeSizeMB=4.0),segFN=segments_1,generation=1,filenames=[segments_1]
[junit4:junit4]   2> 9559 T103 C12 P39828 oasc.SolrDeletionPolicy.updateCommits newest commit = 1
[junit4:junit4]   2>  C11_STATE=coll:collection1 core:collection1 props:{shard=shard1, roles=null, state=recovering, core=collection1, collection=collection1, node_name=127.0.0.1:13544_solr, base_url=http://127.0.0.1:13544/solr}
[junit4:junit4]   2> 9619 T119 C11 P13544 oasc.SolrDeletionPolicy.onInit SolrDeletionPolicy.onInit: commits:num=1
[junit4:junit4]   2> 		commit{dir=NRTCachingDirectory(org.apache.lucene.store.NIOFSDirectory@/usr/home/hudson/hudson-slave/workspace/Lucene-Solr-Tests-4.x-Java6/solr/build/solr-core/test/J1/org.apache.solr.cloud.RecoveryZkTest-1351595889579/jetty2/index lockFactory=org.apache.lucene.store.NativeFSLockFactory@1976bf9e; maxCacheMB=48.0 maxMergeSizeMB=4.0),segFN=segments_1,generation=1,filenames=[segments_1]
[junit4:junit4]   2> 9620 T119 C11 P13544 oasc.SolrDeletionPolicy.updateCommits newest commit = 1
[junit4:junit4]   2> 9625 T119 C11 P13544 REQ /update {distrib.from=http://127.0.0.1:39828/solr/collection1/&update.distrib=FROMLEADER&wt=javabin&version=2} status=0 QTime=11 
[junit4:junit4]   2> 9625 T120 C11 P13544 REQ /update {distrib.from=http://127.0.0.1:39828/solr/collection1/&update.distrib=FROMLEADER&wt=javabin&version=2} status=0 QTime=10 
[junit4:junit4]   2> 9626 T103 C12 P39828 /update {wt=javabin&version=2} {add=[10001 (1417251021526138880)]} 0 79
[junit4:junit4]   2> 9627 T102 C12 P39828 /update {wt=javabin&version=2} {add=[1 (1417251021526138881)]} 0 80
[junit4:junit4]   2> 9633 T89 C13 P61401 /update {wt=javabin&version=2} {add=[10002 (1417251021606879232)]} 0 2
[junit4:junit4]   2> 9635 T87 C13 P61401 /update {wt=javabin&version=2} {add=[2 (1417251021606879233)]} 0 4
[junit4:junit4]   2> 9648 T118 C11 P13544 REQ /update {distrib.from=http://127.0.0.1:39828/solr/collection1/&update.distrib=FROMLEADER&wt=javabin&version=2} status=0 QTime=3 
[junit4:junit4]   2> 9649 T128 C12 P39828 /update {wt=javabin&version=2} {add=[10002 (1417251021613170688)]} 0 11
[junit4:junit4]   2> 9649 T119 C11 P13544 REQ /update {distrib.from=http://127.0.0.1:39828/solr/collection1/&update.distrib=FROMLEADER&wt=javabin&version=2} status=0 QTime=3 
[junit4:junit4]   2> 9650 T103 C12 P39828 /update {wt=javabin&version=2} {add=[2 (1417251021615267840)]} 0 11
[junit4:junit4]   2> 9653 T88 C13 P61401 /update {wt=javabin&version=2} {delete=[10002 (-1417251021628899328)]} 0 0
[junit4:junit4]   2> 9655 T89 C13 P61401 /update {wt=javabin&version=2} {delete=[2 (-1417251021630996480)]} 0 1
[junit4:junit4]   2> 9665 T120 C11 P13544 REQ /update {distrib.from=http://127.0.0.1:39828/solr/collection1/&update.distrib=FROMLEADER&wt=javabin&version=2} status=0 QTime=0 
[junit4:junit4]   2> 9666 T118 C11 P13544 REQ /update {distrib.from=http://127.0.0.1:39828/solr/collection1/&update.distrib=FROMLEADER&wt=javabin&version=2} status=0 QTime=1 
[junit4:junit4]   2> 9666 T128 C12 P39828 /update {wt=javabin&version=2} {delete=[2 (-1417251021635190784)]} 0 7
[junit4:junit4]   2> 9667 T102 C12 P39828 /update {wt=javabin&version=2} {delete=[10002 (-1417251021633093632)]} 0 10
[junit4:junit4]   2> 9672 T87 C13 P61401 /update {wt=javabin&version=2} {add=[3 (1417251021646725120)]} 0 3
[junit4:junit4]   2> 9674 T88 C13 P61401 /update {wt=javabin&version=2} {add=[10003 (1417251021647773696)]} 0 4
[junit4:junit4]   2> 9683 T119 C11 P13544 REQ /update {distrib.from=http://127.0.0.1:39828/solr/collection1/&update.distrib=FROMLEADER&wt=javabin&version=2} status=0 QTime=2 
[junit4:junit4]   2> 9684 T103 C12 P39828 /update {wt=javabin&version=2} {add=[3 (1417251021653016576)]} 0 9
[junit4:junit4]   2> 9685 T120 C11 P13544 REQ /update {distrib.from=http://127.0.0.1:39828/solr/collection1/&update.distrib=FROMLEADER&wt=javabin&version=2} status=0 QTime=2 
[junit4:junit4]   2> 9686 T128 C12 P39828 /update {wt=javabin&version=2} {add=[10003 (1417251021655113728)]} 0 9
[junit4:junit4]   2> 9688 T89 C13 P61401 /update {wt=javabin&version=2} {delete=[3 (-1417251021665599488)]} 0 1
[junit4:junit4]   2> 9690 T87 C13 P61401 /update {wt=javabin&version=2} {delete=[10003 (-1417251021667696640)]} 0 0
[junit4:junit4]   2> 9695 T118 C11 P13544 REQ /update {distrib.from=http://127.0.0.1:39828/solr/collection1/&update.distrib=FROMLEADER&wt=javabin&version=2} status=0 QTime=0 
[junit4:junit4]   2> 9696 T102 C12 P39828 /update {wt=javabin&version=2} {delete=[3 (-1417251021669793792)]} 0 5
[junit4:junit4]   2> 9697 T119 C11 P13544 REQ /update {distrib.from=http://127.0.0.1:39828/solr/collection1/&update.distrib=FROMLEADER&wt=javabin&version=2} status=0 QTime=0 
[junit4:junit4]   2> 9698 T103 C12 P39828 /update {wt=javabin&version=2} {delete=[10003 (-1417251021671890944)]} 0 5
[junit4:junit4]   2> 9702 T88 C13 P61401 /update {wt=javabin&version=2} {add=[4 (1417251021678182400)]} 0 2
[junit4:junit4]   2> 9704 T89 C13 P61401 /update {wt=javabin&version=2} {add=[10004 (1417251021680279552)]} 0 3
[junit4:junit4]   2> 9713 T120 C11 P13544 REQ /update {distrib.from=http://127.0.0.1:39828/solr/collection1/&update.distrib=FROMLEADER&wt=javabin&version=2} status=0 QTime=2 
[junit4:junit4]   2> 9714 T128 C12 P39828 /update {wt=javabin&version=2} {add=[4 (1417251021684473856)]} 0 8
[junit4:junit4]   2> 9715 T118 C11 P13544 REQ /update {distrib.from=http://127.0.0.1:39828/solr/collection1/&update.distrib=FROMLEADER&wt=javabin&version=2} status=0 QTime=2 
[junit4:junit4]   2> 9716 T102 C12 P39828 /update {wt=javabin&version=2} {add=[10004 (1417251021686571008)]} 0 9
[junit4:junit4]   2> 9721 T87 C13 P61401 /update {wt=javabin&version=2} {add=[5 (1417251021698105344)]} 0 3
[junit4:junit4]   2> 9747 T119 C11 P13544 REQ /update {distrib.from=http://127.0.0.1:39828/solr/collection1/&update.distrib=FROMLEADER&wt=javabin&version=2} status=0 QTime=9 
[junit4:junit4]   2> 9748 T103 C12 P39828 /update {wt=javabin&version=2} {add=[5 (1417251021708591104)]} 0 23
[junit4:junit4]   2> 9756 T89 C13 P61401 /update {wt=javabin&version=2} {add=[6 (1417251021732708352)]} 0 4
[junit4:junit4]   2> 9757 T88 C13 P61401 /update {wt=javabin&version=2} {add=[10005 (1417251021699153920)]} 0 37
[junit4:junit4]   2> 9771 T118 C11 P13544 REQ /update {distrib.from=http://127.0.0.1:39828/solr/collection1/&update.distrib=FROMLEADER&wt=javabin&version=2} status=0 QTime=2 
[junit4:junit4]   2> 9772 T103 C12 P39828 /update {wt=javabin&version=2} {add=[10005 (1417251021742145536)]} 0 12
[junit4:junit4]   2> 9778 T87 C13 P61401 /update {wt=javabin&version=2} {add=[10006 (1417251021757874176)]} 0 3
[junit4:junit4]   2> 9783 T119 C11 P13544 REQ /update {distrib.from=http://127.0.0.1:39828/solr/collection1/&update.distrib=FROMLEADER&wt=javabin&version=2} status=0 QTime=3 
[junit4:junit4]   2> 9784 T102 C12 P39828 /update {wt=javabin&version=2} {add=[6 (1417251021741096960)]} 0 25
[junit4:junit4]   2> 9790 T89 C13 P61401 /update {wt=javabin&version=2} {add=[7 (1417251021770457088)]} 0 2
[junit4:junit4]   2> 9790 T120 C11 P13544 REQ /update {distrib.from=http://127.0.0.1:39828/solr/collection1/&update.distrib=FROMLEADER&wt=javabin&version=2} status=0 QTime=2 
[junit4:junit4]   2> 9791 T128 C12 P39828 /update {wt=javabin&version=2} {add=[10006 (1417251021764165632)]} 0 9
[junit4:junit4]   2> 9798 T88 C13 P61401 /update {wt=javabin&version=2} {add=[10007 (1417251021777797120)]} 0 3
[junit4:junit4]   2> 9801 T118 C11 P13544 REQ /update {distrib.from=http://127.0.0.1:39828/solr/collection1/&update.distrib=FROMLEADER&wt=javabin&version=2} status=0 QTime=2 
[junit4:junit4]   2> 9802 T103 C12 P39828 /update {wt=javabin&version=2} {add=[7 (1417251021776748544)]} 0 9
[junit4:junit4]   2> 9808 T87 C13 P61401 /update {wt=javabin&version=2} {add=[8 (1417251021789331456)]} 0 2
[junit4:junit4]   2> 9819 T120 C11 P13544 REQ /update {distrib.from=http://127.0.0.1:39828/solr/collection1/&update.distrib=FROMLEADER&wt=javabin&version=2} status=0 QTime=2 
[junit4:junit4]   2> 9820 T128 C12 P39828 /update {wt=javabin&version=2} {add=[8 (1417251021795622912)]} 0 9
[junit4:junit4]   2> 9824 T119 C11 P13544 REQ /update {distrib.from=http://127.0.0.1:39828/solr/collection1/&update.distrib=FROMLEADER&wt=javabin&version=2} status=0 QTime=17 
[junit4:junit4]   2> 9826 T89 C13 P61401 /update {wt=javabin&version=2} {add=[9 (1417251021808205824)]} 0 3
[junit4:junit4]   2> 9826 T102 C12 P39828 /update {wt=javabin&version=2} {add=[10007 (1417251021785137152)]} 0 25
[junit4:junit4]   2> 9832 T88 C13 P61401 /update {wt=javabin&version=2} {add=[10008 (1417251021814497280)]} 0 2
[junit4:junit4]   2> 9839 T118 C11 P13544 REQ /update {distrib.from=http://127.0.0.1:39828/solr/collection1/&update.distrib=FROMLEADER&wt=javabin&version=2} status=0 QTime=3 
[junit4:junit4]   2> 9841 T103 C12 P39828 /update {wt=javabin&version=2} {add=[9 (1417251021815545856)]} 0 11
[junit4:junit4]   2> 9843 T120 C11 P13544 REQ /update {distrib.from=http://127.0.0.1:39828/solr/collection1/&update.distrib=FROMLEADER&wt=javabin&version=2} status=0 QTime=2 
[junit4:junit4]   2> 9844 T128 C12 P39828 /update {wt=javabin&version=2} {add=[10008 (1417251021820788736)]} 0 8
[junit4:junit4]   2> 9847 T87 C13 P61401 /update {wt=javabin&version=2} {add=[10 (1417251021830225920)]} 0 3
[junit4:junit4]   2> 9853 T89 C13 P61401 /update {wt=javabin&version=2} {add=[10009 (1417251021835468800)]} 0 4
[junit4:junit4]   2> 9859 T119 C11 P13544 REQ /update {distrib.from=http://127.0.0.1:39828/solr/collection1/&update.distrib=FROMLEADER&wt=javabin&version=2} status=0 QTime=2 
[junit4:junit4]   2> 9860 T103 C12 P39828 /update {wt=javabin&version=2} {add=[10 (1417251021837565952)]} 0 9
[junit4:junit4]   2> 9864 T88 C13 P61401 /update {wt=javabin&version=2} {delete=[6 (-1417251021850148864)]} 0 0
[junit4:junit4]   2> 9864 T118 C11 P13544 REQ /update {distrib.from=http://127.0.0.1:39828/solr/collection1/&update.distrib=FROMLEADER&wt=javabin&version=2} status=0 QTime=2 
[junit4:junit4]   2> 9866 T102 C12 P39828 /update {wt=javabin&version=2} {add=[10009 (1417251021842808832)]} 0 10
[junit4:junit4]   2> 9873 T120 C11 P13544 REQ /update {distrib.from=http://127.0.0.1:39828/solr/collection1/&update.distrib=FROMLEADER&wt=javabin&version=2} status=0 QTime=0 
[junit4:junit4]   2> 9874 T128 C12 P39828 /update {wt=javabin&version=2} {delete=[6 (-1417251021855391744)]} 0 5
[junit4:junit4]   2> 9882 T89 C13 P61401 /update {wt=javabin&version=2} {add=[11 (1417251021864828928)]} 0 4
[junit4:junit4]   2> 9888 T87 C13 P61401 /update {wt=javabin&version=2} {add=[10010 (1417251021856440320)]} 0 18
[junit4:junit4]   2> 9901 T119 C11 P13544 REQ /update {distrib.from=http://127.0.0.1:39828/solr/collection1/&update.distrib=FROMLEADER&wt=javabin&version=2} status=0 QTime=2 
[junit4:junit4]   2> 9901 T102 C12 P39828 /update {wt=javabin&version=2} {add=[10010 (1417251021879508992)]} 0 9
[junit4:junit4]   2> 9906 T88 C13 P61401 /update {wt=javabin&version=2} {delete=[10006 (-1417251021894189056)]} 0 1
[junit4:junit4]   2> 9910 T118 C11 P13544 REQ /update {distrib.from=http://127.0.0.1:39828/solr/collection1/&update.distrib=FROMLEADER&wt=javabin&version=2} status=0 QTime=3 
[junit4:junit4]   2> 9911 T103 C12 P39828 /update {wt=javabin&version=2} {add=[11 (1417251021873217536)]} 0 25
[junit4:junit4]   2> 9916 T120 C11 P13544 REQ /update {distrib.from=http://127.0.0.1:39828/solr/collection1/&update.distrib=FROMLEADER&wt=javabin&version=2} status=0 QTime=1 
[junit4:junit4]   2> 9917 T128 C12 P39828 /update {wt=javabin&version=2} {delete=[10006 (-1417251021899431936)]} 0 6
[junit4:junit4]   2> 9920 T87 C13 P61401 /update {wt=javabin&version=2} {add=[12 (1417251021904674816)]} 0 5
[junit4:junit4]   2> 9925 T89 C13 P61401 /update {wt=javabin&version=2} {add=[10011 (1417251021912014848)]} 0 2
[junit4:junit4]   2> 9931 T119 C11 P13544 REQ /update {distrib.from=http://127.0.0.1:39828/solr/collection1/&update.distrib=FROMLEADER&wt=javabin&version=2} status=0 QTime=2 
[junit4:junit4]   2> 9932 T102 C12 P39828 /update {wt=javabin&version=2} {add=[12 (1417251021913063424)]} 0 8
[junit4:junit4]   2> 9938 T118 C11 P13544 REQ /update {distrib.from=http://127.0.0.1:39828/solr/collection1/&update.distrib=FROMLEADER&wt=javabin&version=2} status=0 QTime=3 
[junit4:junit4]   2> 9938 T87 C13 P61401 /update {wt=javabin&version=2} {add=[13 (1417251021925646336)]} 0 2
[junit4:junit4]   2> 9939 T128 C12 P39828 /update {wt=javabin&version=2} {add=[10011 (1417251021918306304)]} 0 10
[junit4:junit4]   2> 9944 T88 C13 P61401 /update {wt=javabin&version=2} {add=[10012 (1417251021932986368)]} 0 2
[junit4:junit4]   2> 9949 T120 C11 P13544 REQ /update {distrib.from=http://127.0.0.1:39828/solr/collection1/&update.distrib=FROMLEADER&wt=javabin&version=2} status=0 QTime=2 
[junit4:junit4]   2> 9950 T103 C12 P39828 /update {wt=javabin&version=2} {add=[13 (1417251021931937792)]} 0 9
[junit4:junit4]   2> 9955 T119 C11 P13544 REQ /update {distrib.from=http://127.0.0.1:39828/solr/collection1/&update.distrib=FROMLEADER&wt=javabin&version=2} status=0 QTime=2 
[junit4:junit4]   2> 9955 T89 C13 P61401 /update {wt=javabin&version=2} {add=[14 (1417251021944520704)]} 0 2
[junit4:junit4]   2> 9956 T102 C12 P39828 /update {wt=javabin&version=2} {add=[10012 (1417251021938229248)]} 0 9
[junit4:junit4]   2> 9962 T87 C13 P61401 /update {wt=javabin&version=2} {add=[10013 (1417251021950812160)]} 0 2
[junit4:junit4]   2> 9967 T118 C11 P13544 REQ /update {distrib.from=http://127.0.0.1:39828/solr/collection1/&update.distrib=FROMLEADER&wt=javabin&version=2} status=0 QTime=2 
[junit4:junit4]   2> 9969 T128 C12 P39828 /update {wt=javabin&version=2} {add=[14 (1417251021950812160)]} 0 9
[junit4:junit4]   2> 9974 T120 C11 P13544 REQ /update {distrib.from=http://127.0.0.1:39828/solr/collection1/&update.distrib=FROMLEADER&wt=javabin&version=2} status=0 QTime=2 
[junit4:junit4]   2> 9975 T103 C12 P39828 /update {wt=javabin&version=2} {add=[10013 (1417251021957103616)]} 0 9
[junit4:junit4]   2> 9976 T88 C13 P61401 /update {wt=javabin&version=2} {add=[15 (1417251021965492224)]} 0 3
[junit4:junit4]   2> 9980 T89 C13 P61401 /update {wt=javabin&version=2} {add=[10014 (1417251021970735104)]} 0 2
[junit4:junit4]   2> 9992 T118 C11 P13544 REQ /update {distrib.from=http://127.0.0.1:39828/solr/collection1/&update.distrib=FROMLEADER&wt=javabin&version=2} status=0 QTime=3 
[junit4:junit4]   2> 9993 T128 C12 P39828 /update {wt=javabin&version=2} {add=[10014 (1417251021975977984)]} 0 10
[junit4:junit4]   2> 10006 T119 C11 P13544 REQ /update {distrib.from=http://127.0.0.1:39828/solr/collection1/&update.distrib=FROMLEADER&wt=javabin&version=2} status=0 QTime=21 
[junit4:junit4]   2> 10007 T102 C12 P39828 /update {wt=javabin&version=2} {add=[15 (1417251021971783680)]} 0 28
[junit4:junit4]   2> 10011 T88 C13 P61401 /update {wt=javabin&version=2} {delete=[8 (-1417251022004289536)]} 0 0
[junit4:junit4]   2> 10017 T87 C13 P61401 /update {wt=javabin&version=2} {add=[10015 (1417251021989609472)]} 0 21
[junit4:junit4]   2> 10018 T120 C11 P13544 REQ /update {distrib.from=http://127.0.0.1:39828/solr/collection1/&update.distrib=FROMLEADER&wt=javabin&version=2} status=0 QTime=0 
[junit4:junit4]   2> 10019 T103 C12 P39828 /update {wt=javabin&version=2} {delete=[8 (-1417251022008483840)]} 0 4
[junit4:junit4]   2> 10027 T89 C13 P61401 /update {wt=javabin&version=2} {add=[16 (1417251022016872448)]} 0 4
[junit4:junit4]   2> 10040 T118 C11 P13544 REQ /update {distrib.from=http://127.0.0.1:39828/solr/collection1/&update.distrib=FROMLEADER&wt=javabin&version=2} status=0 QTime=2 
[junit4:junit4]   2> 10041 T102 C12 P39828 /update {wt=javabin&version=2} {add=[16 (1417251022025261056)]} 0 11
[junit4:junit4]   2> 10042 T119 C11 P13544 REQ /update {distrib.from=http://127.0.0.1:39828/solr/collection1/&update.distrib=FROMLEADER&wt=javabin&version=2} status=0 QTime=2 
[junit4:junit4]   2> 10043 T128 C12 P39828 /update {wt=javabin&version=2} {add=[10015 (1417251022014775296)]} 0 23
[junit4:junit4]   2> 10045 T88 C13 P61401 /update {wt=javabin&version=2} {delete=[9 (-1417251022039941120)]} 0 0
[junit4:junit4]   2> 10047 T87 C13 P61401 /update {wt=javabin&version=2} {delete=[10008 (-1417251022042038272)]} 0 1
[junit4:junit4]   2> 10052 T120 C11 P13544 REQ /update {distrib.from=http://127.0.0.1:39828/solr/collection1/&update.distrib=FROMLEADER&wt=javabin&version=2} status=0 QTime=0 
[junit4:junit4]   2> 10053 T103 C12 P39828 /update {wt=javabin&version=2} {delete=[9 (-1417251022044135424)]} 0 5
[junit4:junit4]   2> 10054 T120 C11 P13544 REQ /update {distrib.from=http://127.0.0.1:39828/solr/collection1/&update.distrib=FROMLEADER&wt=javabin&version=2} status=0 QTime=1 
[junit4:junit4]   2> 10055 T102 C12 P39828 /update {wt=javabin&version=2} {delete=[10008 (-1417251022046232576)]} 0 5
[junit4:junit4]   2> 10058 T89 C13 P61401 /update {wt=javabin&version=2} {add=[17 (1417251022052524032)]} 0 2
[junit4:junit4]   2> 10061 T88 C13 P61401 /update {wt=javabin&version=2} {add=[10016 (1417251022054621184)]} 0 3
[junit4:junit4]   2> 10069 T119 C11 P13544 REQ /update {distrib.from=http://127.0.0.1:39828/solr/collection1/&update.distrib=FROMLEADER&wt=javabin&version=2} status=0 QTime=2 
[junit4:junit4]   2> 10070 T128 C12 P39828 /update {wt=javabin&version=2} {add=[17 (1417251022057766912)]} 0 9
[junit4:junit4]   2> 10072 T118 C11 P13544 REQ /update {distrib.from=http://127.0.0.1:39828/solr/collection1/&update.distrib=FROMLEADER&wt=javabin&version=2} status=0 QTime=2 
[junit4:junit4]   2> 10073 T103 C12 P39828 /update {wt=javabin&version=2} {add=[10016 (1417251022060912640)]} 0 8
[junit4:junit4]   2> 10074 T87 C13 P61401 /update {wt=javabin&version=2} {delete=[11 (-1417251022070349824)]} 0 0
[junit4:junit4]   2> 10077 T89 C13 P61401 /update {wt=javabin&version=2} {delete=[10009 (-1417251022073495552)]} 0 1
[junit4:junit4]   2> 10081 T120 C11 P13544 REQ /update {distrib.from=http://127.0.0.1:39828/solr/collection1/&update.distrib=FROMLEADER&wt=javabin&version=2} status=0 QTime=0 
[junit4:junit4]   2> 10083 T102 C12 P39828 /update {wt=javabin&version=2} {delete=[11 (-1417251022074544128)]} 0 6
[junit4:junit4]   2> 10085 T119 C11 P13544 REQ /update {distrib.from=http://127.0.0.1:39828/solr/collection1/&update.distrib=FROMLEADER&wt=javabin&version=2} status=0 QTime=0 
[junit4:junit4]   2> 10086 T128 C12 P39828 /update {wt=javabin&version=2} {delete=[10009 (-1417251022077689856)]} 0 5
[junit4:junit4]   2> 10089 T88 C13 P61401 /update {wt=javabin&version=2} {add=[18 (1417251022083981312)]} 0 3
[junit4:junit4]   2> 10092 T87 C13 P61401 /update {wt=javabin&version=2} {add=[10017 (1417251022087127040)]} 0 2
[junit4:junit4]   2> 10100 T118 C11 P13544 REQ /update {distrib.from=http://127.0.0.1:39828/solr/collection1/&update.distrib=FROMLEADER&wt=javabin&version=2} status=0 QTime=2 
[junit4:junit4]   2> 10101 T103 C12 P39828 /update {wt=javabin&version=2} {add=[18 (1417251022090272768)]} 0 9
[junit4:junit4]   2> 10105 T120 C11 P13544 REQ /update {distrib.from=http://127.0.0.1:39828/solr/collection1/&update.distrib=FROMLEADER&wt=javabin&version=2} status=0 QTime=2 
[junit4:junit4]   2> 10106 T89 C13 P61401 /update {wt=javabin&version=2} {delete=[15 (-1417251022102855680)]} 0 1
[junit4:junit4]   2> 10106 T102 C12 P39828 /update {wt=javabin&version=2} {add=[10017 (1417251022094467072)]} 0 9
[junit4:junit4]   2> 10110 T88 C13 P61401 /update {wt=javabin&version=2} {delete=[10011 (-1417251022108098560)]} 0 1
[junit4:junit4]   2> 10113 T119 C11 P13544 REQ /update {distrib.from=http://127.0.0.1:39828/solr/collection1/&update.distrib=FROMLEADER&wt=javabin&version=2} status=0 QTime=0 
[junit4:junit4]   2> 10115 T128 C12 P39828 /update {wt=javabin&version=2} {delete=[15 (-1417251022108098560)]} 0 6
[junit4:junit4]   2> 10118 T118 C11 P13544 REQ /update {distrib.from=http://127.0.0.1:39828/solr/collection1/&update.distrib=FROMLEADER&wt=javabin&version=2} status=0 QTime=0 
[junit4:junit4]   2> 10119 T103 C12 P39828 /update {wt=javabin&version=2} {delete=[10011 (-1417251022113341440)]} 0 5
[junit4:junit4]   2> 10122 T87 C13 P61401 /update {wt=javabin&version=2} {add=[19 (1417251022118584320)]} 0 2
[junit4:junit4]   2> 10125 T89 C13 P61401 /update {wt=javabin&version=2} {add=[10018 (1417251022121730048)]} 0 3
[junit4:junit4]   2> 10136 T119 C11 P13544 REQ /update {distrib.from=http://127.0.0.1:39828/solr/collection1/&update.distrib=FROMLEADER&wt=javabin&version=2} status=0 QTime=2 
[junit4:junit4]   2> 10137 T128 C12 P39828 /update {wt=javabin&version=2} {add=[10018 (1417251022128021504)]} 0 9
[junit4:junit4]   2> 10141 T88 C13 P61401 /update {wt=javabin&version=2} {delete=[10015 (-1417251022140604416)]} 0 1
[junit4:junit4]   2> 10148 T119 C11 P13544 REQ /update {distrib.from=http://127.0.0.1:39828/solr/collection1/&update.distrib=FROMLEADER&wt=javabin&version=2} status=0 QTime=0 
[junit4:junit4]   2> 10149 T120 C11 P13544 REQ /update {distrib.from=http://127.0.0.1:39828/solr/collection1/&update.distrib=FROMLEADER&wt=javabin&version=2} status=0 QTime=18 
[junit4:junit4]   2> 10149 T103 C12 P39828 /update {wt=javabin&version=2} {delete=[10015 (-1417251022144798720)]} 0 5
[junit4:junit4]   2> 10150 T102 C12 P39828 /update {wt=javabin&version=2} {add=[19 (1417251022124875776)]} 0 24
[junit4:junit4]   2> 10154 T89 C13 P61401 /update {wt=javabin&version=2} {delete=[16 (-1417251022154235905)]} 0 0
[junit4:junit4]   2> 10156 T87 C13 P61401 /update {wt=javabin&version=2} {add=[10019 (1417251022154235904)]} 0 3
[junit4:junit4]   2> 10161 T119 C11 P13544 REQ /update {distrib.from=http://127.0.0.1:39828/solr/collection1/&update.distrib=FROMLEADER&wt=javabin&version=2} status=0 QTime=0 
[junit4:junit4]   2> 10162 T103 C12 P39828 /update {wt=javabin&version=2} {delete=[16 (-1417251022158430208)]} 0 5
[junit4:junit4]   2> 10167 T118 C11 P13544 REQ /update {distrib.from=http://127.0.0.1:39828/solr/collection1/&update.distrib=FROMLEADER&wt=javabin&version=2} status=0 QTime=2 
[junit4:junit4]   2> 10167 T88 C13 P61401 /update {wt=javabin&version=2} {add=[20 (1417251022166818816)]} 0 1
[junit4:junit4]   2> 10168 T128 C12 P39828 /update {wt=javabin&version=2} {add=[10019 (1417251022160527360)]} 0 9
[junit4:junit4]   2> 10172 T89 C13 P61401 /update {wt=javabin&version=2} {delete=[10016 (-1417251022173110272)]} 0 1
[junit4:junit4]   2> 10179 T119 C11 P13544 REQ /update {distrib.from=http://127.0.0.1:39828/solr/collection1/&update.distrib=FROMLEADER&wt=javabin&version=2} status=0 QTime=0 
[junit4:junit4]   2> 10180 T102 C12 P39828 /update {wt=javabin&version=2} {delete=[10016 (-1417251022177304576)]} 0 5
[junit4:junit4]   2> 10180 T120 C11 P13544 REQ /update {distrib.from=http://127.0.0.1:39828/solr/collection1/&update.distrib=FROMLEADER&wt=javabin&version=2} status=0 QTime=3 
[junit4:junit4]   2> 10181 T103 C12 P39828 /update {wt=javabin&version=2} {add=[20 (1417251022173110272)]} 0 10
[junit4:junit4]   2> 10190 T88 C13 P61401 /update {wt=javabin&version=2} {add=[21 (1417251022186741760)]} 0 5
[junit4:junit4]   2> 10204 T87 C13 P61401 /update {wt=javabin&version=2} {add=[10020 (1417251022185693184)]} 0 21
[junit4:junit4]   2> 10217 T118 C11 P13544 REQ /update {distrib.from=http://127.0.0.1:39828/solr/collection1/&update.distrib=FROMLEADER&wt=javabin&version=2} status=0 QTime=2 
[junit4:junit4]   2> 10218 T102 C12 P39828 /update {wt=javabin&version=2} {add=[10020 (1417251022210859008)]} 0 10
[junit4:junit4]   2> 10224 T89 C13 P61401 /update {wt=javabin&version=2} {add=[10021 (1417251022225539072)]} 0 2
[junit4:junit4]   2> 10233 T119 C11 P13544 REQ /update {distrib.from=http://127.0.0.1:39828/solr/collection1/&update.distrib=FROMLEADER&wt=javabin&version=2} status=0 QTime=17 
[junit4:junit4]   2> 10234 T128 C12 P39828 /update {wt=javabin&version=2} {add=[21 (1417251022197227520)]} 0 39
[junit4:junit4]   2> 10236 T120 C11 P13544 REQ /update {distrib.from=http://127.0.0.1:39828/solr/collection1/&update.distrib=FROMLEADER&wt=javabin&version=2} status=0 QTime=2 
[junit4:junit4]   2> 10237 T103 C12 P39828 /update {wt=javabin&version=2} {add=[10021 (1417251022231830528)]} 0 9
[junit4:junit4]   2> 10238 T88 C13 P61401 /update {wt=javabin&version=2} {delete=[19 (-1417251022242316288)]} 0 0
[junit4:junit4]   2> 10241 T87 C13 P61401 /update {wt=javabin&version=2} {delete=[10019 (-1417251022245462016)]} 0 0
[junit4:junit4]   2> 10246 T119 C11 P13544 REQ /update {distrib.from=http://127.0.0.1:39828/solr/collection1/&update.distrib=FROMLEADER&wt=javabin&version=2} status=0 QTime=0 
[junit4:junit4]   2> 10247 T102 C12 P39828 /update {wt=javabin&version=2} {delete=[19 (-1417251022247559168)]} 0 5
[junit4:junit4]   2> 10248 T118 C11 P13544 REQ /update {distrib.from=http://127.0.0.1:39828/solr/collection1/&update.distrib=FROMLEADER&wt=javabin&version=2} status=0 QTime=1 
[junit4:junit4]   2> 10249 T103 C12 P39828 /update {wt=javabin&version=2} {delete=[10019 (-1417251022249656320)]} 0 5
[junit4:junit4]   2> 10254 T89 C13 P61401 /update {wt=javabin&version=2} {add=[22 (1417251022256996352)]} 0 2
[junit4:junit4]   2> 10255 T88 C13 P61401 /update {wt=javabin&version=2} {add=[10022 (1417251022258044928)]} 0 3
[junit4:junit4]   2> 10265 T120 C11 P13544 REQ /update {distrib.from=http://127.0.0.1:39828/solr/collection1/&update.distrib=FROMLEADER&wt=javabin&version=2} status=0 QTime=2 
[junit4:junit4]   2> 10265 T128 C12 P39828 /update {wt=javabin&version=2} {add=[22 (1417251022263287808)]} 0 8
[junit4:junit4]   2> 10268 T119 C11 P13544 REQ /update {distrib.from=http://127.0.0.1:39828/solr/collection1/&update.distrib=FROMLEADER&wt=javabin&version=2} status=0 QTime=4 
[junit4:junit4]   2> 10269 T102 C12 P39828 /update {wt=javabin&version=2} {add=[10022 (1417251022265384960)]} 0 10
[junit4:junit4]   2> 10271 T87 C13 P61401 /update {wt=javabin&version=2} {add=[23 (1417251022275870720)]} 0 2
[junit4:junit4]   2> 10275 T89 C13 P61401 /update {wt=javabin&version=2} {add=[10023 (1417251022279016448)]} 0 3
[junit4:junit4]   2> 10282 T118 C11 P13544 REQ /update {distrib.from=http://127.0.0.1:39828/solr/collection1/&update.distrib=FROMLEADER&wt=javabin&version=2} status=0 QTime=2 
[junit4:junit4]   2> 10283 T103 C12 P39828 /update {wt=javabin&version=2} {add=[23 (1417251022281113600)]} 0 9
[junit4:junit4]   2> 10285 T120 C11 P13544 REQ /update {distrib.from=http://127.0.0.1:39828/solr/collection1/&update.distrib=FROMLEADER&wt=javabin&version=2} status=0 QTime=2 
[junit4:junit4]   2> 10286 T128 C12 P39828 /update {wt=javabin&version=2} {add=[10023 (1417251022285307904)]} 0 8
[junit4:junit4]   2> 10289 T88 C13 P61401 /update {wt=javabin&version=2} {add=[24 (1417251022293696512)]} 0 3
[junit4:junit4]   2> 10291 T87 C13 P61401 /update {wt=javabin&version=2} {add=[10024 (1417251022296842240)]} 0 2
[junit4:junit4]   2> 10300 T119 C11 P13544 REQ /update {distrib.from=http://127.0.0.1:39828/solr/collection1/&update.distrib=FROMLEADER&wt=javabin&version=2} status=0 QTime=2 
[junit4:junit4]   2> 10300 T102 C12 P39828 /update {wt=javabin&version=2} {add=[24 (1417251022299987968)]} 0 8
[junit4:junit4]   2> 10303 T118 C11 P13544 REQ /update {distrib.from=http://127.0.0.1:39828/solr/collection1/&update.distrib=FROMLEADER&wt=javabin&version=2} status=0 QTime=3 
[junit4:junit4]   2> 10303 T103 C12 P39828 /update {wt=javabin&version=2} {add=[10024 (1417251022303133696)]} 0 8
[junit4:junit4]   2> 10305 T89 C13 P61401 /update {wt=javabin&version=2} {delete=[20 (-1417251022312570880)]} 0 1
[junit4:junit4]   2> 10307 T88 C13 P61401 /update {wt=javabin&version=2} {delete=[10020 (-1417251022314668032)]} 0 1
[junit4:junit4]   2> 10312 T120 C11 P13544 REQ /update {distrib.from=http://127.0.0.1:39828/solr/collection1/&update.distrib=FROMLEADER&wt=javabin&version=2} status=0 QTime=1 
[junit4:junit4]   2> 10313 T128 C12 P39828 /update {wt=javabin&version=2} {delete=[20 (-1417251022316765184)]} 0 5
[junit4:junit4]   2> 10314 T119 C11 P13544 REQ /update {distrib.from=http://127.0.0.1:39828/solr/collection1/&update.distrib=FROMLEADER&wt=javabin&version=2} status=0 QTime=1 
[junit4:junit4]   2> 10315 T102 C12 P39828 /update {wt=javabin&version=2} {delete=[10020 (-1417251022317813760)]} 0 5
[junit4:junit4]   2> 10319 T87 C13 P61401 /update {wt=javabin&version=2} {add=[25 (1417251022325153792)]} 0 3
[junit4:junit4]   2> 10329 T118 C11 P13544 REQ /update {distrib.from=http://127.0.0.1:39828/solr/collection1/&update.distrib=FROMLEADER&wt=javabin&version=2} status=0 QTime=2 
[junit4:junit4]   2> 10330 T103 C12 P39828 /update {wt=javabin&version=2} {add=[25 (1417251022331445248)]} 0 8
[junit4:junit4]   2> 10336 T89 C13 P61401 /update {wt=javabin&version=2} {add=[10025 (1417251022327250944)]} 0 18
[junit4:junit4]   2> 10337 T88 C13 P61401 /update {wt=javabin&version=2} {add=[26 (1417251022342979584)]} 0 4
[junit4:junit4]   2> 10350 T120 C11 P13544 REQ /update {distrib.from=http://127.0.0.1:39828/solr/collection1/&update.distrib=FROMLEADER&wt=javabin&version=2} status=0 QTime=2 
[junit4:junit4]   2> 10351 T128 C12 P39828 /update {wt=javabin&version=2} {add=[26 (1417251022350319616)]} 0 11
[junit4:junit4]   2> 10355 T89 C13 P61401 /update {wt=javabin&version=2} {delete=[21 (-1417251022364999680)]} 0 1
[junit4:junit4]   2> 10361 T119 C11 P13544 REQ /update {distrib.from=http://127.0.0.1:39828/solr/collection1/&update.distrib=FROMLEADER&wt=javabin&version=2} status=0 QTime=2 
[junit4:junit4]   2> 10361 T102 C12 P39828 /update {wt=javabin&version=2} {add=[10025 (1417251022349271040)]} 0 22
[junit4:junit4]   2> 10363 T118 C11 P13544 REQ /update {distrib.from=http://127.0.0.1:39828/solr/collection1/&update.distrib=FROMLEADER&wt=javabin&version=2} status=0 QTime=0 
[junit4:junit4]   2> 10364 T103 C12 P39828 /update {wt=javabin&version=2} {delete=[21 (-1417251022369193984)]} 0 5
[junit4:junit4]   2> 10367 T87 C13 P61401 /update {wt=javabin&version=2} {add=[10026 (1417251022375485440)]} 0 3
[junit4:junit4]   2> 10370 T88 C13 P61401 /update {wt=javabin&version=2} {add=[27 (1417251022378631168)]} 0 3
[junit4:junit4]   2> 10377 T120 C11 P13544 REQ /update {distrib.from=http://127.0.0.1:39828/solr/collection1/&update.distrib=FROMLEADER&wt=javabin&version=2} status=0 QTime=3 
[junit4:junit4]   2> 10378 T128 C12 P39828 /update {wt=javabin&version=2} {add=[10026 (1417251022381776896)]} 0 8
[junit4:junit4]   2> 10381 T89 C13 P61401 /update {wt=javabin&version=2} {delete=[10021 (-1417251022392262656)]} 0 0
[junit4:junit4]   2> 10381 T119 C11 P13544 REQ /update {distrib.from=http://127.0.0.1:39828/solr/collection1/&update.distrib=FROMLEADER&wt=javabin&version=2} status=0 QTime=2 
[junit4:junit4]   2> 10382 T102 C12 P39828 /update {wt=javabin&version=2} {add=[27 (1417251022384922624)]} 0 9
[junit4:junit4]   2> 10388 T87 C13 P61401 /update {wt=javabin&version=2} {add=[28 (1417251022397505536)]} 0 2
[junit4:

[...truncated too long message...]

eptor.run(AbstractConnector.java:933)
[junit4:junit4]    >         at org.eclipse.jetty.util.thread.QueuedThreadPool.runJob(QueuedThreadPool.java:599)
[junit4:junit4]    >         at org.eclipse.jetty.util.thread.QueuedThreadPool$3.run(QueuedThreadPool.java:534)
[junit4:junit4]    >         at java.lang.Thread.run(Thread.java:679)
[junit4:junit4]    >    7) Thread[id=168, name=qtp411693457-168 Acceptor1 SelectChannelConnector@0.0.0.0:13544, state=BLOCKED, group=TGRP-RecoveryZkTest]
[junit4:junit4]    >         at sun.nio.ch.ServerSocketChannelImpl.accept(ServerSocketChannelImpl.java:147)
[junit4:junit4]    >         at org.eclipse.jetty.server.nio.SelectChannelConnector.accept(SelectChannelConnector.java:104)
[junit4:junit4]    >         at org.eclipse.jetty.server.AbstractConnector$Acceptor.run(AbstractConnector.java:933)
[junit4:junit4]    >         at org.eclipse.jetty.util.thread.QueuedThreadPool.runJob(QueuedThreadPool.java:599)
[junit4:junit4]    >         at org.eclipse.jetty.util.thread.QueuedThreadPool$3.run(QueuedThreadPool.java:534)
[junit4:junit4]    >         at java.lang.Thread.run(Thread.java:679)
[junit4:junit4]    >    8) Thread[id=170, name=qtp411693457-170 Acceptor3 SelectChannelConnector@0.0.0.0:13544, state=BLOCKED, group=TGRP-RecoveryZkTest]
[junit4:junit4]    >         at sun.nio.ch.ServerSocketChannelImpl.accept(ServerSocketChannelImpl.java:147)
[junit4:junit4]    >         at org.eclipse.jetty.server.nio.SelectChannelConnector.accept(SelectChannelConnector.java:104)
[junit4:junit4]    >         at org.eclipse.jetty.server.AbstractConnector$Acceptor.run(AbstractConnector.java:933)
[junit4:junit4]    >         at org.eclipse.jetty.util.thread.QueuedThreadPool.runJob(QueuedThreadPool.java:599)
[junit4:junit4]    >         at org.eclipse.jetty.util.thread.QueuedThreadPool$3.run(QueuedThreadPool.java:534)
[junit4:junit4]    >         at java.lang.Thread.run(Thread.java:679)
[junit4:junit4]    > 	at __randomizedtesting.SeedInfo.seed([20E679A9BD29B952]:0)
[junit4:junit4]    > Throwable #2: com.carrotsearch.randomizedtesting.ThreadLeakError: There are still zombie threads that couldn't be terminated:
[junit4:junit4]    >    1) Thread[id=79, name=qtp64462389-79 Acceptor1 SelectChannelConnector@0.0.0.0:61401, state=BLOCKED, group=TGRP-RecoveryZkTest]
[junit4:junit4]    >         at sun.nio.ch.ServerSocketChannelImpl.accept(ServerSocketChannelImpl.java:147)
[junit4:junit4]    >         at org.eclipse.jetty.server.nio.SelectChannelConnector.accept(SelectChannelConnector.java:104)
[junit4:junit4]    >         at org.eclipse.jetty.server.AbstractConnector$Acceptor.run(AbstractConnector.java:933)
[junit4:junit4]    >         at org.eclipse.jetty.util.thread.QueuedThreadPool.runJob(QueuedThreadPool.java:599)
[junit4:junit4]    >         at org.eclipse.jetty.util.thread.QueuedThreadPool$3.run(QueuedThreadPool.java:534)
[junit4:junit4]    >         at java.lang.Thread.run(Thread.java:679)
[junit4:junit4]    >    2) Thread[id=81, name=qtp64462389-81 Acceptor3 SelectChannelConnector@0.0.0.0:61401, state=RUNNABLE, group=TGRP-RecoveryZkTest]
[junit4:junit4]    >         at sun.nio.ch.ServerSocketChannelImpl.accept0(Native Method)
[junit4:junit4]    >         at sun.nio.ch.ServerSocketChannelImpl.accept(ServerSocketChannelImpl.java:163)
[junit4:junit4]    >         at org.eclipse.jetty.server.nio.SelectChannelConnector.accept(SelectChannelConnector.java:104)
[junit4:junit4]    >         at org.eclipse.jetty.server.AbstractConnector$Acceptor.run(AbstractConnector.java:933)
[junit4:junit4]    >         at org.eclipse.jetty.util.thread.QueuedThreadPool.runJob(QueuedThreadPool.java:599)
[junit4:junit4]    >         at org.eclipse.jetty.util.thread.QueuedThreadPool$3.run(QueuedThreadPool.java:534)
[junit4:junit4]    >         at java.lang.Thread.run(Thread.java:679)
[junit4:junit4]    >    3) Thread[id=80, name=qtp64462389-80 Acceptor2 SelectChannelConnector@0.0.0.0:61401, state=BLOCKED, group=TGRP-RecoveryZkTest]
[junit4:junit4]    >         at sun.nio.ch.ServerSocketChannelImpl.accept(ServerSocketChannelImpl.java:147)
[junit4:junit4]    >         at org.eclipse.jetty.server.nio.SelectChannelConnector.accept(SelectChannelConnector.java:104)
[junit4:junit4]    >         at org.eclipse.jetty.server.AbstractConnector$Acceptor.run(AbstractConnector.java:933)
[junit4:junit4]    >         at org.eclipse.jetty.util.thread.QueuedThreadPool.runJob(QueuedThreadPool.java:599)
[junit4:junit4]    >         at org.eclipse.jetty.util.thread.QueuedThreadPool$3.run(QueuedThreadPool.java:534)
[junit4:junit4]    >         at java.lang.Thread.run(Thread.java:679)
[junit4:junit4]    >    4) Thread[id=78, name=qtp64462389-78 Acceptor0 SelectChannelConnector@0.0.0.0:61401, state=BLOCKED, group=TGRP-RecoveryZkTest]
[junit4:junit4]    >         at sun.nio.ch.ServerSocketChannelImpl.accept(ServerSocketChannelImpl.java:147)
[junit4:junit4]    >         at org.eclipse.jetty.server.nio.SelectChannelConnector.accept(SelectChannelConnector.java:104)
[junit4:junit4]    >         at org.eclipse.jetty.server.AbstractConnector$Acceptor.run(AbstractConnector.java:933)
[junit4:junit4]    >         at org.eclipse.jetty.util.thread.QueuedThreadPool.runJob(QueuedThreadPool.java:599)
[junit4:junit4]    >         at org.eclipse.jetty.util.thread.QueuedThreadPool$3.run(QueuedThreadPool.java:534)
[junit4:junit4]    >         at java.lang.Thread.run(Thread.java:679)
[junit4:junit4]    >    5) Thread[id=169, name=qtp411693457-169 Acceptor2 SelectChannelConnector@0.0.0.0:13544, state=BLOCKED, group=TGRP-RecoveryZkTest]
[junit4:junit4]    >         at sun.nio.ch.ServerSocketChannelImpl.accept(ServerSocketChannelImpl.java:147)
[junit4:junit4]    >         at org.eclipse.jetty.server.nio.SelectChannelConnector.accept(SelectChannelConnector.java:104)
[junit4:junit4]    >         at org.eclipse.jetty.server.AbstractConnector$Acceptor.run(AbstractConnector.java:933)
[junit4:junit4]    >         at org.eclipse.jetty.util.thread.QueuedThreadPool.runJob(QueuedThreadPool.java:599)
[junit4:junit4]    >         at org.eclipse.jetty.util.thread.QueuedThreadPool$3.run(QueuedThreadPool.java:534)
[junit4:junit4]    >         at java.lang.Thread.run(Thread.java:679)
[junit4:junit4]    >    6) Thread[id=167, name=qtp411693457-167 Acceptor0 SelectChannelConnector@0.0.0.0:13544, state=RUNNABLE, group=TGRP-RecoveryZkTest]
[junit4:junit4]    >         at sun.nio.ch.ServerSocketChannelImpl.accept0(Native Method)
[junit4:junit4]    >         at sun.nio.ch.ServerSocketChannelImpl.accept(ServerSocketChannelImpl.java:163)
[junit4:junit4]    >         at org.eclipse.jetty.server.nio.SelectChannelConnector.accept(SelectChannelConnector.java:104)
[junit4:junit4]    >         at org.eclipse.jetty.server.AbstractConnector$Acceptor.run(AbstractConnector.java:933)
[junit4:junit4]    >         at org.eclipse.jetty.util.thread.QueuedThreadPool.runJob(QueuedThreadPool.java:599)
[junit4:junit4]    >         at org.eclipse.jetty.util.thread.QueuedThreadPool$3.run(QueuedThreadPool.java:534)
[junit4:junit4]    >         at java.lang.Thread.run(Thread.java:679)
[junit4:junit4]    >    7) Thread[id=168, name=qtp411693457-168 Acceptor1 SelectChannelConnector@0.0.0.0:13544, state=BLOCKED, group=TGRP-RecoveryZkTest]
[junit4:junit4]    >         at sun.nio.ch.ServerSocketChannelImpl.accept(ServerSocketChannelImpl.java:147)
[junit4:junit4]    >         at org.eclipse.jetty.server.nio.SelectChannelConnector.accept(SelectChannelConnector.java:104)
[junit4:junit4]    >         at org.eclipse.jetty.server.AbstractConnector$Acceptor.run(AbstractConnector.java:933)
[junit4:junit4]    >         at org.eclipse.jetty.util.thread.QueuedThreadPool.runJob(QueuedThreadPool.java:599)
[junit4:junit4]    >         at org.eclipse.jetty.util.thread.QueuedThreadPool$3.run(QueuedThreadPool.java:534)
[junit4:junit4]    >         at java.lang.Thread.run(Thread.java:679)
[junit4:junit4]    >    8) Thread[id=170, name=qtp411693457-170 Acceptor3 SelectChannelConnector@0.0.0.0:13544, state=BLOCKED, group=TGRP-RecoveryZkTest]
[junit4:junit4]    >         at sun.nio.ch.ServerSocketChannelImpl.accept(ServerSocketChannelImpl.java:147)
[junit4:junit4]    >         at org.eclipse.jetty.server.nio.SelectChannelConnector.accept(SelectChannelConnector.java:104)
[junit4:junit4]    >         at org.eclipse.jetty.server.AbstractConnector$Acceptor.run(AbstractConnector.java:933)
[junit4:junit4]    >         at org.eclipse.jetty.util.thread.QueuedThreadPool.runJob(QueuedThreadPool.java:599)
[junit4:junit4]    >         at org.eclipse.jetty.util.thread.QueuedThreadPool$3.run(QueuedThreadPool.java:534)
[junit4:junit4]    >         at java.lang.Thread.run(Thread.java:679)
[junit4:junit4]    > 	at __randomizedtesting.SeedInfo.seed([20E679A9BD29B952]:0)
[junit4:junit4] Completed on J1 in 87.51s, 1 test, 2 errors <<< FAILURES!

[...truncated 131 lines...]
BUILD FAILED
/usr/home/hudson/hudson-slave/workspace/Lucene-Solr-Tests-4.x-Java6/build.xml:335: The following error occurred while executing this line:
/usr/home/hudson/hudson-slave/workspace/Lucene-Solr-Tests-4.x-Java6/build.xml:39: The following error occurred while executing this line:
/usr/home/hudson/hudson-slave/workspace/Lucene-Solr-Tests-4.x-Java6/solr/build.xml:178: The following error occurred while executing this line:
/usr/home/hudson/hudson-slave/workspace/Lucene-Solr-Tests-4.x-Java6/lucene/module-build.xml:61: The following error occurred while executing this line:
/usr/home/hudson/hudson-slave/workspace/Lucene-Solr-Tests-4.x-Java6/lucene/common-build.xml:1159: The following error occurred while executing this line:
/usr/home/hudson/hudson-slave/workspace/Lucene-Solr-Tests-4.x-Java6/lucene/common-build.xml:827: There were test failures: 233 suites, 965 tests, 4 suite-level errors, 815 ignored

Total time: 21 minutes 20 seconds
Build step 'Invoke Ant' marked build as failure
Archiving artifacts
Recording test results
Email was triggered for: Failure
Sending email for trigger: Failure



Mime
View raw message