lucene-dev mailing list archives

Site index · List index
Message view « Date » · « Thread »
Top « Date » · « Thread »
From Charlie Cron <hudsonsevilt...@gmail.com>
Subject Build failed in Jenkins: slow-io-beasting #5159
Date Tue, 30 Oct 2012 23:08:39 GMT
See <http://sierranevada.servebeer.com:8080/job/slow-io-beasting/5159/>

------------------------------------------
[...truncated 12317 lines...]
[junit4:junit4] Suite: org.apache.solr.spelling.TestSuggestSpellingConverter
[junit4:junit4] Completed on J6 in 0.03s, 2 tests
[junit4:junit4] 
[junit4:junit4] Suite: org.apache.solr.internal.csv.ExtendedBufferedReaderTest
[junit4:junit4] Completed on J2 in 0.02s, 8 tests
[junit4:junit4] 
[junit4:junit4] Suite: org.apache.solr.cloud.ChaosMonkeySafeLeaderTest
[junit4:junit4] Completed on J7 in 0.00s, 0 tests
[junit4:junit4] 
[junit4:junit4] Suite: org.apache.solr.schema.UUIDFieldTest
[junit4:junit4] Completed on J5 in 0.01s, 1 test
[junit4:junit4] 
[junit4:junit4] Suite: org.apache.solr.handler.admin.SystemInfoHandlerTest
[junit4:junit4] Completed on J1 in 0.02s, 1 test
[junit4:junit4] 
[junit4:junit4] Suite: org.apache.solr.internal.csv.CSVUtilsTest
[junit4:junit4] Completed on J3 in 0.04s, 14 tests
[junit4:junit4] 
[junit4:junit4] Suite: org.apache.solr.internal.csv.writer.CSVWriterTest
[junit4:junit4] Completed on J6 in 0.02s, 2 tests
[junit4:junit4] 
[junit4:junit4] Suite: org.apache.solr.internal.csv.writer.CSVFieldTest
[junit4:junit4] Completed on J2 in 0.01s, 2 tests
[junit4:junit4] 
[junit4:junit4] Suite: org.apache.solr.util.CircularListTest
[junit4:junit4] Completed on J7 in 0.02s, 1 test
[junit4:junit4] 
[junit4:junit4] Suite: org.apache.solr.internal.csv.writer.CSVConfigTest
[junit4:junit4] Completed on J5 in 0.01s, 7 tests
[junit4:junit4] 
[junit4:junit4] Suite: org.apache.solr.AnalysisAfterCoreReloadTest
[junit4:junit4]   2> 784 T671 oasu.AbstractSolrTestCase.tearDown ####TEARDOWN_START testStopwordsAfterCoreReload
[junit4:junit4]   2> NOTE: reproduce with: ant test  -Dtestcase=AnalysisAfterCoreReloadTest
-Dtests.method=testStopwordsAfterCoreReload -Dtests.seed=57F0BCB39139716F -Dtests.slow=true
-Dtests.locale=tr_TR -Dtests.timezone=Indian/Chagos -Dtests.file.encoding=Cp1252
[junit4:junit4] ERROR   0.08s J1 | AnalysisAfterCoreReloadTest.testStopwordsAfterCoreReload
<<<
[junit4:junit4]    > Throwable #1: java.io.FileNotFoundException: <http://sierranevada.servebeer.com:8080/job/slow-io-beasting/ws/solr/build/solr-core/test-files/solr/acollectionafterbaddelete/data/index/write.lock>
(The system cannot find the file specified)
[junit4:junit4]    > 	at java.io.FileInputStream.open(Native Method)
[junit4:junit4]    > 	at java.io.FileInputStream.<init>(FileInputStream.java:106)
[junit4:junit4]    > 	at org.apache.commons.io.FileUtils.doCopyFile(FileUtils.java:935)
[junit4:junit4]    > 	at org.apache.commons.io.FileUtils.doCopyDirectory(FileUtils.java:1225)
[junit4:junit4]    > 	at org.apache.commons.io.FileUtils.doCopyDirectory(FileUtils.java:1223)
[junit4:junit4]    > 	at org.apache.commons.io.FileUtils.doCopyDirectory(FileUtils.java:1223)
[junit4:junit4]    > 	at org.apache.commons.io.FileUtils.doCopyDirectory(FileUtils.java:1223)
[junit4:junit4]    > 	at org.apache.commons.io.FileUtils.copyDirectory(FileUtils.java:1186)
[junit4:junit4]    > 	at org.apache.commons.io.FileUtils.copyDirectory(FileUtils.java:1058)
[junit4:junit4]    > 	at org.apache.solr.AnalysisAfterCoreReloadTest.setUp(AnalysisAfterCoreReloadTest.java:60)
[junit4:junit4]    > 	at sun.reflect.GeneratedMethodAccessor8.invoke(Unknown Source)
[junit4:junit4]    > 	at sun.reflect.DelegatingMethodAccessorImpl.invoke(DelegatingMethodAccessorImpl.java:25)
[junit4:junit4]    > 	at java.lang.reflect.Method.invoke(Method.java:597)
[junit4:junit4]    > 	at com.carrotsearch.randomizedtesting.RandomizedRunner.invoke(RandomizedRunner.java:1559)
[junit4:junit4]    > 	at com.carrotsearch.randomizedtesting.RandomizedRunner.access$600(RandomizedRunner.java:79)
[junit4:junit4]    > 	at com.carrotsearch.randomizedtesting.RandomizedRunner$7.evaluate(RandomizedRunner.java:771)
[junit4:junit4]    > 	at com.carrotsearch.randomizedtesting.RandomizedRunner$8.evaluate(RandomizedRunner.java:787)
[junit4:junit4]    > 	at com.carrotsearch.randomizedtesting.rules.SystemPropertiesRestoreRule$1.evaluate(SystemPropertiesRestoreRule.java:53)
[junit4:junit4]    > 	at org.apache.lucene.util.TestRuleSetupTeardownChained$1.evaluate(TestRuleSetupTeardownChained.java:50)
[junit4:junit4]    > 	at org.apache.lucene.util.TestRuleFieldCacheSanity$1.evaluate(TestRuleFieldCacheSanity.java:51)
[junit4:junit4]    > 	at org.apache.lucene.util.AbstractBeforeAfterRule$1.evaluate(AbstractBeforeAfterRule.java:45)
[junit4:junit4]    > 	at com.carrotsearch.randomizedtesting.rules.SystemPropertiesInvariantRule$1.evaluate(SystemPropertiesInvariantRule.java:55)
[junit4:junit4]    > 	at org.apache.lucene.util.TestRuleThreadAndTestName$1.evaluate(TestRuleThreadAndTestName.java:48)
[junit4:junit4]    > 	at org.apache.lucene.util.TestRuleIgnoreAfterMaxFailures$1.evaluate(TestRuleIgnoreAfterMaxFailures.java:70)
[junit4:junit4]    > 	at org.apache.lucene.util.TestRuleMarkFailure$1.evaluate(TestRuleMarkFailure.java:48)
[junit4:junit4]    > 	at com.carrotsearch.randomizedtesting.rules.StatementAdapter.evaluate(StatementAdapter.java:36)
[junit4:junit4]    > 	at com.carrotsearch.randomizedtesting.ThreadLeakControl$StatementRunner.run(ThreadLeakControl.java:358)
[junit4:junit4]    > 	at com.carrotsearch.randomizedtesting.ThreadLeakControl.forkTimeoutingTask(ThreadLeakControl.java:782)
[junit4:junit4]    > 	at com.carrotsearch.randomizedtesting.ThreadLeakControl$3.evaluate(ThreadLeakControl.java:442)
[junit4:junit4]    > 	at com.carrotsearch.randomizedtesting.RandomizedRunner.runSingleTest(RandomizedRunner.java:746)
[junit4:junit4]    > 	at com.carrotsearch.randomizedtesting.RandomizedRunner$3.evaluate(RandomizedRunner.java:648)
[junit4:junit4]    > 	at com.carrotsearch.randomizedtesting.RandomizedRunner$4.evaluate(RandomizedRunner.java:682)
[junit4:junit4]    > 	at com.carrotsearch.randomizedtesting.RandomizedRunner$5.evaluate(RandomizedRunner.java:693)
[junit4:junit4]    > 	at com.carrotsearch.randomizedtesting.rules.StatementAdapter.evaluate(StatementAdapter.java:36)
[junit4:junit4]    > 	at com.carrotsearch.randomizedtesting.rules.SystemPropertiesRestoreRule$1.evaluate(SystemPropertiesRestoreRule.java:53)
[junit4:junit4]    > 	at org.apache.lucene.util.AbstractBeforeAfterRule$1.evaluate(AbstractBeforeAfterRule.java:45)
[junit4:junit4]    > 	at org.apache.lucene.util.TestRuleStoreClassName$1.evaluate(TestRuleStoreClassName.java:42)
[junit4:junit4]    > 	at com.carrotsearch.randomizedtesting.rules.SystemPropertiesInvariantRule$1.evaluate(SystemPropertiesInvariantRule.java:55)
[junit4:junit4]    > 	at com.carrotsearch.randomizedtesting.rules.NoShadowingOrOverridesOnMethodsRule$1.evaluate(NoShadowingOrOverridesOnMethodsRule.java:39)
[junit4:junit4]    > 	at com.carrotsearch.randomizedtesting.rules.NoShadowingOrOverridesOnMethodsRule$1.evaluate(NoShadowingOrOverridesOnMethodsRule.java:39)
[junit4:junit4]    > 	at com.carrotsearch.randomizedtesting.rules.StatementAdapter.evaluate(StatementAdapter.java:36)
[junit4:junit4]    > 	at org.apache.lucene.util.TestRuleAssertionsRequired$1.evaluate(TestRuleAssertionsRequired.java:43)
[junit4:junit4]    > 	at org.apache.lucene.util.TestRuleMarkFailure$1.evaluate(TestRuleMarkFailure.java:48)
[junit4:junit4]    > 	at org.apache.lucene.util.TestRuleIgnoreAfterMaxFailures$1.evaluate(TestRuleIgnoreAfterMaxFailures.java:70)
[junit4:junit4]    > 	at org.apache.lucene.util.TestRuleIgnoreTestSuites$1.evaluate(TestRuleIgnoreTestSuites.java:55)
[junit4:junit4]    > 	at com.carrotsearch.randomizedtesting.rules.StatementAdapter.evaluate(StatementAdapter.java:36)
[junit4:junit4]    > 	at com.carrotsearch.randomizedtesting.ThreadLeakControl$StatementRunner.run(ThreadLeakControl.java:358)
[junit4:junit4]    > 	at java.lang.Thread.run(Thread.java:662)
[junit4:junit4]    > Throwable #2: java.lang.NullPointerException
[junit4:junit4]    > 	at org.apache.solr.AnalysisAfterCoreReloadTest.cleanUp(AnalysisAfterCoreReloadTest.java:46)
[junit4:junit4]    > 	at sun.reflect.NativeMethodAccessorImpl.invoke0(Native Method)
[junit4:junit4]    > 	at sun.reflect.NativeMethodAccessorImpl.invoke(NativeMethodAccessorImpl.java:39)
[junit4:junit4]    > 	at sun.reflect.DelegatingMethodAccessorImpl.invoke(DelegatingMethodAccessorImpl.java:25)
[junit4:junit4]    > 	at java.lang.reflect.Method.invoke(Method.java:597)
[junit4:junit4]    > 	at com.carrotsearch.randomizedtesting.RandomizedRunner.invoke(RandomizedRunner.java:1559)
[junit4:junit4]    > 	at com.carrotsearch.randomizedtesting.RandomizedRunner.access$600(RandomizedRunner.java:79)
[junit4:junit4]    > 	at com.carrotsearch.randomizedtesting.RandomizedRunner$8.evaluate(RandomizedRunner.java:795)
[junit4:junit4]    > 	at com.carrotsearch.randomizedtesting.rules.SystemPropertiesRestoreRule$1.evaluate(SystemPropertiesRestoreRule.java:53)
[junit4:junit4]    > 	at org.apache.lucene.util.TestRuleSetupTeardownChained$1.evaluate(TestRuleSetupTeardownChained.java:50)
[junit4:junit4]    > 	at org.apache.lucene.util.TestRuleFieldCacheSanity$1.evaluate(TestRuleFieldCacheSanity.java:51)
[junit4:junit4]    > 	at org.apache.lucene.util.AbstractBeforeAfterRule$1.evaluate(AbstractBeforeAfterRule.java:45)
[junit4:junit4]    > 	at com.carrotsearch.randomizedtesting.rules.SystemPropertiesInvariantRule$1.evaluate(SystemPropertiesInvariantRule.java:55)
[junit4:junit4]    > 	at org.apache.lucene.util.TestRuleThreadAndTestName$1.evaluate(TestRuleThreadAndTestName.java:48)
[junit4:junit4]    > 	at org.apache.lucene.util.TestRuleIgnoreAfterMaxFailures$1.evaluate(TestRuleIgnoreAfterMaxFailures.java:70)
[junit4:junit4]    > 	at org.apache.lucene.util.TestRuleMarkFailure$1.evaluate(TestRuleMarkFailure.java:48)
[junit4:junit4]    > 	at com.carrotsearch.randomizedtesting.rules.StatementAdapter.evaluate(StatementAdapter.java:36)
[junit4:junit4]    > 	at com.carrotsearch.randomizedtesting.ThreadLeakControl$StatementRunner.run(ThreadLeakControl.java:358)
[junit4:junit4]    > 	at com.carrotsearch.randomizedtesting.ThreadLeakControl.forkTimeoutingTask(ThreadLeakControl.java:782)
[junit4:junit4]    > 	at com.carrotsearch.randomizedtesting.ThreadLeakControl$3.evaluate(ThreadLeakControl.java:442)
[junit4:junit4]    > 	at com.carrotsearch.randomizedtesting.RandomizedRunner.runSingleTest(RandomizedRunner.java:746)
[junit4:junit4]    > 	at com.carrotsearch.randomizedtesting.RandomizedRunner$3.evaluate(RandomizedRunner.java:648)
[junit4:junit4]    > 	at com.carrotsearch.randomizedtesting.RandomizedRunner$4.evaluate(RandomizedRunner.java:682)
[junit4:junit4]    > 	at com.carrotsearch.randomizedtesting.RandomizedRunner$5.evaluate(RandomizedRunner.java:693)
[junit4:junit4]    > 	at com.carrotsearch.randomizedtesting.rules.StatementAdapter.evaluate(StatementAdapter.java:36)
[junit4:junit4]    > 	at com.carrotsearch.randomizedtesting.rules.SystemPropertiesRestoreRule$1.evaluate(SystemPropertiesRestoreRule.java:53)
[junit4:junit4]    > 	at org.apache.lucene.util.AbstractBeforeAfterRule$1.evaluate(AbstractBeforeAfterRule.java:45)
[junit4:junit4]    > 	at org.apache.lucene.util.TestRuleStoreClassName$1.evaluate(TestRuleStoreClassName.java:42)
[junit4:junit4]    > 	at com.carrotsearch.randomizedtesting.rules.SystemPropertiesInvariantRule$1.evaluate(SystemPropertiesInvariantRule.java:55)
[junit4:junit4]    > 	at com.carrotsearch.randomizedtesting.rules.NoShadowingOrOverridesOnMethodsRule$1.evaluate(NoShadowingOrOverridesOnMethodsRule.java:39)
[junit4:junit4]    > 	at com.carrotsearch.randomizedtesting.rules.NoShadowingOrOverridesOnMethodsRule$1.evaluate(NoShadowingOrOverridesOnMethodsRule.java:39)
[junit4:junit4]    > 	at com.carrotsearch.randomizedtesting.rules.StatementAdapter.evaluate(StatementAdapter.java:36)
[junit4:junit4]    > 	at org.apache.lucene.util.TestRuleAssertionsRequired$1.evaluate(TestRuleAssertionsRequired.java:43)
[junit4:junit4]    > 	at org.apache.lucene.util.TestRuleMarkFailure$1.evaluate(TestRuleMarkFailure.java:48)
[junit4:junit4]    > 	at org.apache.lucene.util.TestRuleIgnoreAfterMaxFailures$1.evaluate(TestRuleIgnoreAfterMaxFailures.java:70)
[junit4:junit4]    > 	at org.apache.lucene.util.TestRuleIgnoreTestSuites$1.evaluate(TestRuleIgnoreTestSuites.java:55)
[junit4:junit4]    > 	at com.carrotsearch.randomizedtesting.rules.StatementAdapter.evaluate(StatementAdapter.java:36)
[junit4:junit4]    > 	at com.carrotsearch.randomizedtesting.ThreadLeakControl$StatementRunner.run(ThreadLeakControl.java:358)
[junit4:junit4]    > 	at java.lang.Thread.run(Thread.java:662)
[junit4:junit4]    > Throwable #3: java.lang.NullPointerException
[junit4:junit4]    > 	at org.apache.solr.util.AbstractSolrTestCase.recurseDelete(AbstractSolrTestCase.java:456)
[junit4:junit4]    > 	at org.apache.solr.util.AbstractSolrTestCase.tearDown(AbstractSolrTestCase.java:214)
[junit4:junit4]    > 	at sun.reflect.GeneratedMethodAccessor10.invoke(Unknown Source)
[junit4:junit4]    > 	at sun.reflect.DelegatingMethodAccessorImpl.invoke(DelegatingMethodAccessorImpl.java:25)
[junit4:junit4]    > 	at java.lang.reflect.Method.invoke(Method.java:597)
[junit4:junit4]    > 	at com.carrotsearch.randomizedtesting.RandomizedRunner.invoke(RandomizedRunner.java:1559)
[junit4:junit4]    > 	at com.carrotsearch.randomizedtesting.RandomizedRunner.access$600(RandomizedRunner.java:79)
[junit4:junit4]    > 	at com.carrotsearch.randomizedtesting.RandomizedRunner$8.evaluate(RandomizedRunner.java:795)
[junit4:junit4]    > 	at com.carrotsearch.randomizedtesting.rules.SystemPropertiesRestoreRule$1.evaluate(SystemPropertiesRestoreRule.java:53)
[junit4:junit4]    > 	at org.apache.lucene.util.TestRuleSetupTeardownChained$1.evaluate(TestRuleSetupTeardownChained.java:50)
[junit4:junit4]    > 	at org.apache.lucene.util.TestRuleFieldCacheSanity$1.evaluate(TestRuleFieldCacheSanity.java:51)
[junit4:junit4]    > 	at org.apache.lucene.util.AbstractBeforeAfterRule$1.evaluate(AbstractBeforeAfterRule.java:45)
[junit4:junit4]    > 	at com.carrotsearch.randomizedtesting.rules.SystemPropertiesInvariantRule$1.evaluate(SystemPropertiesInvariantRule.java:55)
[junit4:junit4]    > 	at org.apache.lucene.util.TestRuleThreadAndTestName$1.evaluate(TestRuleThreadAndTestName.java:48)
[junit4:junit4]    > 	at org.apache.lucene.util.TestRuleIgnoreAfterMaxFailures$1.evaluate(TestRuleIgnoreAfterMaxFailures.java:70)
[junit4:junit4]    > 	at org.apache.lucene.util.TestRuleMarkFailure$1.evaluate(TestRuleMarkFailure.java:48)
[junit4:junit4]    > 	at com.carrotsearch.randomizedtesting.rules.StatementAdapter.evaluate(StatementAdapter.java:36)
[junit4:junit4]    > 	at com.carrotsearch.randomizedtesting.ThreadLeakControl$StatementRunner.run(ThreadLeakControl.java:358)
[junit4:junit4]    > 	at com.carrotsearch.randomizedtesting.ThreadLeakControl.forkTimeoutingTask(ThreadLeakControl.java:782)
[junit4:junit4]    > 	at com.carrotsearch.randomizedtesting.ThreadLeakControl$3.evaluate(ThreadLeakControl.java:442)
[junit4:junit4]    > 	at com.carrotsearch.randomizedtesting.RandomizedRunner.runSingleTest(RandomizedRunner.java:746)
[junit4:junit4]    > 	at com.carrotsearch.randomizedtesting.RandomizedRunner$3.evaluate(RandomizedRunner.java:648)
[junit4:junit4]    > 	at com.carrotsearch.randomizedtesting.RandomizedRunner$4.evaluate(RandomizedRunner.java:682)
[junit4:junit4]    > 	at com.carrotsearch.randomizedtesting.RandomizedRunner$5.evaluate(RandomizedRunner.java:693)
[junit4:junit4]    > 	at com.carrotsearch.randomizedtesting.rules.StatementAdapter.evaluate(StatementAdapter.java:36)
[junit4:junit4]    > 	at com.carrotsearch.randomizedtesting.rules.SystemPropertiesRestoreRule$1.evaluate(SystemPropertiesRestoreRule.java:53)
[junit4:junit4]    > 	at org.apache.lucene.util.AbstractBeforeAfterRule$1.evaluate(AbstractBeforeAfterRule.java:45)
[junit4:junit4]    > 	at org.apache.lucene.util.TestRuleStoreClassName$1.evaluate(TestRuleStoreClassName.java:42)
[junit4:junit4]    > 	at com.carrotsearch.randomizedtesting.rules.SystemPropertiesInvariantRule$1.evaluate(SystemPropertiesInvariantRule.java:55)
[junit4:junit4]    > 	at com.carrotsearch.randomizedtesting.rules.NoShadowingOrOverridesOnMethodsRule$1.evaluate(NoShadowingOrOverridesOnMethodsRule.java:39)
[junit4:junit4]    > 	at com.carrotsearch.randomizedtesting.rules.NoShadowingOrOverridesOnMethodsRule$1.evaluate(NoShadowingOrOverridesOnMethodsRule.java:39)
[junit4:junit4]    > 	at com.carrotsearch.randomizedtesting.rules.StatementAdapter.evaluate(StatementAdapter.java:36)
[junit4:junit4]    > 	at org.apache.lucene.util.TestRuleAssertionsRequired$1.evaluate(TestRuleAssertionsRequired.java:43)
[junit4:junit4]    > 	at org.apache.lucene.util.TestRuleMarkFailure$1.evaluate(TestRuleMarkFailure.java:48)
[junit4:junit4]    > 	at org.apache.lucene.util.TestRuleIgnoreAfterMaxFailures$1.evaluate(TestRuleIgnoreAfterMaxFailures.java:70)
[junit4:junit4]    > 	at org.apache.lucene.util.TestRuleIgnoreTestSuites$1.evaluate(TestRuleIgnoreTestSuites.java:55)
[junit4:junit4]    > 	at com.carrotsearch.randomizedtesting.rules.StatementAdapter.evaluate(StatementAdapter.java:36)
[junit4:junit4]    > 	at com.carrotsearch.randomizedtesting.ThreadLeakControl$StatementRunner.run(ThreadLeakControl.java:358)
[junit4:junit4]    > 	at java.lang.Thread.run(Thread.java:662)
[junit4:junit4]   2> NOTE: test params are: codec=Lucene41: {}, sim=RandomSimilarityProvider(queryNorm=true,coord=yes):
{}, locale=tr_TR, timezone=Indian/Chagos
[junit4:junit4]   2> NOTE: Windows Vista 6.0 x86/Sun Microsystems Inc. 1.6.0_23 (32-bit)/cpus=4,threads=1,free=28326976,total=45961216
[junit4:junit4]   2> NOTE: All tests run in this JVM: [StandardRequestHandlerTest, TestGroupingSearch,
TestIBSimilarityFactory, TestLMDirichletSimilarityFactory, PluginInfoTest, OverseerTest, TestSolrDeletionPolicy2,
TestCharFilters, HighlighterTest, DistanceFunctionTest, ZkNodePropsTest, NumericFieldsTest,
TestRangeQuery, LeaderElectionTest, TestExtendedDismaxParser, SolrCoreTest, TestFiltering,
CoreAdminHandlerTest, PolyFieldTest, MinimalSchemaTest, SuggesterWFSTTest, TestQueryUtils,
TestWriterPerf, AlternateDirectoryTest, SOLR749Test, TestCollationField, TestDFRSimilarityFactory,
TestDefaultSimilarityFactory, SystemInfoHandlerTest, AnalysisAfterCoreReloadTest]
[junit4:junit4] Completed on J1 in 0.09s, 1 test, 1 error <<< FAILURES!
[junit4:junit4] 
[junit4:junit4] Suite: org.apache.solr.TestDocumentBuilder
[junit4:junit4] Completed on J3 in 0.02s, 1 test
[junit4:junit4] 
[junit4:junit4] Suite: org.apache.solr.cloud.ClusterStateTest
[junit4:junit4] Completed on J2 in 0.03s, 1 test
[junit4:junit4] 
[junit4:junit4] Suite: org.apache.solr.search.TestRTGBase
[junit4:junit4] Completed on J3 in 0.00s, 0 tests
[junit4:junit4] 
[junit4:junit4] Suite: org.apache.solr.search.TestStressLucene
[junit4:junit4] Completed on J3 in 0.68s, 1 test
[junit4:junit4] 
[junit4:junit4] Suite: org.apache.solr.search.TestElisionMultitermQuery
[junit4:junit4] Completed on J1 in 1.55s, 1 test
[junit4:junit4] 
[junit4:junit4] Suite: org.apache.solr.handler.component.ResponseLogComponentTest
[junit4:junit4] Completed on J7 in 1.90s, 3 tests
[junit4:junit4] 
[junit4:junit4] Suite: org.apache.solr.analysis.PathHierarchyTokenizerFactoryTest
[junit4:junit4] Completed on J6 in 2.35s, 2 tests
[junit4:junit4] 
[junit4:junit4] Suite: org.apache.solr.update.processor.ScriptEngineTest
[junit4:junit4] IGNOR/A 0.01s J7 | ScriptEngineTest.testJRuby
[junit4:junit4]    > Assumption #1: got: <[null]>, expected: each not null
[junit4:junit4] Completed on J7 in 0.25s, 6 tests, 1 skipped
[junit4:junit4] 
[junit4:junit4] Suite: org.apache.solr.search.TestStressRecovery
[junit4:junit4] IGNOR/A 0.19s J3 | TestStressRecovery.testStressRecovery
[junit4:junit4]    > Assumption #1: FIXME: This test is horribly slow sometimes on Windows!
[junit4:junit4] Completed on J3 in 1.51s, 1 test, 1 skipped
[junit4:junit4] 
[junit4:junit4] Suite: org.apache.solr.util.TestFastOutputStream
[junit4:junit4] Completed on J3 in 0.16s, 1 test
[junit4:junit4] 
[junit4:junit4] Suite: org.apache.solr.util.SimplePostToolTest
[junit4:junit4] Completed on J7 in 0.63s, 11 tests
[junit4:junit4] 
[junit4:junit4] Suite: org.apache.solr.update.processor.StatelessScriptUpdateProcessorFactoryTest
[junit4:junit4] Completed on J6 in 3.71s, 7 tests
[junit4:junit4] 
[junit4:junit4] Suite: org.apache.solr.core.TestBadConfig
[junit4:junit4] Completed on J4 in 8.58s, 6 tests
[junit4:junit4] 
[junit4:junit4] HEARTBEAT J0: 2012-10-30T19:08:18, stalled for  244s at: BasicDistributedZkTest.testDistribSearch
[junit4:junit4] Suite: org.apache.solr.cloud.BasicDistributedZkTest
[junit4:junit4] Completed on J0 in 245.15s, 1 test
[junit4:junit4] 
[junit4:junit4] Suite: org.apache.solr.search.TestReload
[junit4:junit4] Completed on J2 in 19.64s, 1 test
[junit4:junit4] 
[junit4:junit4] Suite: org.apache.solr.handler.component.TermVectorComponentDistributedTest
[junit4:junit4] Completed on J5 in 21.59s, 1 test
[junit4:junit4] 
[junit4:junit4] Suite: org.apache.solr.search.TestStressVersions
[junit4:junit4] Completed on J1 in 26.04s, 1 test
[junit4:junit4] 
[junit4:junit4] 
[junit4:junit4] Tests with failures:
[junit4:junit4]   - org.apache.solr.AnalysisAfterCoreReloadTest.testStopwordsAfterCoreReload
[junit4:junit4] 
[junit4:junit4] 
[junit4:junit4] JVM J0:     2.98 ..   265.73 =   262.75s
[junit4:junit4] JVM J1:     2.26 ..   284.69 =   282.43s
[junit4:junit4] JVM J2:     2.47 ..   276.33 =   273.86s
[junit4:junit4] JVM J3:     2.75 ..   259.36 =   256.61s
[junit4:junit4] JVM J4:     2.72 ..   264.45 =   261.74s
[junit4:junit4] JVM J5:     2.50 ..   277.98 =   275.48s
[junit4:junit4] JVM J6:     2.46 ..   262.45 =   259.98s
[junit4:junit4] JVM J7:     4.97 ..   259.50 =   254.53s
[junit4:junit4] Execution time total: 4 minutes 44 seconds
[junit4:junit4] Tests summary: 233 suites, 965 tests, 1 error, 12 ignored (7 assumptions)

BUILD FAILED
<http://sierranevada.servebeer.com:8080/job/slow-io-beasting/ws/build.xml>:39: The following
error occurred while executing this line:
<http://sierranevada.servebeer.com:8080/job/slow-io-beasting/ws/solr/build.xml>:178:
The following error occurred while executing this line:
<http://sierranevada.servebeer.com:8080/job/slow-io-beasting/ws/lucene/module-build.xml>:61:
The following error occurred while executing this line:
<http://sierranevada.servebeer.com:8080/job/slow-io-beasting/ws/lucene/common-build.xml>:1159:
The following error occurred while executing this line:
<http://sierranevada.servebeer.com:8080/job/slow-io-beasting/ws/lucene/common-build.xml>:827:
There were test failures: 233 suites, 965 tests, 1 error, 12 ignored (7 assumptions)

Total time: 12 minutes 25 seconds
Build step 'Invoke Ant' marked build as failure

---------------------------------------------------------------------
To unsubscribe, e-mail: dev-unsubscribe@lucene.apache.org
For additional commands, e-mail: dev-help@lucene.apache.org


Mime
View raw message