lucene-dev mailing list archives

Site index · List index
Message view « Date » · « Thread »
Top « Date » · « Thread »
From hudsonsevilt...@gmail.com
Subject Build failed in Jenkins: lucene40-beaster #2079
Date Fri, 05 Oct 2012 20:08:14 GMT
See <http://sierranevada.servebeer.com/job/lucene40-beaster/2079/>

------------------------------------------
Started by timer
Building in workspace <http://sierranevada.servebeer.com/job/lucene40-beaster/ws/>
Cleaning up <http://sierranevada.servebeer.com/job/lucene40-beaster/ws/.>
Updating https://svn.apache.org/repos/asf/lucene/dev/branches/lucene_solr_4_0/lucene
At revision 1394778
no change for https://svn.apache.org/repos/asf/lucene/dev/branches/lucene_solr_4_0/lucene
since the previous build
[lucene40-beaster] $ ant -DJAVA7_HOME=/usr/local/jdk1.7.0_01 -DJAVA6_HOME=/usr/local/jdk1.6.0_27
-Dtests.class=org.apache.lucene.index.* test-core
Buildfile: <http://sierranevada.servebeer.com/job/lucene40-beaster/ws/build.xml>

test-core:

ivy-availability-check:

ivy-fail:

ivy-configure:
[ivy:configure] :: Ivy 2.2.0 - 20100923230623 :: http://ant.apache.org/ivy/ ::
[ivy:configure] :: loading settings :: file = <http://sierranevada.servebeer.com/job/lucene40-beaster/ws/ivy-settings.xml>

resolve:

init:

-clover.disable:

-clover.setup:

clover:

compile-core:

compile-test-framework:

ivy-availability-check:

ivy-fail:

ivy-configure:
[ivy:configure] :: loading settings :: file = <http://sierranevada.servebeer.com/job/lucene40-beaster/ws/ivy-settings.xml>

resolve:

BUILD FAILED
<http://sierranevada.servebeer.com/job/lucene40-beaster/ws/build.xml>:49: The following
error occurred while executing this line:
<http://sierranevada.servebeer.com/job/lucene40-beaster/ws/common-build.xml>:643: The
following error occurred while executing this line:
<http://sierranevada.servebeer.com/job/lucene40-beaster/ws/common-build.xml>:292: impossible
to ivy retrieve: java.lang.RuntimeException: problem during retrieve of org.apache.lucene#core-test-framework:
java.text.ParseException: failed to parse report: /home/rmuir/.ivy2/cache/org.apache.lucene-core-test-framework-default.xml:
Premature end of file.
	at org.apache.ivy.core.retrieve.RetrieveEngine.retrieve(RetrieveEngine.java:206)
	at org.apache.ivy.Ivy.retrieve(Ivy.java:540)
	at org.apache.ivy.ant.IvyRetrieve.doExecute(IvyRetrieve.java:67)
	at org.apache.ivy.ant.IvyTask.execute(IvyTask.java:277)
	at org.apache.tools.ant.UnknownElement.execute(UnknownElement.java:291)
	at sun.reflect.GeneratedMethodAccessor4.invoke(Unknown Source)
	at sun.reflect.DelegatingMethodAccessorImpl.invoke(DelegatingMethodAccessorImpl.java:43)
	at java.lang.reflect.Method.invoke(Method.java:601)
	at org.apache.tools.ant.dispatch.DispatchUtils.execute(DispatchUtils.java:106)
	at org.apache.tools.ant.Task.perform(Task.java:348)
	at org.apache.tools.ant.Target.execute(Target.java:390)
	at org.apache.tools.ant.Target.performTasks(Target.java:411)
	at org.apache.tools.ant.Project.executeSortedTargets(Project.java:1399)
	at org.apache.tools.ant.helper.SingleCheckExecutor.executeTargets(SingleCheckExecutor.java:38)
	at org.apache.tools.ant.Project.executeTargets(Project.java:1251)
	at org.apache.tools.ant.taskdefs.Ant.execute(Ant.java:442)
	at org.apache.tools.ant.UnknownElement.execute(UnknownElement.java:291)
	at sun.reflect.GeneratedMethodAccessor4.invoke(Unknown Source)
	at sun.reflect.DelegatingMethodAccessorImpl.invoke(DelegatingMethodAccessorImpl.java:43)
	at java.lang.reflect.Method.invoke(Method.java:601)
	at org.apache.tools.ant.dispatch.DispatchUtils.execute(DispatchUtils.java:106)
	at org.apache.tools.ant.Task.perform(Task.java:348)
	at org.apache.tools.ant.Target.execute(Target.java:390)
	at org.apache.tools.ant.Target.performTasks(Target.java:411)
	at org.apache.tools.ant.Project.executeSortedTargets(Project.java:1399)
	at org.apache.tools.ant.helper.SingleCheckExecutor.executeTargets(SingleCheckExecutor.java:38)
	at org.apache.tools.ant.Project.executeTargets(Project.java:1251)
	at org.apache.tools.ant.taskdefs.Ant.execute(Ant.java:442)
	at org.apache.tools.ant.UnknownElement.execute(UnknownElement.java:291)
	at sun.reflect.GeneratedMethodAccessor4.invoke(Unknown Source)
	at sun.reflect.DelegatingMethodAccessorImpl.invoke(DelegatingMethodAccessorImpl.java:43)
	at java.lang.reflect.Method.invoke(Method.java:601)
	at org.apache.tools.ant.dispatch.DispatchUtils.execute(DispatchUtils.java:106)
	at org.apache.tools.ant.Task.perform(Task.java:348)
	at org.apache.tools.ant.Target.execute(Target.java:390)
	at org.apache.tools.ant.Target.performTasks(Target.java:411)
	at org.apache.tools.ant.Project.executeSortedTargets(Project.java:1399)
	at org.apache.tools.ant.Project.executeTarget(Project.java:1368)
	at org.apache.tools.ant.helper.DefaultExecutor.executeTargets(DefaultExecutor.java:41)
	at org.apache.tools.ant.Project.executeTargets(Project.java:1251)
	at org.apache.tools.ant.Main.runBuild(Main.java:809)
	at org.apache.tools.ant.Main.startAnt(Main.java:217)
	at org.apache.tools.ant.launch.Launcher.run(Launcher.java:280)
	at org.apache.tools.ant.launch.Launcher.main(Launcher.java:109)
Caused by: java.text.ParseException: failed to parse report: /home/rmuir/.ivy2/cache/org.apache.lucene-core-test-framework-default.xml:
Premature end of file.
	at org.apache.ivy.plugins.report.XmlReportParser.parse(XmlReportParser.java:302)
	at org.apache.ivy.core.retrieve.RetrieveEngine.determineArtifactsToCopy(RetrieveEngine.java:288)
	at org.apache.ivy.core.retrieve.RetrieveEngine.retrieve(RetrieveEngine.java:104)
	... 43 more
Caused by: org.xml.sax.SAXParseException; systemId: file:/home/rmuir/.ivy2/cache/org.apache.lucene-core-test-framework-default.xml;
lineNumber: 1; columnNumber: 1; Premature end of file.
	at com.sun.org.apache.xerces.internal.util.ErrorHandlerWrapper.createSAXParseException(ErrorHandlerWrapper.java:198)
	at com.sun.org.apache.xerces.internal.util.ErrorHandlerWrapper.fatalError(ErrorHandlerWrapper.java:177)
	at com.sun.org.apache.xerces.internal.impl.XMLErrorReporter.reportError(XMLErrorReporter.java:441)
	at com.sun.org.apache.xerces.internal.impl.XMLErrorReporter.reportError(XMLErrorReporter.java:368)
	at com.sun.org.apache.xerces.internal.impl.XMLScanner.reportFatalError(XMLScanner.java:1375)
	at com.sun.org.apache.xerces.internal.impl.XMLDocumentScannerImpl$PrologDriver.next(XMLDocumentScannerImpl.java:1016)
	at com.sun.org.apache.xerces.internal.impl.XMLDocumentScannerImpl.next(XMLDocumentScannerImpl.java:607)
	at com.sun.org.apache.xerces.internal.impl.XMLDocumentFragmentScannerImpl.scanDocument(XMLDocumentFragmentScannerImpl.java:488)
	at com.sun.org.apache.xerces.internal.parsers.XML11Configuration.parse(XML11Configuration.java:835)
	at com.sun.org.apache.xerces.internal.parsers.XML11Configuration.parse(XML11Configuration.java:764)
	at com.sun.org.apache.xerces.internal.parsers.XMLParser.parse(XMLParser.java:123)
	at com.sun.org.apache.xerces.internal.parsers.AbstractSAXParser.parse(AbstractSAXParser.java:1210)
	at com.sun.org.apache.xerces.internal.jaxp.SAXParserImpl$JAXPSAXParser.parse(SAXParserImpl.java:568)
	at com.sun.org.apache.xerces.internal.jaxp.SAXParserImpl.parse(SAXParserImpl.java:302)
	at javax.xml.parsers.SAXParser.parse(SAXParser.java:328)
	at org.apache.ivy.plugins.report.XmlReportParser$SaxXmlReportParser.parse(XmlReportParser.java:258)
	at org.apache.ivy.plugins.report.XmlReportParser.parse(XmlReportParser.java:300)
	... 45 more

Total time: 0 seconds
Build step 'Invoke Ant' marked build as failure

---------------------------------------------------------------------
To unsubscribe, e-mail: dev-unsubscribe@lucene.apache.org
For additional commands, e-mail: dev-help@lucene.apache.org


Mime
View raw message