lucene-dev mailing list archives

Site index · List index
Message view « Date » · « Thread »
Top « Date » · « Thread »
From Charlie Cron <hudsonsevilt...@gmail.com>
Subject Build failed in Jenkins: fast-io-beasting #6283
Date Mon, 29 Oct 2012 22:17:10 GMT
See <http://sierranevada.servebeer.com/job/fast-io-beasting/6283/>

------------------------------------------
[...truncated 13943 lines...]
[junit4:junit4]   2> 435847 T10 oasc.SolrCore.close [collection1]  CLOSING SolrCore org.apache.solr.core.SolrCore@d44752d
[junit4:junit4]   2> 435859 T10 oasu.DirectUpdateHandler2.close closing DirectUpdateHandler2{commits=0,autocommits=0,soft
autocommits=0,optimizes=0,rollbacks=0,expungeDeletes=0,docsPending=0,adds=0,deletesById=0,deletesByQuery=0,errors=0,cumulative_adds=0,cumulative_deletesById=0,cumulative_deletesByQuery=0,cumulative_errors=0}
[junit4:junit4]   2> 435859 T10 oasc.SolrCore.decrefSolrCoreState Closing SolrCoreState
[junit4:junit4]   2> 435860 T10 oasu.DefaultSolrCoreState.closeIndexWriter SolrCoreState
ref count has reached 0 - closing IndexWriter
[junit4:junit4]   2> 435860 T10 oasu.DefaultSolrCoreState.closeIndexWriter closing IndexWriter
with IndexWriterCloser
[junit4:junit4]   2> 435861 T10 oasc.SolrCore.closeSearcher [collection1] Closing main
searcher on request.
[junit4:junit4]   2> 435865 T32 oasc.Overseer$ClusterStateUpdater.amILeader According to
ZK I (id=88575088228958210-127.0.0.1:45414_solr-n_0000000000) am no longer a leader.
[junit4:junit4]   2> 435942 T82 oascc.ConnectionManager.process Watcher org.apache.solr.common.cloud.ConnectionManager@68deeebd
name:ZooKeeperConnection Watcher:127.0.0.1:42008/solr got event WatchedEvent state:Disconnected
type:None path:null path:null type:None
[junit4:junit4]   2> 435942 T82 oascc.ConnectionManager.process zkClient has disconnected
[junit4:junit4]   2> 435942 T69 oascc.ConnectionManager.process Watcher org.apache.solr.common.cloud.ConnectionManager@5a335053
name:ZooKeeperConnection Watcher:127.0.0.1:42008/solr got event WatchedEvent state:Disconnected
type:None path:null path:null type:None
[junit4:junit4]   2> 435943 T69 oascc.ConnectionManager.process zkClient has disconnected
[junit4:junit4]   2> 435944 T31 oaz.ClientCnxn$EventThread.run EventThread shut down
[junit4:junit4]   2> 435943 T10 oaz.ZooKeeper.close Session: 0x13aae92cdd60002 closed
[junit4:junit4]   2> 435944 T45 oascc.ConnectionManager.process Watcher org.apache.solr.common.cloud.ConnectionManager@420253af
name:ZooKeeperConnection Watcher:127.0.0.1:42008/solr got event WatchedEvent state:Disconnected
type:None path:null path:null type:None
[junit4:junit4]   2> 435945 T45 oascc.ConnectionManager.process zkClient has disconnected
[junit4:junit4]   2> 435945 T57 oascc.ConnectionManager.process Watcher org.apache.solr.common.cloud.ConnectionManager@2a06bbe7
name:ZooKeeperConnection Watcher:127.0.0.1:42008/solr got event WatchedEvent state:Disconnected
type:None path:null path:null type:None
[junit4:junit4]   2> 435945 T57 oascc.ConnectionManager.process zkClient has disconnected
[junit4:junit4]   2> 435966 T10 oejsh.ContextHandler.doStop stopped o.e.j.s.ServletContextHandler{/solr,null}
[junit4:junit4]   2> 436012 T13 oazs.SessionTrackerImpl.run SessionTrackerImpl exited loop!
[junit4:junit4]   2> 436018 T10 oasc.ChaosMonkey.monkeyLog monkey: stop shard! 58989
[junit4:junit4]   2> 436018 T10 oasc.CoreContainer.shutdown Shutting down CoreContainer
instance=93608538
[junit4:junit4]   2> 437350 T68 oaz.ClientCnxn$SendThread.startConnect Opening socket connection
to server localhost.localdomain/127.0.0.1:42008
[junit4:junit4]   2> 437351 T68 oaz.ClientCnxn$SendThread.run WARNING Session 0x13aae92cdd60005
for server null, unexpected error, closing socket connection and attempting reconnect java.net.ConnectException:
Connection refused
[junit4:junit4]   2> 	at sun.nio.ch.SocketChannelImpl.checkConnect(Native Method)
[junit4:junit4]   2> 	at sun.nio.ch.SocketChannelImpl.finishConnect(SocketChannelImpl.java:567)
[junit4:junit4]   2> 	at org.apache.zookeeper.ClientCnxn$SendThread.run(ClientCnxn.java:1143)
[junit4:junit4]   2> 
[junit4:junit4]   2> 437364 T56 oaz.ClientCnxn$SendThread.startConnect Opening socket connection
to server localhost.localdomain/127.0.0.1:42008
[junit4:junit4]   2> 437365 T56 oaz.ClientCnxn$SendThread.run WARNING Session 0x13aae92cdd60004
for server null, unexpected error, closing socket connection and attempting reconnect java.net.ConnectException:
Connection refused
[junit4:junit4]   2> 	at sun.nio.ch.SocketChannelImpl.checkConnect(Native Method)
[junit4:junit4]   2> 	at sun.nio.ch.SocketChannelImpl.finishConnect(SocketChannelImpl.java:567)
[junit4:junit4]   2> 	at org.apache.zookeeper.ClientCnxn$SendThread.run(ClientCnxn.java:1143)
[junit4:junit4]   2> 
[junit4:junit4]   2> 437813 T44 oaz.ClientCnxn$SendThread.startConnect Opening socket connection
to server localhost.localdomain/127.0.0.1:42008
[junit4:junit4]   2> 437839 T81 oaz.ClientCnxn$SendThread.startConnect Opening socket connection
to server localhost.localdomain/127.0.0.1:42008
[junit4:junit4]   2> 437839 T81 oaz.ClientCnxn$SendThread.run WARNING Session 0x13aae92cdd60006
for server null, unexpected error, closing socket connection and attempting reconnect java.net.ConnectException:
Connection refused
[junit4:junit4]   2> 	at sun.nio.ch.SocketChannelImpl.checkConnect(Native Method)
[junit4:junit4]   2> 	at sun.nio.ch.SocketChannelImpl.finishConnect(SocketChannelImpl.java:567)
[junit4:junit4]   2> 	at org.apache.zookeeper.ClientCnxn$SendThread.run(ClientCnxn.java:1143)
[junit4:junit4]   2> 
[junit4:junit4]   2> 437914 T45 oaz.ClientCnxn$EventThread.run EventThread shut down
[junit4:junit4]   2> 437914 T10 oaz.ZooKeeper.close Session: 0x13aae92cdd60003 closed
[junit4:junit4]   2> 437938 T10 oejsh.ContextHandler.doStop stopped o.e.j.s.ServletContextHandler{/solr,null}
[junit4:junit4]   2> 437989 T10 oasc.ChaosMonkey.monkeyLog monkey: stop shard! 47265
[junit4:junit4]   2> 437990 T10 oasc.CoreContainer.shutdown Shutting down CoreContainer
instance=759477796
[junit4:junit4]   2> 437990 T10 oasc.SolrCore.close [collection1]  CLOSING SolrCore org.apache.solr.core.SolrCore@ed6ee28
[junit4:junit4]   2> 438003 T10 oasu.DirectUpdateHandler2.close closing DirectUpdateHandler2{commits=1,autocommits=0,soft
autocommits=0,optimizes=0,rollbacks=0,expungeDeletes=0,docsPending=0,adds=0,deletesById=0,deletesByQuery=0,errors=0,cumulative_adds=0,cumulative_deletesById=0,cumulative_deletesByQuery=0,cumulative_errors=0}
[junit4:junit4]   2> 438004 T10 oasc.SolrCore.decrefSolrCoreState Closing SolrCoreState
[junit4:junit4]   2> 438004 T10 oasu.DefaultSolrCoreState.closeIndexWriter SolrCoreState
ref count has reached 0 - closing IndexWriter
[junit4:junit4]   2> 438004 T10 oasu.DefaultSolrCoreState.closeIndexWriter closing IndexWriter
with IndexWriterCloser
[junit4:junit4]   2> 438006 T10 oasc.SolrCore.closeSearcher [collection1] Closing main
searcher on request.
[junit4:junit4]   2> 438511 T68 oaz.ClientCnxn$SendThread.startConnect Opening socket connection
to server localhost.localdomain/127.0.0.1:42008
[junit4:junit4]   2> 438512 T68 oaz.ClientCnxn$SendThread.run WARNING Session 0x13aae92cdd60005
for server null, unexpected error, closing socket connection and attempting reconnect java.net.ConnectException:
Connection refused
[junit4:junit4]   2> 	at sun.nio.ch.SocketChannelImpl.checkConnect(Native Method)
[junit4:junit4]   2> 	at sun.nio.ch.SocketChannelImpl.finishConnect(SocketChannelImpl.java:567)
[junit4:junit4]   2> 	at org.apache.zookeeper.ClientCnxn$SendThread.run(ClientCnxn.java:1143)
[junit4:junit4]   2> 
[junit4:junit4]   2> 439332 T56 oaz.ClientCnxn$SendThread.startConnect Opening socket connection
to server localhost.localdomain/127.0.0.1:42008
[junit4:junit4]   2> 439433 T57 oaz.ClientCnxn$EventThread.run EventThread shut down
[junit4:junit4]   2> 439433 T10 oaz.ZooKeeper.close Session: 0x13aae92cdd60004 closed
[junit4:junit4]   2> 439454 T81 oaz.ClientCnxn$SendThread.startConnect Opening socket connection
to server localhost.localdomain/127.0.0.1:42008
[junit4:junit4]   2> 439455 T81 oaz.ClientCnxn$SendThread.run WARNING Session 0x13aae92cdd60006
for server null, unexpected error, closing socket connection and attempting reconnect java.net.ConnectException:
Connection refused
[junit4:junit4]   2> 	at sun.nio.ch.SocketChannelImpl.checkConnect(Native Method)
[junit4:junit4]   2> 	at sun.nio.ch.SocketChannelImpl.finishConnect(SocketChannelImpl.java:567)
[junit4:junit4]   2> 	at org.apache.zookeeper.ClientCnxn$SendThread.run(ClientCnxn.java:1143)
[junit4:junit4]   2> 
[junit4:junit4]   2> 439456 T10 oejsh.ContextHandler.doStop stopped o.e.j.s.ServletContextHandler{/solr,null}
[junit4:junit4]   2> 439507 T10 oasc.ChaosMonkey.monkeyLog monkey: stop shard! 49063
[junit4:junit4]   2> 439507 T10 oasc.CoreContainer.shutdown Shutting down CoreContainer
instance=341752521
[junit4:junit4]   2> 439508 T10 oasc.SolrCore.close [collection1]  CLOSING SolrCore org.apache.solr.core.SolrCore@126212dd
[junit4:junit4]   2> 439519 T10 oasu.DirectUpdateHandler2.close closing DirectUpdateHandler2{commits=0,autocommits=0,soft
autocommits=0,optimizes=0,rollbacks=0,expungeDeletes=0,docsPending=0,adds=0,deletesById=0,deletesByQuery=0,errors=0,cumulative_adds=0,cumulative_deletesById=0,cumulative_deletesByQuery=0,cumulative_errors=0}
[junit4:junit4]   2> 439520 T10 oasc.SolrCore.decrefSolrCoreState Closing SolrCoreState
[junit4:junit4]   2> 439520 T10 oasu.DefaultSolrCoreState.closeIndexWriter SolrCoreState
ref count has reached 0 - closing IndexWriter
[junit4:junit4]   2> 439521 T10 oasu.DefaultSolrCoreState.closeIndexWriter closing IndexWriter
with IndexWriterCloser
[junit4:junit4]   2> 439521 T10 oasc.SolrCore.closeSearcher [collection1] Closing main
searcher on request.
[junit4:junit4]   2> 439751 T68 oaz.ClientCnxn$SendThread.startConnect Opening socket connection
to server localhost.localdomain/127.0.0.1:42008
[junit4:junit4]   2> 439852 T69 oaz.ClientCnxn$EventThread.run EventThread shut down
[junit4:junit4]   2> 439852 T10 oaz.ZooKeeper.close Session: 0x13aae92cdd60005 closed
[junit4:junit4]   2> 439875 T10 oejsh.ContextHandler.doStop stopped o.e.j.s.ServletContextHandler{/solr,null}
[junit4:junit4]   2> 439927 T10 oasc.ChaosMonkey.monkeyLog monkey: stop shard! 56804
[junit4:junit4]   2> 439927 T10 oasc.CoreContainer.shutdown Shutting down CoreContainer
instance=1171357828
[junit4:junit4]   2> 439928 T10 oasc.SolrCore.close [collection1]  CLOSING SolrCore org.apache.solr.core.SolrCore@42130c2
[junit4:junit4]   2> 439945 T10 oasu.DirectUpdateHandler2.close closing DirectUpdateHandler2{commits=1,autocommits=0,soft
autocommits=0,optimizes=0,rollbacks=0,expungeDeletes=0,docsPending=0,adds=0,deletesById=0,deletesByQuery=0,errors=0,cumulative_adds=0,cumulative_deletesById=0,cumulative_deletesByQuery=0,cumulative_errors=0}
[junit4:junit4]   2> 439947 T10 oasc.SolrCore.decrefSolrCoreState Closing SolrCoreState
[junit4:junit4]   2> 439947 T10 oasu.DefaultSolrCoreState.closeIndexWriter SolrCoreState
ref count has reached 0 - closing IndexWriter
[junit4:junit4]   2> 439947 T10 oasu.DefaultSolrCoreState.closeIndexWriter closing IndexWriter
with IndexWriterCloser
[junit4:junit4]   2> 439949 T10 oasc.SolrCore.closeSearcher [collection1] Closing main
searcher on request.
[junit4:junit4]   2> 441392 T81 oaz.ClientCnxn$SendThread.startConnect Opening socket connection
to server localhost.localdomain/127.0.0.1:42008
[junit4:junit4]   2> 441494 T82 oaz.ClientCnxn$EventThread.run EventThread shut down
[junit4:junit4]   2> 441494 T10 oaz.ZooKeeper.close Session: 0x13aae92cdd60006 closed
[junit4:junit4]   2> 441516 T10 oejsh.ContextHandler.doStop stopped o.e.j.s.ServletContextHandler{/solr,null}
[junit4:junit4]   2> 441582 T10 oas.SolrTestCaseJ4.tearDown ###Ending testDistribSearch
[junit4:junit4]   1>     /solr/collections/control_collection/shards (0)
[junit4:junit4]   1>     /solr/collections/control_collection/leader_elect (1)
[junit4:junit4]   1>      /solr/collections/control_collection/leader_elect/control_shard
(1)
[junit4:junit4]   1>       /solr/collections/control_collection/leader_elect/control_shard/election
(1)
[junit4:junit4]   1>        /solr/collections/control_collection/leader_elect/control_shard/election/88575088228958210-127.0.0.1:45414_solr_collection1-n_0000000000
(0)
[junit4:junit4]   1>     /solr/collections/control_collection/leaders (1)
[junit4:junit4]   1>      /solr/collections/control_collection/leaders/control_shard (0)
[junit4:junit4]   1>      DATA:
[junit4:junit4]   1>          {
[junit4:junit4]   1>            "core":"collection1",
[junit4:junit4]   1>            "node_name":"127.0.0.1:45414_solr",
[junit4:junit4]   1>            "base_url":"http://127.0.0.1:45414/solr"}
[junit4:junit4]   1>   /solr/clusterstate.json (0)
[junit4:junit4]   1>   DATA:
[junit4:junit4]   1>       {
[junit4:junit4]   1>         "collection1":{
[junit4:junit4]   1>           "shard1":{
[junit4:junit4]   1>             "range":"80000000-ffffffff",
[junit4:junit4]   1>             "replicas":{
[junit4:junit4]   1>               "127.0.0.1:58989_solr_collection1":{
[junit4:junit4]   1>                 "shard":null,
[junit4:junit4]   1>                 "roles":null,
[junit4:junit4]   1>                 "state":"down",
[junit4:junit4]   1>                 "core":"collection1",
[junit4:junit4]   1>                 "collection":"collection1",
[junit4:junit4]   1>                 "node_name":"127.0.0.1:58989_solr",
[junit4:junit4]   1>                 "base_url":"http://127.0.0.1:58989/solr"},
[junit4:junit4]   1>               "127.0.0.1:49063_solr_collection1":{
[junit4:junit4]   1>                 "shard":"shard1",
[junit4:junit4]   1>                 "roles":null,
[junit4:junit4]   1>                 "state":"active",
[junit4:junit4]   1>                 "core":"collection1",
[junit4:junit4]   1>                 "collection":"collection1",
[junit4:junit4]   1>                 "node_name":"127.0.0.1:49063_solr",
[junit4:junit4]   1>                 "base_url":"http://127.0.0.1:49063/solr",
[junit4:junit4]   1>                 "leader":"true"}}},
[junit4:junit4]   1>           "shard2":{
[junit4:junit4]   1>             "range":"0-7fffffff",
[junit4:junit4]   1>             "replicas":{
[junit4:junit4]   1>               "127.0.0.1:47265_solr_collection1":{
[junit4:junit4]   1>                 "shard":"shard2",
[junit4:junit4]   1>                 "roles":null,
[junit4:junit4]   1>                 "state":"active",
[junit4:junit4]   1>                 "core":"collection1",
[junit4:junit4]   1>                 "collection":"collection1",
[junit4:junit4]   1>                 "node_name":"127.0.0.1:47265_solr",
[junit4:junit4]   1>                 "base_url":"http://127.0.0.1:47265/solr",
[junit4:junit4]   1>                 "leader":"true"},
[junit4:junit4]   1>               "127.0.0.1:56804_solr_collection1":{
[junit4:junit4]   1>                 "shard":"shard2",
[junit4:junit4]   1>                 "roles":null,
[junit4:junit4]   1>                 "state":"active",
[junit4:junit4]   1>                 "core":"collection1",
[junit4:junit4]   1>                 "collection":"collection1",
[junit4:junit4]   1>                 "node_name":"127.0.0.1:56804_solr",
[junit4:junit4]   1>                 "base_url":"http://127.0.0.1:56804/solr"}}}},
[junit4:junit4]   1>         "control_collection":{"control_shard":{"replicas":{"127.0.0.1:45414_solr_collection1":{
[junit4:junit4]   1>                 "shard":"control_shard",
[junit4:junit4]   1>                 "roles":null,
[junit4:junit4]   1>                 "state":"active",
[junit4:junit4]   1>                 "core":"collection1",
[junit4:junit4]   1>                 "collection":"control_collection",
[junit4:junit4]   1>                 "node_name":"127.0.0.1:45414_solr",
[junit4:junit4]   1>                 "base_url":"http://127.0.0.1:45414/solr",
[junit4:junit4]   1>                 "leader":"true"}}}}}
[junit4:junit4]   1>  /zookeeper (1)
[junit4:junit4]   1>  DATA:
[junit4:junit4]   1>      
[junit4:junit4]   1> 
[junit4:junit4]   2> NOTE: reproduce with: ant test  -Dtestcase=BasicDistributedZkTest
-Dtests.method=testDistribSearch -Dtests.seed=78F444F0A53FF24F -Dtests.slow=true -Dtests.locale=ar_IQ
-Dtests.timezone=Europe/Dublin -Dtests.file.encoding=ISO-8859-1
[junit4:junit4] FAILURE  441s J0 | BasicDistributedZkTest.testDistribSearch <<<
[junit4:junit4]    > Throwable #1: java.lang.AssertionError: There are still nodes recoverying
- waited for 180 seconds
[junit4:junit4]    > 	at __randomizedtesting.SeedInfo.seed([78F444F0A53FF24F:F912CAE8D2609273]:0)
[junit4:junit4]    > 	at org.junit.Assert.fail(Assert.java:93)
[junit4:junit4]    > 	at org.apache.solr.cloud.AbstractDistribZkTestBase.waitForRecoveriesToFinish(AbstractDistribZkTestBase.java:165)
[junit4:junit4]    > 	at org.apache.solr.cloud.AbstractDistribZkTestBase.waitForRecoveriesToFinish(AbstractDistribZkTestBase.java:115)
[junit4:junit4]    > 	at org.apache.solr.cloud.AbstractDistribZkTestBase.waitForRecoveriesToFinish(AbstractDistribZkTestBase.java:110)
[junit4:junit4]    > 	at org.apache.solr.cloud.AbstractFullDistribZkTestBase.waitForRecoveriesToFinish(AbstractFullDistribZkTestBase.java:553)
[junit4:junit4]    > 	at org.apache.solr.cloud.BasicDistributedZkTest.doTest(BasicDistributedZkTest.java:162)
[junit4:junit4]    > 	at org.apache.solr.BaseDistributedSearchTestCase.testDistribSearch(BaseDistributedSearchTestCase.java:695)
[junit4:junit4]    > 	at sun.reflect.NativeMethodAccessorImpl.invoke0(Native Method)
[junit4:junit4]    > 	at sun.reflect.NativeMethodAccessorImpl.invoke(NativeMethodAccessorImpl.java:39)
[junit4:junit4]    > 	at sun.reflect.DelegatingMethodAccessorImpl.invoke(DelegatingMethodAccessorImpl.java:25)
[junit4:junit4]    > 	at java.lang.reflect.Method.invoke(Method.java:597)
[junit4:junit4]    > 	at com.carrotsearch.randomizedtesting.RandomizedRunner.invoke(RandomizedRunner.java:1559)
[junit4:junit4]    > 	at com.carrotsearch.randomizedtesting.RandomizedRunner.access$600(RandomizedRunner.java:79)
[junit4:junit4]    > 	at com.carrotsearch.randomizedtesting.RandomizedRunner$6.evaluate(RandomizedRunner.java:737)
[junit4:junit4]    > 	at com.carrotsearch.randomizedtesting.RandomizedRunner$7.evaluate(RandomizedRunner.java:773)
[junit4:junit4]    > 	at com.carrotsearch.randomizedtesting.RandomizedRunner$8.evaluate(RandomizedRunner.java:787)
[junit4:junit4]    > 	at com.carrotsearch.randomizedtesting.rules.SystemPropertiesRestoreRule$1.evaluate(SystemPropertiesRestoreRule.java:53)
[junit4:junit4]    > 	at org.apache.lucene.util.TestRuleSetupTeardownChained$1.evaluate(TestRuleSetupTeardownChained.java:50)
[junit4:junit4]    > 	at org.apache.lucene.util.TestRuleFieldCacheSanity$1.evaluate(TestRuleFieldCacheSanity.java:51)
[junit4:junit4]    > 	at org.apache.lucene.util.AbstractBeforeAfterRule$1.evaluate(AbstractBeforeAfterRule.java:45)
[junit4:junit4]    > 	at com.carrotsearch.randomizedtesting.rules.SystemPropertiesInvariantRule$1.evaluate(SystemPropertiesInvariantRule.java:55)
[junit4:junit4]    > 	at org.apache.lucene.util.TestRuleThreadAndTestName$1.evaluate(TestRuleThreadAndTestName.java:48)
[junit4:junit4]    > 	at org.apache.lucene.util.TestRuleIgnoreAfterMaxFailures$1.evaluate(TestRuleIgnoreAfterMaxFailures.java:70)
[junit4:junit4]    > 	at org.apache.lucene.util.TestRuleMarkFailure$1.evaluate(TestRuleMarkFailure.java:48)
[junit4:junit4]    > 	at com.carrotsearch.randomizedtesting.rules.StatementAdapter.evaluate(StatementAdapter.java:36)
[junit4:junit4]    > 	at com.carrotsearch.randomizedtesting.ThreadLeakControl$StatementRunner.run(ThreadLeakControl.java:358)
[junit4:junit4]    > 	at com.carrotsearch.randomizedtesting.ThreadLeakControl.forkTimeoutingTask(ThreadLeakControl.java:782)
[junit4:junit4]    > 	at com.carrotsearch.randomizedtesting.ThreadLeakControl$3.evaluate(ThreadLeakControl.java:442)
[junit4:junit4]    > 	at com.carrotsearch.randomizedtesting.RandomizedRunner.runSingleTest(RandomizedRunner.java:746)
[junit4:junit4]    > 	at com.carrotsearch.randomizedtesting.RandomizedRunner$3.evaluate(RandomizedRunner.java:648)
[junit4:junit4]    > 	at com.carrotsearch.randomizedtesting.RandomizedRunner$4.evaluate(RandomizedRunner.java:682)
[junit4:junit4]    > 	at com.carrotsearch.randomizedtesting.RandomizedRunner$5.evaluate(RandomizedRunner.java:693)
[junit4:junit4]    > 	at com.carrotsearch.randomizedtesting.rules.StatementAdapter.evaluate(StatementAdapter.java:36)
[junit4:junit4]    > 	at com.carrotsearch.randomizedtesting.rules.SystemPropertiesRestoreRule$1.evaluate(SystemPropertiesRestoreRule.java:53)
[junit4:junit4]    > 	at org.apache.lucene.util.AbstractBeforeAfterRule$1.evaluate(AbstractBeforeAfterRule.java:45)
[junit4:junit4]    > 	at org.apache.lucene.util.TestRuleStoreClassName$1.evaluate(TestRuleStoreClassName.java:42)
[junit4:junit4]    > 	at com.carrotsearch.randomizedtesting.rules.SystemPropertiesInvariantRule$1.evaluate(SystemPropertiesInvariantRule.java:55)
[junit4:junit4]    > 	at com.carrotsearch.randomizedtesting.rules.NoShadowingOrOverridesOnMethodsRule$1.evaluate(NoShadowingOrOverridesOnMethodsRule.java:39)
[junit4:junit4]    > 	at com.carrotsearch.randomizedtesting.rules.NoShadowingOrOverridesOnMethodsRule$1.evaluate(NoShadowingOrOverridesOnMethodsRule.java:39)
[junit4:junit4]    > 	at com.carrotsearch.randomizedtesting.rules.StatementAdapter.evaluate(StatementAdapter.java:36)
[junit4:junit4]    > 	at org.apache.lucene.util.TestRuleAssertionsRequired$1.evaluate(TestRuleAssertionsRequired.java:43)
[junit4:junit4]    > 	at org.apache.lucene.util.TestRuleMarkFailure$1.evaluate(TestRuleMarkFailure.java:48)
[junit4:junit4]    > 	at org.apache.lucene.util.TestRuleIgnoreAfterMaxFailures$1.evaluate(TestRuleIgnoreAfterMaxFailures.java:70)
[junit4:junit4]    > 	at org.apache.lucene.util.TestRuleIgnoreTestSuites$1.evaluate(TestRuleIgnoreTestSuites.java:55)
[junit4:junit4]    > 	at com.carrotsearch.randomizedtesting.rules.StatementAdapter.evaluate(StatementAdapter.java:36)
[junit4:junit4]    > 	at com.carrotsearch.randomizedtesting.ThreadLeakControl$StatementRunner.run(ThreadLeakControl.java:358)
[junit4:junit4]    > 	at java.lang.Thread.run(Thread.java:662)
[junit4:junit4]   2> 441607 T10 oas.SolrTestCaseJ4.deleteCore ###deleteCore
[junit4:junit4]   2> NOTE: test params are: codec=Asserting, sim=RandomSimilarityProvider(queryNorm=false,coord=yes):
{}, locale=ar_IQ, timezone=Europe/Dublin
[junit4:junit4]   2> NOTE: Linux 3.2.0-24-generic amd64/Sun Microsystems Inc. 1.6.0_27
(64-bit)/cpus=8,threads=1,free=206309424,total=310706176
[junit4:junit4]   2> NOTE: All tests run in this JVM: [BasicDistributedZkTest]
[junit4:junit4] Completed on J0 in 442.96s, 1 test, 1 failure <<< FAILURES!
[junit4:junit4] 
[junit4:junit4] Suite: org.apache.solr.core.CoreContainerCoreInitFailuresTest
[junit4:junit4] Completed on J0 in 0.31s, 2 tests
[junit4:junit4] 
[junit4:junit4] Suite: org.apache.solr.util.SimplePostToolTest
[junit4:junit4] Completed on J0 in 1.21s, 11 tests
[junit4:junit4] 
[junit4:junit4] 
[junit4:junit4] Tests with failures:
[junit4:junit4]   - org.apache.solr.cloud.BasicDistributedZkTest.testDistribSearch
[junit4:junit4] 
[junit4:junit4] 
[junit4:junit4] JVM J0:     1.11 ..   446.22 =   445.11s
[junit4:junit4] JVM J1:     1.10 ..   117.64 =   116.54s
[junit4:junit4] JVM J2:     0.87 ..   124.77 =   123.90s
[junit4:junit4] JVM J3:     1.10 ..   127.88 =   126.78s
[junit4:junit4] JVM J4:     0.87 ..   118.12 =   117.25s
[junit4:junit4] JVM J5:     1.10 ..   117.91 =   116.81s
[junit4:junit4] JVM J6:     0.88 ..   129.52 =   128.63s
[junit4:junit4] JVM J7:     0.86 ..   126.92 =   126.06s
[junit4:junit4] Execution time total: 7 minutes 26 seconds
[junit4:junit4] Tests summary: 233 suites, 965 tests, 1 failure, 7 ignored (2 assumptions)

BUILD FAILED
<http://sierranevada.servebeer.com/job/fast-io-beasting/ws/build.xml>:39: The following
error occurred while executing this line:
<http://sierranevada.servebeer.com/job/fast-io-beasting/ws/solr/build.xml>:178: The
following error occurred while executing this line:
<http://sierranevada.servebeer.com/job/fast-io-beasting/ws/lucene/module-build.xml>:61:
The following error occurred while executing this line:
<http://sierranevada.servebeer.com/job/fast-io-beasting/ws/lucene/common-build.xml>:1159:
The following error occurred while executing this line:
<http://sierranevada.servebeer.com/job/fast-io-beasting/ws/lucene/common-build.xml>:827:
There were test failures: 233 suites, 965 tests, 1 failure, 7 ignored (2 assumptions)

Total time: 12 minutes 35 seconds
Build step 'Invoke Ant' marked build as failure

---------------------------------------------------------------------
To unsubscribe, e-mail: dev-unsubscribe@lucene.apache.org
For additional commands, e-mail: dev-help@lucene.apache.org


Mime
View raw message