lucene-dev mailing list archives

Site index · List index
Message view « Date » · « Thread »
Top « Date » · « Thread »
From Charlie Cron <hudsonsevilt...@gmail.com>
Subject Build failed in Jenkins: fast-io-beasting #6264
Date Mon, 29 Oct 2012 19:00:03 GMT
See <http://sierranevada.servebeer.com/job/fast-io-beasting/6264/>

------------------------------------------
[...truncated 24425 lines...]
[junit4:junit4]   2> 111476 T20 oasc.SolrCore.close [collection2]  CLOSING SolrCore org.apache.solr.core.SolrCore@6bedc67e
[junit4:junit4]   2> 111480 T20 oasu.DirectUpdateHandler2.close closing DirectUpdateHandler2{commits=2,autocommits=0,soft
autocommits=0,optimizes=0,rollbacks=0,expungeDeletes=0,docsPending=0,adds=0,deletesById=0,deletesByQuery=0,errors=0,cumulative_adds=1,cumulative_deletesById=0,cumulative_deletesByQuery=0,cumulative_errors=0}
[junit4:junit4]   2> 111480 T20 oasc.SolrCore.decrefSolrCoreState Closing SolrCoreState
[junit4:junit4]   2> 111480 T20 oasu.DefaultSolrCoreState.closeIndexWriter SolrCoreState
ref count has reached 0 - closing IndexWriter
[junit4:junit4]   2> 111481 T20 oasu.DefaultSolrCoreState.closeIndexWriter closing IndexWriter
with IndexWriterCloser
[junit4:junit4]   2> 111482 T20 oasc.SolrCore.closeSearcher [collection2] Closing main
searcher on request.
[junit4:junit4]   2> 111483 T20 oasc.SolrCore.close [collection3]  CLOSING SolrCore org.apache.solr.core.SolrCore@10daab16
[junit4:junit4]   2> 111488 T20 oasu.DirectUpdateHandler2.close closing DirectUpdateHandler2{commits=2,autocommits=0,soft
autocommits=0,optimizes=0,rollbacks=0,expungeDeletes=0,docsPending=0,adds=0,deletesById=0,deletesByQuery=0,errors=0,cumulative_adds=1,cumulative_deletesById=0,cumulative_deletesByQuery=0,cumulative_errors=0}
[junit4:junit4]   2> 111489 T20 oasc.SolrCore.decrefSolrCoreState Closing SolrCoreState
[junit4:junit4]   2> 111489 T20 oasu.DefaultSolrCoreState.closeIndexWriter SolrCoreState
ref count has reached 0 - closing IndexWriter
[junit4:junit4]   2> 111489 T20 oasu.DefaultSolrCoreState.closeIndexWriter closing IndexWriter
with IndexWriterCloser
[junit4:junit4]   2> 111491 T20 oasc.SolrCore.closeSearcher [collection3] Closing main
searcher on request.
[junit4:junit4]   2> 111492 T20 oasc.SolrCore.close [awholynewcollection_0]  CLOSING SolrCore
org.apache.solr.core.SolrCore@26bdff5e
[junit4:junit4]   2> 111493 T20 oasu.DirectUpdateHandler2.close closing DirectUpdateHandler2{commits=1,autocommits=0,soft
autocommits=0,optimizes=0,rollbacks=0,expungeDeletes=0,docsPending=0,adds=0,deletesById=0,deletesByQuery=0,errors=0,cumulative_adds=0,cumulative_deletesById=0,cumulative_deletesByQuery=0,cumulative_errors=0}
[junit4:junit4]   2> 111493 T20 oasc.SolrCore.decrefSolrCoreState Closing SolrCoreState
[junit4:junit4]   2> 111494 T20 oasu.DefaultSolrCoreState.closeIndexWriter SolrCoreState
ref count has reached 0 - closing IndexWriter
[junit4:junit4]   2> 111494 T20 oasu.DefaultSolrCoreState.closeIndexWriter closing IndexWriter
with IndexWriterCloser
[junit4:junit4]   2> 111495 T20 oasc.SolrCore.closeSearcher [awholynewcollection_0] Closing
main searcher on request.
[junit4:junit4]   2> 111496 T20 oasc.SolrCore.close [awholynewcollection_1]  CLOSING SolrCore
org.apache.solr.core.SolrCore@22d03aac
[junit4:junit4]   2> 111497 T20 oasu.DirectUpdateHandler2.close closing DirectUpdateHandler2{commits=0,autocommits=0,soft
autocommits=0,optimizes=0,rollbacks=0,expungeDeletes=0,docsPending=0,adds=0,deletesById=0,deletesByQuery=0,errors=0,cumulative_adds=0,cumulative_deletesById=0,cumulative_deletesByQuery=0,cumulative_errors=0}
[junit4:junit4]   2> 111497 T20 oasc.SolrCore.decrefSolrCoreState Closing SolrCoreState
[junit4:junit4]   2> 111497 T20 oasu.DefaultSolrCoreState.closeIndexWriter SolrCoreState
ref count has reached 0 - closing IndexWriter
[junit4:junit4]   2> 111498 T20 oasu.DefaultSolrCoreState.closeIndexWriter closing IndexWriter
with IndexWriterCloser
[junit4:junit4]   2> 111498 T20 oasc.SolrCore.closeSearcher [awholynewcollection_1] Closing
main searcher on request.
[junit4:junit4]   2> 111499 T20 oasc.SolrCore.close [unloadcollection3]  CLOSING SolrCore
org.apache.solr.core.SolrCore@1bc0e7b8
[junit4:junit4]   2> 111507 T20 oasu.DirectUpdateHandler2.close closing DirectUpdateHandler2{commits=1,autocommits=0,soft
autocommits=0,optimizes=0,rollbacks=0,expungeDeletes=0,docsPending=80,adds=80,deletesById=0,deletesByQuery=0,errors=0,cumulative_adds=80,cumulative_deletesById=0,cumulative_deletesByQuery=0,cumulative_errors=0}
[junit4:junit4]   2> 111507 T20 oasc.SolrCore.decrefSolrCoreState Closing SolrCoreState
[junit4:junit4]   2> 111507 T20 oasu.DefaultSolrCoreState.closeIndexWriter SolrCoreState
ref count has reached 0 - closing IndexWriter
[junit4:junit4]   2> 111508 T20 oasu.DefaultSolrCoreState.closeIndexWriter closing IndexWriter
with IndexWriterCloser
[junit4:junit4]   2> 111510 T20 oasc.SolrCore.closeSearcher [unloadcollection3] Closing
main searcher on request.
[junit4:junit4]   2> 112071 T107 oaz.ClientCnxn$SendThread.startConnect Opening socket
connection to server localhost.localdomain/127.0.0.1:35618
[junit4:junit4]   2> 112071 T107 oaz.ClientCnxn$SendThread.run WARNING Session 0x13aade2ed090009
for server null, unexpected error, closing socket connection and attempting reconnect java.net.ConnectException:
Connection refused
[junit4:junit4]   2> 	at sun.nio.ch.SocketChannelImpl.checkConnect(Native Method)
[junit4:junit4]   2> 	at sun.nio.ch.SocketChannelImpl.finishConnect(SocketChannelImpl.java:567)
[junit4:junit4]   2> 	at org.apache.zookeeper.ClientCnxn$SendThread.run(ClientCnxn.java:1143)
[junit4:junit4]   2> 
[junit4:junit4]   2> 112726 T78 oaz.ClientCnxn$SendThread.startConnect Opening socket connection
to server localhost.localdomain/127.0.0.1:35618
[junit4:junit4]   2> 112827 T79 oaz.ClientCnxn$EventThread.run EventThread shut down
[junit4:junit4]   2> 112827 T20 oaz.ZooKeeper.close Session: 0x13aade2ed090005 closed
[junit4:junit4]   2> 112854 T20 oejsh.ContextHandler.doStop stopped o.e.j.s.ServletContextHandler{/solr,null}
[junit4:junit4]   2> 112910 T20 oasc.ChaosMonkey.monkeyLog monkey: stop shard! 41752
[junit4:junit4]   2> 112911 T20 oasc.CoreContainer.shutdown Shutting down CoreContainer
instance=582937549
[junit4:junit4]   2> 112911 T20 oasc.SolrCore.close [collection1]  CLOSING SolrCore org.apache.solr.core.SolrCore@566d0085
[junit4:junit4]   2> 112925 T20 oasu.DirectUpdateHandler2.close closing DirectUpdateHandler2{commits=114,autocommits=0,soft
autocommits=0,optimizes=0,rollbacks=0,expungeDeletes=0,docsPending=0,adds=0,deletesById=0,deletesByQuery=0,errors=0,cumulative_adds=82,cumulative_deletesById=0,cumulative_deletesByQuery=1,cumulative_errors=0}
[junit4:junit4]   2> 112925 T20 oasc.SolrCore.decrefSolrCoreState Closing SolrCoreState
[junit4:junit4]   2> 112925 T20 oasu.DefaultSolrCoreState.closeIndexWriter SolrCoreState
ref count has reached 0 - closing IndexWriter
[junit4:junit4]   2> 112926 T20 oasu.DefaultSolrCoreState.closeIndexWriter closing IndexWriter
with IndexWriterCloser
[junit4:junit4]   2> 112929 T20 oasc.SolrCore.closeSearcher [collection1] Closing main
searcher on request.
[junit4:junit4]   2> 112931 T20 oasc.SolrCore.close [collection2]  CLOSING SolrCore org.apache.solr.core.SolrCore@10dd151f
[junit4:junit4]   2> 112939 T20 oasu.DirectUpdateHandler2.close closing DirectUpdateHandler2{commits=2,autocommits=0,soft
autocommits=0,optimizes=0,rollbacks=0,expungeDeletes=0,docsPending=0,adds=0,deletesById=0,deletesByQuery=0,errors=0,cumulative_adds=2,cumulative_deletesById=0,cumulative_deletesByQuery=0,cumulative_errors=0}
[junit4:junit4]   2> 112940 T20 oasc.SolrCore.decrefSolrCoreState Closing SolrCoreState
[junit4:junit4]   2> 112940 T20 oasu.DefaultSolrCoreState.closeIndexWriter SolrCoreState
ref count has reached 0 - closing IndexWriter
[junit4:junit4]   2> 112940 T20 oasu.DefaultSolrCoreState.closeIndexWriter closing IndexWriter
with IndexWriterCloser
[junit4:junit4]   2> 112941 T20 oasc.SolrCore.closeSearcher [collection2] Closing main
searcher on request.
[junit4:junit4]   2> 112942 T20 oasc.SolrCore.close [collection3]  CLOSING SolrCore org.apache.solr.core.SolrCore@784f349b
[junit4:junit4]   2> 112950 T92 oaz.ClientCnxn$SendThread.startConnect Opening socket connection
to server localhost.localdomain/127.0.0.1:35618
[junit4:junit4]   2> 112952 T92 oaz.ClientCnxn$SendThread.run WARNING Session 0x13aade2ed090006
for server null, unexpected error, closing socket connection and attempting reconnect java.net.ConnectException:
Connection refused
[junit4:junit4]   2> 	at sun.nio.ch.SocketChannelImpl.checkConnect(Native Method)
[junit4:junit4]   2> 	at sun.nio.ch.SocketChannelImpl.finishConnect(SocketChannelImpl.java:567)
[junit4:junit4]   2> 	at org.apache.zookeeper.ClientCnxn$SendThread.run(ClientCnxn.java:1143)
[junit4:junit4]   2> 
[junit4:junit4]   2> 112955 T20 oasu.DirectUpdateHandler2.close closing DirectUpdateHandler2{commits=2,autocommits=0,soft
autocommits=0,optimizes=0,rollbacks=0,expungeDeletes=0,docsPending=0,adds=0,deletesById=0,deletesByQuery=0,errors=0,cumulative_adds=0,cumulative_deletesById=0,cumulative_deletesByQuery=0,cumulative_errors=0}
[junit4:junit4]   2> 112955 T20 oasc.SolrCore.decrefSolrCoreState Closing SolrCoreState
[junit4:junit4]   2> 112955 T20 oasu.DefaultSolrCoreState.closeIndexWriter SolrCoreState
ref count has reached 0 - closing IndexWriter
[junit4:junit4]   2> 112956 T20 oasu.DefaultSolrCoreState.closeIndexWriter closing IndexWriter
with IndexWriterCloser
[junit4:junit4]   2> 112957 T20 oasc.SolrCore.closeSearcher [collection3] Closing main
searcher on request.
[junit4:junit4]   2> 112958 T20 oasc.SolrCore.close [awholynewcollection_0]  CLOSING SolrCore
org.apache.solr.core.SolrCore@3018076c
[junit4:junit4]   2> 112959 T20 oasu.DirectUpdateHandler2.close closing DirectUpdateHandler2{commits=4,autocommits=0,soft
autocommits=0,optimizes=0,rollbacks=0,expungeDeletes=0,docsPending=0,adds=0,deletesById=0,deletesByQuery=0,errors=0,cumulative_adds=0,cumulative_deletesById=0,cumulative_deletesByQuery=0,cumulative_errors=0}
[junit4:junit4]   2> 112959 T20 oasc.SolrCore.decrefSolrCoreState Closing SolrCoreState
[junit4:junit4]   2> 112959 T20 oasu.DefaultSolrCoreState.closeIndexWriter SolrCoreState
ref count has reached 0 - closing IndexWriter
[junit4:junit4]   2> 112960 T20 oasu.DefaultSolrCoreState.closeIndexWriter closing IndexWriter
with IndexWriterCloser
[junit4:junit4]   2> 112960 T20 oasc.SolrCore.closeSearcher [awholynewcollection_0] Closing
main searcher on request.
[junit4:junit4]   2> 112961 T20 oasc.SolrCore.close [awholynewcollection_1]  CLOSING SolrCore
org.apache.solr.core.SolrCore@6b9de347
[junit4:junit4]   2> 112962 T20 oasu.DirectUpdateHandler2.close closing DirectUpdateHandler2{commits=0,autocommits=0,soft
autocommits=0,optimizes=0,rollbacks=0,expungeDeletes=0,docsPending=0,adds=0,deletesById=0,deletesByQuery=0,errors=0,cumulative_adds=0,cumulative_deletesById=0,cumulative_deletesByQuery=0,cumulative_errors=0}
[junit4:junit4]   2> 112965 T20 oasc.SolrCore.decrefSolrCoreState Closing SolrCoreState
[junit4:junit4]   2> 112966 T20 oasu.DefaultSolrCoreState.closeIndexWriter SolrCoreState
ref count has reached 0 - closing IndexWriter
[junit4:junit4]   2> 112966 T20 oasu.DefaultSolrCoreState.closeIndexWriter closing IndexWriter
with IndexWriterCloser
[junit4:junit4]   2> 112967 T20 oasc.SolrCore.closeSearcher [awholynewcollection_1] Closing
main searcher on request.
[junit4:junit4]   2> 113053 T93 oaz.ClientCnxn$EventThread.run EventThread shut down
[junit4:junit4]   2> 113053 T20 oaz.ZooKeeper.close Session: 0x13aade2ed090006 closed
[junit4:junit4]   2> 113075 T20 oejsh.ContextHandler.doStop stopped o.e.j.s.ServletContextHandler{/solr,null}
[junit4:junit4]   2> 113176 T20 oas.SolrTestCaseJ4.tearDown ###Ending testDistribSearch
[junit4:junit4]   2> 114122 T107 oaz.ClientCnxn$SendThread.startConnect Opening socket
connection to server localhost.localdomain/127.0.0.1:35618
[junit4:junit4]   2> 114223 T108 oaz.ClientCnxn$EventThread.run EventThread shut down
[junit4:junit4]   2> 114223 T20 oaz.ZooKeeper.close Session: 0x13aade2ed090009 closed
[junit4:junit4]   1>            "base_url":"http://127.0.0.1:52309/solr"}
[junit4:junit4]   1>    /solr/collections/control_collection (3)
[junit4:junit4]   1>    DATA:
[junit4:junit4]   1>        {"configName":"conf1"}
[junit4:junit4]   1>     /solr/collections/control_collection/shards (0)
[junit4:junit4]   1>     /solr/collections/control_collection/leader_elect (1)
[junit4:junit4]   1>      /solr/collections/control_collection/leader_elect/control_shard
(1)
[junit4:junit4]   1>       /solr/collections/control_collection/leader_elect/control_shard/election
(1)
[junit4:junit4]   1>        /solr/collections/control_collection/leader_elect/control_shard/election/88574332838150146-127.0.0.1:52322_solr_collection1-n_0000000000
(0)
[junit4:junit4]   1>     /solr/collections/control_collection/leaders (1)
[junit4:junit4]   1>      /solr/collections/control_collection/leaders/control_shard (0)
[junit4:junit4]   1>      DATA:
[junit4:junit4]   1>          {
[junit4:junit4]   1>            "core":"collection1",
[junit4:junit4]   1>            "node_name":"127.0.0.1:52322_solr",
[junit4:junit4]   1>            "base_url":"http://127.0.0.1:52322/solr"}
[junit4:junit4]   1>   /solr/clusterstate.json (0)
[junit4:junit4]   1>   DATA:
[junit4:junit4]   1>       {
[junit4:junit4]   1>         "collection1":{
[junit4:junit4]   1>           "shard1":{
[junit4:junit4]   1>             "range":"80000000-ffffffff",
[junit4:junit4]   1>             "replicas":{
[junit4:junit4]   1>               "127.0.0.1:47331_solr_collection1":{
[junit4:junit4]   1>                 "shard":"shard1",
[junit4:junit4]   1>                 "roles":null,
[junit4:junit4]   1>                 "state":"active",
[junit4:junit4]   1>                 "core":"collection1",
[junit4:junit4]   1>                 "collection":"collection1",
[junit4:junit4]   1>                 "node_name":"127.0.0.1:47331_solr",
[junit4:junit4]   1>                 "base_url":"http://127.0.0.1:47331/solr",
[junit4:junit4]   1>                 "leader":"true"},
[junit4:junit4]   1>               "127.0.0.1:45518_solr_collection1":{
[junit4:junit4]   1>                 "shard":"shard1",
[junit4:junit4]   1>                 "roles":null,
[junit4:junit4]   1>                 "state":"active",
[junit4:junit4]   1>                 "core":"collection1",
[junit4:junit4]   1>                 "collection":"collection1",
[junit4:junit4]   1>                 "node_name":"127.0.0.1:45518_solr",
[junit4:junit4]   1>                 "base_url":"http://127.0.0.1:45518/solr"}}},
[junit4:junit4]   1>           "shard2":{
[junit4:junit4]   1>             "range":"0-7fffffff",
[junit4:junit4]   1>             "replicas":{
[junit4:junit4]   1>               "127.0.0.1:52309_solr_collection1":{
[junit4:junit4]   1>                 "shard":"shard2",
[junit4:junit4]   1>                 "roles":null,
[junit4:junit4]   1>                 "state":"active",
[junit4:junit4]   1>                 "core":"collection1",
[junit4:junit4]   1>                 "collection":"collection1",
[junit4:junit4]   1>                 "node_name":"127.0.0.1:52309_solr",
[junit4:junit4]   1>                 "base_url":"http://127.0.0.1:52309/solr",
[junit4:junit4]   1>                 "leader":"true"},
[junit4:junit4]   1>               "127.0.0.1:41752_solr_collection1":{
[junit4:junit4]   1>                 "shard":"shard2",
[junit4:junit4]   1>                 "roles":null,
[junit4:junit4]   1>                 "state":"active",
[junit4:junit4]   1>                 "core":"collection1",
[junit4:junit4]   1>                 "collection":"collection1",
[junit4:junit4]   1>                 "node_name":"127.0.0.1:41752_solr",
[junit4:junit4]   1>                 "base_url":"http://127.0.0.1:41752/solr"}}}},
[junit4:junit4]   1>         "control_collection":{"control_shard":{"replicas":{"127.0.0.1:52322_solr_collection1":{
[junit4:junit4]   1>                 "shard":"control_shard",
[junit4:junit4]   1>                 "roles":null,
[junit4:junit4]   1>                 "state":"active",
[junit4:junit4]   1>                 "core":"collection1",
[junit4:junit4]   1>                 "collection":"control_collection",
[junit4:junit4]   1>                 "node_name":"127.0.0.1:52322_solr",
[junit4:junit4]   1>                 "base_url":"http://127.0.0.1:52322/solr",
[junit4:junit4]   1>                 "leader":"true"}}}}}
[junit4:junit4]   1>  /zookeeper (1)
[junit4:junit4]   1>  DATA:
[junit4:junit4]   1>      
[junit4:junit4]   1> 
[junit4:junit4]   2> NOTE: reproduce with: ant test  -Dtestcase=BasicDistributedZkTest
-Dtests.method=testDistribSearch -Dtests.seed=EC1C5DF9EC7353CD -Dtests.slow=true -Dtests.locale=ar_AE
-Dtests.timezone=Atlantic/Bermuda -Dtests.file.encoding=ISO-8859-1
[junit4:junit4] FAILURE  114s J0 | BasicDistributedZkTest.testDistribSearch <<<
[junit4:junit4]    > Throwable #1: java.lang.AssertionError: Leader never changed
[junit4:junit4]    > 	at __randomizedtesting.SeedInfo.seed([EC1C5DF9EC7353CD:6DFAD3E19B2C33F1]:0)
[junit4:junit4]    > 	at org.junit.Assert.fail(Assert.java:93)
[junit4:junit4]    > 	at org.apache.solr.cloud.BasicDistributedZkTest.testCoreUnloadAndLeaders(BasicDistributedZkTest.java:446)
[junit4:junit4]    > 	at org.apache.solr.cloud.BasicDistributedZkTest.doTest(BasicDistributedZkTest.java:335)
[junit4:junit4]    > 	at org.apache.solr.BaseDistributedSearchTestCase.testDistribSearch(BaseDistributedSearchTestCase.java:695)
[junit4:junit4]    > 	at sun.reflect.NativeMethodAccessorImpl.invoke0(Native Method)
[junit4:junit4]    > 	at sun.reflect.NativeMethodAccessorImpl.invoke(NativeMethodAccessorImpl.java:39)
[junit4:junit4]    > 	at sun.reflect.DelegatingMethodAccessorImpl.invoke(DelegatingMethodAccessorImpl.java:25)
[junit4:junit4]    > 	at java.lang.reflect.Method.invoke(Method.java:597)
[junit4:junit4]    > 	at com.carrotsearch.randomizedtesting.RandomizedRunner.invoke(RandomizedRunner.java:1559)
[junit4:junit4]    > 	at com.carrotsearch.randomizedtesting.RandomizedRunner.access$600(RandomizedRunner.java:79)
[junit4:junit4]    > 	at com.carrotsearch.randomizedtesting.RandomizedRunner$6.evaluate(RandomizedRunner.java:737)
[junit4:junit4]    > 	at com.carrotsearch.randomizedtesting.RandomizedRunner$7.evaluate(RandomizedRunner.java:773)
[junit4:junit4]    > 	at com.carrotsearch.randomizedtesting.RandomizedRunner$8.evaluate(RandomizedRunner.java:787)
[junit4:junit4]    > 	at com.carrotsearch.randomizedtesting.rules.SystemPropertiesRestoreRule$1.evaluate(SystemPropertiesRestoreRule.java:53)
[junit4:junit4]    > 	at org.apache.lucene.util.TestRuleSetupTeardownChained$1.evaluate(TestRuleSetupTeardownChained.java:50)
[junit4:junit4]    > 	at org.apache.lucene.util.TestRuleFieldCacheSanity$1.evaluate(TestRuleFieldCacheSanity.java:51)
[junit4:junit4]    > 	at org.apache.lucene.util.AbstractBeforeAfterRule$1.evaluate(AbstractBeforeAfterRule.java:45)
[junit4:junit4]    > 	at com.carrotsearch.randomizedtesting.rules.SystemPropertiesInvariantRule$1.evaluate(SystemPropertiesInvariantRule.java:55)
[junit4:junit4]    > 	at org.apache.lucene.util.TestRuleThreadAndTestName$1.evaluate(TestRuleThreadAndTestName.java:48)
[junit4:junit4]    > 	at org.apache.lucene.util.TestRuleIgnoreAfterMaxFailures$1.evaluate(TestRuleIgnoreAfterMaxFailures.java:70)
[junit4:junit4]    > 	at org.apache.lucene.util.TestRuleMarkFailure$1.evaluate(TestRuleMarkFailure.java:48)
[junit4:junit4]    > 	at com.carrotsearch.randomizedtesting.rules.StatementAdapter.evaluate(StatementAdapter.java:36)
[junit4:junit4]    > 	at com.carrotsearch.randomizedtesting.ThreadLeakControl$StatementRunner.run(ThreadLeakControl.java:358)
[junit4:junit4]    > 	at com.carrotsearch.randomizedtesting.ThreadLeakControl.forkTimeoutingTask(ThreadLeakControl.java:782)
[junit4:junit4]    > 	at com.carrotsearch.randomizedtesting.ThreadLeakControl$3.evaluate(ThreadLeakControl.java:442)
[junit4:junit4]    > 	at com.carrotsearch.randomizedtesting.RandomizedRunner.runSingleTest(RandomizedRunner.java:746)
[junit4:junit4]    > 	at com.carrotsearch.randomizedtesting.RandomizedRunner$3.evaluate(RandomizedRunner.java:648)
[junit4:junit4]    > 	at com.carrotsearch.randomizedtesting.RandomizedRunner$4.evaluate(RandomizedRunner.java:682)
[junit4:junit4]    > 	at com.carrotsearch.randomizedtesting.RandomizedRunner$5.evaluate(RandomizedRunner.java:693)
[junit4:junit4]    > 	at com.carrotsearch.randomizedtesting.rules.StatementAdapter.evaluate(StatementAdapter.java:36)
[junit4:junit4]    > 	at com.carrotsearch.randomizedtesting.rules.SystemPropertiesRestoreRule$1.evaluate(SystemPropertiesRestoreRule.java:53)
[junit4:junit4]    > 	at org.apache.lucene.util.AbstractBeforeAfterRule$1.evaluate(AbstractBeforeAfterRule.java:45)
[junit4:junit4]    > 	at org.apache.lucene.util.TestRuleStoreClassName$1.evaluate(TestRuleStoreClassName.java:42)
[junit4:junit4]    > 	at com.carrotsearch.randomizedtesting.rules.SystemPropertiesInvariantRule$1.evaluate(SystemPropertiesInvariantRule.java:55)
[junit4:junit4]    > 	at com.carrotsearch.randomizedtesting.rules.NoShadowingOrOverridesOnMethodsRule$1.evaluate(NoShadowingOrOverridesOnMethodsRule.java:39)
[junit4:junit4]    > 	at com.carrotsearch.randomizedtesting.rules.NoShadowingOrOverridesOnMethodsRule$1.evaluate(NoShadowingOrOverridesOnMethodsRule.java:39)
[junit4:junit4]    > 	at com.carrotsearch.randomizedtesting.rules.StatementAdapter.evaluate(StatementAdapter.java:36)
[junit4:junit4]    > 	at org.apache.lucene.util.TestRuleAssertionsRequired$1.evaluate(TestRuleAssertionsRequired.java:43)
[junit4:junit4]    > 	at org.apache.lucene.util.TestRuleMarkFailure$1.evaluate(TestRuleMarkFailure.java:48)
[junit4:junit4]    > 	at org.apache.lucene.util.TestRuleIgnoreAfterMaxFailures$1.evaluate(TestRuleIgnoreAfterMaxFailures.java:70)
[junit4:junit4]    > 	at org.apache.lucene.util.TestRuleIgnoreTestSuites$1.evaluate(TestRuleIgnoreTestSuites.java:55)
[junit4:junit4]    > 	at com.carrotsearch.randomizedtesting.rules.StatementAdapter.evaluate(StatementAdapter.java:36)
[junit4:junit4]    > 	at com.carrotsearch.randomizedtesting.ThreadLeakControl$StatementRunner.run(ThreadLeakControl.java:358)
[junit4:junit4]    > 	at java.lang.Thread.run(Thread.java:662)
[junit4:junit4]   2> 114247 T20 oas.SolrTestCaseJ4.deleteCore ###deleteCore
[junit4:junit4]   2> NOTE: test params are: codec=Lucene40, sim=DefaultSimilarity, locale=ar_AE,
timezone=Atlantic/Bermuda
[junit4:junit4]   2> NOTE: Linux 3.2.0-24-generic amd64/Sun Microsystems Inc. 1.6.0_27
(64-bit)/cpus=8,threads=1,free=243190064,total=349110272
[junit4:junit4]   2> NOTE: All tests run in this JVM: [PathHierarchyTokenizerFactoryTest,
CoreContainerCoreInitFailuresTest, SimplePostToolTest, BasicDistributedZkTest]
[junit4:junit4] Completed on J0 in 114.39s, 1 test, 1 failure <<< FAILURES!
[junit4:junit4] 
[junit4:junit4] Suite: org.apache.solr.handler.component.TermVectorComponentDistributedTest
[junit4:junit4] Completed on J4 in 11.18s, 1 test
[junit4:junit4] 
[junit4:junit4] Suite: org.apache.solr.search.TestStressReorder
[junit4:junit4] Completed on J3 in 11.11s, 1 test
[junit4:junit4] 
[junit4:junit4] Suite: org.apache.solr.cloud.SyncSliceTest
[junit4:junit4] Completed on J1 in 35.52s, 1 test
[junit4:junit4] 
[junit4:junit4] Suite: org.apache.solr.cloud.BasicDistributedZk2Test
[junit4:junit4] Completed on J7 in 37.81s, 1 test
[junit4:junit4] 
[junit4:junit4] 
[junit4:junit4] Tests with failures:
[junit4:junit4]   - org.apache.solr.cloud.BasicDistributedZkTest.testDistribSearch
[junit4:junit4] 
[junit4:junit4] 
[junit4:junit4] JVM J0:     1.11 ..   126.09 =   124.98s
[junit4:junit4] JVM J1:     1.11 ..   151.36 =   150.25s
[junit4:junit4] JVM J2:     1.11 ..   119.82 =   118.71s
[junit4:junit4] JVM J3:     1.11 ..   127.79 =   126.69s
[junit4:junit4] JVM J4:     0.87 ..   127.45 =   126.58s
[junit4:junit4] JVM J5:     1.11 ..   119.27 =   118.16s
[junit4:junit4] JVM J6:     1.11 ..   122.56 =   121.45s
[junit4:junit4] JVM J7:     1.11 ..   153.57 =   152.46s
[junit4:junit4] Execution time total: 2 minutes 33 seconds
[junit4:junit4] Tests summary: 233 suites, 965 tests, 1 failure, 7 ignored (2 assumptions)

BUILD FAILED
<http://sierranevada.servebeer.com/job/fast-io-beasting/ws/build.xml>:39: The following
error occurred while executing this line:
<http://sierranevada.servebeer.com/job/fast-io-beasting/ws/solr/build.xml>:178: The
following error occurred while executing this line:
<http://sierranevada.servebeer.com/job/fast-io-beasting/ws/lucene/module-build.xml>:61:
The following error occurred while executing this line:
<http://sierranevada.servebeer.com/job/fast-io-beasting/ws/lucene/common-build.xml>:1159:
The following error occurred while executing this line:
<http://sierranevada.servebeer.com/job/fast-io-beasting/ws/lucene/common-build.xml>:827:
There were test failures: 233 suites, 965 tests, 1 failure, 7 ignored (2 assumptions)

Total time: 7 minutes 45 seconds
Build step 'Invoke Ant' marked build as failure

---------------------------------------------------------------------
To unsubscribe, e-mail: dev-unsubscribe@lucene.apache.org
For additional commands, e-mail: dev-help@lucene.apache.org


Mime
View raw message