lucene-dev mailing list archives

Site index · List index
Message view « Date » · « Thread »
Top « Date » · « Thread »
From Policeman Jenkins Server <jenk...@sd-datasolutions.de>
Subject [JENKINS] Lucene-Solr-trunk-Windows (32bit/jdk1.6.0_35) - Build # 1371 - Still Failing!
Date Tue, 30 Oct 2012 17:49:35 GMT
Build: http://jenkins.sd-datasolutions.de/job/Lucene-Solr-trunk-Windows/1371/
Java: 32bit/jdk1.6.0_35 -server -XX:+UseParallelGC

1 tests failed.
REGRESSION:  org.apache.solr.spelling.suggest.SuggesterTSTTest.testRebuild

Error Message:
Exception during query

Stack Trace:
java.lang.RuntimeException: Exception during query
	at __randomizedtesting.SeedInfo.seed([C74E3F67F0A25500:9C6B9D24C4A22F9A]:0)
	at org.apache.solr.SolrTestCaseJ4.assertQ(SolrTestCaseJ4.java:515)
	at org.apache.solr.SolrTestCaseJ4.assertQ(SolrTestCaseJ4.java:482)
	at org.apache.solr.spelling.suggest.SuggesterTest.testRebuild(SuggesterTest.java:105)
	at sun.reflect.NativeMethodAccessorImpl.invoke0(Native Method)
	at sun.reflect.NativeMethodAccessorImpl.invoke(NativeMethodAccessorImpl.java:39)
	at sun.reflect.DelegatingMethodAccessorImpl.invoke(DelegatingMethodAccessorImpl.java:25)
	at java.lang.reflect.Method.invoke(Method.java:597)
	at com.carrotsearch.randomizedtesting.RandomizedRunner.invoke(RandomizedRunner.java:1559)
	at com.carrotsearch.randomizedtesting.RandomizedRunner.access$600(RandomizedRunner.java:79)
	at com.carrotsearch.randomizedtesting.RandomizedRunner$6.evaluate(RandomizedRunner.java:737)
	at com.carrotsearch.randomizedtesting.RandomizedRunner$7.evaluate(RandomizedRunner.java:773)
	at com.carrotsearch.randomizedtesting.RandomizedRunner$8.evaluate(RandomizedRunner.java:787)
	at com.carrotsearch.randomizedtesting.rules.SystemPropertiesRestoreRule$1.evaluate(SystemPropertiesRestoreRule.java:53)
	at org.apache.lucene.util.TestRuleSetupTeardownChained$1.evaluate(TestRuleSetupTeardownChained.java:50)
	at org.apache.lucene.util.TestRuleFieldCacheSanity$1.evaluate(TestRuleFieldCacheSanity.java:51)
	at org.apache.lucene.util.AbstractBeforeAfterRule$1.evaluate(AbstractBeforeAfterRule.java:45)
	at com.carrotsearch.randomizedtesting.rules.SystemPropertiesInvariantRule$1.evaluate(SystemPropertiesInvariantRule.java:55)
	at org.apache.lucene.util.TestRuleThreadAndTestName$1.evaluate(TestRuleThreadAndTestName.java:48)
	at org.apache.lucene.util.TestRuleIgnoreAfterMaxFailures$1.evaluate(TestRuleIgnoreAfterMaxFailures.java:70)
	at org.apache.lucene.util.TestRuleMarkFailure$1.evaluate(TestRuleMarkFailure.java:48)
	at com.carrotsearch.randomizedtesting.rules.StatementAdapter.evaluate(StatementAdapter.java:36)
	at com.carrotsearch.randomizedtesting.ThreadLeakControl$StatementRunner.run(ThreadLeakControl.java:358)
	at com.carrotsearch.randomizedtesting.ThreadLeakControl.forkTimeoutingTask(ThreadLeakControl.java:782)
	at com.carrotsearch.randomizedtesting.ThreadLeakControl$3.evaluate(ThreadLeakControl.java:442)
	at com.carrotsearch.randomizedtesting.RandomizedRunner.runSingleTest(RandomizedRunner.java:746)
	at com.carrotsearch.randomizedtesting.RandomizedRunner$3.evaluate(RandomizedRunner.java:648)
	at com.carrotsearch.randomizedtesting.RandomizedRunner$4.evaluate(RandomizedRunner.java:682)
	at com.carrotsearch.randomizedtesting.RandomizedRunner$5.evaluate(RandomizedRunner.java:693)
	at com.carrotsearch.randomizedtesting.rules.StatementAdapter.evaluate(StatementAdapter.java:36)
	at com.carrotsearch.randomizedtesting.rules.SystemPropertiesRestoreRule$1.evaluate(SystemPropertiesRestoreRule.java:53)
	at org.apache.lucene.util.AbstractBeforeAfterRule$1.evaluate(AbstractBeforeAfterRule.java:45)
	at org.apache.lucene.util.TestRuleStoreClassName$1.evaluate(TestRuleStoreClassName.java:42)
	at com.carrotsearch.randomizedtesting.rules.SystemPropertiesInvariantRule$1.evaluate(SystemPropertiesInvariantRule.java:55)
	at com.carrotsearch.randomizedtesting.rules.NoShadowingOrOverridesOnMethodsRule$1.evaluate(NoShadowingOrOverridesOnMethodsRule.java:39)
	at com.carrotsearch.randomizedtesting.rules.NoShadowingOrOverridesOnMethodsRule$1.evaluate(NoShadowingOrOverridesOnMethodsRule.java:39)
	at com.carrotsearch.randomizedtesting.rules.StatementAdapter.evaluate(StatementAdapter.java:36)
	at org.apache.lucene.util.TestRuleAssertionsRequired$1.evaluate(TestRuleAssertionsRequired.java:43)
	at org.apache.lucene.util.TestRuleMarkFailure$1.evaluate(TestRuleMarkFailure.java:48)
	at org.apache.lucene.util.TestRuleIgnoreAfterMaxFailures$1.evaluate(TestRuleIgnoreAfterMaxFailures.java:70)
	at org.apache.lucene.util.TestRuleIgnoreTestSuites$1.evaluate(TestRuleIgnoreTestSuites.java:55)
	at com.carrotsearch.randomizedtesting.rules.StatementAdapter.evaluate(StatementAdapter.java:36)
	at com.carrotsearch.randomizedtesting.ThreadLeakControl$StatementRunner.run(ThreadLeakControl.java:358)
	at java.lang.Thread.run(Thread.java:662)
Caused by: java.lang.RuntimeException: REQUEST FAILED: xpath=//lst[@name='spellcheck']/lst[@name='suggestions']/lst[@name='ac']/int[@name='numFound'][.='2']
	xml response was: <?xml version="1.0" encoding="UTF-8"?>
<response>
<lst name="responseHeader"><int name="status">0</int><int name="QTime">0</int></lst><lst name="spellcheck"><lst name="suggestions"/></lst>
</response>

	request was:q=ac&spellcheck.count=2&qt=/suggest_tst&spellcheck.onlyMorePopular=true
	at org.apache.solr.SolrTestCaseJ4.assertQ(SolrTestCaseJ4.java:508)
	... 42 more




Build Log:
[...truncated 8023 lines...]
[junit4:junit4] Suite: org.apache.solr.spelling.suggest.SuggesterTSTTest
[junit4:junit4]   2> 1 T1718 oas.SolrTestCaseJ4.initCore ####initCore
[junit4:junit4]   2> Creating dataDir: C:\Users\JenkinsSlave\workspace\Lucene-Solr-trunk-Windows\solr\build\solr-core\test\J0\.\solrtest-SuggesterTSTTest-1351618641237
[junit4:junit4]   2> 4 T1718 oasc.SolrResourceLoader.<init> new SolrResourceLoader for directory: 'C:\Users\JenkinsSlave\workspace\Lucene-Solr-trunk-Windows\solr\build\solr-core\test-files\solr\collection1\'
[junit4:junit4]   2> 6 T1718 oasc.SolrResourceLoader.replaceClassLoader Adding 'file:/C:/Users/JenkinsSlave/workspace/Lucene-Solr-trunk-Windows/solr/build/solr-core/test-files/solr/collection1/lib/classes/' to classloader
[junit4:junit4]   2> 7 T1718 oasc.SolrResourceLoader.replaceClassLoader Adding 'file:/C:/Users/JenkinsSlave/workspace/Lucene-Solr-trunk-Windows/solr/build/solr-core/test-files/solr/collection1/lib/README' to classloader
[junit4:junit4]   2> 73 T1718 oasc.SolrConfig.<init> Using Lucene MatchVersion: LUCENE_50
[junit4:junit4]   2> 173 T1718 oasc.SolrConfig.<init> Loaded SolrConfig: solrconfig-spellchecker.xml
[junit4:junit4]   2> 174 T1718 oass.IndexSchema.readSchema Reading Solr Schema
[junit4:junit4]   2> 180 T1718 oass.IndexSchema.readSchema Schema name=Solr SpellCheck Test
[junit4:junit4]   2> 221 T1718 oass.IndexSchema.readSchema default search field in schema is text
[junit4:junit4]   2> 223 T1718 oass.IndexSchema.readSchema query parser default operator is OR
[junit4:junit4]   2> 225 T1718 oass.IndexSchema.readSchema unique key field: id
[junit4:junit4]   2> 228 T1718 oasc.SolrResourceLoader.locateSolrHome JNDI not configured for solr (NoInitialContextEx)
[junit4:junit4]   2> 229 T1718 oasc.SolrResourceLoader.locateSolrHome using system property solr.solr.home: C:\Users\JenkinsSlave\workspace\Lucene-Solr-trunk-Windows\solr\build\solr-core\test-files\solr
[junit4:junit4]   2> 229 T1718 oasc.SolrResourceLoader.<init> new SolrResourceLoader for directory: 'C:\Users\JenkinsSlave\workspace\Lucene-Solr-trunk-Windows\solr\build\solr-core\test-files\solr\'
[junit4:junit4]   2> 240 T1718 oasc.CoreContainer.<init> New CoreContainer 28084046
[junit4:junit4]   2> 240 T1718 oasc.SolrCore.<init> [collection1] Opening new SolrCore at C:\Users\JenkinsSlave\workspace\Lucene-Solr-trunk-Windows\solr\build\solr-core\test-files\solr\collection1\, dataDir=C:\Users\JenkinsSlave\workspace\Lucene-Solr-trunk-Windows\solr\build\solr-core\test\J0\.\solrtest-SuggesterTSTTest-1351618641237\
[junit4:junit4]   2> 240 T1718 oasc.SolrCore.<init> JMX monitoring not detected for core: collection1
[junit4:junit4]   2> 241 T1718 oasc.SolrCore.initDirectoryFactory org.apache.solr.core.MockFSDirectoryFactory
[junit4:junit4]   2> 241 T1718 oasc.CachingDirectoryFactory.injectLockFactory WARNING No lockType configured for MockDirWrapper(org.apache.lucene.store.MMapDirectory@C:\Users\JenkinsSlave\workspace\Lucene-Solr-trunk-Windows\solr\build\solr-core\test\J0\solrtest-SuggesterTSTTest-1351618641237 lockFactory=org.apache.lucene.store.NativeFSLockFactory@1e72327) assuming 'simple'
[junit4:junit4]   2> 242 T1718 oasc.CachingDirectoryFactory.get return new directory for C:\Users\JenkinsSlave\workspace\Lucene-Solr-trunk-Windows\solr\build\solr-core\test\J0\.\solrtest-SuggesterTSTTest-1351618641237 forceNew:false
[junit4:junit4]   2> 242 T1718 oasc.CachingDirectoryFactory.close Releasing directory:C:\Users\JenkinsSlave\workspace\Lucene-Solr-trunk-Windows\solr\build\solr-core\test\J0\.\solrtest-SuggesterTSTTest-1351618641237
[junit4:junit4]   2> 242 T1718 oasc.SolrCore.getNewIndexDir New index directory detected: old=null new=C:\Users\JenkinsSlave\workspace\Lucene-Solr-trunk-Windows\solr\build\solr-core\test\J0\.\solrtest-SuggesterTSTTest-1351618641237\index/
[junit4:junit4]   2> 243 T1718 oasc.SolrCore.initIndex WARNING [collection1] Solr index directory 'C:\Users\JenkinsSlave\workspace\Lucene-Solr-trunk-Windows\solr\build\solr-core\test\J0\.\solrtest-SuggesterTSTTest-1351618641237\index' doesn't exist. Creating new index...
[junit4:junit4]   2> 244 T1718 oasc.CachingDirectoryFactory.get return new directory for C:\Users\JenkinsSlave\workspace\Lucene-Solr-trunk-Windows\solr\build\solr-core\test\J0\.\solrtest-SuggesterTSTTest-1351618641237\index forceNew:false
[junit4:junit4]   2> 259 T1718 oasc.SolrDeletionPolicy.onCommit SolrDeletionPolicy.onCommit: commits:num=1
[junit4:junit4]   2> 		commit{dir=MockDirWrapper(org.apache.lucene.store.SimpleFSDirectory@C:\Users\JenkinsSlave\workspace\Lucene-Solr-trunk-Windows\solr\build\solr-core\test\J0\solrtest-SuggesterTSTTest-1351618641237\index lockFactory=org.apache.lucene.store.NativeFSLockFactory@3da946),segFN=segments_1,generation=1,filenames=[segments_1]
[junit4:junit4]   2> 260 T1718 oasc.SolrDeletionPolicy.updateCommits newest commit = 1[segments_1]
[junit4:junit4]   2> 261 T1718 oasc.CachingDirectoryFactory.close Releasing directory:C:\Users\JenkinsSlave\workspace\Lucene-Solr-trunk-Windows\solr\build\solr-core\test\J0\.\solrtest-SuggesterTSTTest-1351618641237\index
[junit4:junit4]   2> 263 T1718 oasc.RequestHandlers.initHandlersFromConfig created standard: solr.StandardRequestHandler
[junit4:junit4]   2> 265 T1718 oasc.RequestHandlers.initHandlersFromConfig created /suggest: org.apache.solr.handler.component.SearchHandler
[junit4:junit4]   2> 267 T1718 oasc.RequestHandlers.initHandlersFromConfig created /suggest_tst: org.apache.solr.handler.component.SearchHandler
[junit4:junit4]   2> 267 T1718 oasc.RequestHandlers.initHandlersFromConfig created /suggest_fst: org.apache.solr.handler.component.SearchHandler
[junit4:junit4]   2> 268 T1718 oasc.RequestHandlers.initHandlersFromConfig created /suggest_wfst: org.apache.solr.handler.component.SearchHandler
[junit4:junit4]   2> 288 T1718 oasc.CachingDirectoryFactory.close Releasing directory:C:\Users\JenkinsSlave\workspace\Lucene-Solr-trunk-Windows\solr\build\solr-core\test\J0\.\solrtest-SuggesterTSTTest-1351618641237
[junit4:junit4]   2> 291 T1718 oass.SolrIndexSearcher.<init> Opening Searcher@1ea2f96 main
[junit4:junit4]   2> 294 T1718 oasu.CommitTracker.<init> Hard AutoCommit: disabled
[junit4:junit4]   2> 294 T1718 oasu.CommitTracker.<init> Soft AutoCommit: disabled
[junit4:junit4]   2> 294 T1718 oashc.SpellCheckComponent.inform Initializing spell checkers
[junit4:junit4]   2> 295 T1718 oasss.Suggester.init init: {name=suggest,classname=org.apache.solr.spelling.suggest.Suggester,lookupImpl=org.apache.solr.spelling.suggest.jaspell.JaspellLookup,field=suggest,storeDir=suggest,buildOnCommit=true,threshold=0.0}
[junit4:junit4]   2> 295 T1718 oasssj.JaspellLookupFactory.create init: {name=suggest,classname=org.apache.solr.spelling.suggest.Suggester,lookupImpl=org.apache.solr.spelling.suggest.jaspell.JaspellLookup,field=suggest,storeDir=suggest,buildOnCommit=true,threshold=0.0}
[junit4:junit4]   2> 298 T1718 oashc.SpellCheckComponent.inform Registering newSearcher listener for spellchecker: suggest
[junit4:junit4]   2> 300 T1718 oashc.SpellCheckComponent.inform No queryConverter defined, using default converter
[junit4:junit4]   2> 301 T1718 oashc.SpellCheckComponent.inform Initializing spell checkers
[junit4:junit4]   2> 301 T1718 oasss.Suggester.init init: {name=suggest_tst,classname=org.apache.solr.spelling.suggest.Suggester,lookupImpl=org.apache.solr.spelling.suggest.tst.TSTLookup,field=suggest,storeDir=suggest_tst,buildOnCommit=true,threshold=0.0}
[junit4:junit4]   2> 304 T1718 oashc.SpellCheckComponent.inform Registering newSearcher listener for spellchecker: suggest_tst
[junit4:junit4]   2> 305 T1718 oashc.SpellCheckComponent.inform No queryConverter defined, using default converter
[junit4:junit4]   2> 305 T1718 oashc.SpellCheckComponent.inform Initializing spell checkers
[junit4:junit4]   2> 306 T1718 oasss.Suggester.init init: {name=suggest_fst,classname=org.apache.solr.spelling.suggest.Suggester,lookupImpl=org.apache.solr.spelling.suggest.fst.FSTLookup,field=suggest,storeDir=suggest_fst,buildOnCommit=true,weightBuckets=5,exactMatchFirst=true}
[junit4:junit4]   2> 308 T1718 oashc.SpellCheckComponent.inform Registering newSearcher listener for spellchecker: suggest_fst
[junit4:junit4]   2> 309 T1718 oashc.SpellCheckComponent.inform No queryConverter defined, using default converter
[junit4:junit4]   2> 310 T1718 oashc.SpellCheckComponent.inform Initializing spell checkers
[junit4:junit4]   2> 310 T1718 oasss.Suggester.init init: {name=suggest_wfst,classname=org.apache.solr.spelling.suggest.Suggester,lookupImpl=org.apache.solr.spelling.suggest.fst.WFSTLookupFactory,field=suggest,storeDir=suggest_wfst,buildOnCommit=true,exactMatchFirst=true}
[junit4:junit4]   2> 311 T1718 oashc.SpellCheckComponent.inform Registering newSearcher listener for spellchecker: suggest_wfst
[junit4:junit4]   2> 311 T1718 oashc.SpellCheckComponent.inform No queryConverter defined, using default converter
[junit4:junit4]   2> 313 T1718 oashc.HttpShardHandlerFactory.getParameter Setting socketTimeout to: 0
[junit4:junit4]   2> 313 T1718 oashc.HttpShardHandlerFactory.getParameter Setting urlScheme to: http://
[junit4:junit4]   2> 313 T1718 oashc.HttpShardHandlerFactory.getParameter Setting connTimeout to: 0
[junit4:junit4]   2> 313 T1718 oashc.HttpShardHandlerFactory.getParameter Setting maxConnectionsPerHost to: 20
[junit4:junit4]   2> 314 T1718 oashc.HttpShardHandlerFactory.getParameter Setting corePoolSize to: 0
[junit4:junit4]   2> 314 T1718 oashc.HttpShardHandlerFactory.getParameter Setting maximumPoolSize to: 2147483647
[junit4:junit4]   2> 314 T1718 oashc.HttpShardHandlerFactory.getParameter Setting maxThreadIdleTime to: 5
[junit4:junit4]   2> 314 T1718 oashc.HttpShardHandlerFactory.getParameter Setting sizeOfQueue to: -1
[junit4:junit4]   2> 315 T1718 oashc.HttpShardHandlerFactory.getParameter Setting fairnessPolicy to: false
[junit4:junit4]   2> 315 T1718 oascsi.HttpClientUtil.createClient Creating new http client, config:maxConnectionsPerHost=20&maxConnections=10000&socketTimeout=0&connTimeout=0&retry=false
[junit4:junit4]   2> 325 T1718 oasc.CoreContainer.registerCore registering core: collection1
[junit4:junit4]   2> 335 T1718 oas.SolrTestCaseJ4.initCore ####initCore end
[junit4:junit4]   2> 342 T1718 oas.SolrTestCaseJ4.setUp ###Starting testAnalyzer
[junit4:junit4]   2> 343 T1718 oasss.Suggester.init init: {lookupImpl=org.apache.solr.spelling.suggest.tst.TSTLookupFactory}
[junit4:junit4]   2> 343 T1718 oas.SolrTestCaseJ4.tearDown ###Ending testAnalyzer
[junit4:junit4]   2> 347 T1718 oas.SolrTestCaseJ4.setUp ###Starting testRebuild
[junit4:junit4]   2> ASYNC  NEW_CORE C117 name=collection1 org.apache.solr.core.SolrCore@91cdda
[junit4:junit4]   2> 358 T1718 C117 oasc.CachingDirectoryFactory.close Releasing directory:C:\Users\JenkinsSlave\workspace\Lucene-Solr-trunk-Windows\solr\build\solr-core\test\J0\.\solrtest-SuggesterTSTTest-1351618641237
[junit4:junit4]   2> 363 T1718 C117 oasc.SolrDeletionPolicy.onInit SolrDeletionPolicy.onInit: commits:num=1
[junit4:junit4]   2> 		commit{dir=MockDirWrapper(org.apache.lucene.store.SimpleFSDirectory@C:\Users\JenkinsSlave\workspace\Lucene-Solr-trunk-Windows\solr\build\solr-core\test\J0\solrtest-SuggesterTSTTest-1351618641237\index lockFactory=org.apache.lucene.store.NativeFSLockFactory@3da946),segFN=segments_1,generation=1,filenames=[segments_1]
[junit4:junit4]   2> 366 T1718 C117 oasc.SolrDeletionPolicy.updateCommits newest commit = 1[segments_1]
[junit4:junit4]   2> 369 T1718 C117 UPDATE [collection1] webapp=null path=null params={} {add=[1]} 0 12
[junit4:junit4]   2> 387 T1718 C117 UPDATE [collection1] webapp=null path=null params={} {add=[2]} 0 1
[junit4:junit4]   2> 395 T1718 C117 UPDATE [collection1] webapp=null path=null params={} {add=[3]} 0 2
[junit4:junit4]   2> 402 T1718 C117 oasu.DirectUpdateHandler2.commit start commit{flags=0,_version_=0,optimize=false,openSearcher=true,waitSearcher=true,expungeDeletes=false,softCommit=false}
[junit4:junit4]   2> 419 T1718 C117 oasc.SolrDeletionPolicy.onCommit SolrDeletionPolicy.onCommit: commits:num=2
[junit4:junit4]   2> 		commit{dir=MockDirWrapper(org.apache.lucene.store.SimpleFSDirectory@C:\Users\JenkinsSlave\workspace\Lucene-Solr-trunk-Windows\solr\build\solr-core\test\J0\solrtest-SuggesterTSTTest-1351618641237\index lockFactory=org.apache.lucene.store.NativeFSLockFactory@3da946),segFN=segments_1,generation=1,filenames=[segments_1]
[junit4:junit4]   2> 		commit{dir=MockDirWrapper(org.apache.lucene.store.SimpleFSDirectory@C:\Users\JenkinsSlave\workspace\Lucene-Solr-trunk-Windows\solr\build\solr-core\test\J0\solrtest-SuggesterTSTTest-1351618641237\index lockFactory=org.apache.lucene.store.NativeFSLockFactory@3da946),segFN=segments_2,generation=2,filenames=[_0_Lucene41WithOrds_0.tib, _0_NestedPulsing_0.doc, _0.fnm, _0_Lucene41WithOrds_0.doc, _0_Lucene41WithOrds_0.tii, _0_Lucene41WithOrds_0.pos, _0_nrm.cfs, _0_NestedPulsing_0.tip, _0_NestedPulsing_0.tim, _0_NestedPulsing_0.pos, _0_MockRandom_0.sd, _0_MockRandom_0.tip, _0_MockRandom_0.doc, _0_MockRandom_0.pos, _0_nrm.cfe, segments_2, _0.fdx, _0.si, _0_MockRandom_0.tim, _0.fdt]
[junit4:junit4]   2> 420 T1718 C117 oasc.SolrDeletionPolicy.updateCommits newest commit = 2[_0_Lucene41WithOrds_0.tib, _0_NestedPulsing_0.doc, _0.fnm, _0_Lucene41WithOrds_0.doc, _0_Lucene41WithOrds_0.tii, _0_Lucene41WithOrds_0.pos, _0_nrm.cfs, _0_NestedPulsing_0.tip, _0_NestedPulsing_0.tim, _0_NestedPulsing_0.pos, _0_MockRandom_0.sd, _0_MockRandom_0.tip, _0_MockRandom_0.doc, _0_MockRandom_0.pos, _0_nrm.cfe, segments_2, _0.fdx, _0.si, _0_MockRandom_0.tim, _0.fdt]
[junit4:junit4]   2> 420 T1718 C117 oasc.SolrCore.getSearcher WARNING [collection1] PERFORMANCE WARNING: Overlapping onDeckSearchers=2
[junit4:junit4]   2> 422 T1718 C117 oasc.CachingDirectoryFactory.close Releasing directory:C:\Users\JenkinsSlave\workspace\Lucene-Solr-trunk-Windows\solr\build\solr-core\test\J0\.\solrtest-SuggesterTSTTest-1351618641237
[junit4:junit4]   2> 440 T1718 C117 oass.SolrIndexSearcher.<init> Opening Searcher@1ef53c5 main
[junit4:junit4]   2> 440 T1718 C117 oasu.DirectUpdateHandler2.commit end_commit_flush
[junit4:junit4]   2> 442 T1719 oasc.SolrCore.registerSearcher [collection1] Registered new searcher Searcher@1ea2f96 main{StandardDirectoryReader(segments_1:1)}
[junit4:junit4]   2> 442 T1719 oashc.SpellCheckComponent$SpellCheckerListener.newSearcher Loading spell index for spellchecker: suggest
[junit4:junit4]   2> 442 T1719 oasss.Suggester.reload reload()
[junit4:junit4]   2> 443 T1719 oashc.SpellCheckComponent$SpellCheckerListener.newSearcher SEVERE Exception in reloading spell check index for spellchecker: suggest java.io.FileNotFoundException: C:\Users\JenkinsSlave\workspace\Lucene-Solr-trunk-Windows\solr\build\solr-core\test\J0\.\solrtest-SuggesterTSTTest-1351618641237\suggest\jaspell.dat (The system cannot find the file specified)
[junit4:junit4]   2> 	at java.io.FileInputStream.open(Native Method)
[junit4:junit4]   2> 	at java.io.FileInputStream.<init>(FileInputStream.java:120)
[junit4:junit4]   2> 	at org.apache.solr.spelling.suggest.Suggester.reload(Suggester.java:162)
[junit4:junit4]   2> 	at org.apache.solr.handler.component.SpellCheckComponent$SpellCheckerListener.newSearcher(SpellCheckComponent.java:673)
[junit4:junit4]   2> 	at org.apache.solr.core.SolrCore$6.call(SolrCore.java:1610)
[junit4:junit4]   2> 	at java.util.concurrent.FutureTask$Sync.innerRun(FutureTask.java:303)
[junit4:junit4]   2> 	at java.util.concurrent.FutureTask.run(FutureTask.java:138)
[junit4:junit4]   2> 	at java.util.concurrent.ThreadPoolExecutor$Worker.runTask(ThreadPoolExecutor.java:886)
[junit4:junit4]   2> 	at java.util.concurrent.ThreadPoolExecutor$Worker.run(ThreadPoolExecutor.java:908)
[junit4:junit4]   2> 	at java.lang.Thread.run(Thread.java:662)
[junit4:junit4]   2> 
[junit4:junit4]   2> 443 T1719 oashc.SpellCheckComponent$SpellCheckerListener.newSearcher Loading spell index for spellchecker: suggest_tst
[junit4:junit4]   2> 443 T1719 oasss.Suggester.reload reload()
[junit4:junit4]   2> 445 T1719 oashc.SpellCheckComponent$SpellCheckerListener.newSearcher SEVERE Exception in reloading spell check index for spellchecker: suggest_tst java.io.FileNotFoundException: C:\Users\JenkinsSlave\workspace\Lucene-Solr-trunk-Windows\solr\build\solr-core\test\J0\.\solrtest-SuggesterTSTTest-1351618641237\suggest_tst\tst.dat (The system cannot find the file specified)
[junit4:junit4]   2> 	at java.io.FileInputStream.open(Native Method)
[junit4:junit4]   2> 	at java.io.FileInputStream.<init>(FileInputStream.java:120)
[junit4:junit4]   2> 	at org.apache.solr.spelling.suggest.Suggester.reload(Suggester.java:162)
[junit4:junit4]   2> 	at org.apache.solr.handler.component.SpellCheckComponent$SpellCheckerListener.newSearcher(SpellCheckComponent.java:673)
[junit4:junit4]   2> 	at org.apache.solr.core.SolrCore$6.call(SolrCore.java:1610)
[junit4:junit4]   2> 	at java.util.concurrent.FutureTask$Sync.innerRun(FutureTask.java:303)
[junit4:junit4]   2> 	at java.util.concurrent.FutureTask.run(FutureTask.java:138)
[junit4:junit4]   2> 	at java.util.concurrent.ThreadPoolExecutor$Worker.runTask(ThreadPoolExecutor.java:886)
[junit4:junit4]   2> 	at java.util.concurrent.ThreadPoolExecutor$Worker.run(ThreadPoolExecutor.java:908)
[junit4:junit4]   2> 	at java.lang.Thread.run(Thread.java:662)
[junit4:junit4]   2> 
[junit4:junit4]   2> 445 T1719 oashc.SpellCheckComponent$SpellCheckerListener.newSearcher Loading spell index for spellchecker: suggest_fst
[junit4:junit4]   2> 445 T1719 oasss.Suggester.reload reload()
[junit4:junit4]   2> 446 T1719 oashc.SpellCheckComponent$SpellCheckerListener.newSearcher SEVERE Exception in reloading spell check index for spellchecker: suggest_fst java.io.FileNotFoundException: C:\Users\JenkinsSlave\workspace\Lucene-Solr-trunk-Windows\solr\build\solr-core\test\J0\.\solrtest-SuggesterTSTTest-1351618641237\suggest_fst\fst.bin (The system cannot find the file specified)
[junit4:junit4]   2> 	at java.io.FileInputStream.open(Native Method)
[junit4:junit4]   2> 	at java.io.FileInputStream.<init>(FileInputStream.java:120)
[junit4:junit4]   2> 	at org.apache.solr.spelling.suggest.Suggester.reload(Suggester.java:162)
[junit4:junit4]   2> 	at org.apache.solr.handler.component.SpellCheckComponent$SpellCheckerListener.newSearcher(SpellCheckComponent.java:673)
[junit4:junit4]   2> 	at org.apache.solr.core.SolrCore$6.call(SolrCore.java:1610)
[junit4:junit4]   2> 	at java.util.concurrent.FutureTask$Sync.innerRun(FutureTask.java:303)
[junit4:junit4]   2> 	at java.util.concurrent.FutureTask.run(FutureTask.java:138)
[junit4:junit4]   2> 	at java.util.concurrent.ThreadPoolExecutor$Worker.runTask(ThreadPoolExecutor.java:886)
[junit4:junit4]   2> 	at java.util.concurrent.ThreadPoolExecutor$Worker.run(ThreadPoolExecutor.java:908)
[junit4:junit4]   2> 	at java.lang.Thread.run(Thread.java:662)
[junit4:junit4]   2> 
[junit4:junit4]   2> 446 T1719 oashc.SpellCheckComponent$SpellCheckerListener.newSearcher Loading spell index for spellchecker: suggest_wfst
[junit4:junit4]   2> 446 T1719 oasss.Suggester.reload reload()
[junit4:junit4]   2> 447 T1719 oashc.SpellCheckComponent$SpellCheckerListener.newSearcher SEVERE Exception in reloading spell check index for spellchecker: suggest_wfst java.io.FileNotFoundException: C:\Users\JenkinsSlave\workspace\Lucene-Solr-trunk-Windows\solr\build\solr-core\test\J0\.\solrtest-SuggesterTSTTest-1351618641237\suggest_wfst\wfst.bin (The system cannot find the file specified)
[junit4:junit4]   2> 	at java.io.FileInputStream.open(Native Method)
[junit4:junit4]   2> 	at java.io.FileInputStream.<init>(FileInputStream.java:120)
[junit4:junit4]   2> 	at org.apache.solr.spelling.suggest.Suggester.reload(Suggester.java:162)
[junit4:junit4]   2> 	at org.apache.solr.handler.component.SpellCheckComponent$SpellCheckerListener.newSearcher(SpellCheckComponent.java:673)
[junit4:junit4]   2> 	at org.apache.solr.core.SolrCore$6.call(SolrCore.java:1610)
[junit4:junit4]   2> 	at java.util.concurrent.FutureTask$Sync.innerRun(FutureTask.java:303)
[junit4:junit4]   2> 	at java.util.concurrent.FutureTask.run(FutureTask.java:138)
[junit4:junit4]   2> 	at java.util.concurrent.ThreadPoolExecutor$Worker.runTask(ThreadPoolExecutor.java:886)
[junit4:junit4]   2> 	at java.util.concurrent.ThreadPoolExecutor$Worker.run(ThreadPoolExecutor.java:908)
[junit4:junit4]   2> 	at java.lang.Thread.run(Thread.java:662)
[junit4:junit4]   2> 
[junit4:junit4]   2> 448 T1719 oasc.CachingDirectoryFactory.close Releasing directory:C:\Users\JenkinsSlave\workspace\Lucene-Solr-trunk-Windows\solr\build\solr-core\test\J0\.\solrtest-SuggesterTSTTest-1351618641237\index
[junit4:junit4]   2> 448 T1719 oasc.SolrCore.registerSearcher [collection1] Registered new searcher Searcher@1ef53c5 main{StandardDirectoryReader(segments_2:3 _0(5.0):C3)}
[junit4:junit4]   2> 448 T1718 C117 UPDATE [collection1] webapp=null path=null params={} {commit=} 0 46
[junit4:junit4]   2> 455 T1718 C117 REQ [collection1] webapp=null path=null params={q=ac&spellcheck.count=2&qt=/suggest_tst&spellcheck.onlyMorePopular=true} status=0 QTime=0 
[junit4:junit4]   2> 458 T1718 oas.SolrTestCaseJ4.assertQ SEVERE REQUEST FAILED: xpath=//lst[@name='spellcheck']/lst[@name='suggestions']/lst[@name='ac']/int[@name='numFound'][.='2']
[junit4:junit4]   2> 		xml response was: <?xml version="1.0" encoding="UTF-8"?>
[junit4:junit4]   2> 	<response>
[junit4:junit4]   2> 	<lst name="responseHeader"><int name="status">0</int><int name="QTime">0</int></lst><lst name="spellcheck"><lst name="suggestions"/></lst>
[junit4:junit4]   2> 	</response>
[junit4:junit4]   2> 	
[junit4:junit4]   2> 		request was:q=ac&spellcheck.count=2&qt=/suggest_tst&spellcheck.onlyMorePopular=true
[junit4:junit4]   2> 460 T1718 oasc.SolrException.log SEVERE REQUEST FAILED: q=ac&spellcheck.count=2&qt=/suggest_tst&spellcheck.onlyMorePopular=true:java.lang.RuntimeException: REQUEST FAILED: xpath=//lst[@name='spellcheck']/lst[@name='suggestions']/lst[@name='ac']/int[@name='numFound'][.='2']
[junit4:junit4]   2> 		xml response was: <?xml version="1.0" encoding="UTF-8"?>
[junit4:junit4]   2> 	<response>
[junit4:junit4]   2> 	<lst name="responseHeader"><int name="status">0</int><int name="QTime">0</int></lst><lst name="spellcheck"><lst name="suggestions"/></lst>
[junit4:junit4]   2> 	</response>
[junit4:junit4]   2> 	
[junit4:junit4]   2> 		request was:q=ac&spellcheck.count=2&qt=/suggest_tst&spellcheck.onlyMorePopular=true
[junit4:junit4]   2> 		at org.apache.solr.SolrTestCaseJ4.assertQ(SolrTestCaseJ4.java:508)
[junit4:junit4]   2> 		at org.apache.solr.SolrTestCaseJ4.assertQ(SolrTestCaseJ4.java:482)
[junit4:junit4]   2> 		at org.apache.solr.spelling.suggest.SuggesterTest.testRebuild(SuggesterTest.java:105)
[junit4:junit4]   2> 		at sun.reflect.NativeMethodAccessorImpl.invoke0(Native Method)
[junit4:junit4]   2> 		at sun.reflect.NativeMethodAccessorImpl.invoke(NativeMethodAccessorImpl.java:39)
[junit4:junit4]   2> 		at sun.reflect.DelegatingMethodAccessorImpl.invoke(DelegatingMethodAccessorImpl.java:25)
[junit4:junit4]   2> 		at java.lang.reflect.Method.invoke(Method.java:597)
[junit4:junit4]   2> 		at com.carrotsearch.randomizedtesting.RandomizedRunner.invoke(RandomizedRunner.java:1559)
[junit4:junit4]   2> 		at com.carrotsearch.randomizedtesting.RandomizedRunner.access$600(RandomizedRunner.java:79)
[junit4:junit4]   2> 		at com.carrotsearch.randomizedtesting.RandomizedRunner$6.evaluate(RandomizedRunner.java:737)
[junit4:junit4]   2> 		at com.carrotsearch.randomizedtesting.RandomizedRunner$7.evaluate(RandomizedRunner.java:773)
[junit4:junit4]   2> 		at com.carrotsearch.randomizedtesting.RandomizedRunner$8.evaluate(RandomizedRunner.java:787)
[junit4:junit4]   2> 		at com.carrotsearch.randomizedtesting.rules.SystemPropertiesRestoreRule$1.evaluate(SystemPropertiesRestoreRule.java:53)
[junit4:junit4]   2> 		at org.apache.lucene.util.TestRuleSetupTeardownChained$1.evaluate(TestRuleSetupTeardownChained.java:50)
[junit4:junit4]   2> 		at org.apache.lucene.util.TestRuleFieldCacheSanity$1.evaluate(TestRuleFieldCacheSanity.java:51)
[junit4:junit4]   2> 		at org.apache.lucene.util.AbstractBeforeAfterRule$1.evaluate(AbstractBeforeAfterRule.java:45)
[junit4:junit4]   2> 		at com.carrotsearch.randomizedtesting.rules.SystemPropertiesInvariantRule$1.evaluate(SystemPropertiesInvariantRule.java:55)
[junit4:junit4]   2> 		at org.apache.lucene.util.TestRuleThreadAndTestName$1.evaluate(TestRuleThreadAndTestName.java:48)
[junit4:junit4]   2> 		at org.apache.lucene.util.TestRuleIgnoreAfterMaxFailures$1.evaluate(TestRuleIgnoreAfterMaxFailures.java:70)
[junit4:junit4]   2> 		at org.apache.lucene.util.TestRuleMarkFailure$1.evaluate(TestRuleMarkFailure.java:48)
[junit4:junit4]   2> 		at com.carrotsearch.randomizedtesting.rules.StatementAdapter.evaluate(StatementAdapter.java:36)
[junit4:junit4]   2> 		at com.carrotsearch.randomizedtesting.ThreadLeakControl$StatementRunner.run(ThreadLeakControl.java:358)
[junit4:junit4]   2> 		at com.carrotsearch.randomizedtesting.ThreadLeakControl.forkTimeoutingTask(ThreadLeakControl.java:782)
[junit4:junit4]   2> 		at com.carrotsearch.randomizedtesting.ThreadLeakControl$3.evaluate(ThreadLeakControl.java:442)
[junit4:junit4]   2> 		at com.carrotsearch.randomizedtesting.RandomizedRunner.runSingleTest(RandomizedRunner.java:746)
[junit4:junit4]   2> 		at com.carrotsearch.randomizedtesting.RandomizedRunner$3.evaluate(RandomizedRunner.java:648)
[junit4:junit4]   2> 		at com.carrotsearch.randomizedtesting.RandomizedRunner$4.evaluate(RandomizedRunner.java:682)
[junit4:junit4]   2> 		at com.carrotsearch.randomizedtesting.RandomizedRunner$5.evaluate(RandomizedRunner.java:693)
[junit4:junit4]   2> 		at com.carrotsearch.randomizedtesting.rules.StatementAdapter.evaluate(StatementAdapter.java:36)
[junit4:junit4]   2> 		at com.carrotsearch.randomizedtesting.rules.SystemPropertiesRestoreRule$1.evaluate(SystemPropertiesRestoreRule.java:53)
[junit4:junit4]   2> 		at org.apache.lucene.util.AbstractBeforeAfterRule$1.evaluate(AbstractBeforeAfterRule.java:45)
[junit4:junit4]   2> 		at org.apache.lucene.util.TestRuleStoreClassName$1.evaluate(TestRuleStoreClassName.java:42)
[junit4:junit4]   2> 		at com.carrotsearch.randomizedtesting.rules.SystemPropertiesInvariantRule$1.evaluate(SystemPropertiesInvariantRule.java:55)
[junit4:junit4]   2> 		at com.carrotsearch.randomizedtesting.rules.NoShadowingOrOverridesOnMethodsRule$1.evaluate(NoShadowingOrOverridesOnMethodsRule.java:39)
[junit4:junit4]   2> 		at com.carrotsearch.randomizedtesting.rules.NoShadowingOrOverridesOnMethodsRule$1.evaluate(NoShadowingOrOverridesOnMethodsRule.java:39)
[junit4:junit4]   2> 		at com.carrotsearch.randomizedtesting.rules.StatementAdapter.evaluate(StatementAdapter.java:36)
[junit4:junit4]   2> 		at org.apache.lucene.util.TestRuleAssertionsRequired$1.evaluate(TestRuleAssertionsRequired.java:43)
[junit4:junit4]   2> 		at org.apache.lucene.util.TestRuleMarkFailure$1.evaluate(TestRuleMarkFailure.java:48)
[junit4:junit4]   2> 		at org.apache.lucene.util.TestRuleIgnoreAfterMaxFailures$1.evaluate(TestRuleIgnoreAfterMaxFailures.java:70)
[junit4:junit4]   2> 		at org.apache.lucene.util.TestRuleIgnoreTestSuites$1.evaluate(TestRuleIgnoreTestSuites.java:55)
[junit4:junit4]   2> 		at com.carrotsearch.randomizedtesting.rules.StatementAdapter.evaluate(StatementAdapter.java:36)
[junit4:junit4]   2> 		at com.carrotsearch.randomizedtesting.ThreadLeakControl$StatementRunner.run(ThreadLeakControl.java:358)
[junit4:junit4]   2> 		at java.lang.Thread.run(Thread.java:662)
[junit4:junit4]   2> 	
[junit4:junit4]   2> 462 T1718 oas.SolrTestCaseJ4.tearDown ###Ending testRebuild
[junit4:junit4]   2> NOTE: reproduce with: ant test  -Dtestcase=SuggesterTSTTest -Dtests.method=testRebuild -Dtests.seed=C74E3F67F0A25500 -Dtests.slow=true -Dtests.locale=lv -Dtests.timezone=Asia/Yekaterinburg -Dtests.file.encoding=US-ASCII
[junit4:junit4] ERROR   0.14s | SuggesterTSTTest.testRebuild <<<
[junit4:junit4]    > Throwable #1: java.lang.RuntimeException: Exception during query
[junit4:junit4]    > 	at __randomizedtesting.SeedInfo.seed([C74E3F67F0A25500:9C6B9D24C4A22F9A]:0)
[junit4:junit4]    > 	at org.apache.solr.SolrTestCaseJ4.assertQ(SolrTestCaseJ4.java:515)
[junit4:junit4]    > 	at org.apache.solr.SolrTestCaseJ4.assertQ(SolrTestCaseJ4.java:482)
[junit4:junit4]    > 	at org.apache.solr.spelling.suggest.SuggesterTest.testRebuild(SuggesterTest.java:105)
[junit4:junit4]    > 	at sun.reflect.NativeMethodAccessorImpl.invoke0(Native Method)
[junit4:junit4]    > 	at sun.reflect.NativeMethodAccessorImpl.invoke(NativeMethodAccessorImpl.java:39)
[junit4:junit4]    > 	at sun.reflect.DelegatingMethodAccessorImpl.invoke(DelegatingMethodAccessorImpl.java:25)
[junit4:junit4]    > 	at java.lang.reflect.Method.invoke(Method.java:597)
[junit4:junit4]    > 	at com.carrotsearch.randomizedtesting.RandomizedRunner.invoke(RandomizedRunner.java:1559)
[junit4:junit4]    > 	at com.carrotsearch.randomizedtesting.RandomizedRunner.access$600(RandomizedRunner.java:79)
[junit4:junit4]    > 	at com.carrotsearch.randomizedtesting.RandomizedRunner$6.evaluate(RandomizedRunner.java:737)
[junit4:junit4]    > 	at com.carrotsearch.randomizedtesting.RandomizedRunner$7.evaluate(RandomizedRunner.java:773)
[junit4:junit4]    > 	at com.carrotsearch.randomizedtesting.RandomizedRunner$8.evaluate(RandomizedRunner.java:787)
[junit4:junit4]    > 	at com.carrotsearch.randomizedtesting.rules.SystemPropertiesRestoreRule$1.evaluate(SystemPropertiesRestoreRule.java:53)
[junit4:junit4]    > 	at org.apache.lucene.util.TestRuleSetupTeardownChained$1.evaluate(TestRuleSetupTeardownChained.java:50)
[junit4:junit4]    > 	at org.apache.lucene.util.TestRuleFieldCacheSanity$1.evaluate(TestRuleFieldCacheSanity.java:51)
[junit4:junit4]    > 	at org.apache.lucene.util.AbstractBeforeAfterRule$1.evaluate(AbstractBeforeAfterRule.java:45)
[junit4:junit4]    > 	at com.carrotsearch.randomizedtesting.rules.SystemPropertiesInvariantRule$1.evaluate(SystemPropertiesInvariantRule.java:55)
[junit4:junit4]    > 	at org.apache.lucene.util.TestRuleThreadAndTestName$1.evaluate(TestRuleThreadAndTestName.java:48)
[junit4:junit4]    > 	at org.apache.lucene.util.TestRuleIgnoreAfterMaxFailures$1.evaluate(TestRuleIgnoreAfterMaxFailures.java:70)
[junit4:junit4]    > 	at org.apache.lucene.util.TestRuleMarkFailure$1.evaluate(TestRuleMarkFailure.java:48)
[junit4:junit4]    > 	at com.carrotsearch.randomizedtesting.rules.StatementAdapter.evaluate(StatementAdapter.java:36)
[junit4:junit4]    > 	at com.carrotsearch.randomizedtesting.ThreadLeakControl$StatementRunner.run(ThreadLeakControl.java:358)
[junit4:junit4]    > 	at com.carrotsearch.randomizedtesting.ThreadLeakControl.forkTimeoutingTask(ThreadLeakControl.java:782)
[junit4:junit4]    > 	at com.carrotsearch.randomizedtesting.ThreadLeakControl$3.evaluate(ThreadLeakControl.java:442)
[junit4:junit4]    > 	at com.carrotsearch.randomizedtesting.RandomizedRunner.runSingleTest(RandomizedRunner.java:746)
[junit4:junit4]    > 	at com.carrotsearch.randomizedtesting.RandomizedRunner$3.evaluate(RandomizedRunner.java:648)
[junit4:junit4]    > 	at com.carrotsearch.randomizedtesting.RandomizedRunner$4.evaluate(RandomizedRunner.java:682)
[junit4:junit4]    > 	at com.carrotsearch.randomizedtesting.RandomizedRunner$5.evaluate(RandomizedRunner.java:693)
[junit4:junit4]    > 	at com.carrotsearch.randomizedtesting.rules.StatementAdapter.evaluate(StatementAdapter.java:36)
[junit4:junit4]    > 	at com.carrotsearch.randomizedtesting.rules.SystemPropertiesRestoreRule$1.evaluate(SystemPropertiesRestoreRule.java:53)
[junit4:junit4]    > 	at org.apache.lucene.util.AbstractBeforeAfterRule$1.evaluate(AbstractBeforeAfterRule.java:45)
[junit4:junit4]    > 	at org.apache.lucene.util.TestRuleStoreClassName$1.evaluate(TestRuleStoreClassName.java:42)
[junit4:junit4]    > 	at com.carrotsearch.randomizedtesting.rules.SystemPropertiesInvariantRule$1.evaluate(SystemPropertiesInvariantRule.java:55)
[junit4:junit4]    > 	at com.carrotsearch.randomizedtesting.rules.NoShadowingOrOverridesOnMethodsRule$1.evaluate(NoShadowingOrOverridesOnMethodsRule.java:39)
[junit4:junit4]    > 	at com.carrotsearch.randomizedtesting.rules.NoShadowingOrOverridesOnMethodsRule$1.evaluate(NoShadowingOrOverridesOnMethodsRule.java:39)
[junit4:junit4]    > 	at com.carrotsearch.randomizedtesting.rules.StatementAdapter.evaluate(StatementAdapter.java:36)
[junit4:junit4]    > 	at org.apache.lucene.util.TestRuleAssertionsRequired$1.evaluate(TestRuleAssertionsRequired.java:43)
[junit4:junit4]    > 	at org.apache.lucene.util.TestRuleMarkFailure$1.evaluate(TestRuleMarkFailure.java:48)
[junit4:junit4]    > 	at org.apache.lucene.util.TestRuleIgnoreAfterMaxFailures$1.evaluate(TestRuleIgnoreAfterMaxFailures.java:70)
[junit4:junit4]    > 	at org.apache.lucene.util.TestRuleIgnoreTestSuites$1.evaluate(TestRuleIgnoreTestSuites.java:55)
[junit4:junit4]    > 	at com.carrotsearch.randomizedtesting.rules.StatementAdapter.evaluate(StatementAdapter.java:36)
[junit4:junit4]    > 	at com.carrotsearch.randomizedtesting.ThreadLeakControl$StatementRunner.run(ThreadLeakControl.java:358)
[junit4:junit4]    > 	at java.lang.Thread.run(Thread.java:662)
[junit4:junit4]    > Caused by: java.lang.RuntimeException: REQUEST FAILED: xpath=//lst[@name='spellcheck']/lst[@name='suggestions']/lst[@name='ac']/int[@name='numFound'][.='2']
[junit4:junit4]    > 	xml response was: <?xml version="1.0" encoding="UTF-8"?>
[junit4:junit4]    > <response>
[junit4:junit4]    > <lst name="responseHeader"><int name="status">0</int><int name="QTime">0</int></lst><lst name="spellcheck"><lst name="suggestions"/></lst>
[junit4:junit4]    > </response>
[junit4:junit4]    > 
[junit4:junit4]    > 	request was:q=ac&spellcheck.count=2&qt=/suggest_tst&spellcheck.onlyMorePopular=true
[junit4:junit4]    > 	at org.apache.solr.SolrTestCaseJ4.assertQ(SolrTestCaseJ4.java:508)
[junit4:junit4]    > 	... 42 more
[junit4:junit4]   2> 484 T1718 oas.SolrTestCaseJ4.setUp ###Starting testSuggestions
[junit4:junit4]   2> 490 T1718 C117 UPDATE [collection1] webapp=null path=null params={} {add=[1]} 0 2
[junit4:junit4]   2> 498 T1718 C117 UPDATE [collection1] webapp=null path=null params={} {add=[2]} 0 0
[junit4:junit4]   2> 518 T1718 C117 UPDATE [collection1] webapp=null path=null params={} {add=[3]} 0 1
[junit4:junit4]   2> 525 T1718 C117 oasu.DirectUpdateHandler2.commit start commit{flags=0,_version_=0,optimize=false,openSearcher=true,waitSearcher=true,expungeDeletes=false,softCommit=false}
[junit4:junit4]   2> 593 T1718 C117 oasc.SolrDeletionPolicy.onCommit SolrDeletionPolicy.onCommit: commits:num=2
[junit4:junit4]   2> 		commit{dir=MockDirWrapper(org.apache.lucene.store.SimpleFSDirectory@C:\Users\JenkinsSlave\workspace\Lucene-Solr-trunk-Windows\solr\build\solr-core\test\J0\solrtest-SuggesterTSTTest-1351618641237\index lockFactory=org.apache.lucene.store.NativeFSLockFactory@3da946),segFN=segments_2,generation=2,filenames=[_0_Lucene41WithOrds_0.tib, _0_NestedPulsing_0.doc, _0.fnm, _0_Lucene41WithOrds_0.doc, _0_Lucene41WithOrds_0.tii, _0_Lucene41WithOrds_0.pos, _0_nrm.cfs, _0_NestedPulsing_0.tip, _0_NestedPulsing_0.tim, _0_NestedPulsing_0.pos, _0_MockRandom_0.sd, _0_MockRandom_0.tip, _0_MockRandom_0.doc, _0_MockRandom_0.pos, _0_nrm.cfe, segments_2, _0.fdx, _0.si, _0_MockRandom_0.tim, _0.fdt]
[junit4:junit4]   2> 		commit{dir=MockDirWrapper(org.apache.lucene.store.SimpleFSDirectory@C:\Users\JenkinsSlave\workspace\Lucene-Solr-trunk-Windows\solr\build\solr-core\test\J0\solrtest-SuggesterTSTTest-1351618641237\index lockFactory=org.apache.lucene.store.NativeFSLockFactory@3da946),segFN=segments_3,generation=3,filenames=[_1_NestedPulsing_0.tip, _1_nrm.cfs, _1_MockRandom_0.tip, _1_Lucene41WithOrds_0.doc, _1_NestedPulsing_0.pos, _1_Lucene41WithOrds_0.pos, _1_MockRandom_0.sd, _1_MockRandom_0.tim, _1_MockRandom_0.skp, _1.fnm, _1_MockRandom_0.pos, _1_nrm.cfe, _1_NestedPulsing_0.doc, _1.fdx, _1_MockRandom_0.pyl, _1.fdt, _1.si, _1_Lucene41WithOrds_0.tii, _1_Lucene41WithOrds_0.tib, _1_MockRandom_0.doc, _1_MockRandom_0.frq, _1_NestedPulsing_0.tim, segments_3]
[junit4:junit4]   2> 593 T1718 C117 oasc.SolrDeletionPolicy.updateCommits newest commit = 3[_1_NestedPulsing_0.tip, _1_nrm.cfs, _1_MockRandom_0.tip, _1_Lucene41WithOrds_0.doc, _1_NestedPulsing_0.pos, _1_Lucene41WithOrds_0.pos, _1_MockRandom_0.sd, _1_MockRandom_0.tim, _1_MockRandom_0.skp, _1.fnm, _1_MockRandom_0.pos, _1_nrm.cfe, _1_NestedPulsing_0.doc, _1.fdx, _1_MockRandom_0.pyl, _1.fdt, _1.si, _1_Lucene41WithOrds_0.tii, _1_Lucene41WithOrds_0.tib, _1_MockRandom_0.doc, _1_MockRandom_0.frq, _1_NestedPulsing_0.tim, segments_3]
[junit4:junit4]   2> 603 T1718 C117 oasc.CachingDirectoryFactory.close Releasing directory:C:\Users\JenkinsSlave\workspace\Lucene-Solr-trunk-Windows\solr\build\solr-core\test\J0\.\solrtest-SuggesterTSTTest-1351618641237
[junit4:junit4]   2> 625 T1718 C117 oass.SolrIndexSearcher.<init> Opening Searcher@1d3389 main
[junit4:junit4]   2> 627 T1718 C117 oasu.DirectUpdateHandler2.commit end_commit_flush
[junit4:junit4]   2> 628 T1719 oashc.SpellCheckComponent$SpellCheckerListener.buildSpellIndex Building spell index for spell checker: suggest
[junit4:junit4]   2> 628 T1719 oasss.Suggester.build build()
[junit4:junit4]   2> 632 T1719 oasss.Suggester.build Stored suggest data to: C:\Users\JenkinsSlave\workspace\Lucene-Solr-trunk-Windows\solr\build\solr-core\test\J0\.\solrtest-SuggesterTSTTest-1351618641237\suggest\jaspell.dat
[junit4:junit4]   2> 632 T1719 oashc.SpellCheckComponent$SpellCheckerListener.buildSpellIndex Building spell index for spell checker: suggest_tst
[junit4:junit4]   2> 632 T1719 oasss.Suggester.build build()
[junit4:junit4]   2> 648 T1719 oasss.Suggester.build Stored suggest data to: C:\Users\JenkinsSlave\workspace\Lucene-Solr-trunk-Windows\solr\build\solr-core\test\J0\.\solrtest-SuggesterTSTTest-1351618641237\suggest_tst\tst.dat
[junit4:junit4]   2> 649 T1719 oashc.SpellCheckComponent$SpellCheckerListener.buildSpellIndex Building spell index for spell checker: suggest_fst
[junit4:junit4]   2> 649 T1719 oasss.Suggester.build build()
[junit4:junit4]   2> 672 T1719 oasss.Suggester.build Stored suggest data to: C:\Users\JenkinsSlave\workspace\Lucene-Solr-trunk-Windows\solr\build\solr-core\test\J0\.\solrtest-SuggesterTSTTest-1351618641237\suggest_fst\fst.bin
[junit4:junit4]   2> 672 T1719 oashc.SpellCheckComponent$SpellCheckerListener.buildSpellIndex Building spell index for spell checker: suggest_wfst
[junit4:junit4]   2> 672 T1719 oasss.Suggester.build build()
[junit4:junit4]   2> 680 T1719 oasss.Suggester.build Stored suggest data to: C:\Users\JenkinsSlave\workspace\Lucene-Solr-trunk-Windows\solr\build\solr-core\test\J0\.\solrtest-SuggesterTSTTest-1351618641237\suggest_wfst\wfst.bin
[junit4:junit4]   2> 682 T1719 oasc.SolrCore.registerSearcher [collection1] Registered new searcher Searcher@1d3389 main{StandardDirectoryReader(segments_3:7 _1(5.0):C3)}
[junit4:junit4]   2> 682 T1719 oasc.CachingDirectoryFactory.close Releasing directory:C:\Users\JenkinsSlave\workspace\Lucene-Solr-trunk-Windows\solr\build\solr-core\test\J0\.\solrtest-SuggesterTSTTest-1351618641237\index
[junit4:junit4]   2> 682 T1718 C117 UPDATE [collection1] webapp=null path=null params={} {commit=} 0 157
[junit4:junit4]   2> 696 T1718 C117 REQ [collection1] webapp=null path=null params={q=ac&spellcheck.count=2&qt=/suggest_tst&spellcheck.onlyMorePopular=true} status=0 QTime=7 
[junit4:junit4]   2> 703 T1718 oas.SolrTestCaseJ4.tearDown ###Ending testSuggestions
[junit4:junit4]   2> 708 T1718 oas.SolrTestCaseJ4.setUp ###Starting testReload
[junit4:junit4]   2> 716 T1718 C117 UPDATE [collection1] webapp=null path=null params={} {add=[1]} 0 3
[junit4:junit4]   2> 723 T1718 C117 UPDATE [collection1] webapp=null path=null params={} {add=[2]} 0 0
[junit4:junit4]   2> 731 T1718 C117 UPDATE [collection1] webapp=null path=null params={} {add=[3]} 0 1
[junit4:junit4]   2> 739 T1718 C117 oasu.DirectUpdateHandler2.commit start commit{flags=0,_version_=0,optimize=false,openSearcher=true,waitSearcher=true,expungeDeletes=false,softCommit=false}
[junit4:junit4]   2> 780 T1718 C117 oasc.SolrDeletionPolicy.onCommit SolrDeletionPolicy.onCommit: commits:num=2
[junit4:junit4]   2> 		commit{dir=MockDirWrapper(org.apache.lucene.store.SimpleFSDirectory@C:\Users\JenkinsSlave\workspace\Lucene-Solr-trunk-Windows\solr\build\solr-core\test\J0\solrtest-SuggesterTSTTest-1351618641237\index lockFactory=org.apache.lucene.store.NativeFSLockFactory@3da946),segFN=segments_3,generation=3,filenames=[_1_NestedPulsing_0.tip, _1_nrm.cfs, _1_MockRandom_0.tip, _1_Lucene41WithOrds_0.doc, _1_NestedPulsing_0.pos, _1_Lucene41WithOrds_0.pos, _1_MockRandom_0.sd, _1_MockRandom_0.tim, _1_MockRandom_0.skp, _1.fnm, _1_MockRandom_0.pos, _1_nrm.cfe, _1_NestedPulsing_0.doc, _1.fdx, _1_MockRandom_0.pyl, _1.fdt, _1.si, _1_Lucene41WithOrds_0.tii, _1_Lucene41WithOrds_0.tib, _1_MockRandom_0.doc, _1_MockRandom_0.frq, _1_NestedPulsing_0.tim, segments_3]
[junit4:junit4]   2> 		commit{dir=MockDirWrapper(org.apache.lucene.store.SimpleFSDirectory@C:\Users\JenkinsSlave\workspace\Lucene-Solr-trunk-Windows\solr\build\solr-core\test\J0\solrtest-SuggesterTSTTest-1351618641237\index lockFactory=org.apache.lucene.store.NativeFSLockFactory@3da946),segFN=segments_4,generation=4,filenames=[_2_NestedPulsing_0.tim, _2_Lucene41WithOrds_0.doc, _2.si, _2_Lucene41WithOrds_0.tii, _2_MockRandom_0.tii, _2.fdt, _2_Lucene41WithOrds_0.tib, _2.fdx, _2.fnm, _2_MockRandom_0.sd, _2_nrm.cfe, _2_Lucene41WithOrds_0.pos, _2_NestedPulsing_0.pos, _2_MockRandom_0.tib, _2_MockRandom_0.pos, _2_nrm.cfs, _2_MockRandom_0.doc, _2_NestedPulsing_0.tip, _2_NestedPulsing_0.doc, segments_4]
[junit4:junit4]   2> 781 T1718 C117 oasc.SolrDeletionPolicy.updateCommits newest commit = 4[_2_NestedPulsing_0.tim, _2_Lucene41WithOrds_0.doc, _2.si, _2_Lucene41WithOrds_0.tii, _2_MockRandom_0.tii, _2.fdt, _2_Lucene41WithOrds_0.tib, _2.fdx, _2.fnm, _2_MockRandom_0.sd, _2_nrm.cfe, _2_Lucene41WithOrds_0.pos, _2_NestedPulsing_0.pos, _2_MockRandom_0.tib, _2_MockRandom_0.pos, _2_nrm.cfs, _2_MockRandom_0.doc, _2_NestedPulsing_0.tip, _2_NestedPulsing_0.doc, segments_4]
[junit4:junit4]   2> 793 T1718 C117 oasc.CachingDirectoryFactory.close Releasing directory:C:\Users\JenkinsSlave\workspace\Lucene-Solr-trunk-Windows\solr\build\solr-core\test\J0\.\solrtest-SuggesterTSTTest-1351618641237
[junit4:junit4]   2> 808 T1718 C117 oass.SolrIndexSearcher.<init> Opening Searcher@12bb053 main
[junit4:junit4]   2> 809 T1719 oashc.SpellCheckComponent$SpellCheckerListener.buildSpellIndex Building spell index for spell checker: suggest
[junit4:junit4]   2> 809 T1719 oasss.Suggester.build build()
[junit4:junit4]   2> 809 T1718 C117 oasu.DirectUpdateHandler2.commit end_commit_flush
[junit4:junit4]   2> 817 T1719 oasss.Suggester.build Stored suggest data to: C:\Users\JenkinsSlave\workspace\Lucene-Solr-trunk-Windows\solr\build\solr-core\test\J0\.\solrtest-SuggesterTSTTest-1351618641237\suggest\jaspell.dat
[junit4:junit4]   2> 817 T1719 oashc.SpellCheckComponent$SpellCheckerListener.buildSpellIndex Building spell index for spell checker: suggest_tst
[junit4:junit4]   2> 818 T1719 oasss.Suggester.build build()
[junit4:junit4]   2> 833 T1719 oasss.Suggester.build Stored suggest data to: C:\Users\JenkinsSlave\workspace\Lucene-Solr-trunk-Windows\solr\build\solr-core\test\J0\.\solrtest-SuggesterTSTTest-1351618641237\suggest_tst\tst.dat
[junit4:junit4]   2> 833 T1719 oashc.SpellCheckComponent$SpellCheckerListener.buildSpellIndex Building spell index for spell checker: suggest_fst
[junit4:junit4]   2> 834 T1719 oasss.Suggester.build build()
[junit4:junit4]   2> 854 T1719 oasss.Suggester.build Stored suggest data to: C:\Users\JenkinsSlave\workspace\Lucene-Solr-trunk-Windows\solr\build\solr-core\test\J0\.\solrtest-SuggesterTSTTest-1351618641237\suggest_fst\fst.bin
[junit4:junit4]   2> 854 T1719 oashc.SpellCheckComponent$SpellCheckerListener.buildSpellIndex Building spell index for spell checker: suggest_wfst
[junit4:junit4]   2> 854 T1719 oasss.Suggester.build build()
[junit4:junit4]   2> 871 T1719 oasss.Suggester.build Stored suggest data to: C:\Users\JenkinsSlave\workspace\Lucene-Solr-trunk-Windows\solr\build\solr-core\test\J0\.\solrtest-SuggesterTSTTest-1351618641237\suggest_wfst\wfst.bin
[junit4:junit4]   2> 871 T1719 oasc.SolrCore.registerSearcher [collection1] Registered new searcher Searcher@12bb053 main{StandardDirectoryReader(segments_4:11 _2(5.0):C3)}
[junit4:junit4]   2> 871 T1719 oasc.CachingDirectoryFactory.close Releasing directory:C:\Users\JenkinsSlave\workspace\Lucene-Solr-trunk-Windows\solr\build\solr-core\test\J0\.\solrtest-SuggesterTSTTest-1351618641237\index
[junit4:junit4]   2> 895 T1718 C117 UPDATE [collection1] webapp=null path=null params={} {commit=} 0 157
[junit4:junit4]   2> 900 T1718 oas.SolrTestCaseJ4.deleteCore ###deleteCore
[junit4:junit4]   2> 900 T1718 oasc.CoreContainer.shutdown Shutting down CoreContainer instance=28084046
[junit4:junit4]   2> 902 T1718 oasc.SolrCore.close [collection1]  CLOSING SolrCore org.apache.solr.core.SolrCore@91cdda
[junit4:junit4]   2> 902 T1718 oasu.DirectUpdateHandler2.close closing DirectUpdateHandler2{commits=3,autocommits=0,soft autocommits=0,optimizes=0,rollbacks=0,expungeDeletes=0,docsPending=0,adds=0,deletesById=0,deletesByQuery=0,errors=0,cumulative_adds=9,cumulative_deletesById=0,cumulative_deletesByQuery=0,cumulative_errors=0}
[junit4:junit4]   2> 902 T1718 oasc.SolrCore.decrefSolrCoreState Closing SolrCoreState
[junit4:junit4]   2> 902 T1718 oasu.DefaultSolrCoreState.closeIndexWriter SolrCoreState ref count has reached 0 - closing IndexWriter
[junit4:junit4]   2> 903 T1718 oasu.DefaultSolrCoreState.closeIndexWriter closing IndexWriter with IndexWriterCloser
[junit4:junit4]   2> 916 T1718 C117 oasc.CachingDirectoryFactory.close Releasing directory:C:\Users\JenkinsSlave\workspace\Lucene-Solr-trunk-Windows\solr\build\solr-core\test\J0\.\solrtest-SuggesterTSTTest-1351618641237\index
[junit4:junit4]   2> 918 T1718 oasc.SolrCore.closeSearcher [collection1] Closing main searcher on request.
[junit4:junit4]   2> 918 T1718 oasc.CachingDirectoryFactory.close Releasing directory:C:\Users\JenkinsSlave\workspace\Lucene-Solr-trunk-Windows\solr\build\solr-core\test\J0\.\solrtest-SuggesterTSTTest-1351618641237\index
[junit4:junit4]   2> NOTE: per solr.test.leavedatadir, dataDir will not be removed: C:\Users\JenkinsSlave\workspace\Lucene-Solr-trunk-Windows\solr\build\solr-core\test\J0\.\solrtest-SuggesterTSTTest-1351618641237
[junit4:junit4]   2> 942 T1718 oas.SolrTestCaseJ4.initCore ####initCore
[junit4:junit4]   2> 942 T1718 oasc.SolrResourceLoader.<init> new SolrResourceLoader for directory: 'C:\Users\JenkinsSlave\workspace\Lucene-Solr-trunk-Windows\solr\build\solr-core\test-files\solr\collection1\'
[junit4:junit4]   2> 946 T1718 oasc.SolrResourceLoader.replaceClassLoader Adding 'file:/C:/Users/JenkinsSlave/workspace/Lucene-Solr-trunk-Windows/solr/build/solr-core/test-files/solr/collection1/lib/classes/' to classloader
[junit4:junit4]   2> 947 T1718 oasc.SolrResourceLoader.replaceClassLoader Adding 'file:/C:/Users/JenkinsSlave/workspace/Lucene-Solr-trunk-Windows/solr/build/solr-core/test-files/solr/collection1/lib/README' to classloader
[junit4:junit4]   2> 1011 T1718 oasc.SolrConfig.<init> Using Lucene MatchVersion: LUCENE_50
[junit4:junit4]   2> 1071 T1718 oasc.SolrConfig.<init> Loaded SolrConfig: solrconfig-spellchecker.xml
[junit4:junit4]   2> 1073 T1718 oass.IndexSchema.readSchema Reading Solr Schema
[junit4:junit4]   2> 1081 T1718 oass.IndexSchema.readSchema Schema name=test
[junit4:junit4]   2> 1814 T1718 oass.OpenExchangeRatesOrgProvider.init Initialized with rates=open-exchange-rates.json, refreshInterval=1440.
[junit4:junit4]   2> 1825 T1718 oass.IndexSchema.readSchema default search field in schema is text
[junit4:junit4]   2> 1830 T1718 oass.IndexSchema.readSchema unique key field: id
[junit4:junit4]   2> 1838 T1718 oass.FileExchangeRateProvider.reload Reloading exchange rates from file currency.xml
[junit4:junit4]   2> 1843 T1718 oass.FileExchangeRateProvider.reload Reloading exchange rates from file currency.xml
[junit4:junit4]   2> 1846 T1718 oass.OpenExchangeRatesOrgProvider.reload Reloading exchange rates from open-exchange-rates.json
[junit4:junit4]   2> 1847 T1718 oass.OpenExchangeRatesOrgProvider.reload Reloading exchange rates from open-exchange-rates.json
[junit4:junit4]   2> 1847 T1718 oasc.SolrResourceLoader.locateSolrHome JNDI not configured for solr (NoInitialContextEx)
[junit4:junit4]   2> 1848 T1718 oasc.SolrResourceLoader.locateSolrHome using system property solr.solr.home: C:\Users\JenkinsSlave\workspace\Lucene-Solr-trunk-Windows\solr\build\solr-core\test-files\solr
[junit4:junit4]   2> 1848 T1718 oasc.SolrResourceLoader.<init> new SolrResourceLoader for directory: 'C:\Users\JenkinsSlave\workspace\Lucene-Solr-trunk-Windows\solr\build\solr-core\test-files\solr\'
[junit4:junit4]   2> 1854 T1718 oasc.CoreContainer.<init> New CoreContainer 12251712
[junit4:junit4]   2> 1857 T1718 oasc.SolrCore.<init> [collection1] Opening new SolrCore at C:\Users\JenkinsSlave\workspace\Lucene-Solr-trunk-Windows\solr\build\solr-core\test-files\solr\collection1\, dataDir=C:\Users\JenkinsSlave\workspace\Lucene-Solr-trunk-Windows\solr\build\solr-core\test\J0\.\solrtest-SuggesterTSTTest-1351618641237\
[junit4:junit4]   2> 1857 T1718 oasc.SolrCore.<init> JMX monitoring not detected for core: collection1
[junit4:junit4]   2> 1857 T1718 oasc.SolrCore.initDirectoryFactory org.apache.solr.core.MockFSDirectoryFactory
[junit4:junit4]   2> 1858 T1718 oasc.CachingDirectoryFactory.injectLockFactory WARNING No lockType configured for MockDirWrapper(org.apache.lucene.store.NIOFSDirectory@C:\Users\JenkinsSlave\workspace\Lucene-Solr-trunk-Windows\solr\build\solr-core\test\J0\solrtest-SuggesterTSTTest-1351618641237 lockFactory=org.apache.lucene.store.NativeFSLockFactory@1765daa) assuming 'simple'
[junit4:junit4]   2> 1859 T1718 oasc.CachingDirectoryFactory.get return new directory for C:\Users\JenkinsSlave\workspace\Lucene-Solr-trunk-Windows\solr\build\solr-core\test\J0\.\solrtest-SuggesterTSTTest-1351618641237 forceNew:false
[junit4:junit4]   2> 1859 T1718 oasc.CachingDirectoryFactory.close Releasing directory:C:\Users\JenkinsSlave\workspace\Lucene-Solr-trunk-Windows\solr\build\solr-core\test\J0\.\solrtest-SuggesterTSTTest-1351618641237
[junit4:junit4]   2> 1859 T1718 oasc.SolrCore.getNewIndexDir New index directory detected: old=null new=C:\Users\JenkinsSlave\workspace\Lucene-Solr-trunk-Windows\solr\build\solr-core\test\J0\.\solrtest-SuggesterTSTTest-1351618641237\index/
[junit4:junit4]   2> 1861 T1718 oasc.RequestHandlers.initHandlersFromConfig created standard: solr.StandardRequestHandler
[junit4:junit4]   2> 1863 T1718 oasc.RequestHandlers.initHandlersFromConfig created /suggest: org.apache.solr.handler.component.SearchHandler
[junit4:junit4]   2> 1864 T1718 oasc.RequestHandlers.initHandlersFromConfig created /suggest_tst: org.apache.solr.handler.component.SearchHandler
[junit4:junit4]   2> 1864 T1718 oasc.RequestHandlers.initHandlersFromConfig created /suggest_fst: org.apache.solr.handler.component.SearchHandler
[junit4:junit4]   2> 1865 T1718 oasc.RequestHandlers.initHandlersFromConfig created /suggest_wfst: org.apache.solr.handler.component.SearchHandler
[junit4:junit4]   2> 1869 T1718 oasc.CachingDirectoryFactory.close Releasing directory:C:\Users\JenkinsSlave\workspace\Lucene-Solr-trunk-Windows\solr\build\solr-core\test\J0\.\solrtest-SuggesterTSTTest-1351618641237
[junit4:junit4]   2> 1872 T1718 oasc.CachingDirectoryFactory.get return new directory for C:\Users\JenkinsSlave\workspace\Lucene-Solr-trunk-Windows\solr\build\solr-core\test\J0\.\solrtest-SuggesterTSTTest-1351618641237\index forceNew:false
[junit4:junit4]   2> 1879 T1718 oass.SolrIndexSearcher.<init> Opening Searcher@1e59ecb main
[junit4:junit4]   2> 1880 T1718 oasu.CommitTracker.<init> Hard AutoCommit: disabled
[junit4:junit4]   2> 1880 T1718 oasu.CommitTracker.<init> Soft AutoCommit: disabled
[junit4:junit4]   2> 1881 T1718 oashc.SpellCheckComponent.inform Initializing spell checkers
[junit4:junit4]   2> 1881 T1718 oasss.Suggester.init init: {name=suggest,classname=org.apache.solr.spelling.suggest.Suggester,lookupImpl=org.apache.solr.spelling.suggest.jaspell.JaspellLookup,field=suggest,storeDir=suggest,buildOnCommit=true,threshold=0.0}
[junit4:junit4]   2> 1881 T1718 oasssj.JaspellLookupFactory.create init: {name=suggest,classname=org.apache.solr.spelling.suggest.Suggester,lookupImpl=org.apache.solr.spelling.suggest.jaspell.JaspellLookup,field=suggest,storeDir=suggest,buildOnCommit=true,threshold=0.0}
[junit4:junit4]   2> 1883 T1718 oashc.SpellCheckComponent.inform Registering newSearcher listener for spellchecker: suggest
[junit4:junit4]   2> 1884 T1718 oashc.SpellCheckComponent.inform No queryConverter defined, using default converter
[junit4:junit4]   2> 1884 T1718 oashc.SpellCheckComponent.inform Initializing spell checkers
[junit4:junit4]   2> 1886 T1718 oasss.Suggester.init init: {name=suggest_tst,classname=org.apache.solr.spelling.suggest.Suggester,lookupImpl=org.apache.solr.spelling.suggest.tst.TSTLookup,field=suggest,storeDir=suggest_tst,buildOnCommit=true,threshold=0.0}
[junit4:junit4]   2> 1888 T1718 oashc.SpellCheckComponent.inform Registering newSearcher listener for spellchecker: suggest_tst
[junit4:junit4]   2> 1889 T1718 oashc.SpellCheckComponent.inform No queryConverter defined, using default converter
[junit4:junit4]   2> 1889 T1718 oashc.SpellCheckComponent.inform Initializing spell checkers
[junit4:junit4]   2> 1890 T1718 oasss.Suggester.init init: {name=suggest_fst,classname=org.apache.solr.spelling.suggest.Suggester,lookupImpl=org.apache.solr.spelling.suggest.fst.FSTLookup,field=suggest,storeDir=suggest_fst,buildOnCommit=true,weightBuckets=5,exactMatchFirst=true}
[junit4:junit4]   2> 1892 T1718 oashc.SpellCheckComponent.inform Registering newSearcher listener for spellchecker: suggest_fst
[junit4:junit4]   2> 1892 T1718 oashc.SpellCheckComponent.inform No queryConverter defined, using default converter
[junit4:junit4]   2> 1893 T1718 oashc.SpellCheckComponent.inform Initializing spell checkers
[junit4:junit4]   2> 1893 T1718 oasss.Suggester.init init: {name=suggest_wfst,classname=org.apache.solr.spelling.suggest.Suggester,lookupImpl=org.apache.solr.spelling.suggest.fst.WFSTLookupFactory,field=suggest,storeDir=suggest_wfst,buildOnCommit=true,exactMatchFirst=true}
[junit4:junit4]   2> 1895 T1718 oashc.SpellCheckComponent.inform Registering newSearcher listener for spellchecker: suggest_wfst
[junit4:junit4]   2> 1895 T1718 oashc.SpellCheckComponent.inform No queryConverter defined, using default converter
[junit4:junit4]   2> 1895 T1718 oashc.HttpShardHandlerFactory.getParameter Setting socketTimeout to: 0
[junit4:junit4]   2> 1895 T1718 oashc.HttpShardHandlerFactory.getParameter Setting urlScheme to: http://
[junit4:junit4]   2> 1896 T1718 oashc.HttpShardHandlerFactory.getParameter Setting connTimeout to: 0
[junit4:junit4]   2> 1896 T1718 oashc.HttpShardHandlerFactory.getParameter Setting maxConnectionsPerHost to: 20
[junit4:junit4]   2> 1897 T1718 oashc.HttpShardHandlerFactory.getParameter Setting corePoolSize to: 0
[junit4:junit4]   2> 1897 T1718 oashc.HttpShardHandlerFactory.getParameter Setting maximumPoolSize to: 2147483647
[junit4:junit4]   2> 1897 T1718 oashc.HttpShardHandlerFactory.getParameter Setting maxThreadIdleTime to: 5
[junit4:junit4]   2> 1898 T1718 oashc.HttpShardHandlerFactory.getParameter Setting sizeOfQueue to: -1
[junit4:junit4]   2> 1898 T1718 oashc.HttpShardHandlerFactory.getParameter Setting fairnessPolicy to: false
[junit4:junit4]   2> 1898 T1718 oascsi.HttpClientUtil.createClient Creating new http client, config:maxConnectionsPerHost=20&maxConnections=10000&socketTimeout=0&connTimeout=0&retry=false
[junit4:junit4]   2> 1907 T1720 oasc.SolrCore.registerSearcher [collection1] Registered new searcher Searcher@1e59ecb main{StandardDirectoryReader(segments_4:11 _2(5.0):C3)}
[junit4:junit4]   2> 1907 T1718 oasc.CoreContainer.registerCore registering core: collection1
[junit4:junit4]   2> 1913 T1718 oas.SolrTestCaseJ4.initCore ####initCore end
[junit4:junit4]   2> ASYNC  NEW_CORE C118 name=collection1 org.apache.solr.core.SolrCore@8827f5
[junit4:junit4]   2> 1917 T1718 C118 REQ [collection1] webapp=null path=null params={q=ac&spellcheck.count=2&qt=/suggest_tst&spellcheck.onlyMorePopular=true} status=0 QTime=1 
[junit4:junit4]   2> 1924 T1718 oas.SolrTestCaseJ4.tearDown ###Ending testReload
[junit4:junit4]   2> 1925 T1718 oas.SolrTestCaseJ4.deleteCore ###deleteCore
[junit4:junit4]   2> 1925 T1718 oasc.CoreContainer.shutdown Shutting down CoreContainer instance=12251712
[junit4:junit4]   2> 1925 T1718 oasc.SolrCore.close [collection1]  CLOSING SolrCore org.apache.solr.core.SolrCore@8827f5
[junit4:junit4]   2> 1925 T1718 oasu.DirectUpdateHandler2.close closing DirectUpdateHandler2{commits=0,autocommits=0,soft autocommits=0,optimizes=0,rollbacks=0,expungeDeletes=0,docsPending=0,adds=0,deletesById=0,deletesByQuery=0,errors=0,cumulative_adds=0,cumulative_deletesById=0,cumulative_deletesByQuery=0,cumulative_errors=0}
[junit4:junit4]   2> 1926 T1718 oasc.SolrCore.decrefSolrCoreState Closing SolrCoreState
[junit4:junit4]   2> 1926 T1718 oasu.DefaultSolrCoreState.closeIndexWriter SolrCoreState ref count has reached 0 - closing IndexWriter
[junit4:junit4]   2> 1926 T1718 oasu.DefaultSolrCoreState.closeIndexWriter closing IndexWriter with IndexWriterCloser
[junit4:junit4]   2> 1927 T1718 oasc.SolrCore.closeSearcher [collection1] Closing main searcher on request.
[junit4:junit4]   2> 1927 T1718 oasc.CachingDirectoryFactory.close Releasing directory:C:\Users\JenkinsSlave\workspace\Lucene-Solr-trunk-Windows\solr\build\solr-core\test\J0\.\solrtest-SuggesterTSTTest-1351618641237\index
[junit4:junit4]   2> NOTE: test params are: codec=Lucene41: {id=PostingsFormat(name=Lucene41WithOrds), text=PostingsFormat(name=NestedPulsing), suggest=PostingsFormat(name=MockRandom), spell=PostingsFormat(name=MockRandom)}, sim=RandomSimilarityProvider(queryNorm=true,coord=crazy): {}, locale=lv, timezone=Asia/Yekaterinburg
[junit4:junit4]   2> NOTE: Windows 7 6.1 x86/Sun Microsystems Inc. 1.6.0_35 (32-bit)/cpus=2,threads=1,free=92778072,total=276168704
[junit4:junit4]   2> NOTE: All tests run in this JVM: [TestReversedWildcardFilterFactory, PeerSyncTest, SimpleFacetsTest, XsltUpdateRequestHandlerTest, DistanceFunctionTest, SystemInfoHandlerTest, TestIndexSearcher, AutoCommitTest, TermVectorComponentDistributedTest, TestCSVLoader, TestBinaryField, TestSolrIndexConfig, TestFaceting, TestCharFilters, StatelessScriptUpdateProcessorFactoryTest, SoftAutoCommitTest, ZkCLITest, RecoveryZkTest, FileBasedSpellCheckerTest, HighlighterConfigTest, SuggesterFSTTest, TestJoin, StatsComponentTest, RAMDirectoryFactoryTest, UpdateParamsTest, OpenExchangeRatesOrgProviderTest, TestSuggestSpellingConverter, NotRequiredUniqueKeyTest, TestLuceneMatchVersion, TestRealTimeGet, UpdateRequestProcessorFactoryTest, TestUpdate, PathHierarchyTokenizerFactoryTest, SolrCmdDistributorTest, SpellCheckComponentTest, TestRecovery, SampleTest, QueryEqualityTest, TestDistributedSearch, JSONWriterTest, FieldAnalysisRequestHandlerTest, NoCacheHeaderTest, LeaderElectionTest, TestSolrQueryParser, TestDistributedGrouping, CurrencyFieldTest, TestDocumentBuilder, DateFieldTest, WordBreakSolrSpellCheckerTest, TestPHPSerializedResponseWriter, SolrCoreTest, SpellingQueryConverterTest, PrimitiveFieldTypeTest, FullSolrCloudDistribCmdsTest, TestWordDelimiterFilterFactory, TestMergePolicyConfig, TestStressReorder, TestCodecSupport, TestConfig, CircularListTest, SolrCoreCheckLockOnStartupTest, LeaderElectionIntegrationTest, DocumentAnalysisRequestHandlerTest, CSVRequestHandlerTest, IndexSchemaRuntimeFieldTest, TermVectorComponentTest, ShowFileRequestHandlerTest, TestReplicationHandler, TestPhraseSuggestions, TestLazyCores, XmlUpdateRequestHandlerTest, SpellCheckCollatorTest, SuggesterTSTTest]
[junit4:junit4] Completed in 2.05s, 4 tests, 1 error <<< FAILURES!

[...truncated 488 lines...]
BUILD FAILED
C:\Users\JenkinsSlave\workspace\Lucene-Solr-trunk-Windows\build.xml:335: The following error occurred while executing this line:
C:\Users\JenkinsSlave\workspace\Lucene-Solr-trunk-Windows\build.xml:39: The following error occurred while executing this line:
C:\Users\JenkinsSlave\workspace\Lucene-Solr-trunk-Windows\solr\build.xml:178: The following error occurred while executing this line:
C:\Users\JenkinsSlave\workspace\Lucene-Solr-trunk-Windows\lucene\module-build.xml:61: The following error occurred while executing this line:
C:\Users\JenkinsSlave\workspace\Lucene-Solr-trunk-Windows\lucene\common-build.xml:1159: The following error occurred while executing this line:
C:\Users\JenkinsSlave\workspace\Lucene-Solr-trunk-Windows\lucene\common-build.xml:827: There were test failures: 233 suites, 965 tests, 1 error, 12 ignored (7 assumptions)

Total time: 39 minutes 52 seconds
Build step 'Invoke Ant' marked build as failure
Archiving artifacts
Recording test results
Description set: Java: 32bit/jdk1.6.0_35 -server -XX:+UseParallelGC
Email was triggered for: Failure
Sending email for trigger: Failure



Mime
View raw message