lucene-dev mailing list archives

Site index · List index
Message view « Date » · « Thread »
Top « Date » · « Thread »
From Apache Jenkins Server <jenk...@builds.apache.org>
Subject [JENKINS] Lucene-Solr-Tests-4.x-java7 - Build # 530 - Failure
Date Sun, 07 Oct 2012 22:45:51 GMT
Build: https://builds.apache.org/job/Lucene-Solr-Tests-4.x-java7/530/

1 tests failed.
REGRESSION:  org.apache.solr.cloud.BasicDistributedZkTest.testDistribSearch

Error Message:
Server at http://127.0.0.1:31777/solr/awholynewcollection_6 returned non ok status:500, message:Server Error

Stack Trace:
org.apache.solr.common.SolrException: Server at http://127.0.0.1:31777/solr/awholynewcollection_6 returned non ok status:500, message:Server Error
	at __randomizedtesting.SeedInfo.seed([7E10121731B04D4A:FFF69C0F46EF2D76]:0)
	at org.apache.solr.client.solrj.impl.HttpSolrServer.request(HttpSolrServer.java:372)
	at org.apache.solr.client.solrj.impl.HttpSolrServer.request(HttpSolrServer.java:181)
	at org.apache.solr.client.solrj.request.QueryRequest.process(QueryRequest.java:90)
	at org.apache.solr.client.solrj.SolrServer.query(SolrServer.java:301)
	at org.apache.solr.cloud.BasicDistributedZkTest.waitForNon403or404or503(BasicDistributedZkTest.java:549)
	at org.apache.solr.cloud.BasicDistributedZkTest.testCollectionsAPI(BasicDistributedZkTest.java:386)
	at org.apache.solr.cloud.BasicDistributedZkTest.doTest(BasicDistributedZkTest.java:331)
	at org.apache.solr.BaseDistributedSearchTestCase.testDistribSearch(BaseDistributedSearchTestCase.java:695)
	at sun.reflect.NativeMethodAccessorImpl.invoke0(Native Method)
	at sun.reflect.NativeMethodAccessorImpl.invoke(NativeMethodAccessorImpl.java:57)
	at sun.reflect.DelegatingMethodAccessorImpl.invoke(DelegatingMethodAccessorImpl.java:43)
	at java.lang.reflect.Method.invoke(Method.java:601)
	at com.carrotsearch.randomizedtesting.RandomizedRunner.invoke(RandomizedRunner.java:1559)
	at com.carrotsearch.randomizedtesting.RandomizedRunner.access$600(RandomizedRunner.java:79)
	at com.carrotsearch.randomizedtesting.RandomizedRunner$6.evaluate(RandomizedRunner.java:737)
	at com.carrotsearch.randomizedtesting.RandomizedRunner$7.evaluate(RandomizedRunner.java:773)
	at com.carrotsearch.randomizedtesting.RandomizedRunner$8.evaluate(RandomizedRunner.java:787)
	at com.carrotsearch.randomizedtesting.rules.SystemPropertiesRestoreRule$1.evaluate(SystemPropertiesRestoreRule.java:53)
	at org.apache.lucene.util.TestRuleSetupTeardownChained$1.evaluate(TestRuleSetupTeardownChained.java:50)
	at org.apache.lucene.util.TestRuleFieldCacheSanity$1.evaluate(TestRuleFieldCacheSanity.java:51)
	at org.apache.lucene.util.AbstractBeforeAfterRule$1.evaluate(AbstractBeforeAfterRule.java:45)
	at com.carrotsearch.randomizedtesting.rules.SystemPropertiesInvariantRule$1.evaluate(SystemPropertiesInvariantRule.java:55)
	at org.apache.lucene.util.TestRuleThreadAndTestName$1.evaluate(TestRuleThreadAndTestName.java:48)
	at org.apache.lucene.util.TestRuleIgnoreAfterMaxFailures$1.evaluate(TestRuleIgnoreAfterMaxFailures.java:70)
	at org.apache.lucene.util.TestRuleMarkFailure$1.evaluate(TestRuleMarkFailure.java:48)
	at com.carrotsearch.randomizedtesting.rules.StatementAdapter.evaluate(StatementAdapter.java:36)
	at com.carrotsearch.randomizedtesting.ThreadLeakControl$StatementRunner.run(ThreadLeakControl.java:358)
	at com.carrotsearch.randomizedtesting.ThreadLeakControl.forkTimeoutingTask(ThreadLeakControl.java:782)
	at com.carrotsearch.randomizedtesting.ThreadLeakControl$3.evaluate(ThreadLeakControl.java:442)
	at com.carrotsearch.randomizedtesting.RandomizedRunner.runSingleTest(RandomizedRunner.java:746)
	at com.carrotsearch.randomizedtesting.RandomizedRunner$3.evaluate(RandomizedRunner.java:648)
	at com.carrotsearch.randomizedtesting.RandomizedRunner$4.evaluate(RandomizedRunner.java:682)
	at com.carrotsearch.randomizedtesting.RandomizedRunner$5.evaluate(RandomizedRunner.java:693)
	at com.carrotsearch.randomizedtesting.rules.StatementAdapter.evaluate(StatementAdapter.java:36)
	at com.carrotsearch.randomizedtesting.rules.SystemPropertiesRestoreRule$1.evaluate(SystemPropertiesRestoreRule.java:53)
	at org.apache.lucene.util.AbstractBeforeAfterRule$1.evaluate(AbstractBeforeAfterRule.java:45)
	at org.apache.lucene.util.TestRuleStoreClassName$1.evaluate(TestRuleStoreClassName.java:42)
	at com.carrotsearch.randomizedtesting.rules.SystemPropertiesInvariantRule$1.evaluate(SystemPropertiesInvariantRule.java:55)
	at com.carrotsearch.randomizedtesting.rules.NoShadowingOrOverridesOnMethodsRule$1.evaluate(NoShadowingOrOverridesOnMethodsRule.java:39)
	at com.carrotsearch.randomizedtesting.rules.NoShadowingOrOverridesOnMethodsRule$1.evaluate(NoShadowingOrOverridesOnMethodsRule.java:39)
	at com.carrotsearch.randomizedtesting.rules.StatementAdapter.evaluate(StatementAdapter.java:36)
	at org.apache.lucene.util.TestRuleAssertionsRequired$1.evaluate(TestRuleAssertionsRequired.java:43)
	at org.apache.lucene.util.TestRuleMarkFailure$1.evaluate(TestRuleMarkFailure.java:48)
	at org.apache.lucene.util.TestRuleIgnoreAfterMaxFailures$1.evaluate(TestRuleIgnoreAfterMaxFailures.java:70)
	at org.apache.lucene.util.TestRuleIgnoreTestSuites$1.evaluate(TestRuleIgnoreTestSuites.java:55)
	at com.carrotsearch.randomizedtesting.rules.StatementAdapter.evaluate(StatementAdapter.java:36)
	at com.carrotsearch.randomizedtesting.ThreadLeakControl$StatementRunner.run(ThreadLeakControl.java:358)
	at java.lang.Thread.run(Thread.java:722)




Build Log:
[...truncated 8673 lines...]
[junit4:junit4] Suite: org.apache.solr.cloud.BasicDistributedZkTest
[junit4:junit4]   2> 5 T923 oas.SolrTestCaseJ4.setUp ###Starting testDistribSearch
[junit4:junit4]   2> Creating dataDir: /usr/home/hudson/hudson-slave/workspace/Lucene-Solr-Tests-4.x-java7/solr/build/solr-core/test/J0/./solrtest-BasicDistributedZkTest-1349649135907
[junit4:junit4]   2> 14 T923 oasc.ZkTestServer.run STARTING ZK TEST SERVER
[junit4:junit4]   2> 118 T924 oaz.Environment.logEnv Server environment:zookeeper.version=3.3.6-1366786, built on 07/29/2012 06:22 GMT
[junit4:junit4]   2> 118 T924 oaz.Environment.logEnv Server environment:host.name=lucene.zones.apache.org
[junit4:junit4]   2> 119 T924 oaz.Environment.logEnv Server environment:java.version=1.7.0_06
[junit4:junit4]   2> 119 T924 oaz.Environment.logEnv Server environment:java.vendor=Oracle Corporation
[junit4:junit4]   2> 119 T924 oaz.Environment.logEnv Server environment:java.home=/usr/local/openjdk7/jre
[junit4:junit4]   2> 119 T924 oaz.Environment.logEnv Server environment:java.class.path=/usr/home/hudson/hudson-slave/workspace/Lucene-Solr-Tests-4.x-java7/solr/build/solr-core/classes/test:/usr/home/hudson/hudson-slave/workspace/Lucene-Solr-Tests-4.x-java7/solr/build/solr-test-framework/classes/java:/usr/home/hudson/hudson-slave/workspace/Lucene-Solr-Tests-4.x-java7/solr/build/solr-core/test-files:/usr/home/hudson/hudson-slave/workspace/Lucene-Solr-Tests-4.x-java7/lucene/build/codecs/classes/java:/usr/home/hudson/hudson-slave/workspace/Lucene-Solr-Tests-4.x-java7/lucene/build/test-framework/classes/java:/usr/home/hudson/hudson-slave/workspace/Lucene-Solr-Tests-4.x-java7/solr/build/solr-solrj/classes/java:/usr/home/hudson/hudson-slave/workspace/Lucene-Solr-Tests-4.x-java7/solr/build/solr-core/classes/java:/usr/home/hudson/hudson-slave/workspace/Lucene-Solr-Tests-4.x-java7/lucene/build/analysis/common/lucene-analyzers-common-4.1-SNAPSHOT.jar:/usr/home/hudson/hudson-slave/workspace/Lucene-Solr-Tests-4.x-java7/lucene/build/analysis/kuromoji/lucene-analyzers-kuromoji-4.1-SNAPSHOT.jar:/usr/home/hudson/hudson-slave/workspace/Lucene-Solr-Tests-4.x-java7/lucene/build/analysis/phonetic/lucene-analyzers-phonetic-4.1-SNAPSHOT.jar:/usr/home/hudson/hudson-slave/workspace/Lucene-Solr-Tests-4.x-java7/lucene/build/highlighter/lucene-highlighter-4.1-SNAPSHOT.jar:/usr/home/hudson/hudson-slave/workspace/Lucene-Solr-Tests-4.x-java7/lucene/build/memory/lucene-memory-4.1-SNAPSHOT.jar:/usr/home/hudson/hudson-slave/workspace/Lucene-Solr-Tests-4.x-java7/lucene/build/misc/lucene-misc-4.1-SNAPSHOT.jar:/usr/home/hudson/hudson-slave/workspace/Lucene-Solr-Tests-4.x-java7/lucene/build/spatial/lucene-spatial-4.1-SNAPSHOT.jar:/usr/home/hudson/hudson-slave/workspace/Lucene-Solr-Tests-4.x-java7/lucene/build/suggest/lucene-suggest-4.1-SNAPSHOT.jar:/usr/home/hudson/hudson-slave/workspace/Lucene-Solr-Tests-4.x-java7/lucene/build/grouping/lucene-grouping-4.1-SNAPSHOT.jar:/usr/home/hudson/hudson-slave/workspace/Lucene-Solr-Tests-4.x-java7/lucene/build/queries/lucene-queries-4.1-SNAPSHOT.jar:/usr/home/hudson/hudson-slave/workspace/Lucene-Solr-Tests-4.x-java7/lucene/build/queryparser/lucene-queryparser-4.1-SNAPSHOT.jar:/usr/home/hudson/hudson-slave/workspace/Lucene-Solr-Tests-4.x-java7/solr/core/lib/commons-cli-1.2.jar:/usr/home/hudson/hudson-slave/workspace/Lucene-Solr-Tests-4.x-java7/solr/core/lib/commons-codec-1.7.jar:/usr/home/hudson/hudson-slave/workspace/Lucene-Solr-Tests-4.x-java7/solr/core/lib/commons-fileupload-1.2.1.jar:/usr/home/hudson/hudson-slave/workspace/Lucene-Solr-Tests-4.x-java7/solr/core/lib/commons-lang-2.6.jar:/usr/home/hudson/hudson-slave/workspace/Lucene-Solr-Tests-4.x-java7/solr/core/lib/easymock-2.2.jar:/usr/home/hudson/hudson-slave/workspace/Lucene-Solr-Tests-4.x-java7/solr/core/lib/guava-r05.jar:/usr/home/hudson/hudson-slave/workspace/Lucene-Solr-Tests-4.x-java7/solr/core/lib/javax.servlet-api-3.0.1.jar:/usr/home/hudson/hudson-slave/workspace/Lucene-Solr-Tests-4.x-java7/solr/core/lib/spatial4j-0.3.jar:/usr/home/hudson/hudson-slave/workspace/Lucene-Solr-Tests-4.x-java7/solr/solrj/lib/commons-io-2.1.jar:/usr/home/hudson/hudson-slave/workspace/Lucene-Solr-Tests-4.x-java7/solr/solrj/lib/httpclient-4.1.3.jar:/usr/home/hudson/hudson-slave/workspace/Lucene-Solr-Tests-4.x-java7/solr/solrj/lib/httpcore-4.1.4.jar:/usr/home/hudson/hudson-slave/workspace/Lucene-Solr-Tests-4.x-java7/solr/solrj/lib/httpmime-4.1.3.jar:/usr/home/hudson/hudson-slave/workspace/Lucene-Solr-Tests-4.x-java7/solr/solrj/lib/jcl-over-slf4j-1.6.4.jar:/usr/home/hudson/hudson-slave/workspace/Lucene-Solr-Tests-4.x-java7/solr/solrj/lib/log4j-over-slf4j-1.6.4.jar:/usr/home/hudson/hudson-slave/workspace/Lucene-Solr-Tests-4.x-java7/solr/solrj/lib/slf4j-api-1.6.4.jar:/usr/home/hudson/hudson-slave/workspace/Lucene-Solr-Tests-4.x-java7/solr/solrj/lib/slf4j-jdk14-1.6.4.jar:/usr/home/hudson/hudson-slave/workspace/Lucene-Solr-Tests-4.x-java7/solr/solrj/lib/wstx-asl-3.2.7.jar:/usr/home/hudson/hudson-slave/workspace/Lucene-Solr-Tests-4.x-java7/solr/solrj/lib/zookeeper-3.3.6.jar:/usr/home/hudson/hudson-slave/workspace/Lucene-Solr-Tests-4.x-java7/solr/example/lib/jetty-continuation-8.1.2.v20120308.jar:/usr/home/hudson/hudson-slave/workspace/Lucene-Solr-Tests-4.x-java7/solr/example/lib/jetty-deploy-8.1.2.v20120308.jar:/usr/home/hudson/hudson-slave/workspace/Lucene-Solr-Tests-4.x-java7/solr/example/lib/jetty-http-8.1.2.v20120308.jar:/usr/home/hudson/hudson-slave/workspace/Lucene-Solr-Tests-4.x-java7/solr/example/lib/jetty-io-8.1.2.v20120308.jar:/usr/home/hudson/hudson-slave/workspace/Lucene-Solr-Tests-4.x-java7/solr/example/lib/jetty-jmx-8.1.2.v20120308.jar:/usr/home/hudson/hudson-slave/workspace/Lucene-Solr-Tests-4.x-java7/solr/example/lib/jetty-security-8.1.2.v20120308.jar:/usr/home/hudson/hudson-slave/workspace/Lucene-Solr-Tests-4.x-java7/solr/example/lib/jetty-server-8.1.2.v20120308.jar:/usr/home/hudson/hudson-slave/workspace/Lucene-Solr-Tests-4.x-java7/solr/example/lib/jetty-servlet-8.1.2.v20120308.jar:/usr/home/hudson/hudson-slave/workspace/Lucene-Solr-Tests-4.x-java7/solr/example/lib/jetty-util-8.1.2.v20120308.jar:/usr/home/hudson/hudson-slave/workspace/Lucene-Solr-Tests-4.x-java7/solr/example/lib/jetty-webapp-8.1.2.v20120308.jar:/usr/home/hudson/hudson-slave/workspace/Lucene-Solr-Tests-4.x-java7/solr/example/lib/jetty-xml-8.1.2.v20120308.jar:/usr/home/hudson/hudson-slave/workspace/Lucene-Solr-Tests-4.x-java7/solr/example/lib/servlet-api-3.0.jar:/usr/home/hudson/hudson-slave/workspace/Lucene-Solr-Tests-4.x-java7/solr/example/example-DIH/solr/db/lib/hsqldb-1.8.0.10.jar:/usr/home/hudson/hudson-slave/workspace/Lucene-Solr-Tests-4.x-java7/lucene/build/core/classes/java:/usr/home/hudson/hudson-slave/workspace/Lucene-Solr-Tests-4.x-java7/lucene/test-framework/lib/junit-4.10.jar:/usr/home/hudson/hudson-slave/workspace/Lucene-Solr-Tests-4.x-java7/lucene/test-framework/lib/randomizedtesting-runner-2.0.2.jar:/home/hudson/hudson-slave/tools/Ant/ant-1.8.2/lib/ant-launcher.jar:/home/hudson/.ant/lib/ivy-2.2.0.jar:/home/hudson/hudson-slave/tools/Ant/ant-1.8.2/lib/ant-apache-regexp.jar:/home/hudson/hudson-slave/tools/Ant/ant-1.8.2/lib/ant-junit.jar:/home/hudson/hudson-slave/tools/Ant/ant-1.8.2/lib/ant-apache-bsf.jar:/home/hudson/hudson-slave/tools/Ant/ant-1.8.2/lib/ant-commons-net.jar:/home/hudson/hudson-slave/tools/Ant/ant-1.8.2/lib/ant-antlr.jar:/home/hudson/hudson-slave/tools/Ant/ant-1.8.2/lib/ant-apache-log4j.jar:/home/hudson/hudson-slave/tools/Ant/ant-1.8.2/lib/ant-commons-logging.jar:/home/hudson/hudson-slave/tools/Ant/ant-1.8.2/lib/ant-apache-xalan2.jar:/home/hudson/hudson-slave/tools/Ant/ant-1.8.2/lib/ant-apache-oro.jar:/home/hudson/hudson-slave/tools/Ant/ant-1.8.2/lib/ant-junit4.jar:/home/hudson/hudson-slave/tools/Ant/ant-1.8.2/lib/ant-netrexx.jar:/home/hudson/hudson-slave/tools/Ant/ant-1.8.2/lib/ant-swing.jar:/home/hudson/hudson-slave/tools/Ant/ant-1.8.2/lib/ant-javamail.jar:/home/hudson/hudson-slave/tools/Ant/ant-1.8.2/lib/ant-jsch.jar:/home/hudson/hudson-slave/tools/Ant/ant-1.8.2/lib/ant-jmf.jar:/home/hudson/hudson-slave/tools/Ant/ant-1.8.2/lib/ant.jar:/home/hudson/hudson-slave/tools/Ant/ant-1.8.2/lib/ant-apache-bcel.jar:/home/hudson/hudson-slave/tools/Ant/ant-1.8.2/lib/ant-jai.jar:/home/hudson/hudson-slave/tools/Ant/ant-1.8.2/lib/ant-testutil.jar:/home/hudson/hudson-slave/tools/Ant/ant-1.8.2/lib/ant-apache-resolver.jar:/home/hudson/hudson-slave/tools/Ant/ant-1.8.2/lib/ant-jdepend.jar:/usr/local/openjdk7/lib/tools.jar:/home/hudson/.ivy2/cache/com.carrotsearch.randomizedtesting/junit4-ant/jars/junit4-ant-2.0.2.jar
[junit4:junit4]   2> 120 T924 oaz.Environment.logEnv Server environment:java.library.path=/usr/local/openjdk7/jre/lib/amd64/server:/usr/local/openjdk7/jre/lib/amd64:/usr/local/openjdk7/jre/../lib/amd64:/usr/local/openjdk6/jre/lib/amd64/server:/usr/local/openjdk6/jre/lib/amd64:/usr/local/openjdk6/jre/../lib/amd64:/usr/java/packages/lib/amd64:/lib:/usr/lib:/usr/local/lib
[junit4:junit4]   2> 120 T924 oaz.Environment.logEnv Server environment:java.io.tmpdir=.
[junit4:junit4]   2> 120 T924 oaz.Environment.logEnv Server environment:java.compiler=<NA>
[junit4:junit4]   2> 120 T924 oaz.Environment.logEnv Server environment:os.name=FreeBSD
[junit4:junit4]   2> 120 T924 oaz.Environment.logEnv Server environment:os.arch=amd64
[junit4:junit4]   2> 120 T924 oaz.Environment.logEnv Server environment:os.version=9.0-RELEASE
[junit4:junit4]   2> 120 T924 oaz.Environment.logEnv Server environment:user.name=hudson
[junit4:junit4]   2> 121 T924 oaz.Environment.logEnv Server environment:user.home=/home/hudson
[junit4:junit4]   2> 121 T924 oaz.Environment.logEnv Server environment:user.dir=/usr/home/hudson/hudson-slave/workspace/Lucene-Solr-Tests-4.x-java7/solr/build/solr-core/test/J0
[junit4:junit4]   2> 155 T924 oazs.ZooKeeperServer.setTickTime tickTime set to 1000
[junit4:junit4]   2> 184 T924 oazs.NIOServerCnxn$Factory.<init> binding to port 0.0.0.0/0.0.0.0:0
[junit4:junit4]   2> 222 T923 oasc.ZkTestServer.run start zk server on port:31768
[junit4:junit4]   2> 240 T924 oazsp.FileTxnSnapLog.save Snapshotting: 0
[junit4:junit4]   2> 282 T923 oaz.Environment.logEnv Client environment:zookeeper.version=3.3.6-1366786, built on 07/29/2012 06:22 GMT
[junit4:junit4]   2> 282 T923 oaz.Environment.logEnv Client environment:host.name=lucene.zones.apache.org
[junit4:junit4]   2> 283 T923 oaz.Environment.logEnv Client environment:java.version=1.7.0_06
[junit4:junit4]   2> 283 T923 oaz.Environment.logEnv Client environment:java.vendor=Oracle Corporation
[junit4:junit4]   2> 283 T923 oaz.Environment.logEnv Client environment:java.home=/usr/local/openjdk7/jre
[junit4:junit4]   2> 284 T923 oaz.Environment.logEnv Client environment:java.class.path=/usr/home/hudson/hudson-slave/workspace/Lucene-Solr-Tests-4.x-java7/solr/build/solr-core/classes/test:/usr/home/hudson/hudson-slave/workspace/Lucene-Solr-Tests-4.x-java7/solr/build/solr-test-framework/classes/java:/usr/home/hudson/hudson-slave/workspace/Lucene-Solr-Tests-4.x-java7/solr/build/solr-core/test-files:/usr/home/hudson/hudson-slave/workspace/Lucene-Solr-Tests-4.x-java7/lucene/build/codecs/classes/java:/usr/home/hudson/hudson-slave/workspace/Lucene-Solr-Tests-4.x-java7/lucene/build/test-framework/classes/java:/usr/home/hudson/hudson-slave/workspace/Lucene-Solr-Tests-4.x-java7/solr/build/solr-solrj/classes/java:/usr/home/hudson/hudson-slave/workspace/Lucene-Solr-Tests-4.x-java7/solr/build/solr-core/classes/java:/usr/home/hudson/hudson-slave/workspace/Lucene-Solr-Tests-4.x-java7/lucene/build/analysis/common/lucene-analyzers-common-4.1-SNAPSHOT.jar:/usr/home/hudson/hudson-slave/workspace/Lucene-Solr-Tests-4.x-java7/lucene/build/analysis/kuromoji/lucene-analyzers-kuromoji-4.1-SNAPSHOT.jar:/usr/home/hudson/hudson-slave/workspace/Lucene-Solr-Tests-4.x-java7/lucene/build/analysis/phonetic/lucene-analyzers-phonetic-4.1-SNAPSHOT.jar:/usr/home/hudson/hudson-slave/workspace/Lucene-Solr-Tests-4.x-java7/lucene/build/highlighter/lucene-highlighter-4.1-SNAPSHOT.jar:/usr/home/hudson/hudson-slave/workspace/Lucene-Solr-Tests-4.x-java7/lucene/build/memory/lucene-memory-4.1-SNAPSHOT.jar:/usr/home/hudson/hudson-slave/workspace/Lucene-Solr-Tests-4.x-java7/lucene/build/misc/lucene-misc-4.1-SNAPSHOT.jar:/usr/home/hudson/hudson-slave/workspace/Lucene-Solr-Tests-4.x-java7/lucene/build/spatial/lucene-spatial-4.1-SNAPSHOT.jar:/usr/home/hudson/hudson-slave/workspace/Lucene-Solr-Tests-4.x-java7/lucene/build/suggest/lucene-suggest-4.1-SNAPSHOT.jar:/usr/home/hudson/hudson-slave/workspace/Lucene-Solr-Tests-4.x-java7/lucene/build/grouping/lucene-grouping-4.1-SNAPSHOT.jar:/usr/home/hudson/hudson-slave/workspace/Lucene-Solr-Tests-4.x-java7/lucene/build/queries/lucene-queries-4.1-SNAPSHOT.jar:/usr/home/hudson/hudson-slave/workspace/Lucene-Solr-Tests-4.x-java7/lucene/build/queryparser/lucene-queryparser-4.1-SNAPSHOT.jar:/usr/home/hudson/hudson-slave/workspace/Lucene-Solr-Tests-4.x-java7/solr/core/lib/commons-cli-1.2.jar:/usr/home/hudson/hudson-slave/workspace/Lucene-Solr-Tests-4.x-java7/solr/core/lib/commons-codec-1.7.jar:/usr/home/hudson/hudson-slave/workspace/Lucene-Solr-Tests-4.x-java7/solr/core/lib/commons-fileupload-1.2.1.jar:/usr/home/hudson/hudson-slave/workspace/Lucene-Solr-Tests-4.x-java7/solr/core/lib/commons-lang-2.6.jar:/usr/home/hudson/hudson-slave/workspace/Lucene-Solr-Tests-4.x-java7/solr/core/lib/easymock-2.2.jar:/usr/home/hudson/hudson-slave/workspace/Lucene-Solr-Tests-4.x-java7/solr/core/lib/guava-r05.jar:/usr/home/hudson/hudson-slave/workspace/Lucene-Solr-Tests-4.x-java7/solr/core/lib/javax.servlet-api-3.0.1.jar:/usr/home/hudson/hudson-slave/workspace/Lucene-Solr-Tests-4.x-java7/solr/core/lib/spatial4j-0.3.jar:/usr/home/hudson/hudson-slave/workspace/Lucene-Solr-Tests-4.x-java7/solr/solrj/lib/commons-io-2.1.jar:/usr/home/hudson/hudson-slave/workspace/Lucene-Solr-Tests-4.x-java7/solr/solrj/lib/httpclient-4.1.3.jar:/usr/home/hudson/hudson-slave/workspace/Lucene-Solr-Tests-4.x-java7/solr/solrj/lib/httpcore-4.1.4.jar:/usr/home/hudson/hudson-slave/workspace/Lucene-Solr-Tests-4.x-java7/solr/solrj/lib/httpmime-4.1.3.jar:/usr/home/hudson/hudson-slave/workspace/Lucene-Solr-Tests-4.x-java7/solr/solrj/lib/jcl-over-slf4j-1.6.4.jar:/usr/home/hudson/hudson-slave/workspace/Lucene-Solr-Tests-4.x-java7/solr/solrj/lib/log4j-over-slf4j-1.6.4.jar:/usr/home/hudson/hudson-slave/workspace/Lucene-Solr-Tests-4.x-java7/solr/solrj/lib/slf4j-api-1.6.4.jar:/usr/home/hudson/hudson-slave/workspace/Lucene-Solr-Tests-4.x-java7/solr/solrj/lib/slf4j-jdk14-1.6.4.jar:/usr/home/hudson/hudson-slave/workspace/Lucene-Solr-Tests-4.x-java7/solr/solrj/lib/wstx-asl-3.2.7.jar:/usr/home/hudson/hudson-slave/workspace/Lucene-Solr-Tests-4.x-java7/solr/solrj/lib/zookeeper-3.3.6.jar:/usr/home/hudson/hudson-slave/workspace/Lucene-Solr-Tests-4.x-java7/solr/example/lib/jetty-continuation-8.1.2.v20120308.jar:/usr/home/hudson/hudson-slave/workspace/Lucene-Solr-Tests-4.x-java7/solr/example/lib/jetty-deploy-8.1.2.v20120308.jar:/usr/home/hudson/hudson-slave/workspace/Lucene-Solr-Tests-4.x-java7/solr/example/lib/jetty-http-8.1.2.v20120308.jar:/usr/home/hudson/hudson-slave/workspace/Lucene-Solr-Tests-4.x-java7/solr/example/lib/jetty-io-8.1.2.v20120308.jar:/usr/home/hudson/hudson-slave/workspace/Lucene-Solr-Tests-4.x-java7/solr/example/lib/jetty-jmx-8.1.2.v20120308.jar:/usr/home/hudson/hudson-slave/workspace/Lucene-Solr-Tests-4.x-java7/solr/example/lib/jetty-security-8.1.2.v20120308.jar:/usr/home/hudson/hudson-slave/workspace/Lucene-Solr-Tests-4.x-java7/solr/example/lib/jetty-server-8.1.2.v20120308.jar:/usr/home/hudson/hudson-slave/workspace/Lucene-Solr-Tests-4.x-java7/solr/example/lib/jetty-servlet-8.1.2.v20120308.jar:/usr/home/hudson/hudson-slave/workspace/Lucene-Solr-Tests-4.x-java7/solr/example/lib/jetty-util-8.1.2.v20120308.jar:/usr/home/hudson/hudson-slave/workspace/Lucene-Solr-Tests-4.x-java7/solr/example/lib/jetty-webapp-8.1.2.v20120308.jar:/usr/home/hudson/hudson-slave/workspace/Lucene-Solr-Tests-4.x-java7/solr/example/lib/jetty-xml-8.1.2.v20120308.jar:/usr/home/hudson/hudson-slave/workspace/Lucene-Solr-Tests-4.x-java7/solr/example/lib/servlet-api-3.0.jar:/usr/home/hudson/hudson-slave/workspace/Lucene-Solr-Tests-4.x-java7/solr/example/example-DIH/solr/db/lib/hsqldb-1.8.0.10.jar:/usr/home/hudson/hudson-slave/workspace/Lucene-Solr-Tests-4.x-java7/lucene/build/core/classes/java:/usr/home/hudson/hudson-slave/workspace/Lucene-Solr-Tests-4.x-java7/lucene/test-framework/lib/junit-4.10.jar:/usr/home/hudson/hudson-slave/workspace/Lucene-Solr-Tests-4.x-java7/lucene/test-framework/lib/randomizedtesting-runner-2.0.2.jar:/home/hudson/hudson-slave/tools/Ant/ant-1.8.2/lib/ant-launcher.jar:/home/hudson/.ant/lib/ivy-2.2.0.jar:/home/hudson/hudson-slave/tools/Ant/ant-1.8.2/lib/ant-apache-regexp.jar:/home/hudson/hudson-slave/tools/Ant/ant-1.8.2/lib/ant-junit.jar:/home/hudson/hudson-slave/tools/Ant/ant-1.8.2/lib/ant-apache-bsf.jar:/home/hudson/hudson-slave/tools/Ant/ant-1.8.2/lib/ant-commons-net.jar:/home/hudson/hudson-slave/tools/Ant/ant-1.8.2/lib/ant-antlr.jar:/home/hudson/hudson-slave/tools/Ant/ant-1.8.2/lib/ant-apache-log4j.jar:/home/hudson/hudson-slave/tools/Ant/ant-1.8.2/lib/ant-commons-logging.jar:/home/hudson/hudson-slave/tools/Ant/ant-1.8.2/lib/ant-apache-xalan2.jar:/home/hudson/hudson-slave/tools/Ant/ant-1.8.2/lib/ant-apache-oro.jar:/home/hudson/hudson-slave/tools/Ant/ant-1.8.2/lib/ant-junit4.jar:/home/hudson/hudson-slave/tools/Ant/ant-1.8.2/lib/ant-netrexx.jar:/home/hudson/hudson-slave/tools/Ant/ant-1.8.2/lib/ant-swing.jar:/home/hudson/hudson-slave/tools/Ant/ant-1.8.2/lib/ant-javamail.jar:/home/hudson/hudson-slave/tools/Ant/ant-1.8.2/lib/ant-jsch.jar:/home/hudson/hudson-slave/tools/Ant/ant-1.8.2/lib/ant-jmf.jar:/home/hudson/hudson-slave/tools/Ant/ant-1.8.2/lib/ant.jar:/home/hudson/hudson-slave/tools/Ant/ant-1.8.2/lib/ant-apache-bcel.jar:/home/hudson/hudson-slave/tools/Ant/ant-1.8.2/lib/ant-jai.jar:/home/hudson/hudson-slave/tools/Ant/ant-1.8.2/lib/ant-testutil.jar:/home/hudson/hudson-slave/tools/Ant/ant-1.8.2/lib/ant-apache-resolver.jar:/home/hudson/hudson-slave/tools/Ant/ant-1.8.2/lib/ant-jdepend.jar:/usr/local/openjdk7/lib/tools.jar:/home/hudson/.ivy2/cache/com.carrotsearch.randomizedtesting/junit4-ant/jars/junit4-ant-2.0.2.jar
[junit4:junit4]   2> 284 T923 oaz.Environment.logEnv Client environment:java.library.path=/usr/local/openjdk7/jre/lib/amd64/server:/usr/local/openjdk7/jre/lib/amd64:/usr/local/openjdk7/jre/../lib/amd64:/usr/local/openjdk6/jre/lib/amd64/server:/usr/local/openjdk6/jre/lib/amd64:/usr/local/openjdk6/jre/../lib/amd64:/usr/java/packages/lib/amd64:/lib:/usr/lib:/usr/local/lib
[junit4:junit4]   2> 285 T923 oaz.Environment.logEnv Client environment:java.io.tmpdir=.
[junit4:junit4]   2> 285 T923 oaz.Environment.logEnv Client environment:java.compiler=<NA>
[junit4:junit4]   2> 285 T923 oaz.Environment.logEnv Client environment:os.name=FreeBSD
[junit4:junit4]   2> 286 T923 oaz.Environment.logEnv Client environment:os.arch=amd64
[junit4:junit4]   2> 286 T923 oaz.Environment.logEnv Client environment:os.version=9.0-RELEASE
[junit4:junit4]   2> 286 T923 oaz.Environment.logEnv Client environment:user.name=hudson
[junit4:junit4]   2> 286 T923 oaz.Environment.logEnv Client environment:user.home=/home/hudson
[junit4:junit4]   2> 287 T923 oaz.Environment.logEnv Client environment:user.dir=/usr/home/hudson/hudson-slave/workspace/Lucene-Solr-Tests-4.x-java7/solr/build/solr-core/test/J0
[junit4:junit4]   2> 290 T923 oaz.ZooKeeper.<init> Initiating client connection, connectString=127.0.0.1:31768 sessionTimeout=10000 watcher=org.apache.solr.common.cloud.ConnectionManager@2d60226a
[junit4:junit4]   2> 329 T928 oaz.ClientCnxn$SendThread.startConnect Opening socket connection to server /127.0.0.1:31768
[junit4:junit4]   2> 329 T923 oascc.ConnectionManager.waitForConnected Waiting for client to connect to ZooKeeper
[junit4:junit4]   2> 333 T928 oaz.ClientCnxn$SendThread.primeConnection Socket connection established to localhost/127.0.0.1:31768, initiating session
[junit4:junit4]   2> 333 T925 oazs.NIOServerCnxn$Factory.run Accepted socket connection from /140.211.11.196:31769
[junit4:junit4]   2> 348 T925 oazs.NIOServerCnxn.doIO WARNING Exception causing close of session 0x0 due to java.io.IOException: ZooKeeperServer not running
[junit4:junit4]   2> 348 T925 oazs.NIOServerCnxn.closeSock Closed socket connection for client /140.211.11.196:31769 (no session established for client)
[junit4:junit4]   2> 349 T928 oaz.ClientCnxn$SendThread.run Unable to read additional data from server sessionid 0x0, likely server has closed socket, closing socket connection and attempting reconnect
[junit4:junit4]   2> 1734 T928 oaz.ClientCnxn$SendThread.startConnect Opening socket connection to server localhost/127.0.0.1:31768
[junit4:junit4]   2> 1734 T928 oaz.ClientCnxn$SendThread.primeConnection Socket connection established to localhost/127.0.0.1:31768, initiating session
[junit4:junit4]   2> 1735 T925 oazs.NIOServerCnxn$Factory.run Accepted socket connection from /140.211.11.196:31775
[junit4:junit4]   2> 1736 T925 oazs.NIOServerCnxn.readConnectRequest Client attempting to establish new session at /140.211.11.196:31775
[junit4:junit4]   2> 1754 T927 oazsp.FileTxnLog.append Creating new log file: log.1
[junit4:junit4]   2> 1801 T927 oazs.NIOServerCnxn.finishSessionInit Established session 0x13a3d5b7a2c0000 with negotiated timeout 10000 for client /140.211.11.196:31775
[junit4:junit4]   2> 1802 T928 oaz.ClientCnxn$SendThread.readConnectResult Session establishment complete on server localhost/127.0.0.1:31768, sessionid = 0x13a3d5b7a2c0000, negotiated timeout = 10000
[junit4:junit4]   2> 1807 T930 oascc.ConnectionManager.process Watcher org.apache.solr.common.cloud.ConnectionManager@2d60226a name:ZooKeeperConnection Watcher:127.0.0.1:31768 got event WatchedEvent state:SyncConnected type:None path:null path:null type:None
[junit4:junit4]   2> 1807 T923 oascc.ConnectionManager.waitForConnected Client is connected to ZooKeeper
[junit4:junit4]   2> 1812 T923 oascc.SolrZkClient.makePath makePath: /solr
[junit4:junit4]   2> 1921 T929 oazs.PrepRequestProcessor.pRequest Processed session termination for sessionid: 0x13a3d5b7a2c0000
[junit4:junit4]   2> 1922 T930 oaz.ClientCnxn$EventThread.run EventThread shut down
[junit4:junit4]   2> 1922 T925 oazs.NIOServerCnxn.doIO WARNING EndOfStreamException: Unable to read additional data from client sessionid 0x13a3d5b7a2c0000, likely client has closed socket
[junit4:junit4]   2> 1922 T923 oaz.ZooKeeper.close Session: 0x13a3d5b7a2c0000 closed
[junit4:junit4]   2> 1923 T923 oaz.ZooKeeper.<init> Initiating client connection, connectString=127.0.0.1:31768/solr sessionTimeout=10000 watcher=org.apache.solr.common.cloud.ConnectionManager@34a61eda
[junit4:junit4]   2> 1924 T925 oazs.NIOServerCnxn.closeSock Closed socket connection for client /140.211.11.196:31775 which had sessionid 0x13a3d5b7a2c0000
[junit4:junit4]   2> 1924 T931 oaz.ClientCnxn$SendThread.startConnect Opening socket connection to server /127.0.0.1:31768
[junit4:junit4]   2> 1924 T923 oascc.ConnectionManager.waitForConnected Waiting for client to connect to ZooKeeper
[junit4:junit4]   2> 1925 T931 oaz.ClientCnxn$SendThread.primeConnection Socket connection established to localhost/127.0.0.1:31768, initiating session
[junit4:junit4]   2> 1925 T925 oazs.NIOServerCnxn$Factory.run Accepted socket connection from /140.211.11.196:31776
[junit4:junit4]   2> 1926 T925 oazs.NIOServerCnxn.readConnectRequest Client attempting to establish new session at /140.211.11.196:31776
[junit4:junit4]   2> 1927 T927 oazs.NIOServerCnxn.finishSessionInit Established session 0x13a3d5b7a2c0001 with negotiated timeout 10000 for client /140.211.11.196:31776
[junit4:junit4]   2> 1927 T931 oaz.ClientCnxn$SendThread.readConnectResult Session establishment complete on server localhost/127.0.0.1:31768, sessionid = 0x13a3d5b7a2c0001, negotiated timeout = 10000
[junit4:junit4]   2> 1928 T932 oascc.ConnectionManager.process Watcher org.apache.solr.common.cloud.ConnectionManager@34a61eda name:ZooKeeperConnection Watcher:127.0.0.1:31768/solr got event WatchedEvent state:SyncConnected type:None path:null path:null type:None
[junit4:junit4]   2> 1928 T923 oascc.ConnectionManager.waitForConnected Client is connected to ZooKeeper
[junit4:junit4]   2> 1934 T923 oascc.SolrZkClient.makePath makePath: /collections/collection1
[junit4:junit4]   2> 1941 T923 oascc.SolrZkClient.makePath makePath: /collections/collection1/shards
[junit4:junit4]   2> 1946 T923 oascc.SolrZkClient.makePath makePath: /collections/control_collection
[junit4:junit4]   2> 1949 T923 oascc.SolrZkClient.makePath makePath: /collections/control_collection/shards
[junit4:junit4]   2> 1954 T923 oasc.AbstractZkTestCase.putConfig put /usr/home/hudson/hudson-slave/workspace/Lucene-Solr-Tests-4.x-java7/solr/build/solr-core/test-files/solr/collection1/conf/solrconfig.xml to /configs/conf1/solrconfig.xml
[junit4:junit4]   2> 1982 T923 oascc.SolrZkClient.makePath makePath: /configs/conf1/solrconfig.xml
[junit4:junit4]   2> 1997 T923 oasc.AbstractZkTestCase.putConfig put /usr/home/hudson/hudson-slave/workspace/Lucene-Solr-Tests-4.x-java7/solr/build/solr-core/test-files/solr/collection1/conf/schema.xml to /configs/conf1/schema.xml
[junit4:junit4]   2> 1998 T923 oascc.SolrZkClient.makePath makePath: /configs/conf1/schema.xml
[junit4:junit4]   2> 2103 T923 oasc.AbstractZkTestCase.putConfig put /usr/home/hudson/hudson-slave/workspace/Lucene-Solr-Tests-4.x-java7/solr/build/solr-core/test-files/solr/collection1/conf/solrconfig.xml to /configs/conf1/solrconfig.xml
[junit4:junit4]   2> 2104 T923 oascc.SolrZkClient.makePath makePath: /configs/conf1/solrconfig.xml
[junit4:junit4]   2> 2117 T923 oasc.AbstractZkTestCase.putConfig put /usr/home/hudson/hudson-slave/workspace/Lucene-Solr-Tests-4.x-java7/solr/build/solr-core/test-files/solr/collection1/conf/stopwords.txt to /configs/conf1/stopwords.txt
[junit4:junit4]   2> 2118 T923 oascc.SolrZkClient.makePath makePath: /configs/conf1/stopwords.txt
[junit4:junit4]   2> 2121 T923 oasc.AbstractZkTestCase.putConfig put /usr/home/hudson/hudson-slave/workspace/Lucene-Solr-Tests-4.x-java7/solr/build/solr-core/test-files/solr/collection1/conf/protwords.txt to /configs/conf1/protwords.txt
[junit4:junit4]   2> 2122 T923 oascc.SolrZkClient.makePath makePath: /configs/conf1/protwords.txt
[junit4:junit4]   2> 2125 T923 oasc.AbstractZkTestCase.putConfig put /usr/home/hudson/hudson-slave/workspace/Lucene-Solr-Tests-4.x-java7/solr/build/solr-core/test-files/solr/collection1/conf/currency.xml to /configs/conf1/currency.xml
[junit4:junit4]   2> 2126 T923 oascc.SolrZkClient.makePath makePath: /configs/conf1/currency.xml
[junit4:junit4]   2> 2129 T923 oasc.AbstractZkTestCase.putConfig put /usr/home/hudson/hudson-slave/workspace/Lucene-Solr-Tests-4.x-java7/solr/build/solr-core/test-files/solr/collection1/conf/open-exchange-rates.json to /configs/conf1/open-exchange-rates.json
[junit4:junit4]   2> 2130 T923 oascc.SolrZkClient.makePath makePath: /configs/conf1/open-exchange-rates.json
[junit4:junit4]   2> 2133 T923 oasc.AbstractZkTestCase.putConfig put /usr/home/hudson/hudson-slave/workspace/Lucene-Solr-Tests-4.x-java7/solr/build/solr-core/test-files/solr/collection1/conf/mapping-ISOLatin1Accent.txt to /configs/conf1/mapping-ISOLatin1Accent.txt
[junit4:junit4]   2> 2134 T923 oascc.SolrZkClient.makePath makePath: /configs/conf1/mapping-ISOLatin1Accent.txt
[junit4:junit4]   2> 2137 T923 oasc.AbstractZkTestCase.putConfig put /usr/home/hudson/hudson-slave/workspace/Lucene-Solr-Tests-4.x-java7/solr/build/solr-core/test-files/solr/collection1/conf/old_synonyms.txt to /configs/conf1/old_synonyms.txt
[junit4:junit4]   2> 2137 T923 oascc.SolrZkClient.makePath makePath: /configs/conf1/old_synonyms.txt
[junit4:junit4]   2> 2141 T923 oasc.AbstractZkTestCase.putConfig put /usr/home/hudson/hudson-slave/workspace/Lucene-Solr-Tests-4.x-java7/solr/build/solr-core/test-files/solr/collection1/conf/synonyms.txt to /configs/conf1/synonyms.txt
[junit4:junit4]   2> 2142 T923 oascc.SolrZkClient.makePath makePath: /configs/conf1/synonyms.txt
[junit4:junit4]   2> 2145 T929 oazs.PrepRequestProcessor.pRequest Processed session termination for sessionid: 0x13a3d5b7a2c0001
[junit4:junit4]   2> 2153 T932 oaz.ClientCnxn$EventThread.run EventThread shut down
[junit4:junit4]   2> 2153 T923 oaz.ZooKeeper.close Session: 0x13a3d5b7a2c0001 closed
[junit4:junit4]   2> 2153 T925 oazs.NIOServerCnxn.closeSock Closed socket connection for client /140.211.11.196:31776 which had sessionid 0x13a3d5b7a2c0001
[junit4:junit4]   2> 2155 T923 oejs.Server.doStart jetty-8.1.2.v20120308
[junit4:junit4]   2> 2159 T923 oejs.AbstractConnector.doStart Started SocketConnector@0.0.0.0:31777
[junit4:junit4]   2> 2159 T923 oasc.SolrResourceLoader.locateSolrHome JNDI not configured for solr (NoInitialContextEx)
[junit4:junit4]   2> 2159 T923 oasc.SolrResourceLoader.locateSolrHome using system property solr.solr.home: /usr/home/hudson/hudson-slave/workspace/Lucene-Solr-Tests-4.x-java7/solr/build/solr-core/test-files/solr
[junit4:junit4]   2> 2160 T923 oasc.SolrResourceLoader.<init> new SolrResourceLoader for deduced Solr Home: '/usr/home/hudson/hudson-slave/workspace/Lucene-Solr-Tests-4.x-java7/solr/build/solr-core/test-files/solr/'
[junit4:junit4]   2> 2188 T923 oass.SolrDispatchFilter.init SolrDispatchFilter.init()
[junit4:junit4]   2> 2189 T923 oasc.SolrResourceLoader.locateSolrHome JNDI not configured for solr (NoInitialContextEx)
[junit4:junit4]   2> 2189 T923 oasc.SolrResourceLoader.locateSolrHome using system property solr.solr.home: /usr/home/hudson/hudson-slave/workspace/Lucene-Solr-Tests-4.x-java7/solr/build/solr-core/test-files/solr
[junit4:junit4]   2> 2189 T923 oasc.CoreContainer$Initializer.initialize looking for solr.xml: /usr/home/hudson/hudson-slave/workspace/Lucene-Solr-Tests-4.x-java7/solr/build/solr-core/test-files/solr/solr.xml
[junit4:junit4]   2> 2190 T923 oasc.CoreContainer.<init> New CoreContainer 1019262308
[junit4:junit4]   2> 2190 T923 oasc.CoreContainer.load Loading CoreContainer using Solr Home: '/usr/home/hudson/hudson-slave/workspace/Lucene-Solr-Tests-4.x-java7/solr/build/solr-core/test-files/solr/'
[junit4:junit4]   2> 2190 T923 oasc.SolrResourceLoader.<init> new SolrResourceLoader for directory: '/usr/home/hudson/hudson-slave/workspace/Lucene-Solr-Tests-4.x-java7/solr/build/solr-core/test-files/solr/'
[junit4:junit4]   2> 2213 T923 oasc.CoreContainer.load Registering Log Listener
[junit4:junit4]   2> 2225 T923 oasc.CoreContainer.initZooKeeper Zookeeper client=127.0.0.1:31768/solr
[junit4:junit4]   2> 2244 T923 oaz.ZooKeeper.<init> Initiating client connection, connectString=127.0.0.1:31768/solr sessionTimeout=5000 watcher=org.apache.solr.common.cloud.ConnectionManager@6d4ec5a8
[junit4:junit4]   2> 2245 T942 oaz.ClientCnxn$SendThread.startConnect Opening socket connection to server /127.0.0.1:31768
[junit4:junit4]   2> 2245 T923 oascc.ConnectionManager.waitForConnected Waiting for client to connect to ZooKeeper
[junit4:junit4]   2> 2246 T942 oaz.ClientCnxn$SendThread.primeConnection Socket connection established to localhost/127.0.0.1:31768, initiating session
[junit4:junit4]   2> 2246 T925 oazs.NIOServerCnxn$Factory.run Accepted socket connection from /140.211.11.196:31778
[junit4:junit4]   2> 2247 T925 oazs.NIOServerCnxn.readConnectRequest Client attempting to establish new session at /140.211.11.196:31778
[junit4:junit4]   2> 2248 T927 oazs.NIOServerCnxn.finishSessionInit Established session 0x13a3d5b7a2c0002 with negotiated timeout 5000 for client /140.211.11.196:31778
[junit4:junit4]   2> 2248 T942 oaz.ClientCnxn$SendThread.readConnectResult Session establishment complete on server localhost/127.0.0.1:31768, sessionid = 0x13a3d5b7a2c0002, negotiated timeout = 5000
[junit4:junit4]   2> 2249 T943 oascc.ConnectionManager.process Watcher org.apache.solr.common.cloud.ConnectionManager@6d4ec5a8 name:ZooKeeperConnection Watcher:127.0.0.1:31768/solr got event WatchedEvent state:SyncConnected type:None path:null path:null type:None
[junit4:junit4]   2> 2249 T923 oascc.ConnectionManager.waitForConnected Client is connected to ZooKeeper
[junit4:junit4]   2> 2267 T929 oazs.PrepRequestProcessor.pRequest Got user-level KeeperException when processing sessionid:0x13a3d5b7a2c0002 type:create cxid:0x2 zxid:0xfffffffffffffffe txntype:unknown reqpath:n/a Error Path:/solr/overseer Error:KeeperErrorCode = NodeExists for /solr/overseer
[junit4:junit4]   2> 2276 T923 oascc.SolrZkClient.makePath makePath: /live_nodes
[junit4:junit4]   2> 2279 T923 oasc.ZkController.createEphemeralLiveNode Register node as live in ZooKeeper:/live_nodes/127.0.0.1:31777_solr
[junit4:junit4]   2> 2283 T929 oazs.PrepRequestProcessor.pRequest Got user-level KeeperException when processing sessionid:0x13a3d5b7a2c0002 type:delete cxid:0x7 zxid:0xfffffffffffffffe txntype:unknown reqpath:n/a Error Path:/solr/live_nodes/127.0.0.1:31777_solr Error:KeeperErrorCode = NoNode for /solr/live_nodes/127.0.0.1:31777_solr
[junit4:junit4]   2> 2285 T923 oascc.SolrZkClient.makePath makePath: /live_nodes/127.0.0.1:31777_solr
[junit4:junit4]   2> 2288 T923 oashc.HttpShardHandlerFactory.getParameter Setting socketTimeout to: 0
[junit4:junit4]   2> 2289 T923 oashc.HttpShardHandlerFactory.getParameter Setting urlScheme to: http://
[junit4:junit4]   2> 2289 T923 oashc.HttpShardHandlerFactory.getParameter Setting connTimeout to: 0
[junit4:junit4]   2> 2289 T923 oashc.HttpShardHandlerFactory.getParameter Setting maxConnectionsPerHost to: 20
[junit4:junit4]   2> 2289 T923 oashc.HttpShardHandlerFactory.getParameter Setting corePoolSize to: 0
[junit4:junit4]   2> 2290 T923 oashc.HttpShardHandlerFactory.getParameter Setting maximumPoolSize to: 2147483647
[junit4:junit4]   2> 2290 T923 oashc.HttpShardHandlerFactory.getParameter Setting maxThreadIdleTime to: 5
[junit4:junit4]   2> 2290 T923 oashc.HttpShardHandlerFactory.getParameter Setting sizeOfQueue to: -1
[junit4:junit4]   2> 2291 T923 oashc.HttpShardHandlerFactory.getParameter Setting fairnessPolicy to: false
[junit4:junit4]   2> 2291 T923 oascsi.HttpClientUtil.createClient Creating new http client, config:maxConnectionsPerHost=20&maxConnections=10000&socketTimeout=0&connTimeout=0&retry=false
[junit4:junit4]   2> 2304 T923 oascc.SolrZkClient.makePath makePath: /overseer_elect/election
[junit4:junit4]   2> 2323 T929 oazs.PrepRequestProcessor.pRequest Got user-level KeeperException when processing sessionid:0x13a3d5b7a2c0002 type:delete cxid:0x15 zxid:0xfffffffffffffffe txntype:unknown reqpath:n/a Error Path:/solr/overseer_elect/leader Error:KeeperErrorCode = NoNode for /solr/overseer_elect/leader
[junit4:junit4]   2> 2324 T923 oascc.SolrZkClient.makePath makePath: /overseer_elect/leader
[junit4:junit4]   2> 2327 T923 oasc.Overseer.start Overseer (id=88450605788168194-127.0.0.1:31777_solr-n_0000000000) starting
[junit4:junit4]   2> 2328 T929 oazs.PrepRequestProcessor.pRequest Got user-level KeeperException when processing sessionid:0x13a3d5b7a2c0002 type:create cxid:0x1a zxid:0xfffffffffffffffe txntype:unknown reqpath:n/a Error Path:/solr/overseer Error:KeeperErrorCode = NodeExists for /solr/overseer
[junit4:junit4]   2> 2344 T929 oazs.PrepRequestProcessor.pRequest Got user-level KeeperException when processing sessionid:0x13a3d5b7a2c0002 type:create cxid:0x1b zxid:0xfffffffffffffffe txntype:unknown reqpath:n/a Error Path:/solr/overseer Error:KeeperErrorCode = NodeExists for /solr/overseer
[junit4:junit4]   2> 2345 T929 oazs.PrepRequestProcessor.pRequest Got user-level KeeperException when processing sessionid:0x13a3d5b7a2c0002 type:create cxid:0x1c zxid:0xfffffffffffffffe txntype:unknown reqpath:n/a Error Path:/solr/overseer Error:KeeperErrorCode = NodeExists for /solr/overseer
[junit4:junit4]   2> 2350 T929 oazs.PrepRequestProcessor.pRequest Got user-level KeeperException when processing sessionid:0x13a3d5b7a2c0002 type:create cxid:0x1d zxid:0xfffffffffffffffe txntype:unknown reqpath:n/a Error Path:/solr/overseer Error:KeeperErrorCode = NodeExists for /solr/overseer
[junit4:junit4]   2> 2357 T945 oasc.OverseerCollectionProcessor.run Process current queue of collection creations
[junit4:junit4]   2> 2369 T923 oascc.SolrZkClient.makePath makePath: /clusterstate.json
[junit4:junit4]   2> 2377 T923 oascc.ZkStateReader.createClusterStateWatchersAndUpdate Updating cluster state from ZooKeeper... 
[junit4:junit4]   2> 2393 T944 oasc.Overseer$ClusterStateUpdater.run Starting to work on the main queue
[junit4:junit4]   2> 2400 T923 oasc.CoreContainer.create Creating SolrCore 'collection1' using instanceDir: /usr/home/hudson/hudson-slave/workspace/Lucene-Solr-Tests-4.x-java7/solr/build/solr-core/test-files/solr/collection1
[junit4:junit4]   2> 2400 T923 oasc.ZkController.createCollectionZkNode Check for collection zkNode:control_collection
[junit4:junit4]   2> 2401 T923 oasc.ZkController.createCollectionZkNode Collection zkNode exists
[junit4:junit4]   2> 2402 T923 oasc.ZkController.readConfigName Load collection config from:/collections/control_collection
[junit4:junit4]   2> 2404 T923 oasc.SolrResourceLoader.<init> new SolrResourceLoader for directory: '/usr/home/hudson/hudson-slave/workspace/Lucene-Solr-Tests-4.x-java7/solr/build/solr-core/test-files/solr/collection1/'
[junit4:junit4]   2> 2404 T923 oasc.SolrResourceLoader.replaceClassLoader Adding 'file:/usr/home/hudson/hudson-slave/workspace/Lucene-Solr-Tests-4.x-java7/solr/build/solr-core/test-files/solr/collection1/lib/README' to classloader
[junit4:junit4]   2> 2405 T923 oasc.SolrResourceLoader.replaceClassLoader Adding 'file:/usr/home/hudson/hudson-slave/workspace/Lucene-Solr-Tests-4.x-java7/solr/build/solr-core/test-files/solr/collection1/lib/classes/' to classloader
[junit4:junit4]   2> 2454 T923 oasc.SolrConfig.<init> Using Lucene MatchVersion: LUCENE_41
[junit4:junit4]   2> 2503 T923 oasc.SolrConfig.<init> Loaded SolrConfig: solrconfig.xml
[junit4:junit4]   2> 2604 T923 oass.IndexSchema.readSchema Reading Solr Schema
[junit4:junit4]   2> 2609 T923 oass.IndexSchema.readSchema Schema name=test
[junit4:junit4]   2> 3069 T923 oass.OpenExchangeRatesOrgProvider.init Initialized with rates=open-exchange-rates.json, refreshInterval=1440.
[junit4:junit4]   2> 3078 T923 oass.IndexSchema.readSchema default search field in schema is text
[junit4:junit4]   2> 3081 T923 oass.IndexSchema.readSchema unique key field: id
[junit4:junit4]   2> 3097 T923 oass.FileExchangeRateProvider.reload Reloading exchange rates from file currency.xml
[junit4:junit4]   2> 3101 T923 oass.FileExchangeRateProvider.reload Reloading exchange rates from file currency.xml
[junit4:junit4]   2> 3105 T923 oass.OpenExchangeRatesOrgProvider.reload Reloading exchange rates from open-exchange-rates.json
[junit4:junit4]   2> 3107 T923 oass.OpenExchangeRatesOrgProvider.reload Reloading exchange rates from open-exchange-rates.json
[junit4:junit4]   2> 3108 T923 oasc.SolrCore.<init> [collection1] Opening new SolrCore at /usr/home/hudson/hudson-slave/workspace/Lucene-Solr-Tests-4.x-java7/solr/build/solr-core/test-files/solr/collection1/, dataDir=./org.apache.solr.cloud.BasicDistributedZkTest-1349649135906/control/data/
[junit4:junit4]   2> 3109 T923 oasc.JmxMonitoredMap.<init> JMX monitoring is enabled. Adding Solr mbeans to JMX Server: com.sun.jmx.mbeanserver.JmxMBeanServer@65614411
[junit4:junit4]   2> 3110 T923 oasc.SolrCore.getNewIndexDir New index directory detected: old=null new=./org.apache.solr.cloud.BasicDistributedZkTest-1349649135906/control/data/index/
[junit4:junit4]   2> 3110 T923 oasc.SolrCore.initIndex WARNING [collection1] Solr index directory './org.apache.solr.cloud.BasicDistributedZkTest-1349649135906/control/data/index' doesn't exist. Creating new index...
[junit4:junit4]   2> 3111 T923 oasc.CachingDirectoryFactory.get return new directory for /usr/home/hudson/hudson-slave/workspace/Lucene-Solr-Tests-4.x-java7/solr/build/solr-core/test/J0/./org.apache.solr.cloud.BasicDistributedZkTest-1349649135906/control/data/index forceNew:false
[junit4:junit4]   2> 3117 T923 oasc.SolrDeletionPolicy.onCommit SolrDeletionPolicy.onCommit: commits:num=1
[junit4:junit4]   2> 		commit{dir=NRTCachingDirectory(org.apache.lucene.store.NIOFSDirectory@/usr/home/hudson/hudson-slave/workspace/Lucene-Solr-Tests-4.x-java7/solr/build/solr-core/test/J0/org.apache.solr.cloud.BasicDistributedZkTest-1349649135906/control/data/index lockFactory=org.apache.lucene.store.NativeFSLockFactory@26b1396e; maxCacheMB=48.0 maxMergeSizeMB=4.0),segFN=segments_1,generation=1,filenames=[segments_1]
[junit4:junit4]   2> 3117 T923 oasc.SolrDeletionPolicy.updateCommits newest commit = 1
[junit4:junit4]   2> 3118 T923 oasc.SolrCore.initWriters created xml: solr.XMLResponseWriter
[junit4:junit4]   2> 3120 T923 oasup.UpdateRequestProcessorChain.init inserting DistributedUpdateProcessorFactory into updateRequestProcessorChain "dedupe"
[junit4:junit4]   2> 3120 T923 oasup.UpdateRequestProcessorChain.init inserting DistributedUpdateProcessorFactory into updateRequestProcessorChain "dedupe-allfields"
[junit4:junit4]   2> 3121 T923 oasup.UpdateRequestProcessorChain.init inserting DistributedUpdateProcessorFactory into updateRequestProcessorChain "stored_sig"
[junit4:junit4]   2> 3121 T923 oasup.UpdateRequestProcessorChain.init inserting DistributedUpdateProcessorFactory into updateRequestProcessorChain "uniq-fields"
[junit4:junit4]   2> 3122 T923 oasup.UpdateRequestProcessorChain.init inserting DistributedUpdateProcessorFactory into updateRequestProcessorChain "distrib-dup-test-chain-implicit"
[junit4:junit4]   2> 3122 T923 oasc.RequestHandlers.initHandlersFromConfig adding lazy requestHandler: solr.ReplicationHandler
[junit4:junit4]   2> 3122 T923 oasc.RequestHandlers.initHandlersFromConfig created /replication: solr.ReplicationHandler
[junit4:junit4]   2> 3123 T923 oasc.RequestHandlers.initHandlersFromConfig created standard: solr.StandardRequestHandler
[junit4:junit4]   2> 3123 T923 oasc.RequestHandlers.initHandlersFromConfig created /get: solr.RealTimeGetHandler
[junit4:junit4]   2> 3124 T923 oasc.RequestHandlers.initHandlersFromConfig created dismax: solr.SearchHandler
[junit4:junit4]   2> 3124 T923 oasc.RequestHandlers.initHandlersFromConfig created mock: org.apache.solr.core.MockQuerySenderListenerReqHandler
[junit4:junit4]   2> 3125 T923 oasc.RequestHandlers.initHandlersFromConfig created /admin/: org.apache.solr.handler.admin.AdminHandlers
[junit4:junit4]   2> 3125 T923 oasc.RequestHandlers.initHandlersFromConfig created defaults: solr.StandardRequestHandler
[junit4:junit4]   2> 3126 T923 oasc.RequestHandlers.initHandlersFromConfig adding lazy requestHandler: solr.StandardRequestHandler
[junit4:junit4]   2> 3126 T923 oasc.RequestHandlers.initHandlersFromConfig created lazy: solr.StandardRequestHandler
[junit4:junit4]   2> 3126 T923 oasc.RequestHandlers.initHandlersFromConfig created /update: solr.UpdateRequestHandler
[junit4:junit4]   2> 3127 T923 oasc.RequestHandlers.initHandlersFromConfig created /terms: org.apache.solr.handler.component.SearchHandler
[junit4:junit4]   2> 3127 T923 oasc.RequestHandlers.initHandlersFromConfig created spellCheckCompRH: org.apache.solr.handler.component.SearchHandler
[junit4:junit4]   2> 3128 T923 oasc.RequestHandlers.initHandlersFromConfig created spellCheckCompRH_Direct: org.apache.solr.handler.component.SearchHandler
[junit4:junit4]   2> 3128 T923 oasc.RequestHandlers.initHandlersFromConfig created spellCheckWithWordbreak: org.apache.solr.handler.component.SearchHandler
[junit4:junit4]   2> 3129 T923 oasc.RequestHandlers.initHandlersFromConfig created spellCheckWithWordbreak_Direct: org.apache.solr.handler.component.SearchHandler
[junit4:junit4]   2> 3129 T923 oasc.RequestHandlers.initHandlersFromConfig created spellCheckCompRH1: org.apache.solr.handler.component.SearchHandler
[junit4:junit4]   2> 3130 T923 oasc.RequestHandlers.initHandlersFromConfig created tvrh: org.apache.solr.handler.component.SearchHandler
[junit4:junit4]   2> 3130 T923 oasc.RequestHandlers.initHandlersFromConfig created /mlt: solr.MoreLikeThisHandler
[junit4:junit4]   2> 3131 T923 oasc.RequestHandlers.initHandlersFromConfig created /debug/dump: solr.DumpRequestHandler
[junit4:junit4]   2> 3139 T923 oashl.XMLLoader.init xsltCacheLifetimeSeconds=60
[junit4:junit4]   2> 3143 T923 oasc.SolrCore.initDeprecatedSupport WARNING solrconfig.xml uses deprecated <admin/gettableFiles>, Please update your config to use the ShowFileRequestHandler.
[junit4:junit4]   2> 3144 T923 oasc.SolrCore.initDeprecatedSupport WARNING adding ShowFileRequestHandler with hidden files: [SCHEMA.XML, OLD_SYNONYMS.TXT, STOPWORDS.TXT, PROTWORDS.TXT, OPEN-EXCHANGE-RATES.JSON, SYNONYMS.TXT, CURRENCY.XML, MAPPING-ISOLATIN1ACCENT.TXT]
[junit4:junit4]   2> 3147 T923 oass.SolrIndexSearcher.<init> Opening Searcher@15dd234c main
[junit4:junit4]   2> 3148 T923 oasu.CommitTracker.<init> Hard AutoCommit: disabled
[junit4:junit4]   2> 3149 T923 oasu.CommitTracker.<init> Soft AutoCommit: disabled
[junit4:junit4]   2> 3149 T923 oashc.SpellCheckComponent.inform Initializing spell checkers
[junit4:junit4]   2> 3155 T923 oass.DirectSolrSpellChecker.init init: {name=direct,classname=DirectSolrSpellChecker,field=lowerfilt,minQueryLength=3}
[junit4:junit4]   2> 3206 T946 oasc.SolrCore.registerSearcher [collection1] Registered new searcher Searcher@15dd234c main{StandardDirectoryReader(segments_1:1)}
[junit4:junit4]   2> 3210 T929 oazs.PrepRequestProcessor.pRequest Got user-level KeeperException when processing sessionid:0x13a3d5b7a2c0002 type:create cxid:0x53 zxid:0xfffffffffffffffe txntype:unknown reqpath:n/a Error Path:/solr/overseer/queue Error:KeeperErrorCode = NoNode for /solr/overseer/queue
[junit4:junit4]   2> 3222 T923 oasc.CoreContainer.register registering core: collection1
[junit4:junit4]   2> 3223 T923 oasc.ZkController.register Register shard - core:collection1 address:http://127.0.0.1:31777/solr shardId:control_shard
[junit4:junit4]   2> 3232 T923 oascsi.HttpClientUtil.createClient Creating new http client, config:maxConnections=10000&maxConnectionsPerHost=20&connTimeout=30000&socketTimeout=30000&retry=false
[junit4:junit4]   2> 3244 T923 oascc.SolrZkClient.makePath makePath: /collections/control_collection/leader_elect/control_shard/election
[junit4:junit4]   2> 3266 T929 oazs.PrepRequestProcessor.pRequest Got user-level KeeperException when processing sessionid:0x13a3d5b7a2c0002 type:delete cxid:0x62 zxid:0xfffffffffffffffe txntype:unknown reqpath:n/a Error Path:/solr/collections/control_collection/leaders Error:KeeperErrorCode = NoNode for /solr/collections/control_collection/leaders
[junit4:junit4]   2> 3267 T923 oasc.ShardLeaderElectionContext.runLeaderProcess Running the leader process.
[junit4:junit4]   2> 3268 T929 oazs.PrepRequestProcessor.pRequest Got user-level KeeperException when processing sessionid:0x13a3d5b7a2c0002 type:create cxid:0x63 zxid:0xfffffffffffffffe txntype:unknown reqpath:n/a Error Path:/solr/overseer Error:KeeperErrorCode = NodeExists for /solr/overseer
[junit4:junit4]   2> 3399 T944 oascc.ZkStateReader.updateClusterState Updating cloud state from ZooKeeper... 
[junit4:junit4]   2> 3416 T929 oazs.PrepRequestProcessor.pRequest Got user-level KeeperException when processing sessionid:0x13a3d5b7a2c0002 type:create cxid:0x6a zxid:0xfffffffffffffffe txntype:unknown reqpath:n/a Error Path:/solr/overseer/queue-work Error:KeeperErrorCode = NoNode for /solr/overseer/queue-work
[junit4:junit4]   2> 3440 T943 oascc.ZkStateReader$2.process A cluster state change has occurred - updating...
[junit4:junit4]   2> 3780 T923 oasc.ShardLeaderElectionContext.waitForReplicasToComeUp Enough replicas found to continue.
[junit4:junit4]   2> 3780 T923 oasc.ShardLeaderElectionContext.runLeaderProcess I may be the new leader - try and sync
[junit4:junit4]   2> 3781 T923 oasc.SyncStrategy.sync Sync replicas to http://127.0.0.1:31777/solr/collection1/
[junit4:junit4]   2> 3781 T923 oasc.SyncStrategy.syncReplicas Sync Success - now sync replicas to me
[junit4:junit4]   2> 3781 T923 oasc.SyncStrategy.syncToMe http://127.0.0.1:31777/solr/collection1/ has no replicas
[junit4:junit4]   2> 3782 T923 oasc.ShardLeaderElectionContext.runLeaderProcess I am the new leader: http://127.0.0.1:31777/solr/collection1/
[junit4:junit4]   2> 3782 T923 oascc.SolrZkClient.makePath makePath: /collections/control_collection/leaders/control_shard
[junit4:junit4]   2> 3788 T929 oazs.PrepRequestProcessor.pRequest Got user-level KeeperException when processing sessionid:0x13a3d5b7a2c0002 type:create cxid:0x88 zxid:0xfffffffffffffffe txntype:unknown reqpath:n/a Error Path:/solr/overseer Error:KeeperErrorCode = NodeExists for /solr/overseer
[junit4:junit4]   2> 3948 T944 oascc.ZkStateReader.updateClusterState Updating cloud state from ZooKeeper... 
[junit4:junit4]   2> 3961 T943 oascc.ZkStateReader$2.process A cluster state change has occurred - updating...
[junit4:junit4]   2> 4002 T923 oasc.ZkController.register We are http://127.0.0.1:31777/solr/collection1/ and leader is http://127.0.0.1:31777/solr/collection1/
[junit4:junit4]   2> 4002 T923 oasc.ZkController.register No LogReplay needed for core=collection1 baseURL=http://127.0.0.1:31777/solr
[junit4:junit4]   2> 4003 T923 oasc.ZkController.checkRecovery I am the leader, no recovery necessary
[junit4:junit4]   2> 4049 T923 oascc.ZkStateReader.updateClusterState Updating cloud state from ZooKeeper... 
[junit4:junit4]   2> 4050 T923 oass.SolrDispatchFilter.init user.dir=/usr/home/hudson/hudson-slave/workspace/Lucene-Solr-Tests-4.x-java7/solr/build/solr-core/test/J0
[junit4:junit4]   2> 4050 T923 oass.SolrDispatchFilter.init SolrDispatchFilter.init() done
[junit4:junit4]   2> 4051 T923 oascsi.HttpClientUtil.createClient Creating new http client, config:maxConnections=128&maxConnectionsPerHost=32&followRedirects=false
[junit4:junit4]   2> 4161 T923 oejs.Server.doStart jetty-8.1.2.v20120308
[junit4:junit4]   2> 4164 T923 oejs.AbstractConnector.doStart Started SocketConnector@0.0.0.0:31785
[junit4:junit4]   2> 4164 T923 oasc.SolrResourceLoader.locateSolrHome JNDI not configured for solr (NoInitialContextEx)
[junit4:junit4]   2> 4164 T923 oasc.SolrResourceLoader.locateSolrHome using system property solr.solr.home: /usr/home/hudson/hudson-slave/workspace/Lucene-Solr-Tests-4.x-java7/solr/build/solr-core/test/J0/./solrtest-jetty1-1349649139959
[junit4:junit4]   2> 4165 T923 oasc.SolrResourceLoader.<init> new SolrResourceLoader for deduced Solr Home: '/usr/home/hudson/hudson-slave/workspace/Lucene-Solr-Tests-4.x-java7/solr/build/solr-core/test/J0/./solrtest-jetty1-1349649139959/'
[junit4:junit4]   2> 4192 T923 oass.SolrDispatchFilter.init SolrDispatchFilter.init()
[junit4:junit4]   2> 4192 T923 oasc.SolrResourceLoader.locateSolrHome JNDI not configured for solr (NoInitialContextEx)
[junit4:junit4]   2> 4192 T923 oasc.SolrResourceLoader.locateSolrHome using system property solr.solr.home: /usr/home/hudson/hudson-slave/workspace/Lucene-Solr-Tests-4.x-java7/solr/build/solr-core/test/J0/./solrtest-jetty1-1349649139959
[junit4:junit4]   2> 4193 T923 oasc.CoreContainer$Initializer.initialize looking for solr.xml: /usr/home/hudson/hudson-slave/workspace/Lucene-Solr-Tests-4.x-java7/solr/build/solr-core/test/J0/./solrtest-jetty1-1349649139959/solr.xml
[junit4:junit4]   2> 4193 T923 oasc.CoreContainer.<init> New CoreContainer 228878730
[junit4:junit4]   2> 4193 T923 oasc.CoreContainer.load Loading CoreContainer using Solr Home: '/usr/home/hudson/hudson-slave/workspace/Lucene-Solr-Tests-4.x-java7/solr/build/solr-core/test/J0/./solrtest-jetty1-1349649139959/'
[junit4:junit4]   2> 4194 T923 oasc.SolrResourceLoader.<init> new SolrResourceLoader for directory: '/usr/home/hudson/hudson-slave/workspace/Lucene-Solr-Tests-4.x-java7/solr/build/solr-core/test/J0/./solrtest-jetty1-1349649139959/'
[junit4:junit4]   2> 4216 T923 oasc.CoreContainer.load Registering Log Listener
[junit4:junit4]   2> 4227 T923 oasc.CoreContainer.initZooKeeper Zookeeper client=127.0.0.1:31768/solr
[junit4:junit4]   2> 4227 T923 oaz.ZooKeeper.<init> Initiating client connection, connectString=127.0.0.1:31768/solr sessionTimeout=5000 watcher=org.apache.solr.common.cloud.ConnectionManager@4401d9b9
[junit4:junit4]   2> 4228 T956 oaz.ClientCnxn$SendThread.startConnect Opening socket connection to server /127.0.0.1:31768
[junit4:junit4]   2> 4228 T923 oascc.ConnectionManager.waitForConnected Waiting for client to connect to ZooKeeper
[junit4:junit4]   2> 4229 T956 oaz.ClientCnxn$SendThread.primeConnection Socket connection established to localhost/127.0.0.1:31768, initiating session
[junit4:junit4]   2> 4230 T925 oazs.NIOServerCnxn$Factory.run Accepted socket connection from /140.211.11.196:31786
[junit4:junit4]   2> 4230 T925 oazs.NIOServerCnxn.readConnectRequest Client attempting to establish new session at /140.211.11.196:31786
[junit4:junit4]   2> 4292 T927 oazs.NIOServerCnxn.finishSessionInit Established session 0x13a3d5b7a2c0003 with negotiated timeout 5000 for client /140.211.11.196:31786
[junit4:junit4]   2> 4293 T956 oaz.ClientCnxn$SendThread.readConnectResult Session establishment complete on server localhost/127.0.0.1:31768, sessionid = 0x13a3d5b7a2c0003, negotiated timeout = 5000
[junit4:junit4]   2> 4293 T957 oascc.ConnectionManager.process Watcher org.apache.solr.common.cloud.ConnectionManager@4401d9b9 name:ZooKeeperConnection Watcher:127.0.0.1:31768/solr got event WatchedEvent state:SyncConnected type:None path:null path:null type:None
[junit4:junit4]   2> 4293 T923 oascc.ConnectionManager.waitForConnected Client is connected to ZooKeeper
[junit4:junit4]   2> 4294 T929 oazs.PrepRequestProcessor.pRequest Got user-level KeeperException when processing sessionid:0x13a3d5b7a2c0003 type:create cxid:0x1 zxid:0xfffffffffffffffe txntype:unknown reqpath:n/a Error Path:/solr/overseer Error:KeeperErrorCode = NodeExists for /solr/overseer
[junit4:junit4]   2> 4296 T929 oazs.PrepRequestProcessor.pRequest Got user-level KeeperException when processing sessionid:0x13a3d5b7a2c0003 type:create cxid:0x2 zxid:0xfffffffffffffffe txntype:unknown reqpath:n/a Error Path:/solr/overseer Error:KeeperErrorCode = NodeExists for /solr/overseer
[junit4:junit4]   2> 4336 T923 oasc.ZkController.createEphemeralLiveNode Register node as live in ZooKeeper:/live_nodes/127.0.0.1:31785_solr
[junit4:junit4]   2> 4337 T929 oazs.PrepRequestProcessor.pRequest Got user-level KeeperException when processing sessionid:0x13a3d5b7a2c0003 type:delete cxid:0x4 zxid:0xfffffffffffffffe txntype:unknown reqpath:n/a Error Path:/solr/live_nodes/127.0.0.1:31785_solr Error:KeeperErrorCode = NoNode for /solr/live_nodes/127.0.0.1:31785_solr
[junit4:junit4]   2> 4343 T923 oascc.SolrZkClient.makePath makePath: /live_nodes/127.0.0.1:31785_solr
[junit4:junit4]   2> 4346 T943 oascc.ZkStateReader$3.process Updating live nodes
[junit4:junit4]   2> 4347 T923 oashc.HttpShardHandlerFactory.getParameter Setting socketTimeout to: 0
[junit4:junit4]   2> 4347 T923 oashc.HttpShardHandlerFactory.getParameter Setting urlScheme to: http://
[junit4:junit4]   2> 4347 T923 oashc.HttpShardHandlerFactory.getParameter Setting connTimeout to: 0
[junit4:junit4]   2> 4348 T923 oashc.HttpShardHandlerFactory.getParameter Setting maxConnectionsPerHost to: 20
[junit4:junit4]   2> 4348 T923 oashc.HttpShardHandlerFactory.getParameter Setting corePoolSize to: 0
[junit4:junit4]   2> 4349 T923 oashc.HttpShardHandlerFactory.getParameter Setting maximumPoolSize to: 2147483647
[junit4:junit4]   2> 4349 T923 oashc.HttpShardHandlerFactory.getParameter Setting maxThreadIdleTime to: 5
[junit4:junit4]   2> 4350 T923 oashc.HttpShardHandlerFactory.getParameter Setting sizeOfQueue to: -1
[junit4:junit4]   2> 4350 T923 oashc.HttpShardHandlerFactory.getParameter Setting fairnessPolicy to: false
[junit4:junit4]   2> 4350 T923 oascsi.HttpClientUtil.createClient Creating new http client, config:maxConnectionsPerHost=20&maxConnections=10000&socketTimeout=0&connTimeout=0&retry=false
[junit4:junit4]   2> 4372 T923 oascc.ZkStateReader.createClusterStateWatchersAndUpdate Updating cluster state from ZooKeeper... 
[junit4:junit4]   2> 4399 T923 oasc.CoreContainer.create Creating SolrCore 'collection1' using instanceDir: /usr/home/hudson/hudson-slave/workspace/Lucene-Solr-Tests-4.x-java7/solr/build/solr-core/test/J0/./solrtest-jetty1-1349649139959/collection1
[junit4:junit4]   2> 4399 T923 oasc.ZkController.createCollectionZkNode Check for collection zkNode:collection1
[junit4:junit4]   2> 4401 T923 oasc.ZkController.createCollectionZkNode Collection zkNode exists
[junit4:junit4]   2> 4401 T923 oasc.ZkController.readConfigName Load collection config from:/collections/collection1
[junit4:junit4]   2> 4403 T923 oasc.SolrResourceLoader.<init> new SolrResourceLoader for directory: '/usr/home/hudson/hudson-slave/workspace/Lucene-Solr-Tests-4.x-java7/solr/build/solr-core/test/J0/./solrtest-jetty1-1349649139959/collection1/'
[junit4:junit4]   2> 4404 T923 oasc.SolrResourceLoader.replaceClassLoader Adding 'file:/usr/home/hudson/hudson-slave/workspace/Lucene-Solr-Tests-4.x-java7/solr/build/solr-core/test/J0/solrtest-jetty1-1349649139959/collection1/lib/classes/' to classloader
[junit4:junit4]   2> 4405 T923 oasc.SolrResourceLoader.replaceClassLoader Adding 'file:/usr/home/hudson/hudson-slave/workspace/Lucene-Solr-Tests-4.x-java7/solr/build/solr-core/test/J0/solrtest-jetty1-1349649139959/collection1/lib/README' to classloader
[junit4:junit4]   2> 4452 T923 oasc.SolrConfig.<init> Using Lucene MatchVersion: LUCENE_41
[junit4:junit4]   2> 4477 T944 oascc.ZkStateReader.updateClusterState Updating cloud state from ZooKeeper... 
[junit4:junit4]   2> 4490 T943 oascc.ZkStateReader$2.process A cluster state change has occurred - updating...
[junit4:junit4]   2> 4490 T957 oascc.ZkStateReader$2.process A cluster state change has occurred - updating...
[junit4:junit4]   2> 4521 T923 oasc.SolrConfig.<init> Loaded SolrConfig: solrconfig.xml
[junit4:junit4]   2> 4622 T923 oass.IndexSchema.readSchema Reading Solr Schema
[junit4:junit4]   2> 4628 T923 oass.IndexSchema.readSchema Schema name=test
[junit4:junit4]   2> 5207 T923 oass.OpenExchangeRatesOrgProvider.init Initialized with rates=open-exchange-rates.json, refreshInterval=1440.
[junit4:junit4]   2> 5218 T923 oass.IndexSchema.readSchema default search field in schema is text
[junit4:junit4]   2> 5222 T923 oass.IndexSchema.readSchema unique key field: id
[junit4:junit4]   2> 5240 T923 oass.FileExchangeRateProvider.reload Reloading exchange rates from file currency.xml
[junit4:junit4]   2> 5245 T923 oass.FileExchangeRateProvider.reload Reloading exchange rates from file currency.xml
[junit4:junit4]   2> 5250 T923 oass.OpenExchangeRatesOrgProvider.reload Reloading exchange rates from open-exchange-rates.json
[junit4:junit4]   2> 5252 T923 oass.OpenExchangeRatesOrgProvider.reload Reloading exchange rates from open-exchange-rates.json
[junit4:junit4]   2> 5253 T923 oasc.SolrCore.<init> [collection1] Opening new SolrCore at /usr/home/hudson/hudson-slave/workspace/Lucene-Solr-Tests-4.x-java7/solr/build/solr-core/test/J0/./solrtest-jetty1-1349649139959/collection1/, dataDir=./org.apache.solr.cloud.BasicDistributedZkTest-1349649135906/jetty1/
[junit4:junit4]   2> 5254 T923 oasc.JmxMonitoredMap.<init> JMX monitoring is enabled. Adding Solr mbeans to JMX Server: com.sun.jmx.mbeanserver.JmxMBeanServer@65614411
[junit4:junit4]   2> 5255 T923 oasc.SolrCore.getNewIndexDir New index directory detected: old=null new=./org.apache.solr.cloud.BasicDistributedZkTest-1349649135906/jetty1/index/
[junit4:junit4]   2> 5256 T923 oasc.SolrCore.initIndex WARNING [collection1] Solr index directory './org.apache.solr.cloud.BasicDistributedZkTest-1349649135906/jetty1/index' doesn't exist. Creating new index...
[junit4:junit4]   2> 5257 T923 oasc.CachingDirectoryFactory.get return new directory for /usr/home/hudson/hudson-slave/workspace/Lucene-Solr-Tests-4.x-java7/solr/build/solr-core/test/J0/./org.apache.solr.cloud.BasicDistributedZkTest-1349649135906/jetty1/index forceNew:false
[junit4:junit4]   2> 5265 T923 oasc.SolrDeletionPolicy.onCommit SolrDeletionPolicy.onCommit: commits:num=1
[junit4:junit4]   2> 		commit{dir=NRTCachingDirectory(org.apache.lucene.store.NIOFSDirectory@/usr/home/hudson/hudson-slave/workspace/Lucene-Solr-Tests-4.x-java7/solr/build/solr-core/test/J0/org.apache.solr.cloud.BasicDistributedZkTest-1349649135906/jetty1/index lockFactory=org.apache.lucene.store.NativeFSLockFactory@10a62a4b; maxCacheMB=48.0 maxMergeSizeMB=4.0),segFN=segments_1,generation=1,filenames=[segments_1]
[junit4:junit4]   2> 5266 T923 oasc.SolrDeletionPolicy.updateCommits newest commit = 1
[junit4:junit4]   2> 5267 T923 oasc.SolrCore.initWriters created xml: solr.XMLResponseWriter
[junit4:junit4]   2> 5270 T923 oasup.UpdateRequestProcessorChain.init inserting DistributedUpdateProcessorFactory into updateRequestProcessorChain "dedupe"
[junit4:junit4]   2> 5270 T923 oasup.UpdateRequestProcessorChain.init inserting DistributedUpdateProcessorFactory into updateRequestProcessorChain "dedupe-allfields"
[junit4:junit4]   2> 5271 T923 oasup.UpdateRequestProcessorChain.init inserting DistributedUpdateProcessorFactory into updateRequestProcessorChain "stored_sig"
[junit4:junit4]   2> 5271 T923 oasup.UpdateRequestProcessorChain.init inserting DistributedUpdateProcessorFactory into updateRequestProcessorChain "uniq-fields"
[junit4:junit4]   2> 5272 T923 oasup.UpdateRequestProcessorChain.init inserting DistributedUpdateProcessorFactory into updateRequestProcessorChain "distrib-dup-test-chain-implicit"
[junit4:junit4]   2> 5273 T923 oasc.RequestHandlers.initHandlersFromConfig adding lazy requestHandler: solr.ReplicationHandler
[junit4:junit4]   2> 5274 T923 oasc.RequestHandlers.initHandlersFromConfig created /replication: solr.ReplicationHandler
[junit4:junit4]   2> 5274 T923 oasc.RequestHandlers.initHandlersFromConfig created standard: solr.StandardRequestHandler
[junit4:junit4]   2> 5275 T923 oasc.RequestHandlers.initHandlersFromConfig created /get: solr.RealTimeGetHandler
[junit4:junit4]   2> 5276 T923 oasc.RequestHandlers.initHandlersFromConfig created dismax: solr.SearchHandler
[junit4:junit4]   2> 5277 T923 oasc.RequestHandlers.initHandlersFromConfig created mock: org.apache.solr.core.MockQuerySenderListenerReqHandler
[junit4:junit4]   2> 5278 T923 oasc.RequestHandlers.initHandlersFromConfig created /admin/: org.apache.solr.handler.admin.AdminHandlers
[junit4:junit4]   2> 5278 T923 oasc.RequestHandlers.initHandlersFromConfig created defaults: solr.StandardRequestHandler
[junit4:junit4]   2> 5279 T923 oasc.RequestHandlers.initHandlersFromConfig adding lazy requestHandler: solr.StandardRequestHandler
[junit4:junit4]   2> 5279 T923 oasc.RequestHandlers.initHandlersFromConfig created lazy: solr.StandardRequestHandler
[junit4:junit4]   2> 5280 T923 oasc.RequestHandlers.initHandlersFromConfig created /update: solr.UpdateRequestHandler
[junit4:junit4]   2> 5281 T923 oasc.RequestHandlers.initHandlersFromConfig created /terms: org.apache.solr.handler.component.SearchHandler
[junit4:junit4]   2> 5282 T923 oasc.RequestHandlers.initHandlersFromConfig created spellCheckCompRH: org.apache.solr.handler.component.SearchHandler
[junit4:junit4]   2> 5282 T923 oasc.RequestHandlers.initHandlersFromConfig created spellCheckCompRH_Direct: org.apache.solr.handler.component.SearchHandler
[junit4:junit4]   2> 5283 T923 oasc.RequestHandlers.initHandlersFromConfig created spellCheckWithWordbreak: org.apache.solr.handler.component.SearchHandler
[junit4:junit4]   2> 5284 T923 oasc.RequestHandlers.initHandlersFromConfig created spellCheckWithWordbreak_Direct: org.apache.solr.handler.component.SearchHandler
[junit4:junit4]   2> 5285 T923 oasc.RequestHandlers.initHandlersFromConfig created spellCheckCompRH1: org.apache.solr.handler.component.SearchHandler
[junit4:junit4]   2> 5286 T923 oasc.RequestHandlers.initHandlersFromConfig created tvrh: org.apache.solr.handler.component.SearchHandler
[junit4:junit4]   2> 5287 T923 oasc.RequestHandlers.initHandlersFromConfig created /mlt: solr.MoreLikeThisHandler
[junit4:junit4]   2> 5288 T923 oasc.RequestHandlers.initHandlersFromConfig created /debug/dump: solr.DumpRequestHandler
[junit4:junit4]   2> 5302 T923 oashl.XMLLoader.init xsltCacheLifetimeSeconds=60
[junit4:junit4]   2> 5307 T923 oasc.SolrCore.initDeprecatedSupport WARNING solrconfig.xml uses deprecated <admin/gettableFiles>, Please update your config to use the ShowFileRequestHandler.
[junit4:junit4]   2> 5308 T923 oasc.SolrCore.initDeprecatedSupport WARNING adding ShowFileRequestHandler with hidden files: [SCHEMA.XML, OLD_SYNONYMS.TXT, STOPWORDS.TXT, PROTWORDS.TXT, OPEN-EXCHANGE-RATES.JSON, SYNONYMS.TXT, CURRENCY.XML, MAPPING-ISOLATIN1ACCENT.TXT]
[junit4:junit4]   2> 5312 T923 oass.SolrIndexSearcher.<init> Opening Searcher@230c374c main
[junit4:junit4]   2> 5314 T923 oasu.CommitTracker.<init> Hard AutoCommit: disabled
[junit4:junit4]   2> 5314 T923 oasu.CommitTracker.<init> Soft AutoCommit: disabled
[junit4:junit4]   2> 5315 T923 oashc.SpellCheckComponent.inform Initializing spell checkers
[junit4:junit4]   2> 5323 T923 oass.DirectSolrSpellChecker.init init: {name=direct,classname=DirectSolrSpellChecker,field=lowerfilt,minQueryLength=3}
[junit4:junit4]   2> 5377 T958 oasc.SolrCore.registerSearcher [collection1] Registered new searcher Searcher@230c374c main{StandardDirectoryReader(segments_1:1)}
[junit4:junit4]   2> 5500 T944 oascc.ZkStateReader.updateClusterState Updating cloud state from ZooKeeper... 
[junit4:junit4]   2> 5515 T943 oascc.ZkStateReader$2.process A cluster state change has occurred - updating...
[junit4:junit4]   2> 5515 T957 oascc.ZkStateReader$2.process A cluster state change has occurred - updating...
[junit4:junit4]   2> 5886 T923 oasc.CoreContainer.register registering core: collection1
[junit4:junit4]   2> 5886 T923 oasc.ZkController.register Register shard - core:collection1 address:http://127.0.0.1:31785/solr shardId:shard1
[junit4:junit4]   2> 5888 T923 oascc.SolrZkClient.makePath makePath: /collections/collection1/leader_elect/shard1/election
[junit4:junit4]   2> 5905 T929 oazs.PrepRequestProcessor.pRequest Got user-level KeeperException when processing sessionid:0x13a3d5b7a2c0003 type:delete cxid:0x43 zxid:0xfffffffffffffffe txntype:unknown reqpath:n/a Error Path:/solr/collections/collection1/leaders Error:KeeperErrorCode = NoNode for /solr/collections/collection1/leaders
[junit4:junit4]   2> 5906 T923 oasc.ShardLeaderElectionContext.runLeaderProcess Running the leader process.
[junit4:junit4]   2> 5906 T929 oazs.PrepRequestProcessor.pRequest Got user-level KeeperException when processing sessionid:0x13a3d5b7a2c0003 type:create cxid:0x44 zxid:0xfffffffffffffffe txntype:unknown reqpath:n/a Error Path:/solr/overseer Error:KeeperErrorCode = NodeExists for /solr/overseer
[junit4:junit4]   2> 5909 T923 oasc.ShardLeaderElectionContext.waitForReplicasToComeUp Enough replicas found to continue.
[junit4:junit4]   2> 5909 T923 oasc.ShardLeaderElectionContext.runLeaderProcess I may be the new leader - try and sync
[junit4:junit4]   2> 5910 T923 oasc.SyncStrategy.sync Sync replicas to http://127.0.0.1:31785/solr/collection1/
[junit4:junit4]   2> 5910 T923 oasc.SyncStrategy.syncReplicas Sync Success - now sync replicas to me
[junit4:junit4]   2> 5911 T923 oasc.SyncStrategy.syncToMe http://127.0.0.1:31785/solr/collection1/ has no replicas
[junit4:junit4]   2> 5911 T923 oasc.ShardLeaderElectionContext.runLeaderProcess I am the new leader: http://127.0.0.1:31785/solr/collection1/
[junit4:junit4]   2> 5912 T923 oascc.SolrZkClient.makePath makePath: /collections/collection1/leaders/shard1
[junit4:junit4]   2> 5917 T929 oazs.PrepRequestProcessor.pRequest Got user-level KeeperException when processing sessionid:0x13a3d5b7a2c0003 type:create cxid:0x4e zxid:0xfffffffffffffffe txntype:unknown reqpath:n/a Error Path:/solr/overseer Error:KeeperErrorCode = NodeExists for /solr/overseer
[junit4:junit4]   2> 6026 T944 oascc.ZkStateReader.updateClusterState Updating cloud state from ZooKeeper... 
[junit4:junit4]   2> 6036 T943 oascc.ZkStateReader$2.process A cluster state change has occurred - updating...
[junit4:junit4]   2> 6036 T957 oascc.ZkStateReader$2.process A cluster state change has occurred - updating...
[junit4:junit4]   2> 6073 T923 oasc.ZkController.register We are http://127.0.0.1:31785/solr/collection1/ and leader is http://127.0.0.1:31785/solr/collection1/
[junit4:junit4]   2> 6073 T923 oasc.ZkController.register No LogReplay needed for core=collection1 baseURL=http://127.0.0.1:31785/solr
[junit4:junit4]   2> 6074 T923 oasc.ZkController.checkRecovery I am the leader, no recovery necessary
[junit4:junit4]   2> 6076 T923 oascc.ZkStateReader.updateClusterState Updating cloud state from ZooKeeper... 
[junit4:junit4]   2> 6077 T923 oass.SolrDispatchFilter.init user.dir=/usr/home/hudson/hudson-slave/workspace/Lucene-Solr-Tests-4.x-java7/solr/build/solr-core/test/J0
[junit4:junit4]   2> 6077 T923 oass.SolrDispatchFilter.init SolrDispatchFilter.init() done
[junit4:junit4]   2> 6078 T923 oascsi.HttpClientUtil.createClient Creating new http client, config:maxConnections=128&maxConnectionsPerHost=32&followRedirects=false
[junit4:junit4]   2> 6250 T923 oejs.Server.doStart jetty-8.1.2.v20120308
[junit4:junit4]   2> 6253 T923 oejs.AbstractConnector.doStart Started SocketConnector@0.0.0.0:31791
[junit4:junit4]   2> 6253 T923 oasc.SolrResourceLoader.locateSolrHome JNDI not configured for solr (NoInitialContextEx)
[junit4:junit4]   2> 6254 T923 oasc.SolrResourceLoader.locateSolrHome using system property solr.solr.home: /usr/home/hudson/hudson-slave/workspace/Lucene-Solr-Tests-4.x-java7/solr/build/solr-core/test/J0/./solrtest-jetty2-1349649141994
[junit4:junit4]   2> 6254 T923 oasc.SolrResourceLoader.<init> new SolrResourceLoader for deduced Solr Home: '/usr/home/hudson/hudson-slave/workspace/Lucene-Solr-Tests-4.x-java7/solr/build/solr-core/test/J0/./solrtest-jetty2-1349649141994/'
[junit4:junit4]   2> 6296 T923 oass.SolrDispatchFilter.init SolrDispatchFilter.init()
[junit4:junit4]   2> 6297 T923 oasc.SolrResourceLoader.locateSolrHome JNDI not configured for solr (NoInitialContextEx)
[junit4:junit4]   2> 6297 T923 oasc.SolrResourceLoader.locateSolrHome using system property solr.solr.home: /usr/home/hudson/hudson-slave/workspace/Lucene-Solr-Tests-4.x-java7/solr/build/solr-core/test/J0/./solrtest-jetty2-1349649141994
[junit4:junit4]   2> 6297 T923 oasc.CoreContainer$Initializer.initialize looking for solr.xml: /usr/home/hudson/hudson-slave/workspace/Lucene-Solr-Tests-4.x-java7/solr/build/solr-core/test/J0/./solrtest-jetty2-1349649141994/solr.xml
[junit4:junit4]   2> 6298 T923 oasc.CoreContainer.<init> New CoreContainer 1736318529
[junit4:junit4]   2> 6298 T923 oasc.CoreContainer.load Loading CoreContainer using Solr Home: '/usr/home/hudson/hudson-slave/workspace/Lucene-Solr-Tests-4.x-java7/solr/build/solr-core/test/J0/./solrtest-jetty2-1349649141994/'
[junit4:junit4]   2> 6299 T923 oasc.SolrResourceLoader.<init> new SolrResourceLoader for directory: '/usr/home/hudson/hudson-slave/workspace/Lucene-Solr-Tests-4.x-java7/solr/build/solr-core/test/J0/./solrtest-jetty2-1349649141994/'
[junit4:junit4]   2> 6331 T923 oasc.CoreContainer.load Registering Log Listener
[junit4:junit4]   2> 6347 T923 oasc.CoreContainer.initZooKeeper Zookeeper client=127.0.0.1:31768/solr
[junit4:junit4]   2> 6347 T923 oaz.ZooKeeper.<init> Initiating client connection, connectString=127.0.0.1:31768/solr sessionTimeout=5000 watcher=org.apache.solr.common.cloud.ConnectionManager@40594b8b
[junit4:junit4]   2> 6348 T968 oaz.ClientCnxn$SendThread.startConnect Opening socket connection to server /127.0.0.1:31768
[junit4:junit4]   2> 6348 T923 oascc.ConnectionManager.waitForConnected Waiting for client to connect to ZooKeeper
[junit4:junit4]   2> 6350 T968 oaz.ClientCnxn$SendThread.primeConnection Socket connection established to localhost/127.0.0.1:31768, initiating session
[junit4:junit4]   2> 6350 T925 oazs.NIOServerCnxn$Factory.run Accepted socket connection from /140.211.11.196:31792
[junit4:junit4]   2> 6350 T925 oazs.NIOServerCnxn.readConnectRequest Client attempting to establish new session at /140.211.11.196:31792
[junit4:junit4]   2> 6353 T927 oazs.NIOServerCnxn.finishSessionInit Established session 0x13a3d5b7a2c0004 with negotiated timeout 5000 for client /140.211.11.196:31792
[junit4:junit4]   2> 6353 T968 oaz.ClientCnxn$SendThread.readConnectResult Session establishment complete on server localhost/127.0.0.1:31768, sessionid = 0x13a3d5b7a2c0004, negotiated timeout = 5000
[junit4:junit4]   2> 6353 T969 oascc.ConnectionManager.process Watcher org.apache.solr.common.cloud.ConnectionManager@40594b8b name:ZooKeeperConnection Watcher:127.0.0.1:31768/solr got event WatchedEvent state:SyncConnected type:None path:null path:null type:None
[junit4:junit4]   2> 6353 T923 oascc.ConnectionManager.waitForConnected Client is connected to ZooKeeper
[junit4:junit4]   2> 6354 T929 oazs.PrepRequestProcessor.pRequest Got user-level KeeperException when processing sessionid:0x13a3d5b7a2c0004 type:create cxid:0x1 zxid:0xfffffffffffffffe txntype:unknown reqpath:n/a Error Path:/solr/overseer Error:KeeperErrorCode = NodeExists for /solr/overseer
[junit4:junit4]   2> 6365 T929 oazs.PrepRequestProcessor.pRequest Got user-level KeeperException when processing sessionid:0x13a3d5b7a2c0004 type:create cxid:0x2 zxid:0xfffffffffffffffe txntype:unknown reqpath:n/a Error Path:/solr/overseer Error:KeeperErrorCode = NodeExists for /solr/overseer
[junit4:junit4]   2> 6366 T923 oasc.ZkController.createEphemeralLiveNode Register node as live in ZooKeeper:/live_nodes/127.0.0.1:31791_solr
[junit4:junit4]   2> 6367 T929 oazs.PrepRequestProcessor.pRequest Got user-level KeeperException when processing sessionid:0x13a3d5b7a2c0004 type:delete cxid:0x4 zxid:0xfffffffffffffffe txntype:unknown reqpath:n/a Error Path:/solr/live_nodes/127.0.0.1:31791_solr Error:KeeperErrorCode = NoNode for /solr/live_nodes/127.0.0.1:31791_solr
[junit4:junit4]   2> 6369 T923 oascc.SolrZkClient.makePath makePath: /live_nodes/127.0.0.1:31791_solr
[junit4:junit4]   2> 6371 T943 oascc.ZkStateReader$3.process Updating live nodes
[junit4:junit4]   2> 6371 T957 oascc.ZkStateReader$3.process Updating live nodes
[junit4:junit4]   2> 6372 T923 oashc.HttpShardHandlerFactory.getParameter Setting socketTimeout to: 0
[junit4:junit4]   2> 6373 T923 oashc.HttpShardHandlerFactory.getParameter Setting urlScheme to: http://
[junit4:junit4]   2> 6373 T923 oashc.HttpShardHandlerFactory.getParameter Setting connTimeout to: 0
[junit4:junit4]   2> 6374 T923 oashc.HttpShardHandlerFactory.getParameter Setting maxConnectionsPerHost to: 20
[junit4:junit4]   2> 6374 T923 oashc.HttpShardHandlerFactory.getParameter Setting corePoolSize to: 0
[junit4:junit4]   2> 6375 T923 oashc.HttpShardHandlerFactory.getParameter Setting maximumPoolSize to: 2147483647
[junit4:junit4]   2> 6375 T923 oashc.HttpShardHandlerFactory.getParameter Setting maxThreadIdleTime to: 5
[junit4:junit4]   2> 6376 T923 oashc.HttpShardHandlerFactory.getParameter Setting sizeOfQueue to: -1
[junit4:junit4]   2> 6376 T923 oashc.HttpShardHandlerFactory.getParameter Setting fairnessPolicy to: false
[junit4:junit4]   2> 6377 T923 oascsi.HttpClientUtil.createClient Creating new http client, config:maxConnectionsPerHost=20&maxConnections=10000&socketTimeout=0&connTimeout=0&retry=false
[junit4:junit4]   2> 6397 T923 oascc.ZkStateReader.createClusterStateWatchersAndUpdate Updating cluster state from ZooKeeper... 
[junit4:junit4]   2> 6404 T923 oasc.CoreContainer.create Creating SolrCore 'collection1' using instanceDir: /usr/home/hudson/hudson-slave/workspace/Lucene-Solr-Tests-4.x-java7/solr/build/solr-core/test/J0/./solrtest-jetty2-1349649141994/collection1
[junit4:junit4]   2> 6405 T923 oasc.ZkController.createCollectionZkNode Check for collection zkNode:collection1
[junit4:junit4]   2> 6406 T923 oasc.ZkController.createCollectionZkNode Collection zkNode exists
[junit4:junit4]   2> 6406 T923 oasc.ZkController.readConfigName Load collection config from:/collections/collection1
[junit4:junit4]   2> 6408 T923 oasc.SolrResourceLoader.<init> new SolrResourceLoader for directory: '/usr/home/hudson/hudson-slave/workspace/Lucene-Solr-Tests-4.x-java7/solr/build/solr-core/test/J0/./solrtest-jetty2-1349649141994/collection1/'
[junit4:junit4]   2> 6409 T923 oasc.SolrResourceLoader.replaceClassLoader Adding 'file:/usr/home/hudson/hudson-slave/workspace/Lucene-Solr-Tests-4.x-java7/solr/build/solr-core/test/J0/solrtest-jetty2-1349649141994/collection1/lib/README' to classloader
[junit4:junit4]   2> 6410 T923 oasc.SolrResourceLoader.replaceClassLoader Adding 'file:/usr/home/hudson/hudson-slave/workspace/Lucene-Solr-Tests-4.x-java7/solr/build/solr-core/test/J0/solrtest-jetty2-1349649141994/collection1/lib/classes/' to classloader
[junit4:junit4]   2> 6461 T923 oasc.SolrConfig.<init> Using Lucene MatchVersion: LUCENE_41
[junit4:junit4]   2> 6544 T944 oascc.ZkStateReader.updateClusterState Updating cloud state from ZooKeeper... 
[junit4:junit4]   2> 6545 T923 oasc.SolrConfig.<init> Loaded SolrConfig: solrconfig.xml
[junit4:junit4]   2> 6558 T943 oascc.ZkStateReader$2.process A cluster state change has occurred - updating...
[junit4:junit4]   2> 6558 T957 oascc.ZkStateReader$2.process A cluster state change has occurred - updating...
[junit4:junit4]   2> 6647 T969 oascc.ZkStateReader$2.process A cluster state change has occurred - updating...
[junit4:junit4]   2> 6647 T923 oass.IndexSchema.readSchema Reading Solr Schema
[junit4:junit4]   2> 6653 T923 oass.IndexSchema.readSchema Schema name=test
[junit4:junit4]   2> 7270 T923 oass.OpenExchangeRatesOrgProvider.init Initialized with rates=open-exchange-rates.json, refreshInterval=1440.
[junit4:junit4]   2> 7281 T923 oass.IndexSchema.readSchema default search field in schema is text
[junit4:junit4]   2> 7286 T923 oass.IndexSchema.readSchema unique key field: id
[junit4:junit4]   2> 7305 T923 oass.FileExchangeRateProvider.reload Reloading exchange rates from file currency.xml
[junit4:junit4]   2> 7311 T923 oass.FileExchangeRateProvider.reload Reloading exchange rates from file currency.xml
[junit4:junit4]   2> 7316 T923 oass.OpenExchangeRatesOrgProvider.reload Reloading exchange rates from open-exchange-rates.json
[junit4:junit4]   2> 7318 T923 oass.OpenExchangeRatesOrgProvider.reload Reloading exchange rates from open-exchange-rates.json
[junit4:junit4]   2> 7319 T923 oasc.SolrCore.<init> [collection1] Opening new SolrCore at /usr/home/hudson/hudson-slave/workspace/Lucene-Solr-Tests-4.x-java7/solr/build/solr-core/test/J0/./solrtest-jetty2-1349649141994/collection1/, dataDir=./org.apache.solr.cloud.BasicDistributedZkTest-1349649135906/jetty2/
[junit4:junit4]   2> 7320 T923 oasc.JmxMonitoredMap.<init> JMX monitoring is enabled. Adding Solr mbeans to JMX Server: com.sun.jmx.mbeanserver.JmxMBeanServer@65614411
[junit4:junit4]   2> 7321 T923 oasc.SolrCore.getNewIndexDir New index directory detected: old=null new=./org.apache.solr.cloud.BasicDistributedZkTest-1349649135906/jetty2/index/
[junit4:junit4]   2> 7322 T923 oasc.SolrCore.initIndex WARNING [collection1] Solr index directory './org.apache.solr.cloud.BasicDistributedZkTest-1349649135906/jetty2/index' doesn't exist. Creating new index...
[junit4:junit4]   2> 7323 T923 oasc.CachingDirectoryFactory.get return new directory for /usr/home/hudson/hudson-slave/workspace/Lucene-Solr-Tests-4.x-java7/solr/build/solr-core/test/J0/./org.apache.solr.cloud.BasicDistributedZkTest-1349649135906/jetty2/index forceNew:false
[junit4:junit4]   2> 7337 T923 oasc.SolrDeletionPolicy.onCommit SolrDeletionPolicy.onCommit: commits:num=1
[junit4:junit4]   2> 		commit{dir=NRTCachingDirectory(org.apache.lucene.store.NIOFSDirectory@/usr/home/hudson/hudson-slave/workspace/Lucene-Solr-Tests-4.x-java7/solr/build/solr-core/test/J0/org.apache.solr.cloud.BasicDistributedZkTest-1349649135906/jetty2/index lockFactory=org.apache.lucene.store.NativeFSLockFactory@15e39292; maxCacheMB=48.0 maxMergeSizeMB=4.0),segFN=segments_1,generation=1,filenames=[segments_1]
[junit4:junit4]   2> 7337 T923 oasc.SolrDeletionPolicy.updateCommits newest commit = 1
[junit4:junit4]   2> 7339 T923 oasc.SolrCore.initWriters created xml: solr.XMLResponseWriter
[junit4:junit4]   2> 7341 T923 oasup.UpdateRequestProcessorChain.init inserting DistributedUpdateProcessorFactory into updateRequestProcessorChain "dedupe"
[junit4:junit4]   2> 7342 T923 oasup.UpdateRequestProcessorChain.init inserting DistributedUpdateProcessorFactory into updateRequestProcessorChain "dedupe-allfields"
[junit4:junit4]   2> 7342 T923 oasup.UpdateRequestProcessorChain.init inserting DistributedUpdateProcessorFactory into updateRequestProcessorChain "stored_sig"
[junit4:junit4]   2> 7343 T923 oasup.UpdateRequestProcessorChain.init inserting DistributedUpdateProcessorFactory into updateRequestProcessorChain "uniq-fields"
[junit4:junit4]   2> 7344 T923 oasup.UpdateRequestProcessorChain.init inserting DistributedUpdateProcessorFactory into updateRequestProcessorChain "distrib-dup-test-chain-implicit"
[junit4:junit4]   2> 7344 T923 oasc.RequestHandlers.initHandlersFromConfig adding lazy requestHandler: solr.ReplicationHandler
[junit4:junit4]   2> 7345 T923 oasc.RequestHandlers.initHandlersFromConfig created /replication: solr.ReplicationHandler
[junit4:junit4]   2> 7346 T923 oasc.RequestHandlers.initHandlersFromConfig created standard: solr.StandardRequestHandler
[junit4:junit4]   2> 7347 T923 oasc.RequestHandlers.initHandlersFromConfig created /get: solr.RealTimeGetHandler
[junit4:junit4]   2> 7348 T923 oasc.RequestHandlers.initHandlersFromConfig created dismax: solr.SearchHandler
[junit4:junit4]   2> 7348 T923 oasc.RequestHandlers.initHandlersFromConfig created mock: org.apache.solr.core.MockQuerySenderListenerReqHandler
[junit4:junit4]   2> 7349 T923 oasc.RequestHandlers.initHandlersFromConfig created /admin/: org.apache.solr.handler.admin.AdminHandlers
[junit4:junit4]   2> 7350 T923 oasc.RequestHandlers.initHandlersFromConfig created defaults: solr.StandardRequestHandler
[junit4:junit4]   2> 7350 T923 oasc.RequestHandlers.initHandlersFromConfig adding lazy requestHandler: solr.StandardRequestHandler
[junit4:junit4]   2> 7351 T923 oasc.RequestHandlers.initHandlersFromConfig created lazy: solr.StandardRequestHandler
[junit4:junit4]   2> 7352 T923 oasc.RequestHandlers.initHandlersFromConfig created /update: solr.UpdateRequestHandler
[junit4:junit4]   2> 7353 T923 oasc.RequestHandlers.initHandlersFromConfig created /terms: org.apache.solr.handler.component.SearchHandler
[junit4:junit4]   2> 7353 T923 oasc.RequestHandlers.initHandlersFromConfig created spellCheckCompRH: org.apache.solr.handler.component.SearchHandler
[junit4:junit4]   2> 7354 T923 oasc.RequestHandlers.initHandlersFromConfig created spellCheckCompRH_Direct: org.apache.solr.handler.component.SearchHandler
[junit4:junit4]   2> 7355 T923 oasc.RequestHandlers.initHandlersFromConfig created spellCheckWithWordbreak: org.apache.solr.handler.component.SearchHandler
[junit4:junit4]   2> 7356 T923 oasc.RequestHandlers.initHandlersFromConfig created spellCheckWithWordbreak_Direct: org.apache.solr.handler.component.SearchHandler
[junit4:junit4]   2> 7356 T923 oasc.RequestHandlers.initHandlersFromConfig created spellCheckCompRH1: org.apache.solr.handler.component.SearchHandler
[junit4:junit4]   2> 7357 T923 oasc.RequestHandlers.initHandlersFromConfig created tvrh: org.apache.solr.handler.component.SearchHandler
[junit4:junit4]   2> 7358 T923 oasc.RequestHandlers.initHandlersFromConfig created /mlt: solr.MoreLikeThisHandler
[junit4:junit4]   2> 7359 T923 oasc.RequestHandlers.initHandlersFromConfig created /debug/dump: solr.DumpRequestHandler
[junit4:junit4]   2> 7372 T923 oashl.XMLLoader.init xsltCacheLifetimeSeconds=60
[junit4:junit4]   2> 7377 T923 oasc.SolrCore.initDeprecatedSupport WARNING solrconfig.xml uses deprecated <admin/gettableFiles>, Please update your config to use the ShowFileRequestHandler.
[junit4:junit4]   2> 7378 T923 oasc.SolrCore.initDeprecatedSupport WARNING adding ShowFileRequestHandler with hidden files: [SCHEMA.XML, OLD_SYNONYMS.TXT, STOPWORDS.TXT, PROTWORDS.TXT, OPEN-EXCHANGE-RATES.JSON, SYNONYMS.TXT, CURRENCY.XML, MAPPING-ISOLATIN1ACCENT.TXT]
[junit4:junit4]   2> 7382 T923 oass.SolrIndexSearcher.<init> Opening Searcher@25be20bc main
[junit4:junit4]   2> 7384 T923 oasu.CommitTracker.<init> Hard AutoCommit: disabled
[junit4:junit4]   2> 7384 T923 oasu.CommitTracker.<init> Soft AutoCommit: disabled
[junit4:junit4]   2> 7385 T923 oashc.SpellCheckComponent.inform Initializing spell checkers
[junit4:junit4]   2> 7393 T923 oass.DirectSolrSpellChecker.init init: {name=direct,classname=DirectSolrSpellChecker,field=lowerfilt,minQueryLength=3}
[junit4:junit4]   2> 7449 T970 oasc.SolrCore.registerSearcher [collection1] Registered new searcher Searcher@25be20bc main{StandardDirectoryReader(segments_1:1)}
[junit4:junit4]   2> 7566 T944 oascc.ZkStateReader.updateClusterState Updating cloud state from ZooKeeper... 
[junit4:junit4]   2> 7579 T969 oascc.ZkStateReader$2.process A cluster state change has occurred - updating...
[junit4:junit4]   2> 7579 T957 oascc.ZkStateReader$2.process A cluster state change has occurred - updating...
[junit4:junit4]   2> 7579 T943 oascc.ZkStateReader$2.process A cluster state change has occurred - updating...
[junit4:junit4]   2> 7958 T923 oasc.CoreContainer.register registering core: collection1
[junit4:junit4]   2> 7958 T923 oasc.ZkController.register Register shard - core:collection1 address:http://127.0.0.1:31791/solr shardId:shard2
[junit4:junit4]   2> 7960 T923 oascc.SolrZkClient.makePath makePath: /collections/collection1/leader_elect/shard2/election
[junit4:junit4]   2> 7973 T929 oazs.PrepRequestProcessor.pRequest Got user-level KeeperException when processing sessionid:0x13a3d5b7a2c0004 type:delete cxid:0x42 zxid:0xfffffffffffffffe txntype:unknown reqpath:n/a Error Path:/solr/collections/collection1/leaders/shard2 Error:KeeperErrorCode = NoNode for /solr/collections/collection1/leaders/shard2
[junit4:junit4]   2> 7974 T923 oasc.ShardLeaderElectionContext.runLeaderProcess Running the leader process.
[junit4:junit4]   2> 7975 T929 oazs.PrepRequestProcessor.pRequest Got user-level KeeperException when processing sessionid:0x13a3d5b7a2c0004 type:create cxid:0x43 zxid:0xfffffffffffffffe txntype:unknown reqpath:n/a Error Path:/solr/overseer Error:KeeperErrorCode = NodeExists for /solr/overseer
[junit4:junit4]   2> 7985 T923 oasc.ShardLeaderElectionContext.waitForReplicasToComeUp Enough replicas found to continue.
[junit4:junit4]   2> 7985 T923 oasc.ShardLeaderElectionContext.runLeaderProcess I may be the new leader - try and sync
[junit4:junit4]   2> 7986 T923 oasc.SyncStrategy.sync Sync replicas to http://127.0.0.1:31791/solr/collection1/
[junit4:junit4]   2> 7986 T923 oasc.SyncStrategy.syncReplicas Sync Success - now sync replicas to me
[junit4:junit4]   2> 7987 T923 oasc.SyncStrategy.syncToMe http://127.0.0.1:31791/solr/collection1/ has no replicas
[junit4:junit4]   2> 7987 T923 oasc.ShardLeaderElectionContext.runLeaderProcess I am the new leader: http://127.0.0.1:31791/solr/collection1/
[junit4:junit4]   2> 7988 T923 oascc.SolrZkClient.makePath makePath: /collections/collection1/leaders/shard2
[junit4:junit4]   2> 7992 T929 oazs.PrepRequestProcessor.pRequest Got user-level KeeperException when processing sessionid:0x13a3d5b7a2c0004 type:create cxid:0x4c zxid:0xfffffffffffffffe txntype:unknown reqpath:n/a Error Path:/solr/overseer Error:KeeperErrorCode = NodeExists for /solr/overseer
[junit4:junit4]   2> 8085 T944 oascc.ZkStateReader.updateClusterState Updating cloud state from ZooKeeper... 
[junit4:junit4]   2> 8095 T943 oascc.ZkStateReader$2.process A cluster state change has occurred - updating...
[junit4:junit4]   2> 8095 T969 oascc.ZkStateReader$2.process A cluster state change has occurred - updating...
[junit4:junit4]   2> 8095 T957 oascc.ZkStateReader$2.process A cluster state change has occurred - updating...
[junit4:junit4]   2> 8103 T923 oasc.ZkController.register We are http://127.0.0.1:31791/solr/collection1/ and leader is http://127.0.0.1:31791/solr/collection1/
[junit4:junit4]   2> 8103 T923 oasc.ZkController.register No LogReplay needed for core=collection1 baseURL=http://127.0.0.1:31791/solr
[junit4:junit4]   2> 8104 T923 oasc.ZkController.checkRecovery I am the leader, no recovery necessary
[junit4:junit4]   2> 8106 T923 oascc.ZkStateReader.updateClusterState Updating cloud state from ZooKeeper... 
[junit4:junit4]   2> 8107 T923 oass.SolrDispatchFilter.init user.dir=/usr/home/hudson/hudson-slave/workspace/Lucene-Solr-Tests-4.x-java7/solr/build/solr-core/test/J0
[junit4:junit4]   2> 8107 T923 oass.SolrDispatchFilter.init SolrDispatchFilter.init() done
[junit4:junit4]   2> 8108 T923 oascsi.HttpClientUtil.createClient Creating new http client, config:maxConnections=128&maxConnectionsPerHost=32&followRedirects=false
[junit4:junit4]   2> 8281 T923 oejs.Server.doStart jetty-8.1.2.v20120308
[junit4:junit4]   2> 8284 T923 oejs.AbstractConnector.doStart Started SocketConnector@0.0.0.0:31795
[junit4:junit4]   2> 8285 T923 oasc.SolrResourceLoader.locateSolrHome JNDI not configured for solr (NoInitialContextEx)
[junit4:junit4]   2> 8285 T923 oasc.SolrResourceLoader.locateSolrHome using system property solr.solr.home: /usr/home/hudson/hudson-slave/workspace/Lucene-Solr-Tests-4.x-java7/solr/build/solr-core/test/J0/./solrtest-jetty3-1349649144024
[junit4:junit4]   2> 8286 T923 oasc.SolrResourceLoader.<init> new SolrResourceLoader for deduced Solr Home: '/usr/home/hudson/hudson-slave/workspace/Lucene-Solr-Tests-4.x-java7/solr/build/solr-core/test/J0/./solrtest-jetty3-1349649144024/'
[junit4:junit4]   2> 8328 T923 oass.SolrDispatchFilter.init SolrDispatchFilter.init()
[junit4:junit4]   2> 8328 T923 oasc.SolrResourceLoader.locateSolrHome JNDI not configured for solr (NoInitialContextEx)
[junit4:junit4]   2> 8329 T923 oasc.SolrResourceLoader.locateSolrHome using system property solr.solr.home: /usr/home/hudson/hudson-slave/workspace/Lucene-Solr-Tests-4.x-java7/solr/build/solr-core/test/J0/./solrtest-jetty3-1349649144024
[junit4:junit4]   2> 8329 T923 oasc.CoreContainer$Initializer.initialize looking for solr.xml: /usr/home/hudson/hudson-slave/workspace/Lucene-Solr-Tests-4.x-java7/solr/build/solr-core/test/J0/./solrtest-jetty3-1349649144024/solr.xml
[junit4:junit4]   2> 8330 T923 oasc.CoreContainer.<init> New CoreContainer 1801802460
[junit4:junit4]   2> 8330 T923 oasc.CoreContainer.load Loading CoreContainer using Solr Home: '/usr/home/hudson/hudson-slave/workspace/Lucene-Solr-Tests-4.x-java7/solr/build/solr-core/test/J0/./solrtest-jetty3-1349649144024/'
[junit4:junit4]   2> 8331 T923 oasc.SolrResourceLoader.<init> new SolrResourceLoader for directory: '/usr/home/hudson/hudson-slave/workspace/Lucene-Solr-Tests-4.x-java7/solr/build/solr-core/test/J0/./solrtest-jetty3-1349649144024/'
[junit4:junit4]   2> 8364 T923 oasc.CoreContainer.load Registering Log Listener
[junit4:junit4]   2> 8380 T923 oasc.CoreContainer.initZooKeeper Zookeeper client=127.0.0.1:31768/solr
[junit4:junit4]   2> 8380 T923 oaz.ZooKeeper.<init> Initiating client connection, connectString=127.0.0.1:31768/solr sessionTimeout=5000 watcher=org.apache.solr.common.cloud.ConnectionManager@34f6770b
[junit4:junit4]   2> 8381 T980 oaz.ClientCnxn$SendThread.startConnect Opening socket connection to server /127.0.0.1:31768
[junit4:junit4]   2> 8381 T923 oascc.ConnectionManager.waitForConnected Waiting for client to connect to ZooKeeper
[junit4:junit4]   2> 8383 T980 oaz.ClientCnxn$SendThread.primeConnection Socket connection established to localhost/127.0.0.1:31768, initiating session
[junit4:junit4]   2> 8383 T925 oazs.NIOServerCnxn$Factory.run Accepted socket connection from /140.211.11.196:31796
[junit4:junit4]   2> 8383 T925 oazs.NIOServerCnxn.readConnectRequest Client attempting to establish new session at /140.211.11.196:31796
[junit4:junit4]   2> 8385 T927 oazs.NIOServerCnxn.finishSessionInit Established session 0x13a3d5b7a2c0005 with negotiated timeout 5000 for client /140.211.11.196:31796
[junit4:junit4]   2> 8386 T980 oaz.ClientCnxn$SendThread.readConnectResult Session establishment complete on server localhost/127.0.0.1:31768, sessionid = 0x13a3d5b7a2c0005, negotiated timeout = 5000
[junit4:junit4]   2> 8386 T981 oascc.ConnectionManager.process Watcher org.apache.solr.common.cloud.ConnectionManager@34f6770b name:ZooKeeperConnection Watcher:127.0.0.1:31768/solr got event WatchedEvent state:SyncConnected type:None path:null path:null type:None
[junit4:junit4]   2> 8386 T923 oascc.ConnectionManager.waitForConnected Client is connected to ZooKeeper
[junit4:junit4]   2> 8387 T929 oazs.PrepRequestProcessor.pRequest Got user-level KeeperException when processing sessionid:0x13a3d5b7a2c0005 type:create cxid:0x1 zxid:0xfffffffffffffffe txntype:unknown reqpath:n/a Error Path:/solr/overseer Error:KeeperErrorCode = NodeExists for /solr/overseer
[junit4:junit4]   2> 8388 T929 oazs.PrepRequestProcessor.pRequest Got user-level KeeperException when processing sessionid:0x13a3d5b7a2c0005 type:create cxid:0x2 zxid:0xfffffffffffffffe txntype:unknown reqpath:n/a Error Path:/solr/overseer Error:KeeperErrorCode = NodeExists for /solr/overseer
[junit4:junit4]   2> 8390 T923 oasc.ZkController.createEphemeralLiveNode Register node as live in ZooKeeper:/live_nodes/127.0.0.1:31795_solr
[junit4:junit4]   2> 8391 T929 oazs.PrepRequestProcessor.pRequest Got user-level KeeperException when processing sessionid:0x13a3d5b7a2c0005 type:delete cxid:0x4 zxid:0xfffffffffffffffe txntype:unknown reqpath:n/a Error Path:/solr/live_nodes/127.0.0.1:31795_solr Error:KeeperErrorCode = NoNode for /solr/live_nodes/127.0.0.1:31795_solr
[junit4:junit4]   2> 8399 T923 oascc.SolrZkClient.makePath makePath: /live_nodes/127.0.0.1:31795_solr
[junit4:junit4]   2> 8402 T969 oascc.ZkStateReader$3.process Updating live nodes
[junit4:junit4]   2> 8402 T943 oascc.ZkStateReader$3.process Updating live nodes
[junit4:junit4]   2> 8402 T957 oascc.ZkStateReader$3.process Updating live nodes
[junit4:junit4]   2> 8403 T923 oashc.HttpShardHandlerFactory.getParameter Setting socketTimeout to: 0
[junit4:junit4]   2> 8404 T923 oashc.HttpShardHandlerFactory.getParameter Setting urlScheme to: http://
[junit4:junit4]   2> 8404 T923 oashc.HttpShardHandlerFactory.getParameter Setting connTimeout to: 0
[junit4:junit4]   2> 8405 T923 oashc.HttpShardHandlerFactory.getParameter Setting maxConnectionsPerHost to: 20
[junit4:junit4]   2> 8405 T923 oashc.HttpShardHandlerFactory.getParameter Setting corePoolSize to: 0
[junit4:junit4]   2> 8406 T923 oashc.HttpShardHandlerFactory.getParameter Setting maximumPoolSize to: 2147483647
[junit4:junit4]   2> 8406 T923 oashc.HttpShardHandlerFactory.getParameter Setting maxThreadIdleTime to: 5
[junit4:junit4]   2> 8406 T923 oashc.HttpShardHandlerFactory.getParameter Setting sizeOfQueue to: -1
[junit4:junit4]   2> 8407 T923 oashc.HttpShardHandlerFactory.getParameter Setting fairnessPolicy to: false
[junit4:junit4]   2> 8407 T923 oascsi.HttpClientUtil.createClient Creating new http client, config:maxConnectionsPerHost=20&maxConnections=10000&socketTimeout=0&connTimeout=0&retry=false
[junit4:junit4]   2> 8426 T923 oascc.ZkStateReader.createClusterStateWatchersAndUpdate Updating cluster state from ZooKeeper... 
[junit4:junit4]   2> 8433 T923 oasc.CoreContainer.create Creating SolrCore 'collection1' using instanceDir: /usr/home/hudson/hudson-slave/workspace/Lucene-Solr-Tests-4.x-java7/solr/build/solr-core/test/J0/./solrtest-jetty3-1349649144024/collection1
[junit4:junit4]   2> 8434 T923 oasc.ZkController.createCollectionZkNode Check for collection zkNode:collection1
[junit4:junit4]   2> 8434 T923 oasc.ZkController.createCollectionZkNode Collection zkNode exists
[junit4:junit4]   2> 8435 T923 oasc.ZkController.readConfigName Load collection config from:/collections/collection1
[junit4:junit4]   2> 8437 T923 oasc.SolrResourceLoader.<init> new SolrResourceLoader for directory: '/usr/home/hudson/hudson-slave/workspace/Lucene-Solr-Tests-4.x-java7/solr/build/solr-core/test/J0/./solrtest-jetty3-1349649144024/collection1/'
[junit4:junit4]   2> 8438 T923 oasc.SolrResourceLoader.replaceClassLoader Adding 'file:/usr/home/hudson/hudson-slave/workspace/Lucene-Solr-Tests-4.x-java7/solr/build/solr-core/test/J0/solrtest-jetty3-1349649144024/collection1/lib/classes/' to classloader
[junit4:junit4]   2> 8439 T923 oasc.SolrResourceLoader.replaceClassLoader Adding 'file:/usr/home/hudson/hudson-slave/workspace/Lucene-Solr-Tests-4.x-java7/solr/build/solr-core/test/J0/solrtest-jetty3-1349649144024/collection1/lib/README' to classloader
[junit4:junit4]   2> 8490 T923 oasc.SolrConfig.<init> Using Lucene MatchVersion: LUCENE_41
[junit4:junit4]   2> 8562 T923 oasc.SolrConfig.<init> Loaded SolrConfig: solrconfig.xml
[junit4:junit4]   2> 8603 T944 oascc.ZkStateReader.updateClusterState Updating cloud state from ZooKeeper... 
[junit4:junit4]   2> 8663 T923 oass.IndexSchema.readSchema Reading Solr Schema
[junit4:junit4]   2> 8670 T923 oass.IndexSchema.readSchema Schema name=test
[junit4:junit4]   2> 8688 T943 oascc.ZkStateReader$2.process A cluster state change has occurred - updating...
[junit4:junit4]   2> 8688 T969 oascc.ZkStateReader$2.process A cluster state change has occurred - updating...
[junit4:junit4]   2> 8688 T957 oascc.ZkStateReader$2.process A cluster state change has occurred - updating...
[junit4:junit4]   2> 8688 T981 oascc.ZkStateReader$2.process A cluster state change has occurred - updating...
[junit4:junit4]   2> 9226 T923 oass.OpenExchangeRatesOrgProvider.init Initialized with rates=open-exchange-rates.json, refreshInterval=1440.
[junit4:junit4]   2> 9234 T923 oass.IndexSchema.readSchema default search field in schema is text
[junit4:junit4]   2> 9237 T923 oass.IndexSchema.readSchema unique key field: id
[junit4:junit4]   2> 9251 T923 oass.FileExchangeRateProvider.reload Reloading exchange rates from file currency.xml
[junit4:junit4]   2> 9255 T923 oass.FileExchangeRateProvider.reload Reloading exchange rates from file currency.xml
[junit4:junit4]   2> 9259 T923 oass.OpenExchangeRatesOrgProvider.reload Reloading exchange rates from open-exchange-rates.json
[junit4:junit4]   2> 9260 T923 oass.OpenExchangeRatesOrgProvider.reload Reloading exchange rates from open-exchange-rates.json
[junit4:junit4]   2> 9262 T923 oasc.SolrCore.<init> [collection1] Opening new SolrCore at /usr/home/hudson/hudson-slave/workspace/Lucene-Solr-Tests-4.x-java7/solr/build/solr-core/test/J0/./solrtest-jetty3-1349649144024/collection1/, dataDir=./org.apache.solr.cloud.BasicDistributedZkTest-1349649135906/jetty3/
[junit4:junit4]   2> 9262 T923 oasc.JmxMonitoredMap.<init> JMX monitoring is enabled. Adding Solr mbeans to JMX Server: com.sun.jmx.mbeanserver.JmxMBeanServer@65614411
[junit4:junit4]   2> 9263 T923 oasc.SolrCore.getNewIndexDir New index directory detected: old=null new=./org.apache.solr.cloud.BasicDistributedZkTest-1349649135906/jetty3/index/
[junit4:junit4]   2> 9264 T923 oasc.SolrCore.initIndex WARNING [collection1] Solr index directory './org.apache.solr.cloud.BasicDistributedZkTest-1349649135906/jetty3/index' doesn't exist. Creating new index...
[junit4:junit4]   2> 9265 T923 oasc.CachingDirectoryFactory.get return new directory for /usr/home/hudson/hudson-slave/workspace/Lucene-Solr-Tests-4.x-java7/solr/build/solr-core/test/J0/./org.apache.solr.cloud.BasicDistributedZkTest-1349649135906/jetty3/index forceNew:false
[junit4:junit4]   2> 9303 T923 oasc.SolrDeletionPolicy.onCommit SolrDeletionPolicy.onCommit: commits:num=1
[junit4:junit4]   2> 		commit{dir=NRTCachingDirectory(org.apache.lucene.store.NIOFSDirectory@/usr/home/hudson/hudson-slave/workspace/Lucene-Solr-Tests-4.x-java7/solr/build/solr-core/test/J0/org.apache.solr.cloud.BasicDistributedZkTest-1349649135906/jetty3/index lockFactory=org.apache.lucene.store.NativeFSLockFactory@28171893; maxCacheMB=48.0 maxMergeSizeMB=4.0),segFN=segments_1,generation=1,filenames=[segments_1]
[junit4:junit4]   2> 9304 T923 oasc.SolrDeletionPolicy.updateCommits newest commit = 1
[junit4:junit4]   2> 9305 T923 oasc.SolrCore.initWriters created xml: solr.XMLResponseWriter
[junit4:junit4]   2> 9308 T923 oasup.UpdateRequestProcessorChain.init inserting DistributedUpdateProcessorFactory into updateRequestProcessorChain "dedupe"
[junit4:junit4]   2> 9309 T923 oasup.UpdateRequestProcessorChain.init inserting DistributedUpdateProcessorFactory into updateRequestProcessorChain "dedupe-allfields"
[junit4:junit4]   2> 9309 T923 oasup.UpdateRequestProcessorChain.init inserting DistributedUpdateProcessorFactory into updateRequestProcessorChain "stored_sig"
[junit4:junit4]   2> 9310 T923 oasup.UpdateRequestProcessorChain.init inserting DistributedUpdateProcessorFactory into updateRequestProcessorChain "uniq-fields"
[junit4:junit4]   2> 9311 T923 oasup.UpdateRequestProcessorChain.init inserting DistributedUpdateProcessorFactory into updateRequestProcessorChain "distrib-dup-test-chain-implicit"
[junit4:junit4]   2> 9311 T923 oasc.RequestHandlers.initHandlersFromConfig adding lazy requestHandler: solr.ReplicationHandler
[junit4:junit4]   2> 9312 T923 oasc.RequestHandlers.initHandlersFromConfig created /replication: solr.ReplicationHandler
[junit4:junit4]   2> 9313 T923 oasc.RequestHandlers.initHandlersFromConfig created standard: solr.StandardRequestHandler
[junit4:junit4]   2> 9313 T923 oasc.RequestHandlers.initHandlersFromConfig created /get: solr.RealTimeGetHandler
[junit4:junit4]   2> 9314 T923 oasc.RequestHandlers.initHandlersFromConfig created dismax: solr.SearchHandler
[junit4:junit4]   2> 9315 T923 oasc.RequestHandlers.initHandlersFromConfig created mock: org.apache.solr.core.MockQuerySenderListenerReqHandler
[junit4:junit4]   2> 9316 T923 oasc.RequestHandlers.initHandlersFromConfig created /admin/: org.apache.solr.handler.admin.AdminHandlers
[junit4:junit4]   2> 9317 T923 oasc.RequestHandlers.initHandlersFromConfig created defaults: solr.StandardRequestHandler
[junit4:junit4]   2> 9317 T923 oasc.RequestHandlers.initHandlersFromConfig adding lazy requestHandler: solr.StandardRequestHandler
[junit4:junit4]   2> 9318 T923 oasc.RequestHandlers.initHandlersFromConfig created lazy: solr.StandardRequestHandler
[junit4:junit4]   2> 9318 T923 oasc.RequestHandlers.initHandlersFromConfig created /update: solr.UpdateRequestHandler
[junit4:junit4]   2> 9319 T923 oasc.RequestHandlers.initHandlersFromConfig created /terms: org.apache.solr.handler.component.SearchHandler
[junit4:junit4]   2> 9320 T923 oasc.RequestHandlers.initHandlersFromConfig created spellCheckCompRH: org.apache.solr.handler.component.SearchHandler
[junit4:junit4]   2> 9321 T923 oasc.RequestHandlers.initHandlersFromConfig created spellCheckCompRH_Direct: org.apache.solr.handler.component.SearchHandler
[junit4:junit4]   2> 9321 T923 oasc.RequestHandlers.initHandlersFromConfig created spellCheckWithWordbreak: org.apache.solr.handler.component.SearchHandler
[junit4:junit4]   2> 9322 T923 oasc.RequestHandlers.initHandlersFromConfig created spellCheckWithWordbreak_Direct: org.apache.solr.handler.component.SearchHandler
[junit4:junit4]   2> 9323 T923 oasc.RequestHandlers.initHandlersFromConfig created spellCheckCompRH1: org.apache.solr.handler.component.SearchHandler
[junit4:junit4]   2> 9324 T923 oasc.RequestHandlers.initHandlersFromConfig created tvrh: org.apache.solr.handler.component.SearchHandler
[junit4:junit4]   2> 9325 T923 oasc.RequestHandlers.initHandlersFromConfig created /mlt: solr.MoreLikeThisHandler
[junit4:junit4]   2> 9326 T923 oasc.RequestHandlers.initHandlersFromConfig created /debug/dump: solr.DumpRequestHandler
[junit4:junit4]   2> 9339 T923 oashl.XMLLoader.init xsltCacheLifetimeSeconds=60
[junit4:junit4]   2> 9343 T923 oasc.SolrCore.initDeprecatedSupport WARNING solrconfig.xml uses deprecated <admin/gettableFiles>, Please update your config to use the ShowFileRequestHandler.
[junit4:junit4]   2> 9345 T923 oasc.SolrCore.initDeprecatedSupport WARNING adding ShowFileRequestHandler with hidden files: [SCHEMA.XML, OLD_SYNONYMS.TXT, STOPWORDS.TXT, PROTWORDS.TXT, OPEN-EXCHANGE-RATES.JSON, SYNONYMS.TXT, CURRENCY.XML, MAPPING-ISOLATIN1ACCENT.TXT]
[junit4:junit4]   2> 9349 T923 oass.SolrIndexSearcher.<init> Opening Searcher@117b025d main
[junit4:junit4]   2> 9351 T923 oasu.CommitTracker.<init> Hard AutoCommit: disabled
[junit4:junit4]   2> 9351 T923 oasu.CommitTracker.<init> Soft AutoCommit: disabled
[junit4:junit4]   2> 9352 T923 oashc.SpellCheckComponent.inform Initializing spell checkers
[junit4:junit4]   2> 9390 T923 oass.DirectSolrSpellChecker.init init: {name=direct,classname=DirectSolrSpellChecker,field=lowerfilt,minQueryLength=3}
[junit4:junit4]   2> 9459 T982 oasc.SolrCore.registerSearcher [collection1] Registered new searcher Searcher@117b025d main{StandardDirectoryReader(segments_1:1)}
[junit4:junit4]   2> 9708 T944 oascc.ZkStateReader.updateClusterState Updating cloud state from ZooKeeper... 
[junit4:junit4]   2> 9722 T943 oascc.ZkStateReader$2.process A cluster state change has occurred - updating...
[junit4:junit4]   2> 9722 T969 oascc.ZkStateReader$2.process A cluster state change has occurred - updating...
[junit4:junit4]   2> 9722 T981 oascc.ZkStateReader$2.process A cluster state change has occurred - updating...
[junit4:junit4]   2> 9722 T957 oascc.ZkStateReader$2.process A cluster state change has occurred - updating...
[junit4:junit4]   2> 9968 T923 oasc.CoreContainer.register registering core: collection1
[junit4:junit4]   2> 9969 T923 oasc.ZkController.register Register shard - core:collection1 address:http://127.0.0.1:31795/solr shardId:shard1
[junit4:junit4]   2> 9975 T923 oasc.ZkController.register We are http://127.0.0.1:31795/solr/collection1/ and leader is http://127.0.0.1:31785/solr/collection1/
[junit4:junit4]   2> 9976 T923 oasc.ZkController.register No LogReplay needed for core=collection1 baseURL=http://127.0.0.1:31795/solr
[junit4:junit4]   2> 9976 T923 oasc.ZkController.checkRecovery Core needs to recover:collection1
[junit4:junit4]   2> 9977 T923 oasu.DefaultSolrCoreState.doRecovery Running recovery - first canceling any ongoing recovery
[junit4:junit4]   2> ASYNC  NEW_CORE C117 name=collection1 org.apache.solr.core.SolrCore@24ce8073 url=http://127.0.0.1:31795/solr/collection1 node=127.0.0.1:31795_solr
[junit4:junit4]   2> 9985 T983 C117 P31795 oasc.RecoveryStrategy.run Starting recovery process.  core=collection1 recoveringAfterStartup=true
[junit4:junit4]   2> 9985 T923 oascc.ZkStateReader.updateClusterState Updating cloud state from ZooKeeper... 
[junit4:junit4]   2> 9986 T983 C117 P31795 oasc.RecoveryStrategy.doRecovery ###### startupVersions=[]
[junit4:junit4]   2> 9987 T923 oass.SolrDispatchFilter.init user.dir=/usr/home/hudson/hudson-slave/workspace/Lucene-Solr-Tests-4.x-java7/solr/build/solr-core/test/J0
[junit4:junit4]   2> 9987 T923 oass.SolrDispatchFilter.init SolrDispatchFilter.init() done
[junit4:junit4]   2> 9988 T923 oascsi.HttpClientUtil.createClient Creating new http client, config:maxConnections=128&maxConnectionsPerHost=32&followRedirects=false
[junit4:junit4]   2> 10009 T923 oaz.ZooKeeper.<init> Initiating client connection, connectString=127.0.0.1:31768/solr sessionTimeout=10000 watcher=org.apache.solr.common.cloud.ConnectionManager@52739a45
[junit4:junit4]   2> 10010 T984 oaz.ClientCnxn$SendThread.startConnect Opening socket connection to server /127.0.0.1:31768
[junit4:junit4]   2> 10010 T923 oascc.ConnectionManager.waitForConnected Waiting for client to connect to ZooKeeper
[junit4:junit4]   2> 10011 T984 oaz.ClientCnxn$SendThread.primeConnection Socket connection established to localhost/127.0.0.1:31768, initiating session
[junit4:junit4]   2> 10011 T925 oazs.NIOServerCnxn$Factory.run Accepted socket connection from /140.211.11.196:31807
[junit4:junit4]   2> 10012 T925 oazs.NIOServerCnxn.readConnectRequest Client attempting to establish new session at /140.211.11.196:31807
[junit4:junit4]   2> 10071 T983 C117 P31795 oasc.RecoveryStrategy.doRecovery Attempting to PeerSync from http://127.0.0.1:31785/solr/collection1/ core=collection1 - recoveringAfterStartup=true
[junit4:junit4]   2> 10072 T927 oazs.NIOServerCnxn.finishSessionInit Established session 0x13a3d5b7a2c0006 with negotiated timeout 10000 for client /140.211.11.196:31807
[junit4:junit4]   2> 10072 T984 oaz.ClientCnxn$SendThread.readConnectResult Session establishment complete on server localhost/127.0.0.1:31768, sessionid = 0x13a3d5b7a2c0006, negotiated timeout = 10000
[junit4:junit4]   2> 10072 T985 oascc.ConnectionManager.process Watcher org.apache.solr.common.cloud.ConnectionManager@52739a45 name:ZooKeeperConnection Watcher:127.0.0.1:31768/solr got event WatchedEvent state:SyncConnected type:None path:null path:null type:None
[junit4:junit4]   2> 10073 T923 oascc.ConnectionManager.waitForConnected Client is connected to ZooKeeper
[junit4:junit4]   2> 10074 T923 oascc.ZkStateReader.createClusterStateWatchersAndUpdate Updating cluster state from ZooKeeper... 
[junit4:junit4]   2> 10078 T923 oasc.ChaosMonkey.monkeyLog monkey: init - expire sessions:true cause connection loss:true
[junit4:junit4]   2> 10079 T923 oascsi.HttpClientUtil.createClient Creating new http client, config:
[junit4:junit4]   2> 10081 T983 C117 P31795 oascsi.HttpClientUtil.createClient Creating new http client, config:maxConnectionsPerHost=20&maxConnections=10000&connTimeout=30000&socketTimeout=30000&retry=false
[junit4:junit4]   2> 10092 T923 oascc.ZkStateReader.updateClusterState Updating cloud state from ZooKeeper... 
[junit4:junit4]   2> 10094 T923 oasc.AbstractDistribZkTestBase.waitForRecoveriesToFinish Wait for recoveries to finish - collection: collection1 failOnTimeout:true timeout (sec):1800
[junit4:junit4]   2> 10095 T923 oascc.ZkStateReader.updateClusterState Updating cloud state from ZooKeeper... 
[junit4:junit4]   2> 10101 T983 C117 P31795 oasu.PeerSync.sync PeerSync: core=collection1 url=http://127.0.0.1:31795/solr START replicas=[http://127.0.0.1:31785/solr/collection1/] nUpdates=100
[junit4:junit4]   2> 10102 T983 C117 P31795 oasu.PeerSync.sync WARNING no frame of reference to tell of we've missed updates
[junit4:junit4]   2> 10103 T983 C117 P31795 oasc.RecoveryStrategy.doRecovery PeerSync Recovery was not successful - trying replication. core=collection1
[junit4:junit4]   2> 10103 T983 C117 P31795 oasc.RecoveryStrategy.doRecovery Starting Replication Recovery. core=collection1
[junit4:junit4]   2> 10103 T983 C117 P31795 oascsi.HttpClientUtil.createClient Creating new http client, config:maxConnections=128&maxConnectionsPerHost=32&followRedirects=false
[junit4:junit4]   2> ASYNC  NEW_CORE C118 name=collection1 org.apache.solr.core.SolrCore@46a52c6d url=http://127.0.0.1:31785/solr/collection1 node=127.0.0.1:31785_solr
[junit4:junit4]   2> 10112 T949 C118 P31785 REQ /get {distrib=false&qt=/get&wt=javabin&version=2&getVersions=100} status=0 QTime=0 
[junit4:junit4]   2> 10228 T944 oascc.ZkStateReader.updateClusterState Updating cloud state from ZooKeeper... 
[junit4:junit4]   2> 10241 T943 oascc.ZkStateReader$2.process A cluster state change has occurred - updating...
[junit4:junit4]   2> 10241 T957 oascc.ZkStateReader$2.process A cluster state change has occurred - updating...
[junit4:junit4]   2> 10241 T985 oascc.ZkStateReader$2.process A cluster state change has occurred - updating...
[junit4:junit4]   2> 10241 T981 oascc.ZkStateReader$2.process A cluster state change has occurred - updating...
[junit4:junit4]   2> 10241 T969 oascc.ZkStateReader$2.process A cluster state change has occurred - updating...
[junit4:junit4]   2> 11097 T923 oascc.ZkStateReader.updateClusterState Updating cloud state from ZooKeeper... 
[junit4:junit4]   2> 12099 T923 oascc.ZkStateReader.updateClusterState Updating cloud state from ZooKeeper... 
[junit4:junit4]   2> 13101 T923 oascc.ZkStateReader.updateClusterState Updating cloud state from ZooKeeper... 
[junit4:junit4]   2>  C117_STATE=coll:collection1 core:collection1 props:{shard=shard1, roles=null, state=recovering, core=collection1, collection=collection1, node_name=127.0.0.1:31795_solr, base_url=http://127.0.0.1:31795/solr}
[junit4:junit4]   2> 13135 T983 C117 P31795 oasc.RecoveryStrategy.doRecovery Begin buffering updates. core=collection1
[junit4:junit4]   2> 13135 T983 C117 P31795 oasu.UpdateLog.bufferUpdates Starting to buffer updates. FSUpdateLog{state=ACTIVE, tlog=null}
[junit4:junit4]   2> 13136 T983 C117 P31795 oasc.RecoveryStrategy.replicate Attempting to replicate from http://127.0.0.1:31785/solr/collection1/. core=collection1
[junit4:junit4]   2> 13136 T983 C117 P31795 oascsi.HttpClientUtil.createClient Creating new http client, config:maxConnections=128&maxConnectionsPerHost=32&followRedirects=false
[junit4:junit4]   2> 13149 T951 C118 P31785 oasu.DirectUpdateHandler2.commit start commit{flags=0,_version_=0,optimize=false,openSearcher=true,waitSearcher=true,expungeDeletes=false,softCommit=false}
[junit4:junit4]   2> 13152 T951 C118 P31785 oasc.SolrDeletionPolicy.onInit SolrDeletionPolicy.onInit: commits:num=1
[junit4:junit4]   2> 		commit{dir=NRTCachingDirectory(org.apache.lucene.store.NIOFSDirectory@/usr/home/hudson/hudson-slave/workspace/Lucene-Solr-Tests-4.x-java7/solr/build/solr-core/test/J0/org.apache.solr.cloud.BasicDistributedZkTest-1349649135906/jetty1/index lockFactory=org.apache.lucene.store.NativeFSLockFactory@10a62a4b; maxCacheMB=48.0 maxMergeSizeMB=4.0),segFN=segments_1,generation=1,filenames=[segments_1]
[junit4:junit4]   2> 13153 T951 C118 P31785 oasc.SolrDeletionPolicy.updateCommits newest commit = 1
[junit4:junit4]   2> 13154 T951 C118 P31785 oass.SolrIndexSearcher.<init> Opening Searcher@3d5c7600 main
[junit4:junit4]   2> 13155 T951 C118 P31785 oasu.DirectUpdateHandler2.commit end_commit_flush
[junit4:junit4]   2> 13156 T958 oasc.SolrCore.registerSearcher [collection1] Registered new searcher Searcher@3d5c7600 main{StandardDirectoryReader(segments_1:1)}
[junit4:junit4]   2> 13157 T951 C118 P31785 /update {waitSearcher=true&commit=true&commit_end_point=true&wt=javabin&softCommit=false&version=2} {commit=} 0 9
[junit4:junit4]   2> 13210 T983 C117 P31795 oash.ReplicationHandler.inform Commits will be reserved for  10000
[junit4:junit4]   2> 13211 T983 C117 P31795 oascsi.HttpClientUtil.createClient Creating new http client, config:connTimeout=5000&socketTimeout=20000&allowCompression=false&maxConnections=10000&maxConnectionsPerHost=10000
[junit4:junit4]   2> 13232 T983 C117 P31795 oash.SnapPuller.<init>  No value set for 'pollInterval'. Timer Task not started.
[junit4:junit4]   2> 13234 T952 C118 P31785 oash.ReplicationHandler.inform Commits will be reserved for  10000
[junit4:junit4]   2> 13235 T952 C118 P31785 REQ /replication {command=indexversion&wt=javabin&qt=/replication&version=2} status=0 QTime=2 
[junit4:junit4]   2> 13240 T983 C117 P31795 oasc.SolrDeletionPolicy.onInit SolrDeletionPolicy.onInit: commits:num=1
[junit4:junit4]   2> 		commit{dir=NRTCachingDirectory(org.apache.lucene.store.NIOFSDirectory@/usr/home/hudson/hudson-slave/workspace/Lucene-Solr-Tests-4.x-java7/solr/build/solr-core/test/J0/org.apache.solr.cloud.BasicDistributedZkTest-1349649135906/jetty3/index lockFactory=org.apache.lucene.store.NativeFSLockFactory@28171893; maxCacheMB=48.0 maxMergeSizeMB=4.0),segFN=segments_1,generation=1,filenames=[segments_1]
[junit4:junit4]   2> 13240 T983 C117 P31795 oasc.SolrDeletionPolicy.updateCommits newest commit = 1
[junit4:junit4]   2> 13241 T983 C117 P31795 oasu.DirectUpdateHandler2.commit start commit{flags=0,_version_=0,optimize=false,openSearcher=true,waitSearcher=true,expungeDeletes=false,softCommit=false}
[junit4:junit4]   2> 13278 T983 C117 P31795 oasc.SolrDeletionPolicy.onCommit SolrDeletionPolicy.onCommit: commits:num=2
[junit4:junit4]   2> 		commit{dir=NRTCachingDirectory(org.apache.lucene.store.NIOFSDirectory@/usr/home/hudson/hudson-slave/workspace/Lucene-Solr-Tests-4.x-java7/solr/build/solr-core/test/J0/org.apache.solr.cloud.BasicDistributedZkTest-1349649135906/jetty3/index lockFactory=org.apache.lucene.store.NativeFSLockFactory@28171893; maxCacheMB=48.0 maxMergeSizeMB=4.0),segFN=segments_1,generation=1,filenames=[segments_1]
[junit4:junit4]   2> 		commit{dir=NRTCachingDirectory(org.apache.lucene.store.NIOFSDirectory@/usr/home/hudson/hudson-slave/workspace/Lucene-Solr-Tests-4.x-java7/solr/build/solr-core/test/J0/org.apache.solr.cloud.BasicDistributedZkTest-1349649135906/jetty3/index lockFactory=org.apache.lucene.store.NativeFSLockFactory@28171893; maxCacheMB=48.0 maxMergeSizeMB=4.0),segFN=segments_2,generation=2,filenames=[segments_2]
[junit4:junit4]   2> 13279 T983 C117 P31795 oasc.SolrDeletionPolicy.updateCommits newest commit = 2
[junit4:junit4]   2> 13282 T983 C117 P31795 oass.SolrIndexSearcher.<init> Opening Searcher@2c3f4c5c main
[junit4:junit4]   2> 13282 T983 C117 P31795 oasu.DirectUpdateHandler2.commit end_commit_flush
[junit4:junit4]   2> 13284 T982 oasc.SolrCore.registerSearcher [collection1] Registered new searcher Searcher@2c3f4c5c main{StandardDirectoryReader(segments_2:2)}
[junit4:junit4]   2> 13285 T983 C117 P31795 oasc.RecoveryStrategy.replay No replay needed. core=collection1
[junit4:junit4]   2> 13285 T983 C117 P31795 oasc.RecoveryStrategy.doRecovery Replication Recovery was successful - registering as Active. core=collection1
[junit4:junit4]   2> 13287 T983 C117 P31795 oasc.RecoveryStrategy.doRecovery Finished recovery process. core=collection1
[junit4:junit4]   2> 13769 T944 oascc.ZkStateReader.updateClusterState Updating cloud state from ZooKeeper... 
[junit4:junit4]   2> 13783 T969 oascc.ZkStateReader$2.process A cluster state change has occurred - updating...
[junit4:junit4]   2> 13783 T957 oascc.ZkStateReader$2.process A cluster state change has occurred - updating...
[junit4:junit4]   2> 13783 T985 oascc.ZkStateReader$2.process A cluster state change has occurred - updating...
[junit4:junit4]   2> 13783 T981 oascc.ZkStateReader$2.process A cluster state change has occurred - updating...
[junit4:junit4]   2> 13783 T943 oascc.ZkStateReader$2.process A cluster state change has occurred - updating...
[junit4:junit4]   2> 14104 T923 oascc.ZkStateReader.updateClusterState Updating cloud state from ZooKeeper... 
[junit4:junit4]   2> ASYNC  NEW_CORE C119 name=collection1 org.apache.solr.core.SolrCore@40cc7452 url=http://127.0.0.1:31777/solr/collection1 node=127.0.0.1:31777_solr
[junit4:junit4]   2> 14121 T935 C119 P31777 oasc.SolrDeletionPolicy.onInit SolrDeletionPolicy.onInit: commits:num=1
[junit4:junit4]   2> 		commit{dir=NRTCachingDirectory(org.apache.lucene.store.NIOFSDirectory@/usr/home/hudson/hudson-slave/workspace/Lucene-Solr-Tests-4.x-java7/solr/build/solr-core/test/J0/org.apache.solr.cloud.BasicDistributedZkTest-1349649135906/control/data/index lockFactory=org.apache.lucene.store.NativeFSLockFactory@26b1396e; maxCacheMB=48.0 maxMergeSizeMB=4.0),segFN=segments_1,generation=1,filenames=[segments_1]
[junit4:junit4]   2> 14122 T935 C119 P31777 oasc.SolrDeletionPolicy.updateCommits newest commit = 1
[junit4:junit4]   2> 14124 T935 C119 P31777 oass.SolrIndexSearcher.<init> Opening Searcher@34f877e3 realtime
[junit4:junit4]   2> 14124 T935 C119 P31777 /update {wt=javabin&version=2} {deleteByQuery=*:* (-1415209707129274368)} 0 8
[junit4:junit4]   2> 14125 T923 oaz.ZooKeeper.<init> Initiating client connection, connectString=127.0.0.1:31768/solr sessionTimeout=10000 watcher=org.apache.solr.common.cloud.ConnectionManager@2486f340
[junit4:junit4]   2> 14127 T987 oaz.ClientCnxn$SendThread.startConnect Opening socket connection to server /127.0.0.1:31768
[junit4:junit4]   2> 14127 T923 oascc.ConnectionManager.waitForConnected Waiting for client to connect to ZooKeeper
[junit4:junit4]   2> 14128 T987 oaz.ClientCnxn$SendThread.primeConnection Socket connection established to localhost/127.0.0.1:31768, initiating session
[junit4:junit4]   2> 14128 T925 oazs.NIOServerCnxn$Factory.run Accepted socket connection from /140.211.11.196:31829
[junit4:junit4]   2> 14128 T925 oazs.NIOServerCnxn.readConnectRequest Client attempting to establish new session at /140.211.11.196:31829
[junit4:junit4]   2> 14170 T927 oazs.NIOServerCnxn.finishSessionInit Established session 0x13a3d5b7a2c0007 with negotiated timeout 10000 for client /140.211.11.196:31829
[junit4:junit4]   2> 14170 T987 oaz.ClientCnxn$SendThread.readConnectResult Session establishment complete on server localhost/127.0.0.1:31768, sessionid = 0x13a3d5b7a2c0007, negotiated timeout = 10000
[junit4:junit4]   2> 14171 T988 oascc.ConnectionManager.process Watcher org.apache.solr.common.cloud.ConnectionManager@2486f340 name:ZooKeeperConnection Watcher:127.0.0.1:31768/solr got event WatchedEvent state:SyncConnected type:None path:null path:null type:None
[junit4:junit4]   2> 14171 T923 oascc.ConnectionManager.waitForConnected Client is connected to ZooKeeper
[junit4:junit4]   2> 14172 T923 oascc.ZkStateReader.createClusterStateWatchersAndUpdate Updating cluster state from ZooKeeper... 
[junit4:junit4]   2> 14179 T953 C118 P31785 oass.SolrIndexSearcher.<init> Opening Searcher@572b7af7 realtime
[junit4:junit4]   2>  C117_STATE=coll:collection1 core:collection1 props:{shard=shard1, roles=null, state=active, core=collection1, collection=collection1, node_name=127.0.0.1:31795_solr, base_url=http://127.0.0.1:31795/solr}
[junit4:junit4]   2> 14187 T973 C117 P31795 oass.SolrIndexSearcher.<init> Opening Searcher@64f221c7 realtime
[junit4:junit4]   2> 14188 T973 C117 P31795 REQ /update {update.distrib=FROMLEADER&_version_=-1415209707192188928&update.from=http://127.0.0.1:31785/solr/collection1/&wt=javabin&version=2} status=0 QTime=2 
[junit4:junit4]   2> ASYNC  NEW_CORE C120 name=collection1 org.apache.solr.core.SolrCore@7bb649a url=http://127.0.0.1:31791/solr/collection1 node=127.0.0.1:31791_solr
[junit4:junit4]   2> 14192 T961 C120 P31791 oasc.SolrDeletionPolicy.onInit SolrDeletionPolicy.onInit: commits:num=1
[junit4:junit4]   2> 		commit{dir=NRTCachingDirectory(org.apache.lucene.store.NIOFSDirectory@/usr/home/hudson/hudson-slave/workspace/Lucene-Solr-Tests-4.x-java7/solr/build/solr-core/test/J0/org.apache.solr.cloud.BasicDistributedZkTest-1349649135906/jetty2/index lockFactory=org.apache.lucene.store.NativeFSLockFactory@15e39292; maxCacheMB=48.0 maxMergeSizeMB=4.0),segFN=segments_1,generation=1,filenames=[segments_1]
[junit4:junit4]   2> 14193 T961 C120 P31791 oasc.SolrDeletionPolicy.updateCommits newest commit = 1
[junit4:junit4]   2> 14195 T961 C120 P31791 oass.SolrIndexSearcher.<init> Opening Searcher@f4e5df0 realtime
[junit4:junit4]   2> 14195 T961 C120 P31791 REQ /update {update.distrib=TOLEADER&wt=javabin&version=2} status=0 QTime=8 
[junit4:junit4]   2> 14196 T953 C118 P31785 /update {wt=javabin&version=2} {deleteByQuery=*:* (-1415209707192188928)} 0 19
[junit4:junit4]   2> 14204 T935 C119 P31777 /update {wt=javabin&version=2} {add=[1 (1415209707216306176)]} 0 5
[junit4:junit4]   2> 14217 T973 C117 P31795 REQ /update {distrib.from=http://127.0.0.1:31785/solr/collection1/&update.distrib=FROMLEADER&wt=javabin&version=2} status=0 QTime=3 
[junit4:junit4]   2> 14218 T953 C118 P31785 /update {wt=javabin&version=2} {add=[1 (1415209707224694784)]} 0 11
[junit4:junit4]   2> 14223 T935 C119 P31777 /update {wt=javabin&version=2} {add=[2 (1415209707239374848)]} 0 2
[junit4:junit4]   2> 14236 T961 C120 P31791 REQ /update {distrib.from=http://127.0.0.1:31785/solr/collection1/&update.distrib=TOLEADER&wt=javabin&version=2} status=0 QTime=4 
[junit4:junit4]   2> 14237 T953 C118 P31785 /update {wt=javabin&version=2} {add=[2]} 0 11
[junit4:junit4]   2> 14242 T935 C119 P31777 /update {wt=javabin&version=2} {add=[3 (1415209707259297792)]} 0 2
[junit4:junit4]   2> 14249 T961 C120 P31791 REQ /update {distrib.from=http://127.0.0.1:31785/solr/collection1/&update.distrib=TOLEADER&wt=javabin&version=2} status=0 QTime=1 
[junit4:junit4]   2> 14250 T953 C118 P31785 /update {wt=javabin&version=2} {add=[3]} 0 5
[junit4:junit4]   2> 14255 T935 C119 P31777 /update {wt=javabin&version=2} {add=[4 (1415209707272929280)]} 0 2
[junit4:junit4]   2> 14263 T973 C117 P31795 REQ /update {distrib.from=http://127.0.0.1:31785/solr/collection1/&update.distrib=FROMLEADER&wt=javabin&version=2} status=0 QTime=1 
[junit4:junit4]   2> 14264 T953 C118 P31785 /update {wt=javabin&version=2} {add=[4 (1415209707277123584)]} 0 6
[junit4:junit4]   2> 14269 T935 C119 P31777 /update {wt=javabin&version=2} {add=[5 (1415209707287609344)]} 0 2
[junit4:junit4]   2> 14274 T962 C120 P31791 /update {wt=javabin&version=2} {add=[5 (1415209707291803648)]} 0 2
[junit4:junit4]   2> 14279 T935 C119 P31777 /update {wt=javabin&version=2} {add=[6 (1415209707298095104)]} 0 2
[junit4:junit4]   2> 14284 T962 C120 P31791 /update {wt=javabin&version=2} {add=[6 (1415209707303337984)]} 0 2
[junit4:junit4]   2> 14289 T935 C119 P31777 /update {wt=javabin&version=2} {add=[7 (1415209707308580864)]} 0 2
[junit4:junit4]   2> 14294 T962 C120 P31791 /update {wt=javabin&version=2} {add=[7 (1415209707313823744)]} 0 2
[junit4:junit4]   2> 14299 T935 C119 P31777 /update {wt=javabin&version=2} {add=[8 (1415209707319066624)]} 0 2
[junit4:junit4]   2> 14308 T973 C117 P31795 REQ /update {distrib.from=http://127.0.0.1:31785/solr/collection1/&update.distrib=FROMLEADER&wt=javabin&version=2} status=0 QTime=2 
[junit4:junit4]   2> 14309 T953 C118 P31785 /update {wt=javabin&version=2} {add=[8 (1415209707324309504)]} 0 7
[junit4:junit4]   2> 14313 T935 C119 P31777 /update {wt=javabin&version=2} {add=[9 (1415209707333746688)]} 0 2
[junit4:junit4]   2> 14318 T962 C120 P31791 /update {wt=javabin&version=2} {add=[9 (1415209707338989568)]} 0 2
[junit4:junit4]   2> 14337 T935 C119 P31777 /update {wt=javabin&version=2} {add=[10 (1415209707344232448)]} 0 15
[junit4:junit4]   2> 14345 T973 C117 P31795 REQ /update {distrib.from=http://127.0.0.1:31785/solr/collection1/&update.distrib=FROMLEADER&wt=javabin&version=2} status=0 QTime=1 
[junit4:junit4]   2> 14346 T953 C118 P31785 /update {wt=javabin&version=2} {add=[10 (1415209707364155392)]} 0 6
[junit4:junit4]   2> 14353 T935 C119 P31777 /update {wt=javabin&version=2} {add=[11 (1415209707373592576)]} 0 4
[junit4:junit4]   2> 14365 T973 C117 P31795 REQ /update {distrib.from=http://127.0.0.1:31785/solr/collection1/&update.distrib=FROMLEADER&wt=javabin&version=2} status=0 QTime=2 
[junit4:junit4]   2> 14365 T954 C118 P31785 REQ /update {distrib.from=http://127.0.0.1:31791/solr/collection1/&update.distrib=TOLEADER&wt=javabin&version=2} status=0 QTime=7 
[junit4:junit4]   2> 14366 T962 C120 P31791 /update {wt=javabin&version=2} {add=[11]} 0 10
[junit4:junit4]   2> 14371 T935 C119 P31777 /update {wt=javabin&version=2} {add=[12 (1415209707394564096)]} 0 2
[junit4:junit4]   2> 14382 T973 C117 P31795 REQ /update {distrib.from=http://127.0.0.1:31785/solr/collection1/&update.distrib=FROMLEADER&wt=javabin&version=2} status=0 QTime=2 
[junit4:junit4]   2> 14383 T954 C118 P31785 REQ /update {distrib.from=http://127.0.0.1:31791/solr/collection1/&update.distrib=TOLEADER&wt=javabin&version=2} status=0 QTime=7 
[junit4:junit4]   2> 14384 T962 C120 P31791 /update {wt=javabin&version=2} {add=[12]} 0 11
[junit4:junit4]   2> 14389 T935 C119 P31777 /update {wt=javabin&version=2} {add=[13 (1415209707413438464)]} 0 2
[junit4:junit4]   2> 14402 T973 C117 P31795 REQ /update {distrib.from=http://127.0.0.1:31785/solr/collection1/&update.distrib=FROMLEADER&wt=javabin&version=2} status=0 QTime=2 
[junit4:junit4]   2> 14403 T954 C118 P31785 REQ /update {distrib.from=http://127.0.0.1:31791/solr/collection1/&update.distrib=TOLEADER&wt=javabin&version=2} status=0 QTime=8 
[junit4:junit4]   2> 14404 T962 C120 P31791 /update {wt=javabin&version=2} {add=[13]} 0 12
[junit4:junit4]   2> 14409 T935 C119 P31777 /update {wt=javabin&version=2} {add=[14 (1415209707434409984)]} 0 1
[junit4:junit4]   2> 14421 T973 C117 P31795 REQ /update {distrib.from=http://127.0.0.1:31785/solr/collection1/&update.distrib=FROMLEADER&wt=javabin&version=2} status=0 QTime=2 
[junit4:junit4]   2> 14422 T954 C118 P31785 REQ /update {distrib.from=http://127.0.0.1:31791/solr/collection1/&update.distrib=TOLEADER&wt=javabin&version=2} status=0 QTime=7 
[junit4:junit4]   2> 14423 T962 C120 P31791 /update {wt=javabin&version=2} {add=[14]} 0 11
[junit4:junit4]   2> 14427 T935 C119 P31777 /update {wt=javabin&version=2} {add=[15 (1415209707453284352)]} 0 1
[junit4:junit4]   2> 14436 T973 C117 P31795 REQ /update {distrib.from=http://127.0.0.1:31785/solr/collection1/&update.distrib=FROMLEADER&wt=javabin&version=2} status=0 QTime=2 
[junit4:junit4]   2> 14436 T953 C118 P31785 /update {wt=javabin&version=2} {add=[15 (1415209707458527232)]} 0 6
[junit4:junit4]   2> 14440 T935 C119 P31777 /update {wt=javabin&version=2} {add=[16 (1415209707466915840)]} 0 1
[junit4:junit4]   2> 14495 T973 C117 P31795 REQ /update {distrib.from=http://127.0.0.1:31785/solr/collection1/&update.distrib=FROMLEADER&wt=javabin&version=2} status=0 QTime=23 
[junit4:junit4]   2> 14496 T953 C118 P31785 /update {wt=javabin&version=2} {add=[16 (1415209707472158720)]} 0 53
[junit4:junit4]   2> 14504 T935 C119 P31777 /update {wt=javabin&version=2} {add=[17 (1415209707532976128)]} 0 4
[junit4:junit4]   2> 14512 T962 C120 P31791 /update {wt=javabin&version=2} {add=[17 (1415209707540316160)]} 0 5
[junit4:junit4]   2> 14516 T935 C119 P31777 /update {wt=javabin&version=2} {add=[100 (1415209707547656192)]} 0 1
[junit4:junit4]   2> 14527 T973 C117 P31795 REQ /update {distrib.from=http://127.0.0.1:31785/solr/collection1/&update.distrib=FROMLEADER&wt=javabin&version=2} status=0 QTime=3 
[junit4:junit4]   2> 14528 T953 C118 P31785 /update {wt=javabin&version=2} {add=[100 (1415209707551850496)]} 0 9
[junit4:junit4]   2> 14532 T935 C119 P31777 /update {wt=javabin&version=2} {add=[101 (1415209707564433408)]} 0 1
[junit4:junit4]   2> 14542 T973 C117 P31795 REQ /update {distrib.from=http://127.0.0.1:31785/solr/collection1/&update.distrib=FROMLEADER&wt=javabin&version=2} status=0 QTime=1 
[junit4:junit4]   2> 14543 T954 C118 P31785 REQ /update {distrib.from=http://127.0.0.1:31791/solr/collection1/&update.distrib=TOLEADER&wt=javabin&version=2} status=0 QTime=5 
[junit4:junit4]   2> 14543 T962 C120 P31791 /update {wt=javabin&version=2} {add=[101]} 0 8
[junit4:junit4]   2> 14560 T935 C119 P31777 /update {wt=javabin&version=2} {add=[102 (1415209707579113472)]} 0 14
[junit4:junit4]   2> 14572 T973 C117 P31795 REQ /update {distrib.from=http://127.0.0.1:31785/solr/collection1/&update.distrib=FROMLEADER&wt=javabin&version=2} status=0 QTime=2 
[junit4:junit4]   2> 14572 T954 C118 P31785 REQ /update {distrib.from=http://127.0.0.1:31791/solr/collection1/&update.distrib=TOLEADER&wt=javabin&version=2} status=0 QTime=6 
[junit4:junit4]   2> 14573 T962 C120 P31791 /update {wt=javabin&version=2} {add=[102]} 0 10
[junit4:junit4]   2> 14578 T935 C119 P31777 /update {wt=javabin&version=2} {add=[103 (1415209707610570752)]} 0 2
[junit4:junit4]   2> 14583 T962 C120 P31791 /update {wt=javabin&version=2} {add=[103 (1415209707616862208)]} 0 2
[junit4:junit4]   2> 14587 T935 C119 P31777 /update {wt=javabin&version=2} {add=[104 (1415209707621056512)]} 0 1
[junit4:junit4]   2> 14595 T961 C120 P31791 REQ /update {distrib.from=http://127.0.0.1:31785/solr/collection1/&update.distrib=TOLEADER&wt=javabin&version=2} status=0 QTime=2 
[junit4:junit4]   2> 14595 T953 C118 P31785 /update {wt=javabin&version=2} {add=[104]} 0 5
[junit4:junit4]   2> 14599 T935 C119 P31777 /update {wt=javabin&version=2} {add=[105 (1415209707634688000)]} 0 1
[junit4:junit4]   2> 14619 T961 C120 P31791 REQ /update {distrib.from=http://127.0.0.1:31785/solr/collection1/&update.distrib=TOLEADER&wt=javabin&version=2} status=0 QTime=14 
[junit4:junit4]   2> 14620 T953 C118 P31785 /update {wt=javabin&version=2} {add=[105]} 0 18
[junit4:junit4]   2> 14625 T935 C119 P31777 /update {wt=javabin&version=2} {add=[106 (1415209707661950976)]} 0 1
[junit4:junit4]   2> 14633 T961 C120 P31791 REQ /update {distrib.from=http://127.0.0.1:31785/solr/collection1/&update.distrib=TOLEADER&wt=javabin&version=2} status=0 QTime=2 
[junit4:junit4]   2> 14634 T953 C118 P31785 /update {wt=javabin&version=2} {add=[106]} 0 6
[junit4:junit4]   2> 14638 T935 C119 P31777 /update {wt=javabin&version=2} {add=[107 (1415209707674533888)]} 0 1
[junit4:junit4]   2> 14649 T973 C117 P31795 REQ /update {distrib.from=http://127.0.0.1:31785/solr/collection1/&update.distrib=FROMLEADER&wt=javabin&version=2} status=0 QTime=2 
[junit4:junit4]   2> 14650 T954 C118 P31785 REQ /update {distrib.from=http://127.0.0.1:31791/solr/collection1/&update.distrib=TOLEADER&wt=javabin&version=2} status=0 QTime=6 
[junit4:junit4]   2> 14650 T962 C120 P31791 /update {wt=javabin&version=2} {add=[107]} 0 9
[junit4:junit4]   2> 14655 T935 C119 P31777 /update {wt=javabin&version=2} {add=[108 (1415209707692359680)]} 0 1
[junit4:junit4]   2> 14664 T973 C117 P31795 REQ /update {distrib.from=http://127.0.0.1:31785/solr/collection1/&update.distrib=FROMLEADER&wt=javabin&version=2} status=0 QTime=1 
[junit4:junit4]   2> 14665 T954 C118 P31785 REQ /update {distrib.from=http://127.0.0.1:31791/solr/collection1/&update.distrib=TOLEADER&wt=javabin&version=2} status=0 QTime=5 
[junit4:junit4]   2> 14665 T962 C120 P31791 /update {wt=javabin&version=2} {add=[108]} 0 8
[junit4:junit4]   2> 14669 T935 C119 P31777 /update {wt=javabin&version=2} {add=[109 (1415209707707039744)]} 0 1
[junit4:junit4]   2> 14677 T973 C117 P31795 REQ /update {distrib.from=http://127.0.0.1:31785/solr/collection1/&update.distrib=FROMLEADER&wt=javabin&version=2} status=0 QTime=1 
[junit4:junit4]   2> 14677 T953 C118 P31785 /update {wt=javabin&version=2} {add=[109 (1415209707712282624)]} 0 5
[junit4:junit4]   2> 14682 T935 C119 P31777 /update {wt=javabin&version=2} {add=[110 (1415209707720671232)]} 0 1
[junit4:junit4]   2> 14692 T973 C117 P31795 REQ /update {distrib.from=http://127.0.0.1:31785/solr/collection1/&update.distrib=FROMLEADER&wt=javabin&version=2} status=0 QTime=1 
[junit4:junit4]   2> 14693 T954 C118 P31785 REQ /update {distrib.from=http://127.0.0.1:31791/solr/collection1/&update.distrib=TOLEADER&wt=javabin&version=2} status=0 QTime=6 
[junit4:junit4]   2> 14694 T962 C120 P31791 /update {wt=javabin&version=2} {add=[110]} 0 10
[junit4:junit4]   2> 14698 T935 C119 P31777 /update {wt=javabin&version=2} {add=[111 (1415209707737448448)]} 0 1
[junit4:junit4]   2> 14707 T973 C117 P31795 REQ /update {distrib.from=http://127.0.0.1:31785/solr/collection1/&update.distrib=FROMLEADER&wt=javabin&version=2} status=0 QTime=2 
[junit4:junit4]   2> 14707 T953 C118 P31785 /update {wt=javabin&version=2} {add=[111 (1415209707741642752)]} 0 6
[junit4:junit4]   2> 14724 T935 C119 P31777 /update {wt=javabin&version=2} {add=[112 (1415209707752128512)]} 0 13
[junit4:junit4]   2> 14728 T962 C120 P31791 /update {wt=javabin&version=2} {add=[112 (1415209707768905728)]} 0 1
[junit4:junit4]   2> 14733 T935 C119 P31777 /update {wt=javabin&version=2} {add=[113 (1415209707773100032)]} 0 2
[junit4:junit4]   2> 14744 T973 C117 P31795 REQ /update {distrib.from=http://127.0.0.1:31785/solr/collection1/&update.distrib=FROMLEADER&wt=javabin&version=2} status=0 QTime=1 
[junit4:junit4]   2> 14745 T954 C118 P31785 REQ /update {distrib.from=http://127.0.0.1:31791/solr/collection1/&update.distrib=TOLEADER&wt=javabin&version=2} status=0 QTime=6 
[junit4:junit4]   2> 14746 T962 C120 P31791 /update {wt=javabin&version=2} {add=[113]} 0 10
[junit4:junit4]   2> 14750 T935 C119 P31777 /update {wt=javabin&version=2} {add=[114 (1415209707791974400)]} 0 1
[junit4:junit4]   2> 14796 T973 C117 P31795 REQ /update {distrib.from=http://127.0.0.1:31785/solr/collection1/&update.distrib=FROMLEADER&wt=javabin&version=2} status=0 QTime=18 
[junit4:junit4]   2> 14797 T954 C118 P31785 REQ /update {distrib.from=http://127.0.0.1:31791/solr/collection1/&update.distrib=TOLEADER&wt=javabin&version=2} status=0 QTime=40 
[junit4:junit4]   2> 14797 T962 C120 P31791 /update {wt=javabin&version=2} {add=[114]} 0 44
[junit4:junit4]   2> 14801 T935 C119 P31777 /update {wt=javabin&version=2} {add=[115 (1415209707846500352)]} 0 1
[junit4:junit4]   2> 14808 T961 C120 P31791 REQ /update {distrib.from=http://127.0.0.1:31785/solr/collection1/&update.distrib=TOLEADER&wt=javabin&version=2} status=0 QTime=1 
[junit4:junit4]   2> 14809 T953 C118 P31785 /update {wt=javabin&version=2} {add=[115]} 0 5
[junit4:junit4]   2> 14813 T935 C119 P31777 /update {wt=javabin&version=2} {add=[116 (1415209707858034688)]} 0 1
[junit4:junit4]   2> 14816 T962 C120 P31791 /update {wt=javabin&version=2} {add=[116 (1415209707861180416)]} 0 1
[junit4:junit4]   2> 14820 T935 C119 P31777 /update {wt=javabin&version=2} {add=[117 (1415209707865374720)]} 0 1
[junit4:junit4]   2> 14827 T961 C120 P31791 REQ /update {distrib.from=http://127.0.0.1:31785/solr/collection1/&update.distrib=TOLEADER&wt=javabin&version=2} status=0 QTime=2 
[junit4:junit4]   2> 14828 T953 C118 P31785 /update {wt=javabin&version=2} {add=[117]} 0 6
[junit4:junit4]   2> 14832 T935 C119 P31777 /update {wt=javabin&version=2} {add=[118 (1415209707877957632)]} 0 1
[junit4:junit4]   2> 14847 T973 C117 P31795 REQ /update {distrib.from=http://127.0.0.1:31785/solr/collection1/&update.distrib=FROMLEADER&wt=javabin&version=2} status=0 QTime=3 
[junit4:junit4]   2> 14848 T954 C118 P31785 REQ /update {distrib.from=http://127.0.0.1:31791/solr/collection1/&update.distrib=TOLEADER&wt=javabin&version=2} status=0 QTime=10 
[junit4:junit4]   2> 14849 T962 C120 P31791 /update {wt=javabin&version=2} {add=[118]} 0 14
[junit4:junit4]   2> 14853 T935 C119 P31777 /update {wt=javabin&version=2} {add=[119 (1415209707899977728)]} 0 1
[junit4:junit4]   2> 14860 T961 C120 P31791 REQ /update {distrib.from=http://127.0.0.1:31785/solr/collection1/&update.distrib=TOLEADER&wt=javabin&version=2} status=0 QTime=1 
[junit4:junit4]   2> 14860 T953 C118 P31785 /update {wt=javabin&version=2} {add=[119]} 0 4
[junit4:junit4]   2> 14864 T935 C119 P31777 /update {wt=javabin&version=2} {add=[120 (1415209707911512064)]} 0 1
[junit4:junit4]   2> 14867 T962 C120 P31791 /update {wt=javabin&version=2} {add=[120 (1415209707914657792)]} 0 1
[junit4:junit4]   2> 14871 T935 C119 P31777 /update {wt=javabin&version=2} {add=[121 (1415209707918852096)]} 0 1
[junit4:junit4]   2> 14878 T961 C120 P31791 REQ /update {distrib.from=http://127.0.0.1:31785/solr/collection1/&update.distrib=TOLEADER&wt=javabin&version=2} status=0 QTime=1 
[junit4:junit4]   2> 14879 T953 C118 P31785 /update {wt=javabin&version=2} {add=[121]} 0 5
[junit4:junit4]   2> 14893 T935 C119 P31777 /update {wt=javabin&version=2} {add=[122 (1415209707931435008)]} 0 11
[junit4:junit4]   2> 14907 T973 C117 P31795 REQ /update {distrib.from=http://127.0.0.1:31785/solr/collection1/&update.distrib=FROMLEADER&wt=javabin&version=2} status=0 QTime=2 
[junit4:junit4]   2> 14907 T954 C118 P31785 REQ /update {distrib.from=http://127.0.0.1:31791/solr/collection1/&update.distrib=TOLEADER&wt=javabin&version=2} status=0 QTime=6 
[junit4:junit4]   2> 14908 T962 C120 P31791 /update {wt=javabin&version=2} {add=[122]} 0 11
[junit4:junit4]   2> 14913 T935 C119 P31777 /update {wt=javabin&version=2} {add=[123 (1415209707961843712)]} 0 2
[junit4:junit4]   2> 14921 T973 C117 P31795 REQ /update {distrib.from=http://127.0.0.1:31785/solr/collection1/&update.distrib=FROMLEADER&wt=javabin&version=2} status=0 QTime=2 
[junit4:junit4]   2> 14922 T953 C118 P31785 /update {wt=javabin&version=2} {add=[123 (1415209707967086592)]} 0 6
[junit4:junit4]   2> 14926 T935 C119 P31777 /update {wt=javabin&version=2} {add=[124 (1415209707976523776)]} 0 1
[junit4:junit4]   2> 14939 T973 C117 P31795 REQ /update {distrib.from=http://127.0.0.1:31785/solr/collection1/&update.distrib=FROMLEADER&wt=javabin&version=2} status=0 QTime=2 
[junit4:junit4]   2> 14940 T954 C118 P31785 REQ /update {distrib.from=http://127.0.0.1:31791/solr/collection1/&update.distrib=TOLEADER&wt=javabin&version=2} status=0 QTime=8 
[junit4:junit4]   2> 14940 T962 C120 P31791 /update {wt=javabin&version=2} {add=[124]} 0 11
[junit4:junit4]   2> 14944 T935 C119 P31777 /update {wt=javabin&version=2} {add=[125 (1415209707996446720)]} 0 1
[junit4:junit4]   2> 14957 T973 C117 P31795 REQ /update {distrib.from=http://127.0.0.1:31785/solr/collection1/&update.distrib=FROMLEADER&wt=javabin&version=2} status=0 QTime=2 
[junit4:junit4]   2> 14958 T954 C118 P31785 REQ /update {distrib.from=http://127.0.0.1:31791/solr/collection1/&update.distrib=TOLEADER&wt=javabin&version=2} status=0 QTime=8 
[junit4:junit4]   2> 14958 T962 C120 P31791 /update {wt=javabin&version=2} {add=[125]} 0 11
[junit4:junit4]   2> 14964 T935 C119 P31777 /update {wt=javabin&version=2} {add=[126 (1415209708016369664)]} 0 2
[junit4:junit4]   2> 14972 T961 C120 P31791 REQ /update {distrib.from=http://127.0.0.1:31785/solr/collection1/&update.distrib=TOLEADER&wt=javabin&version=2} status=0 QTime=2 
[junit4:junit4]   2> 14973 T953 C118 P31785 /update {wt=javabin&version=2} {add=[126]} 0 6
[junit4:junit4]   2> 14978 T935 C119 P31777 /update {wt=javabin&version=2} {add=[127 (1415209708031049728)]} 0 2
[junit4:junit4]   2> 15025 T962 C120 P31791 /update {wt=javabin&version=2} {add=[127 (1415209708036292608)]} 0 44
[junit4:junit4]   2> 15031 T935 C119 P31777 /update {wt=javabin&version=2} {add=[128 (1415209708086624256)]} 0 2
[junit4:junit4]   2> 15069 T962 C120 P31791 /update {wt=javabin&version=2} {add=[128 (1415209708091867136)]} 0 35
[junit4:junit4]   2> 15075 T935 C119 P31777 /update {wt=javabin&version=2} {add=[129 (1415209708132761600)]} 0 2
[junit4:junit4]   2> 15088 T973 C117 P31795 REQ /update {distrib.from=http://127.0.0.1:31785/solr/collection1/&update.distrib=FROMLEADER&wt=javabin&version=2} status=0 QTime=2 
[junit4:junit4]   2> 15089 T954 C118 P31785 REQ /update {distrib.from=http://127.0.0.1:31791/solr/collection1/&update.distrib=TOLEADER&wt=javabin&version=2} status=0 QTime=7 
[junit4:junit4]   2> 15090 T962 C120 P31791 /update {wt=javabin&version=2} {add=[129]} 0 12
[junit4:junit4]   2> 15095 T935 C119 P31777 /update {wt=javabin&version=2} {add=[130 (1415209708153733120)]} 0 2
[junit4:junit4]   2> 15099 T962 C120 P31791 /update {wt=javabin&version=2} {add=[130 (1415209708157927424)]} 0 1
[junit4:junit4]   2> 15104 T935 C119 P31777 /update {wt=javabin&version=2} {add=[131 (1415209708163170304)]} 0 2
[junit4:junit4]   2> 15108 T962 C120 P31791 /update {wt=javabin&version=2} {add=[131 (1415209708167364608)]} 0 1
[junit4:junit4]   2> 15127 T935 C119 P31777 /update {wt=javabin&version=2} {add=[132 (1415209708172607488)]} 0 16
[junit4:junit4]   2> 15137 T973 C117 P31795 REQ /update {distrib.from=http://127.0.0.1:31785/solr/collection1/&update.distrib=FROMLEADER&wt=javabin&version=2} status=0 QTime=2 
[junit4:junit4]   2> 15138 T953 C118 P31785 /update {wt=javabin&version=2} {add=[132 (1415209708193579008)]} 0 7
[junit4:junit4]   2> 15144 T935 C119 P31777 /update {wt=javabin&version=2} {add=[133 (1415209708203016192)]} 0 3
[junit4:junit4]   2> 15152 T973 C117 P31795 REQ /update {distrib.from=http://127.0.0.1:31785/solr/collection1/&update.distrib=FROMLEADER&wt=javabin&version=2} status=0 QTime=2 
[junit4:junit4]   2> 15152 T953 C118 P31785 /update {wt=javabin&version=2} {add=[133 (1415209708209307648)]} 0 5
[junit4:junit4]   2> 15156 T935 C119 P31777 /update {wt=javabin&version=2} {add=[134 (1415209708217696256)]} 0 1
[junit4:junit4]   2> 15160 T962 C120 P31791 /update {wt=javabin&version=2} {add=[134 (1415209708221890560)]} 0 1
[junit4:junit4]   2> 15164 T935 C119 P31777 /update {wt=javabin&version=2} {add=[135 (1415209708226084864)]} 0 1
[junit4:junit4]   2> 15172 T973 C117 P31795 REQ /update {distrib.from=http://127.0.0.1:31785/solr/collection1/&update.distrib=FROMLEADER&wt=javabin&version=2} status=0 QTime=1 
[junit4:junit4]   2> 15173 T953 C118 P31785 /update {wt=javabin&version=2} {add=[135 (1415209708230279168)]} 0 6
[junit4:junit4]   2> 15177 T935 C119 P31777 /update {wt=javabin&version=2} {add=[136 (1415209708239716352)]} 0 1
[junit4:junit4]   2> 15185 T961 C120 P31791 REQ /update {distrib.from=http://127.0.0.1:31785/solr/collection1/&update.distrib=TOLEADER&wt=javabin&version=2} status=0 QTime=1 
[junit4:junit4]   2> 15185 T953 C118 P31785 /update {wt=javabin&version=2} {add=[136]} 0 5
[junit4:junit4]   2> 15189 T935 C119 P31777 /update {wt=javabin&version=2} {add=[137 (1415209708252299264)]} 0 1
[junit4:junit4]   2> 15193 T962 C120 P31791 /update {wt=javabin&version=2} {add=[137 (1415209708257542144)]} 0 1
[junit4:junit4]   2> 15197 T935 C119 P31777 /update {wt=javabin&version=2} {add=[138 (1415209708260687872)]} 0 1
[junit4:junit4]   2> 15230 T973 C117 P31795 REQ /update {distrib.from=http://127.0.0.1:31785/solr/collection1/&update.distrib=FROMLEADER&wt=javabin&version=2} status=0 QTime=12 
[junit4:junit4]   2> 15231 T954 C118 P31785 REQ /update {distrib.from=http://127.0.0.1:31791/solr/collection1/&update.distrib=TOLEADER&wt=javabin&version=2} status=0 QTime=28 
[junit4:junit4]   2> 15231 T962 C120 P31791 /update {wt=javabin&version=2} {add=[138]} 0 31
[junit4:junit4]   2> 15237 T935 C119 P31777 /update {wt=javabin&version=2} {add=[139 (1415209708302630912)]} 0 2
[junit4:junit4]   2> 15245 T961 C120 P31791 REQ /update {distrib.from=http://127.0.0.1:31785/solr/collection1/&update.distrib=TOLEADER&wt=javabin&version=2} status=0 QTime=2 
[junit4:junit4]   2> 15245 T953 C118 P31785 /update {wt=javabin&version=2} {add=[139]} 0 5
[junit4:junit4]   2> 15249 T935 C119 P31777 /update {wt=javabin&version=2} {add=[140 (1415209708315213824)]} 0 1
[junit4:junit4]   2> 15256 T961 C120 P31791 REQ /update {distrib.from=http://127.0.0.1:31785/solr/collection1/&update.distrib=TOLEADER&wt=javabin&version=2} status=0 QTime=1 
[junit4:junit4]   2> 15257 T953 C118 P31785 /update {wt=javabin&version=2} {add=[140]} 0 5
[junit4:junit4]   2> 15262 T935 C119 P31777 /update {wt=javabin&version=2} {add=[141 (1415209708328845312)]} 0 2
[junit4:junit4]   2> 15266 T962 C120 P31791 /update {wt=javabin&version=2} {add=[141 (1415209708334088192)]} 0 1
[junit4:junit4]   2> 15282 T935 C119 P31777 /update {wt=javabin&version=2} {add=[142 (1415209708338282496)]} 0 12
[junit4:junit4]   2> 15294 T962 C120 P31791 /update {wt=javabin&version=2} {add=[142 (1415209708355059712)]} 0 9
[junit4:junit4]   2> 15301 T935 C119 P31777 /update {wt=javabin&version=2} {add=[143 (1415209708368691200)]} 0 3
[junit4:junit4]   2> 15310 T961 C120 P31791 REQ /update {distrib.from=http://127.0.0.1:31785/solr/collection1/&update.distrib=TOLEADER&wt=javabin&version=2} status=0 QTime=3 
[junit4:junit4]   2> 15310 T953 C118 P31785 /update {wt=javabin&version=2} {add=[143]} 0 6
[junit4:junit4]   2> 15314 T935 C119 P31777 /update {wt=javabin&version=2} {add=[144 (1415209708383371264)]} 0 1
[junit4:junit4]   2> 15318 T962 C120 P31791 /update {wt=javabin&version=2} {add=[144 (1415209708387565568)]} 0 1
[junit4:junit4]   2> 15322 T935 C119 P31777 /update {wt=javabin&version=2} {add=[145 (1415209708391759872)]} 0 1
[junit4:junit4]   2> 15326 T962 C120 P31791 /update {wt=javabin&version=2} {add=[145 (1415209708395954176)]} 0 1
[junit4:junit4]   2> 15330 T935 C119 P31777 /update {wt=javabin&version=2} {add=[146 (1415209708400148480)]} 0 1
[junit4:junit4]   2> 15344 T973 C117 P31795 REQ /update {distrib.from=http://127.0.0.1:31785/solr/collection1/&update.distrib=FROMLEADER&wt=javabin&version=2} status=0 QTime=3 
[junit4:junit4]   2> 15344 T954 C118 P31785 REQ /update {distrib.from=http://127.0.0.1:31791/solr/collection1/&update.distrib=TOLEADER&wt=javabin&version=2} status=0 QTime=8 
[junit4:junit4]   2> 15345 T962 C120 P31791 /update {wt=javabin&version=2} {add=[146]} 0 12
[junit4:junit4]   2> 15349 T935 C119 P31777 /update {wt=javabin&version=2} {add=[147 (1415209708420071424)]} 0 1
[junit4:junit4]   2> 15353 T962 C120 P31791 /update {wt=javabin&version=2} {add=[147 (1415209708424265728)]} 0 1
[junit4:junit4]   2> 15357 T935 C119 P31777 /update {wt=javabin&version=2} {add=[148 (1415209708428460032)]} 0 1
[junit4:junit4]   2> 15369 T973 C117 P31795 REQ /update {distrib.from=http://127.0.0.1:31785/solr/collection1/&update.distrib=FROMLEADER&wt=javabin&version=2} status=0 QTime=2 
[junit4:junit4]   2> 15369 T954 C118 P31785 REQ /update {distrib.from=http://127.0.0.1:31791/solr/collection1/&update.distrib=TOLEADER&wt=javabin&version=2} status=0 QTime=6 
[junit4:junit4]   2> 15370 T962 C120 P31791 /update {wt=javabin&version=2} {add=[148]} 0 10
[junit4:junit4]   2> 15375 T935 C119 P31777 /update {wt=javabin&version=2} {add=[149 (1415209708447334400)]} 0 2
[junit4:junit4]   2> 15381 T961 C120 P31791 REQ /update {distrib.from=http://127.0.0.1:31785/solr/collection1/&update.distrib=TOLEADER&wt=javabin&version=2} status=0 QTime=1 
[junit4:junit4]   2> 15382 T953 C118 P31785 /update {wt=javabin&version=2} {add=[149]} 0 5
[junit4:junit4]   2> 15385 T935 C119 P31777 oasu.DirectUpdateHandler2.commit start commit{flags=0,_version_=0,optimize=false,openSearcher=true,waitSearcher=true,expungeDeletes=false,softCommit=false}
[junit4:junit4]   2> 15773 T935 C119 P31777 oasc.SolrDeletionPolicy.onCommit SolrDeletionPolicy.onCommit: commits:num=2
[junit4:junit4]   2> 		commit{dir=NRTCachingDirectory(org.apache.lucene.store.NIOFSDirectory@/usr/home/hudson/hudson-slave/workspace/Lucene-Solr-Tests-4.x-java7/solr/build/solr-core/test/J0/org.apache.solr.cloud.BasicDistributedZkTest-1349649135906/control/data/index lockFactory=org.apache.lucene.store.NativeFSLockFactory@26b1396e; maxCacheMB=48.0 maxMergeSizeMB=4.0),segFN=segments_1,generation=1,filenames=[segments_1]
[junit4:junit4]   2> 		commit{dir=NRTCachingDirectory(org.apache.lucene.store.NIOFSDirectory@/usr/home/hudson/hudson-slave/workspace/Lucene-Solr-Tests-4.x-java7/solr/build/solr-core/test/J0/org.apache.solr.cloud.BasicDistributedZkTest-1349649135906/control/data/index lockFactory=org.apache.lucene.store.NativeFSLockFactory@26b1396e; maxCacheMB=48.0 maxMergeSizeMB=4.0),segFN=segments_2,generation=2,filenames=[_2_Direct_0.tip, _4_TestBloomFilteredLucene40Postings_0.frq, _5_nrm.cfe, _5_Memory_0.ram, _2_Direct_0.tim, _3_TestBloomFilteredLucene40Postings_0.prx, _2_TestBloomFilteredLucene40Postings_0.blm, _6_Direct_0.tip, _6_Direct_0.tim, _3.fdt, _0_TestBloomFilteredLucene40Postings_0.frq, _3_TestBloomFilteredLucene40Postings_0.frq, _3_TestBloomFilteredLucene40Postings_0.tim, _5_Direct_0.prx, _0_TestBloomFilteredLucene40Postings_0.blm, _1_MockVariableIntBlock_0.tii, _0_Memory_0.ram, _2.fdt, _3_TestBloomFilteredLucene40Postings_0.tip, _2.fdx, _1_MockVariableIntBlock_0.tib, _5_TestBloomFilteredLucene40Postings_0.frq, _1.fdx, _5_nrm.cfs, _1.fdt, _0_MockVariableIntBlock_0.frq, _3.si, _6.fdt, _3_TestBloomFilteredLucene40Postings_0.blm, _6_Memory_0.ram, _1_MockVariableIntBlock_0.skp, _2.si, _5_Direct_0.tim, _0_MockVariableIntBlock_0.doc, _6.fdx, _1_MockVariableIntBlock_0.pyl, _3.fnm, _4_TestBloomFilteredLucene40Postings_0.prx, _0_MockVariableIntBlock_0.pyl, _1_Memory_0.ram, _2_nrm.cfe, _5_TestBloomFilteredLucene40Postings_0.blm, _1_MockVariableIntBlock_0.doc, _0_MockVariableIntBlock_0.pos, _2_nrm.cfs, _5_Direct_0.tip, _2_TestBloomFilteredLucene40Postings_0.frq, _4_TestBloomFilteredLucene40Postings_0.blm, _1_MockVariableIntBlock_0.pos, _1_Direct_0.prx, _6_Direct_0.prx, _2.fnm, _3.fdx, _1.si, _4_TestBloomFilteredLucene40Postings_0.tim, _6.si, _6.fnm, _0_Direct_0.tip, _0_Direct_0.prx, _4_TestBloomFilteredLucene40Postings_0.tip, _0_Direct_0.tim, _1_Direct_0.frq, _3_nrm.cfe, _3_Direct_0.frq, _5.fdt, _2_TestBloomFilteredLucene40Postings_0.prx, _4.fnm, _4_nrm.cfe, _0_MockVariableIntBlock_0.skp, _1.fnm, _4.fdx, _4_Direct_0.frq, _5_TestBloomFilteredLucene40Postings_0.prx, _1_Direct_0.tim, _3_Direct_0.prx, _1_Direct_0.tip, _0_TestBloomFilteredLucene40Postings_0.tim, _2_TestBloomFilteredLucene40Postings_0.tim, _0_TestBloomFilteredLucene40Postings_0.tip, _3_Direct_0.tip, _0.fnm, _4_Direct_0.tim, _5_Direct_0.frq, _0_Direct_0.frq, _1_TestBloomFilteredLucene40Postings_0.frq, _2_TestBloomFilteredLucene40Postings_0.tip, _5.si, _3_nrm.cfs, _4_Memory_0.ram, _4_Direct_0.prx, _4_nrm.cfs, _4_Direct_0.tip, _3_Direct_0.tim, _0_TestBloomFilteredLucene40Postings_0.prx, _1_TestBloomFilteredLucene40Postings_0.blm, _1_TestBloomFilteredLucene40Postings_0.tip, _6_nrm.cfs, _0_MockVariableIntBlock_0.tib, _6_TestBloomFilteredLucene40Postings_0.tip, _2_Memory_0.ram, _1_TestBloomFilteredLucene40Postings_0.tim, _0.si, _3_Memory_0.ram, _6_TestBloomFilteredLucene40Postings_0.tim, _0_MockVariableIntBlock_0.tii, _6_TestBloomFilteredLucene40Postings_0.frq, _1_nrm.cfs, _5.fnm, _1_TestBloomFilteredLucene40Postings_0.prx, _6_nrm.cfe, _0_nrm.cfs, _4.fdt, _4.si, _1_nrm.cfe, _1_MockVariableIntBlock_0.frq, _2_Direct_0.prx, _0_nrm.cfe, _5.fdx, segments_2, _6_TestBloomFilteredLucene40Postings_0.blm, _0.fdx, _2_Direct_0.frq, _6_TestBloomFilteredLucene40Postings_0.prx, _5_TestBloomFilteredLucene40Postings_0.tim, _6_Direct_0.frq, _5_TestBloomFilteredLucene40Postings_0.tip, _0.fdt]
[junit4:junit4]   2> 15774 T935 C119 P31777 oasc.SolrDeletionPolicy.updateCommits newest commit = 2
[junit4:junit4]   2> 15784 T935 C119 P31777 oass.SolrIndexSearcher.<init> Opening Searcher@2b42b3a5 main
[junit4:junit4]   2> 15784 T935 C119 P31777 oasu.DirectUpdateHandler2.commit end_commit_flush
[junit4:junit4]   2> 15787 T946 oasc.SolrCore.registerSearcher [collection1] Registered new searcher Searcher@2b42b3a5 main{StandardDirectoryReader(segments_2:15:nrt _0(4.1):C10 _1(4.1):C10 _2(4.1):C10 _3(4.1):C10 _4(4.1):C10 _5(4.1):C10 _6(4.1):C7)}
[junit4:junit4]   2> 15788 T935 C119 P31777 /update {waitSearcher=true&wt=javabin&commit=true&softCommit=false&version=2} {commit=} 0 403
[junit4:junit4]   2> 15791 T962 C120 P31791 oasu.DirectUpdateHandler2.commit start commit{flags=0,_version_=0,optimize=false,openSearcher=true,waitSearcher=true,expungeDeletes=false,softCommit=false}
[junit4:junit4]   2> 15991 T962 C120 P31791 oasc.SolrDeletionPolicy.onCommit SolrDeletionPolicy.onCommit: commits:num=2
[junit4:junit4]   2> 		commit{dir=NRTCachingDirectory(org.apache.lucene.store.NIOFSDirectory@/usr/home/hudson/hudson-slave/workspace/Lucene-Solr-Tests-4.x-java7/solr/build/solr-core/test/J0/org.apache.solr.cloud.BasicDistributedZkTest-1349649135906/jetty2/index lockFactory=org.apache.lucene.store.NativeFSLockFactory@15e39292; maxCacheMB=48.0 maxMergeSizeMB=4.0),segFN=segments_1,generation=1,filenames=[segments_1]
[junit4:junit4]   2> 		commit{dir=NRTCachingDirectory(org.apache.lucene.store.NIOFSDirectory@/usr/home/hudson/hudson-slave/workspace/Lucene-Solr-Tests-4.x-java7/solr/build/solr-core/test/J0/org.apache.solr.cloud.BasicDistributedZkTest-1349649135906/jetty2/index lockFactory=org.apache.lucene.store.NativeFSLockFactory@15e39292; maxCacheMB=48.0 maxMergeSizeMB=4.0),segFN=segments_2,generation=2,filenames=[_3_nrm.cfe, _2_Direct_0.tip, _3_Direct_0.frq, _2_Direct_0.tim, _3_TestBloomFilteredLucene40Postings_0.prx, _2_TestBloomFilteredLucene40Postings_0.prx, _2_TestBloomFilteredLucene40Postings_0.blm, _3.fdt, _0_MockVariableIntBlock_0.skp, _1.fnm, _0_TestBloomFilteredLucene40Postings_0.frq, _3_Direct_0.prx, _1_Direct_0.tim, _3_TestBloomFilteredLucene40Postings_0.frq, _1_Direct_0.tip, _3_TestBloomFilteredLucene40Postings_0.tim, _0_TestBloomFilteredLucene40Postings_0.tim, _2_TestBloomFilteredLucene40Postings_0.tim, _3_Direct_0.tip, _0_TestBloomFilteredLucene40Postings_0.blm, _0_TestBloomFilteredLucene40Postings_0.tip, _0.fnm, _0_Memory_0.ram, _2.fdt, _3_TestBloomFilteredLucene40Postings_0.tip, _0_Direct_0.frq, _2.fdx, _2_TestBloomFilteredLucene40Postings_0.tip, _1_TestBloomFilteredLucene40Postings_0.frq, _3_nrm.cfs, _1.fdx, _1.fdt, _0_MockVariableIntBlock_0.frq, _3.si, _3_TestBloomFilteredLucene40Postings_0.blm, _3_Direct_0.tim, _2.si, _0_MockVariableIntBlock_0.doc, _0_TestBloomFilteredLucene40Postings_0.prx, _1_TestBloomFilteredLucene40Postings_0.blm, _3.fnm, _0_MockVariableIntBlock_0.pyl, _1_TestBloomFilteredLucene40Postings_0.tip, _2_nrm.cfe, _1_Memory_0.ram, _0_MockVariableIntBlock_0.tib, _0_MockVariableIntBlock_0.pos, _2_Memory_0.ram, _3_Memory_0.ram, _2_nrm.cfs, _0.si, _1_TestBloomFilteredLucene40Postings_0.tim, _0_MockVariableIntBlock_0.tii, _2_TestBloomFilteredLucene40Postings_0.frq, _1_nrm.cfs, _1_TestBloomFilteredLucene40Postings_0.prx, _0_nrm.cfs, _1_Direct_0.prx, _2.fnm, _1_nrm.cfe, _3.fdx, _2_Direct_0.prx, _1.si, _0_nrm.cfe, segments_2, _2_Direct_0.frq, _0_Direct_0.tip, _0.fdx, _0_Direct_0.prx, _0_Direct_0.tim, _0.fdt, _1_Direct_0.frq]
[junit4:junit4]   2> 15992 T962 C120 P31791 oasc.SolrDeletionPolicy.updateCommits newest commit = 2
[junit4:junit4]   2> 15999 T962 C120 P31791 oass.SolrIndexSearcher.<init> Opening Searcher@d9bc818 main
[junit4:junit4]   2> 15999 T962 C120 P31791 oasu.DirectUpdateHandler2.commit end_commit_flush
[junit4:junit4]   2> 16001 T970 oasc.SolrCore.registerSearcher [collection1] Registered new searcher Searcher@d9bc818 main{StandardDirectoryReader(segments_2:9:nrt _0(4.1):C10 _1(4.1):C10 _2(4.1):C10 _3(4.1):C5)}
[junit4:junit4]   2> 16002 T962 C120 P31791 oasu.SolrCmdDistributor.distribCommit Distrib commit to:[StdNode: http://127.0.0.1:31785/solr/collection1/, StdNode: http://127.0.0.1:31795/solr/collection1/]
[junit4:junit4]   2> 16004 T954 C118 P31785 oasu.DirectUpdateHandler2.commit start commit{flags=0,_version_=0,optimize=false,openSearcher=true,waitSearcher=true,expungeDeletes=false,softCommit=false}
[junit4:junit4]   2> 16005 T973 C117 P31795 oasu.DirectUpdateHandler2.commit start commit{flags=0,_version_=0,optimize=false,openSearcher=true,waitSearcher=true,expungeDeletes=false,softCommit=false}
[junit4:junit4]   2> 16319 T973 C117 P31795 oasc.SolrDeletionPolicy.onCommit SolrDeletionPolicy.onCommit: commits:num=2
[junit4:junit4]   2> 		commit{dir=NRTCachingDirectory(org.apache.lucene.store.NIOFSDirectory@/usr/home/hudson/hudson-slave/workspace/Lucene-Solr-Tests-4.x-java7/solr/build/solr-core/test/J0/org.apache.solr.cloud.BasicDistributedZkTest-1349649135906/jetty3/index lockFactory=org.apache.lucene.store.NativeFSLockFactory@28171893; maxCacheMB=48.0 maxMergeSizeMB=4.0),segFN=segments_2,generation=2,filenames=[segments_2]
[junit4:junit4]   2> 		commit{dir=NRTCachingDirectory(org.apache.lucene.store.NIOFSDirectory@/usr/home/hudson/hudson-slave/workspace/Lucene-Solr-Tests-4.x-java7/solr/build/solr-core/test/J0/org.apache.solr.cloud.BasicDistributedZkTest-1349649135906/jetty3/index lockFactory=org.apache.lucene.store.NativeFSLockFactory@28171893; maxCacheMB=48.0 maxMergeSizeMB=4.0),segFN=segments_3,generation=3,filenames=[_3_nrm.cfe, _2_Direct_0.tip, _3_Direct_0.frq, _2_Direct_0.tim, _3_TestBloomFilteredLucene40Postings_0.prx, _2_TestBloomFilteredLucene40Postings_0.prx, _2_TestBloomFilteredLucene40Postings_0.blm, _3.fdt, _0_MockVariableIntBlock_0.skp, _1.fnm, _0_TestBloomFilteredLucene40Postings_0.frq, _3_Direct_0.prx, _1_Direct_0.tim, _3_TestBloomFilteredLucene40Postings_0.frq, _1_Direct_0.tip, _3_TestBloomFilteredLucene40Postings_0.tim, _0_TestBloomFilteredLucene40Postings_0.tim, _2_TestBloomFilteredLucene40Postings_0.tim, _3_Direct_0.tip, _0_TestBloomFilteredLucene40Postings_0.blm, _0_TestBloomFilteredLucene40Postings_0.tip, _0.fnm, _0_Memory_0.ram, _2.fdt, _3_TestBloomFilteredLucene40Postings_0.tip, _0_Direct_0.frq, _2.fdx, _2_TestBloomFilteredLucene40Postings_0.tip, _1_TestBloomFilteredLucene40Postings_0.frq, _3_nrm.cfs, _1.fdx, _1.fdt, _0_MockVariableIntBlock_0.frq, _3.si, _3_TestBloomFilteredLucene40Postings_0.blm, _3_Direct_0.tim, _2.si, _0_MockVariableIntBlock_0.doc, _0_TestBloomFilteredLucene40Postings_0.prx, _1_TestBloomFilteredLucene40Postings_0.blm, _3.fnm, _0_MockVariableIntBlock_0.pyl, _1_TestBloomFilteredLucene40Postings_0.tip, _2_nrm.cfe, _1_Memory_0.ram, _0_MockVariableIntBlock_0.tib, _0_MockVariableIntBlock_0.pos, _2_Memory_0.ram, _3_Memory_0.ram, _2_nrm.cfs, _0.si, _1_TestBloomFilteredLucene40Postings_0.tim, _0_MockVariableIntBlock_0.tii, _2_TestBloomFilteredLucene40Postings_0.frq, _1_nrm.cfs, _1_TestBloomFilteredLucene40Postings_0.prx, _0_nrm.cfs, _1_Direct_0.prx, _2.fnm, _1_nrm.cfe, _3.fdx, _2_Direct_0.prx, _1.si, _0_nrm.cfe, _2_Direct_0.frq, _0_Direct_0.tip, _0.fdx, _0_Direct_0.prx, _0_Direct_0.tim, _0.fdt, segments_3, _1_Direct_0.frq]
[junit4:junit4]   2> 16320 T954 C118 P31785 oasc.SolrDeletionPolicy.onCommit SolrDeletionPolicy.onCommit: commits:num=2
[junit4:junit4]   2> 		commit{dir=NRTCachingDirectory(org.apache.lucene.store.NIOFSDirectory@/usr/home/hudson/hudson-slave/workspace/Lucene-Solr-Tests-4.x-java7/solr/build/solr-core/test/J0/org.apache.solr.cloud.BasicDistributedZkTest-1349649135906/jetty1/index lockFactory=org.apache.lucene.store.NativeFSLockFactory@10a62a4b; maxCacheMB=48.0 maxMergeSizeMB=4.0),segFN=segments_1,generation=1,filenames=[segments_1]
[junit4:junit4]   2> 		commit{dir=NRTCachingDirectory(org.apache.lucene.store.NIOFSDirectory@/usr/home/hudson/hudson-slave/workspace/Lucene-Solr-Tests-4.x-java7/solr/build/solr-core/test/J0/org.apache.solr.cloud.BasicDistributedZkTest-1349649135906/jetty1/index lockFactory=org.apache.lucene.store.NativeFSLockFactory@10a62a4b; maxCacheMB=48.0 maxMergeSizeMB=4.0),segFN=segments_2,generation=2,filenames=[_3_nrm.cfe, _2_Direct_0.tip, _3_Direct_0.frq, _2_Direct_0.tim, _3_TestBloomFilteredLucene40Postings_0.prx, _2_TestBloomFilteredLucene40Postings_0.prx, _2_TestBloomFilteredLucene40Postings_0.blm, _3.fdt, _0_MockVariableIntBlock_0.skp, _1.fnm, _0_TestBloomFilteredLucene40Postings_0.frq, _3_Direct_0.prx, _1_Direct_0.tim, _3_TestBloomFilteredLucene40Postings_0.frq, _1_Direct_0.tip, _3_TestBloomFilteredLucene40Postings_0.tim, _0_TestBloomFilteredLucene40Postings_0.tim, _2_TestBloomFilteredLucene40Postings_0.tim, _3_Direct_0.tip, _0_TestBloomFilteredLucene40Postings_0.blm, _0_TestBloomFilteredLucene40Postings_0.tip, _0.fnm, _0_Memory_0.ram, _2.fdt, _3_TestBloomFilteredLucene40Postings_0.tip, _0_Direct_0.frq, _2.fdx, _2_TestBloomFilteredLucene40Postings_0.tip, _1_TestBloomFilteredLucene40Postings_0.frq, _3_nrm.cfs, _1.fdx, _1.fdt, _0_MockVariableIntBlock_0.frq, _3.si, _3_TestBloomFilteredLucene40Postings_0.blm, _3_Direct_0.tim, _2.si, _0_MockVariableIntBlock_0.doc, _0_TestBloomFilteredLucene40Postings_0.prx, _1_TestBloomFilteredLucene40Postings_0.blm, _3.fnm, _0_MockVariableIntBlock_0.pyl, _1_TestBloomFilteredLucene40Postings_0.tip, _2_nrm.cfe, _1_Memory_0.ram, _0_MockVariableIntBlock_0.tib, _0_MockVariableIntBlock_0.pos, _2_Memory_0.ram, _3_Memory_0.ram, _2_nrm.cfs, _0.si, _1_TestBloomFilteredLucene40Postings_0.tim, _0_MockVariableIntBlock_0.tii, _2_TestBloomFilteredLucene40Postings_0.frq, _1_nrm.cfs, _1_TestBloomFilteredLucene40Postings_0.prx, _0_nrm.cfs, _1_Direct_0.prx, _2.fnm, _1_nrm.cfe, _3.fdx, _2_Direct_0.prx, _1.si, _0_nrm.cfe, segments_2, _2_Direct_0.frq, _0_Direct_0.tip, _0.fdx, _0_Direct_0.prx, _0_Direct_0.tim, _0.fdt, _1_Direct_0.frq]
[junit4:junit4]   2> 16321 T973 C117 P31795 oasc.SolrDeletionPolicy.updateCommits newest commit = 3
[junit4:junit4]   2> 16322 T954 C118 P31785 oasc.SolrDeletionPolicy.updateCommits newest commit = 2
[junit4:junit4]   2> 16331 T954 C118 P31785 oass.SolrIndexSearcher.<init> Opening Searcher@6f36f6f0 main
[junit4:junit4]   2> 16331 T973 C117 P31795 oass.SolrIndexSearcher.<init> Opening Searcher@d196168 main
[junit4:junit4]   2> 16332 T954 C118 P31785 oasu.DirectUpdateHandler2.commit end_commit_flush
[junit4:junit4]   2> 16332 T973 C117 P31795 oasu.DirectUpdateHandler2.commit end_commit_flush
[junit4:junit4]   2> 16332 T982 oasc.JmxMonitoredMap.put WARNING Failed to register info bean: searcher javax.management.InstanceNotFoundException: solr/collection1:type=searcher,id=org.apache.solr.search.SolrIndexSearcher
[junit4:junit4]   2> 	at com.sun.jmx.interceptor.DefaultMBeanServerInterceptor.getMBean(DefaultMBeanServerInterceptor.java:1095)
[junit4:junit4]   2> 	at com.sun.jmx.interceptor.DefaultMBeanServerInterceptor.exclusiveUnregisterMBean(DefaultMBeanServerInterceptor.java:427)
[junit4:junit4]   2> 	at com.sun.jmx.interceptor.DefaultMBeanServerInterceptor.unregisterMBean(DefaultMBeanServerInterceptor.java:415)
[junit4:junit4]   2> 	at com.sun.jmx.mbeanserver.JmxMBeanServer.unregisterMBean(JmxMBeanServer.java:536)
[junit4:junit4]   2> 	at org.apache.solr.core.JmxMonitoredMap.put(JmxMonitoredMap.java:138)
[junit4:junit4]   2> 	at org.apache.solr.core.JmxMonitoredMap.put(JmxMonitoredMap.java:51)
[junit4:junit4]   2> 	at org.apache.solr.search.SolrIndexSearcher.register(SolrIndexSearcher.java:242)
[junit4:junit4]   2> 	at org.apache.solr.core.SolrCore.registerSearcher(SolrCore.java:1691)
[junit4:junit4]   2> 	at org.apache.solr.core.SolrCore.access$000(SolrCore.java:124)
[junit4:junit4]   2> 	at org.apache.solr.core.SolrCore$7.call(SolrCore.java:1568)
[junit4:junit4]   2> 	at java.util.concurrent.FutureTask$Sync.innerRun(FutureTask.java:334)
[junit4:junit4]   2> 	at java.util.concurrent.FutureTask.run(FutureTask.java:166)
[junit4:junit4]   2> 	at java.util.concurrent.ThreadPoolExecutor.runWorker(ThreadPoolExecutor.java:1110)
[junit4:junit4]   2> 	at java.util.concurrent.ThreadPoolExecutor$Worker.run(ThreadPoolExecutor.java:603)
[junit4:junit4]   2> 	at java.lang.Thread.run(Thread.java:722)
[junit4:junit4]   2> 
[junit4:junit4]   2> 16334 T958 oasc.SolrCore.registerSearcher [collection1] Registered new searcher Searcher@6f36f6f0 main{StandardDirectoryReader(segments_2:9:nrt _0(4.1):C10 _1(4.1):C10 _2(4.1):C10 _3(4.1):C2)}
[junit4:junit4]   2> 16335 T982 oasc.SolrCore.registerSearcher [collection1] Registered new searcher Searcher@d196168 main{StandardDirectoryReader(segments_3:10:nrt _0(4.1):C10 _1(4.1):C10 _2(4.1):C10 _3(4.1):C2)}
[junit4:junit4]   2> 16335 T954 C118 P31785 /update {waitSearcher=true&commit=true&commit_end_point=true&expungeDeletes=false&wt=javabin&softCommit=false&version=2} {commit=} 0 331
[junit4:junit4]   2> 16335 T973 C117 P31795 /update {waitSearcher=true&commit=true&commit_end_point=true&expungeDeletes=false&wt=javabin&softCommit=false&version=2} {commit=} 0 330
[junit4:junit4]   2> 16336 T962 C120 P31791 /update {waitSearcher=true&wt=javabin&commit=true&softCommit=false&version=2} {commit=} 0 545
[junit4:junit4]   2> 16341 T935 C119 P31777 REQ /select {distrib=false&sort=n_ti1+desc&wt=javabin&q=*:*&version=2} hits=67 status=0 QTime=2 
[junit4:junit4]   2> 16351 T955 C118 P31785 REQ /select {sort=n_ti1+desc&distrib=false&collection=collection1&wt=javabin&rows=10&version=2&NOW=1349649152248&shard.url=127.0.0.1:31785/solr/collection1/|127.0.0.1:31795/solr/collection1/&fl=id&start=0&q=*:*&isShard=true&fsv=true} hits=32 status=0 QTime=1 
[junit4:junit4]   2> 16352 T963 C120 P31791 REQ /select {sort=n_ti1+desc&distrib=false&collection=collection1&wt=javabin&rows=10&version=2&NOW=1349649152248&shard.url=127.0.0.1:31791/solr/collection1/&fl=id&start=0&q=*:*&isShard=true&fsv=true} hits=35 status=0 QTime=2 
[junit4:junit4]   2> 16367 T955 C118 P31785 REQ /select {shard.url=127.0.0.1:31785/solr/collection1/|127.0.0.1:31795/solr/collection1/&NOW=1349649152248&q=*:*&ids=125,1,122,123,14,100&distrib=false&collection=collection1&isShard=true&wt=javabin&version=2} status=0 QTime=1 
[junit4:junit4]   2> 16367 T963 C120 P31791 REQ /select {shard.url=127.0.0.1:31791/solr/collection1/&NOW=1349649152248&q=*:*&ids=143,126,2,131&distrib=false&collection=collection1&isShard=true&wt=javabin&version=2} status=0 QTime=1 
[junit4:junit4]   2> 16369 T953 C118 P31785 REQ /select {collection=collection1&sort=n_ti1+desc&wt=javabin&q=*:*&version=2} hits=67 status=0 QTime=22 
[junit4:junit4]   2> 16379 T935 C119 P31777 REQ /select {distrib=false&sort=n_ti1+asc&wt=javabin&q=*:*&version=2} hits=67 status=0 QTime=1 
[junit4:junit4]   2> 16386 T950 C118 P31785 REQ /select {sort=n_ti1+asc&distrib=false&collection=collection1&wt=javabin&rows=10&version=2&NOW=1349649152284&shard.url=127.0.0.1:31785/solr/collection1/|127.0.0.1:31795/solr/collection1/&fl=id&start=0&q=*:*&isShard=true&fsv=true} hits=32 status=0 QTime=0 
[junit4:junit4]   2> 16387 T964 C120 P31791 REQ /select {sort=n_ti1+asc&distrib=false&collection=collection1&wt=javabin&rows=10&version=2&NOW=1349649152284&shard.url=127.0.0.1:31791/solr/collection1/&fl=id&start=0&q=*:*&isShard=true&fsv=true} hits=35 status=0 QTime=1 
[junit4:junit4]   2> 16392 T964 C120 P31791 REQ /select {shard.url=127.0.0.1:31791/solr/collection1/&NOW=1349649152284&q=*:*&ids=147,112,137,140,130&distrib=false&collection=collection1&isShard=true&wt=javabin&version=2} status=0 QTime=1 
[junit4:junit4]   2> 16392 T950 C118 P31785 REQ /select {shard.url=127.0.0.1:31785/solr/collection1/|127.0.0.1:31795/solr/collection1/&NOW=1349649152284&q=*:*&ids=10,113,110,4,8&distrib=false&collection=collection1&isShard=true&wt=javabin&version=2} status=0 QTime=1 
[junit4:junit4]   2> 16394 T962 C120 P31791 REQ /select {collection=collection1&sort=n_ti1+asc&wt=javabin&q=*:*&version=2} hits=67 status=0 QTime=11 
[junit4:junit4]   2> 16402 T935 C119 P31777 REQ /select {distrib=false&sort=n_f1+desc&wt=javabin&q=*:*&version=2} hits=67 status=0 QTime=2 
[junit4:junit4]   2> 16410 T951 C118 P31785 REQ /select {sort=n_f1+desc&distrib=false&wt=javabin&rows=10&version=2&fl=id&shard.url=127.0.0.1:31785/solr/collection1/|127.0.0.1:31795/solr/collection1/&NOW=1349649152307&start=0&q=*:*&isShard=true&fsv=true} hits=32 status=0 QTime=1 
[junit4:junit4]   2> 16410 T965 C120 P31791 REQ /select {sort=n_f1+desc&distrib=false&wt=javabin&rows=10&version=2&fl=id&shard.url=127.0.0.1:31791/solr/collection1/&NOW=1349649152307&start=0&q=*:*&isShard=true&fsv=true} hits=35 status=0 QTime=1 
[junit4:junit4]   2> 16415 T951 C118 P31785 REQ /select {shard.url=127.0.0.1:31785/solr/collection1/|127.0.0.1:31795/solr/collection1/&NOW=1349649152307&q=*:*&ids=133,107&distrib=false&isShard=true&wt=javabin&version=2} status=0 QTime=0 
[junit4:junit4]   2> 16416 T965 C120 P31791 REQ /select {shard.url=127.0.0.1:31791/solr/collection1/&NOW=1349649152307&q=*:*&ids=3,134,126,147,7,104,142,141&distrib=false&isShard=true&wt=javabin&version=2} status=0 QTime=1 
[junit4:junit4]   2> 16419 T974 C117 P31795 REQ /select {sort=n_f1+desc&wt=javabin&q=*:*&version=2} hits=67 status=0 QTime=13 
[junit4:junit4]   2> 16424 T935 C119 P31777 REQ /select {distrib=false&sort=n_f1+asc&wt=javabin&q=*:*&version=2} hits=67 status=0 QTime=0 
[junit4:junit4]   2> 16427 T923 oascsi.HttpClientUtil.createClient Creating new http client, config:
[junit4:junit4]   2> 16439 T923 oaz.ZooKeeper.<init> Initiating client connection, connectString=127.0.0.1:31768/solr sessionTimeout=10000 watcher=org.apache.solr.common.cloud.ConnectionManager@38066074
[junit4:junit4]   2> 16441 T999 oaz.ClientCnxn$SendThread.startConnect Opening socket connection to server /127.0.0.1:31768
[junit4:junit4]   2> 16441 T923 oascc.ConnectionManager.waitForConnected Waiting for client to connect to ZooKeeper
[junit4:junit4]   2> 16442 T999 oaz.ClientCnxn$SendThread.primeConnection Socket connection established to localhost/127.0.0.1:31768, initiating session
[junit4:junit4]   2> 16442 T925 oazs.NIOServerCnxn$Factory.run Accepted socket connection from /140.211.11.196:31846
[junit4:junit4]   2> 16442 T925 oazs.NIOServerCnxn.readConnectRequest Client attempting to establish new session at /140.211.11.196:31846
[junit4:junit4]   2> 16445 T927 oazs.NIOServerCnxn.finishSessionInit Established session 0x13a3d5b7a2c0008 with negotiated timeout 10000 for client /140.211.11.196:31846
[junit4:junit4]   2> 16445 T999 oaz.ClientCnxn$SendThread.readConnectResult Session establishment complete on server localhost/127.0.0.1:31768, sessionid = 0x13a3d5b7a2c0008, negotiated timeout = 10000
[junit4:junit4]   2> 16445 T1000 oascc.ConnectionManager.process Watcher org.apache.solr.common.cloud.ConnectionManager@38066074 name:ZooKeeperConnection Watcher:127.0.0.1:31768/solr got event WatchedEvent state:SyncConnected type:None path:null path:null type:None
[junit4:junit4]   2> 16446 T923 oascc.ConnectionManager.waitForConnected Client is connected to ZooKeeper
[junit4:junit4]   2> 16447 T923 oascc.ZkStateReader.createClusterStateWatchersAndUpdate Updating cluster state from ZooKeeper... 
[junit4:junit4]   2> 16463 T951 C118 P31785 REQ /select {sort=n_f1+asc&distrib=false&wt=javabin&rows=10&version=2&fl=id&shard.url=127.0.0.1:31785/solr/collection1/|127.0.0.1:31795/solr/collection1/&NOW=1349649152360&start=0&q=*:*&isShard=true&fsv=true} hits=32 status=0 QTime=1 
[junit4:junit4]   2> 16463 T965 C120 P31791 REQ /select {sort=n_f1+asc&distrib=false&wt=javabin&rows=10&version=2&fl=id&shard.url=127.0.0.1:31791/solr/collection1/&NOW=1349649152360&start=0&q=*:*&isShard=true&fsv=true} hits=35 status=0 QTime=1 
[junit4:junit4]   2> 16468 T951 C118 P31785 REQ /select {shard.url=127.0.0.1:31785/solr/collection1/|127.0.0.1:31795/solr/collection1/&NOW=1349649152360&q=*:*&ids=109,16,11&distrib=false&isShard=true&wt=javabin&version=2} status=0 QTime=0 
[junit4:junit4]   2> 16468 T965 C120 P31791 REQ /select {shard.url=127.0.0.1:31791/solr/collection1/&NOW=1349649152360&q=*:*&ids=116,144,2,121,149,105,140&distrib=false&isShard=true&wt=javabin&version=2} status=0 QTime=1 
[junit4:junit4]   2> 16472 T975 C117 P31795 REQ /select {sort=n_f1+asc&wt=javabin&q=*:*&version=2} hits=67 status=0 QTime=13 
[junit4:junit4]   2> 16479 T935 C119 P31777 REQ /select {distrib=false&sort=n_tf1+desc&wt=javabin&q=*:*&version=2} hits=67 status=0 QTime=1 
[junit4:junit4]   2> 16487 T976 C117 P31795 REQ /select {sort=n_tf1+desc&distrib=false&collection=collection1&wt=javabin&rows=10&version=2&NOW=1349649152384&shard.url=127.0.0.1:31785/solr/collection1/|127.0.0.1:31795/solr/collection1/&fl=id&start=0&q=*:*&isShard=true&fsv=true} hits=32 status=0 QTime=1 
[junit4:junit4]   2> 16489 T963 C120 P31791 REQ /select {sort=n_tf1+desc&distrib=false&collection=collection1&wt=javabin&rows=10&version=2&fl=id&shard.url=127.0.0.1:31791/solr/collection1/&NOW=1349649152384&start=0&q=*:*&isShard=true&fsv=true} hits=35 status=0 QTime=1 
[junit4:junit4]   2> 16494 T976 C117 P31795 REQ /select {shard.url=127.0.0.1:31785/solr/collection1/|127.0.0.1:31795/solr/collection1/&NOW=1349649152384&q=*:*&ids=125,148,122,107,111,14&distrib=false&collection=collection1&isShard=true&wt=javabin&version=2} status=0 QTime=1 
[junit4:junit4]   2> 16494 T963 C120 P31791 REQ /select {shard.url=127.0.0.1:31791/solr/collection1/&NOW=1349649152384&q=*:*&ids=144,112,130,141&distrib=false&collection=collection1&isShard=true&wt=javabin&version=2} status=0 QTime=1 
[junit4:junit4]   2> 16497 T1001 C118 P31785 REQ /select {collection=collection1&sort=n_tf1+desc&wt=javabin&q=*:*&version=2} hits=67 status=0 QTime=14 
[junit4:junit4]   2> 16503 T935 C119 P31777 REQ /select {distrib=false&sort=n_tf1+asc&wt=javabin&q=*:*&version=2} hits=67 status=0 QTime=1 
[junit4:junit4]   2> 16512 T964 C120 P31791 REQ /select {sort=n_tf1+asc&distrib=false&wt=javabin&rows=10&version=2&fl=id&shard.url=127.0.0.1:31791/solr/collection1/&NOW=1349649152409&start=0&q=*:*&isShard=true&fsv=true} hits=35 status=0 QTime=1 
[junit4:junit4]   2> 16512 T950 C118 P31785 REQ /select {sort=n_tf1+asc&distrib=false&wt=javabin&rows=10&version=2&fl=id&shard.url=127.0.0.1:31785/solr/collection1/|127.0.0.1:31795/solr/collection1/&NOW=1349649152409&start=0&q=*:*&isShard=true&fsv=true} hits=32 status=0 QTime=1 
[junit4:junit4]   2> 16517 T950 C118 P31785 REQ /select {shard.url=127.0.0.1:31785/solr/collection1/|127.0.0.1:31795/solr/collection1/&NOW=1349649152409&q=*:*&ids=113,129,13&distrib=false&isShard=true&wt=javabin&version=2} status=0 QTime=1 
[junit4:junit4]   2> 16517 T964 C120 P31791 REQ /select {shard.url=127.0.0.1:31791/solr/collection1/&NOW=1349649152409&q=*:*&ids=117,6,139,136,5,120,142&distrib=false&isShard=true&wt=javabin&version=2} status=0 QTime=1 
[junit4:junit4]   2> 16520 T962 C120 P31791 REQ /select {sort=n_tf1+asc&wt=javabin&q=*:*&version=2} hits=67 status=0 QTime=12 
[junit4:junit4]   2> 16527 T935 C119 P31777 REQ /select {distrib=false&sort=n_d1+desc&wt=javabin&q=*:*&version=2} hits=67 status=0 QTime=1 
[junit4:junit4]   2> 16536 T955 C118 P31785 REQ /select {sort=n_d1+desc&distrib=false&wt=javabin&rows=10&version=2&fl=id&shard.url=127.0.0.1:31785/solr/collection1/|127.0.0.1:31795/solr/collection1/&NOW=1349649152433&start=0&q=*:*&isShard=true&fsv=true} hits=32 status=0 QTime=1 
[junit4:junit4]   2> 16537 T963 C120 P31791 REQ /select {sort=n_d1+desc&distrib=false&wt=javabin&rows=10&version=2&fl=id&shard.url=127.0.0.1:31791/solr/collection1/&NOW=1349649152433&start=0&q=*:*&isShard=true&fsv=true} hits=35 status=0 QTime=1 
[junit4:junit4]   2> 16542 T955 C118 P31785 REQ /select {shard.url=127.0.0.1:31785/solr/collection1/|127.0.0.1:31795/solr/collection1/&NOW=1349649152433&q=*:*&ids=10,123,124&distrib=false&isShard=true&wt=javabin&version=2} status=0 QTime=1 
[junit4:junit4]   2> 16542 T963 C120 P31791 REQ /select {shard.url=127.0.0.1:31791/solr/collection1/&NOW=1349649152433&q=*:*&ids=143,145,121,5,149,103,131&distrib=false&isShard=true&wt=javabin&version=2} status=0 QTime=1 
[junit4:junit4]   2> 16546 T953 C118 P31785 REQ /select {sort=n_d1+desc&wt=javabin&q=*:*&version=2} hits=67 status=0 QTime=14 
[junit4:junit4]   2> 16553 T935 C119 P31777 REQ /select {distrib=false&sort=n_d1+asc&wt=javabin&q=*:*&version=2} hits=67 status=0 QTime=1 
[junit4:junit4]   2> 16562 T963 C120 P31791 REQ /select {sort=n_d1+asc&distrib=false&collection=collection1&wt=javabin&rows=10&version=2&fl=id&shard.url=127.0.0.1:31791/solr/collection1/&NOW=1349649152459&start=0&q=*:*&isShard=true&fsv=true} hits=35 status=0 QTime=0 
[junit4:junit4]   2> 16562 T976 C117 P31795 REQ /select {sort=n_d1+asc&distrib=false&collection=collection1&wt=javabin&rows=10&version=2&fl=id&shard.url=127.0.0.1:31785/solr/collection1/|127.0.0.1:31795/solr/collection1/&NOW=1349649152459&start=0&q=*:*&isShard=true&fsv=true} hits=32 status=0 QTime=0 
[junit4:junit4]   2> 16568 T976 C117 P31795 REQ /select {shard.url=127.0.0.1:31785/solr/collection1/|127.0.0.1:31795/solr/collection1/&NOW=1349649152459&q=*:*&ids=148,108,15,16,8,13&distrib=false&collection=collection1&isShard=true&wt=javabin&version=2} status=0 QTime=1 
[junit4:junit4]   2> 16568 T963 C120 P31791 REQ /select {shard.url=127.0.0.1:31791/solr/collection1/&NOW=1349649152459&q=*:*&ids=134,3,2,17&distrib=false&collection=collection1&isShard=true&wt=javabin&version=2} status=0 QTime=1 
[junit4:junit4]   2> 16571 T953 C118 P31785 REQ /select {collection=collection1&sort=n_d1+asc&wt=javabin&q=*:*&version=2} hits=67 status=0 QTime=13 
[junit4:junit4]   2> 16579 T935 C119 P31777 REQ /select {distrib=false&sort=n_td1+desc&wt=javabin&q=*:*&version=2} hits=67 status=0 QTime=1 
[junit4:junit4]   2> 16587 T977 C117 P31795 REQ /select {sort=n_td1+desc&distrib=false&collection=collection1&wt=javabin&rows=10&version=2&NOW=1349649152485&shard.url=127.0.0.1:31785/solr/collection1/|127.0.0.1:31795/solr/collection1/&fl=id&start=0&q=*:*&isShard=true&fsv=true} hits=32 status=0 QTime=1 
[junit4:junit4]   2> 16588 T965 C120 P31791 REQ /select {sort=n_td1+desc&distrib=false&collection=collection1&wt=javabin&rows=10&version=2&NOW=1349649152485&shard.url=127.0.0.1:31791/solr/collection1/&fl=id&start=0&q=*:*&isShard=true&fsv=true} hits=35 status=0 QTime=2 
[junit4:junit4]   2> 16593 T977 C117 P31795 REQ /select {shard.url=127.0.0.1:31785/solr/collection1/|127.0.0.1:31795/solr/collection1/&NOW=1349649152485&q=*:*&ids=135,148,124&distrib=false&collection=collection1&isShard=true&wt=javabin&version=2} status=0 QTime=1 
[junit4:junit4]   2> 16593 T965 C120 P31791 REQ /select {shard.url=127.0.0.1:31791/solr/collection1/&NOW=1349649152485&q=*:*&ids=117,144,2,128,112,120,140&distrib=false&collection=collection1&isShard=true&wt=javabin&version=2} status=0 QTime=0 
[junit4:junit4]   2> 16597 T974 C117 P31795 REQ /select {collection=collection1&sort=n_td1+desc&wt=javabin&q=*:*&version=2} hits=67 status=0 QTime=13 
[junit4:junit4]   2> 16604 T935 C119 P31777 REQ /select {distrib=false&sort=n_td1+asc&wt=javabin&q=*:*&version=2} hits=67 status=0 QTime=1 
[junit4:junit4]   2> 16611 T978 C117 P31795 REQ /select {sort=n_td1+asc&distrib=false&collection=collection1&wt=javabin&rows=10&version=2&NOW=1349649152509&shard.url=127.0.0.1:31785/solr/collection1/|127.0.0.1:31795/solr/collection1/&fl=id&start=0&q=*:*&isShard=true&fsv=true} hits=32 status=0 QTime=0 
[junit4:junit4]   2> 16612 T964 C120 P31791 REQ /select {sort=n_td1+asc&distrib=false&collection=collection1&wt=javabin&rows=10&version=2&fl=id&shard.url=127.0.0.1:31791/solr/collection1/&NOW=1349649152509&start=0&q=*:*&isShard=true&fsv=true} hits=35 status=0 QTime=1 
[junit4:junit4]   2> 16616 T964 C120 P31791 REQ /select {shard.url=127.0.0.1:31791/solr/collection1/&NOW=1349649152509&q=*:*&ids=7,6,149,5,9&distrib=false&collection=collection1&isShard=true&wt=javabin&version=2} status=0 QTime=1 
[junit4:junit4]   2> 16616 T978 C117 P31795 REQ /select {shard.url=127.0.0.1:31785/solr/collection1/|127.0.0.1:31795/solr/collection1/&NOW=1349649152509&q=*:*&ids=110,4,8,101,11&distrib=false&collection=collection1&isShard=true&wt=javabin&version=2} status=0 QTime=1 
[junit4:junit4]   2> 16619 T962 C120 P31791 REQ /select {collection=collection1&sort=n_td1+asc&wt=javabin&q=*:*&version=2} hits=67 status=0 QTime=11 
[junit4:junit4]   2> 16627 T935 C119 P31777 REQ /select {distrib=false&sort=n_l1+desc&wt=javabin&q=*:*&version=2} hits=67 status=0 QTime=2 
[junit4:junit4]   2> 16635 T977 C117 P31795 REQ /select {sort=n_l1+desc&distrib=false&wt=javabin&rows=10&version=2&fl=id&shard.url=127.0.0.1:31785/solr/collection1/|127.0.0.1:31795/solr/collection1/&NOW=1349649152532&start=0&q=*:*&isShard=true&fsv=true} hits=32 status=0 QTime=1 
[junit4:junit4]   2> 16635 T965 C120 P31791 REQ /select {sort=n_l1+desc&distrib=false&wt=javabin&rows=10&version=2&fl=id&shard.url=127.0.0.1:31791/solr/collection1/&NOW=1349649152532&start=0&q=*:*&isShard=true&fsv=true} hits=35 status=0 QTime=1 
[junit4:junit4]   2> 16640 T977 C117 P31795 REQ /select {shard.url=127.0.0.1:31785/solr/collection1/|127.0.0.1:31795/solr/collection1/&NOW=1349649152532&q=*:*&ids=135,114,10,108,12&distrib=false&isShard=true&wt=javabin&version=2} status=0 QTime=1 
[junit4:junit4]   2> 16640 T965 C120 P31791 REQ /select {shard.url=127.0.0.1:31791/solr/collection1/&NOW=1349649152532&q=*:*&ids=136,9,140,119,141&distrib=false&isShard=true&wt=javabin&version=2} status=0 QTime=1 
[junit4:junit4]   2> 16642 T975 C117 P31795 REQ /select {sort=n_l1+desc&wt=javabin&q=*:*&version=2} hits=67 status=0 QTime=11 
[junit4:junit4]   2> 16648 T935 C119 P31777 REQ /select {distrib=false&sort=n_l1+asc&wt=javabin&q=*:*&version=2} hits=67 status=0 QTime=1 
[junit4:junit4]   2> 16656 T965 C120 P31791 REQ /select {sort=n_l1+asc&distrib=false&collection=collection1&wt=javabin&rows=10&version=2&fl=id&shard.url=127.0.0.1:31791/solr/collection1/&NOW=1349649152553&start=0&q=*:*&isShard=true&fsv=true} hits=35 status=0 QTime=1 
[junit4:junit4]   2> 16656 T951 C118 P31785 REQ /select {sort=n_l1+asc&distrib=false&collection=collection1&wt=javabin&rows=10&version=2&NOW=1349649152553&shard.url=127.0.0.1:31785/solr/collection1/|127.0.0.1:31795/solr/collection1/&fl=id&start=0&q=*:*&isShard=true&fsv=true} hits=32 status=0 QTime=0 
[junit4:junit4]   2> 16678 T951 C118 P31785 REQ /select {shard.url=127.0.0.1:31785/solr/collection1/|127.0.0.1:31795/solr/collection1/&NOW=1349649152553&q=*:*&ids=113,148,107,111,14&distrib=false&collection=collection1&isShard=true&wt=javabin&version=2} status=0 QTime=1 
[junit4:junit4]   2> 16678 T965 C120 P31791 REQ /select {shard.url=127.0.0.1:31791/solr/collection1/&NOW=1349649152553&q=*:*&ids=3,144,139,105,120&distrib=false&collection=collection1&isShard=true&wt=javabin&version=2} status=0 QTime=1 
[junit4:junit4]   2> 16680 T975 C117 P31795 REQ /select {collection=collection1&sort=n_l1+asc&wt=javabin&q=*:*&version=2} hits=67 status=0 QTime=28 
[junit4:junit4]   2> 16688 T935 C119 P31777 REQ /select {distrib=false&sort=n_tl1+desc&wt=javabin&q=*:*&version=2} hits=67 status=0 QTime=2 
[junit4:junit4]   2> 16697 T951 C118 P31785 REQ /select {sort=n_tl1+desc&distrib=false&wt=javabin&rows=10&version=2&fl=id&shard.url=127.0.0.1:31785/solr/collection1/|127.0.0.1:31795/solr/collection1/&NOW=1349649152593&start=0&q=*:*&isShard=true&fsv=true} hits=32 status=0 QTime=1 
[junit4:junit4]   2> 16697 T965 C120 P31791 REQ /select {sort=n_tl1+desc&distrib=false&wt=javabin&rows=10&version=2&fl=id&shard.url=127.0.0.1:31791/solr/collection1/&NOW=1349649152593&start=0&q=*:*&isShard=true&fsv=true} hits=35 status=0 QTime=2 
[junit4:junit4]   2> 16702 T951 C118 P31785 REQ /select {shard.url=127.0.0.1:31785/solr/collection1/|127.0.0.1:31795/solr/collection1/&NOW=1349649152593&q=*:*&ids=125,109,15,101,100&distrib=false&isShard=true&wt=javabin&version=2} status=0 QTime=1 
[junit4:junit4]   2> 16702 T965 C120 P31791 REQ /select {shard.url=127

[...truncated too long message...]

e.solr.cloud.BasicDistributedZkTest.waitForNon403or404or503(BasicDistributedZkTest.java:549)
[junit4:junit4]    > 	at org.apache.solr.cloud.BasicDistributedZkTest.testCollectionsAPI(BasicDistributedZkTest.java:386)
[junit4:junit4]    > 	at org.apache.solr.cloud.BasicDistributedZkTest.doTest(BasicDistributedZkTest.java:331)
[junit4:junit4]    > 	at org.apache.solr.BaseDistributedSearchTestCase.testDistribSearch(BaseDistributedSearchTestCase.java:695)
[junit4:junit4]    > 	at sun.reflect.NativeMethodAccessorImpl.invoke0(Native Method)
[junit4:junit4]    > 	at sun.reflect.NativeMethodAccessorImpl.invoke(NativeMethodAccessorImpl.java:57)
[junit4:junit4]    > 	at sun.reflect.DelegatingMethodAccessorImpl.invoke(DelegatingMethodAccessorImpl.java:43)
[junit4:junit4]    > 	at java.lang.reflect.Method.invoke(Method.java:601)
[junit4:junit4]    > 	at com.carrotsearch.randomizedtesting.RandomizedRunner.invoke(RandomizedRunner.java:1559)
[junit4:junit4]    > 	at com.carrotsearch.randomizedtesting.RandomizedRunner.access$600(RandomizedRunner.java:79)
[junit4:junit4]    > 	at com.carrotsearch.randomizedtesting.RandomizedRunner$6.evaluate(RandomizedRunner.java:737)
[junit4:junit4]    > 	at com.carrotsearch.randomizedtesting.RandomizedRunner$7.evaluate(RandomizedRunner.java:773)
[junit4:junit4]    > 	at com.carrotsearch.randomizedtesting.RandomizedRunner$8.evaluate(RandomizedRunner.java:787)
[junit4:junit4]    > 	at com.carrotsearch.randomizedtesting.rules.SystemPropertiesRestoreRule$1.evaluate(SystemPropertiesRestoreRule.java:53)
[junit4:junit4]    > 	at org.apache.lucene.util.TestRuleSetupTeardownChained$1.evaluate(TestRuleSetupTeardownChained.java:50)
[junit4:junit4]    > 	at org.apache.lucene.util.TestRuleFieldCacheSanity$1.evaluate(TestRuleFieldCacheSanity.java:51)
[junit4:junit4]    > 	at org.apache.lucene.util.AbstractBeforeAfterRule$1.evaluate(AbstractBeforeAfterRule.java:45)
[junit4:junit4]    > 	at com.carrotsearch.randomizedtesting.rules.SystemPropertiesInvariantRule$1.evaluate(SystemPropertiesInvariantRule.java:55)
[junit4:junit4]    > 	at org.apache.lucene.util.TestRuleThreadAndTestName$1.evaluate(TestRuleThreadAndTestName.java:48)
[junit4:junit4]    > 	at org.apache.lucene.util.TestRuleIgnoreAfterMaxFailures$1.evaluate(TestRuleIgnoreAfterMaxFailures.java:70)
[junit4:junit4]    > 	at org.apache.lucene.util.TestRuleMarkFailure$1.evaluate(TestRuleMarkFailure.java:48)
[junit4:junit4]    > 	at com.carrotsearch.randomizedtesting.rules.StatementAdapter.evaluate(StatementAdapter.java:36)
[junit4:junit4]    > 	at com.carrotsearch.randomizedtesting.ThreadLeakControl$StatementRunner.run(ThreadLeakControl.java:358)
[junit4:junit4]    > 	at com.carrotsearch.randomizedtesting.ThreadLeakControl.forkTimeoutingTask(ThreadLeakControl.java:782)
[junit4:junit4]    > 	at com.carrotsearch.randomizedtesting.ThreadLeakControl$3.evaluate(ThreadLeakControl.java:442)
[junit4:junit4]    > 	at com.carrotsearch.randomizedtesting.RandomizedRunner.runSingleTest(RandomizedRunner.java:746)
[junit4:junit4]    > 	at com.carrotsearch.randomizedtesting.RandomizedRunner$3.evaluate(RandomizedRunner.java:648)
[junit4:junit4]    > 	at com.carrotsearch.randomizedtesting.RandomizedRunner$4.evaluate(RandomizedRunner.java:682)
[junit4:junit4]    > 	at com.carrotsearch.randomizedtesting.RandomizedRunner$5.evaluate(RandomizedRunner.java:693)
[junit4:junit4]    > 	at com.carrotsearch.randomizedtesting.rules.StatementAdapter.evaluate(StatementAdapter.java:36)
[junit4:junit4]    > 	at com.carrotsearch.randomizedtesting.rules.SystemPropertiesRestoreRule$1.evaluate(SystemPropertiesRestoreRule.java:53)
[junit4:junit4]    > 	at org.apache.lucene.util.AbstractBeforeAfterRule$1.evaluate(AbstractBeforeAfterRule.java:45)
[junit4:junit4]    > 	at org.apache.lucene.util.TestRuleStoreClassName$1.evaluate(TestRuleStoreClassName.java:42)
[junit4:junit4]    > 	at com.carrotsearch.randomizedtesting.rules.SystemPropertiesInvariantRule$1.evaluate(SystemPropertiesInvariantRule.java:55)
[junit4:junit4]    > 	at com.carrotsearch.randomizedtesting.rules.NoShadowingOrOverridesOnMethodsRule$1.evaluate(NoShadowingOrOverridesOnMethodsRule.java:39)
[junit4:junit4]    > 	at com.carrotsearch.randomizedtesting.rules.NoShadowingOrOverridesOnMethodsRule$1.evaluate(NoShadowingOrOverridesOnMethodsRule.java:39)
[junit4:junit4]    > 	at com.carrotsearch.randomizedtesting.rules.StatementAdapter.evaluate(StatementAdapter.java:36)
[junit4:junit4]    > 	at org.apache.lucene.util.TestRuleAssertionsRequired$1.evaluate(TestRuleAssertionsRequired.java:43)
[junit4:junit4]    > 	at org.apache.lucene.util.TestRuleMarkFailure$1.evaluate(TestRuleMarkFailure.java:48)
[junit4:junit4]    > 	at org.apache.lucene.util.TestRuleIgnoreAfterMaxFailures$1.evaluate(TestRuleIgnoreAfterMaxFailures.java:70)
[junit4:junit4]    > 	at org.apache.lucene.util.TestRuleIgnoreTestSuites$1.evaluate(TestRuleIgnoreTestSuites.java:55)
[junit4:junit4]    > 	at com.carrotsearch.randomizedtesting.rules.StatementAdapter.evaluate(StatementAdapter.java:36)
[junit4:junit4]    > 	at com.carrotsearch.randomizedtesting.ThreadLeakControl$StatementRunner.run(ThreadLeakControl.java:358)
[junit4:junit4]    > 	at java.lang.Thread.run(Thread.java:722)
[junit4:junit4]   2> 599567 T923 oas.SolrTestCaseJ4.deleteCore ###deleteCore
[junit4:junit4]   2> NOTE: test params are: codec=Lucene40: {n_f1=PostingsFormat(name=TestBloomFilteredLucene40Postings), foo_b=MockVariableIntBlock(baseBlockSize=41), cat=PostingsFormat(name=Direct), foo_d=PostingsFormat(name=Memory doPackFST= true), foo_f=MockVariableIntBlock(baseBlockSize=41), n_tl1=PostingsFormat(name=TestBloomFilteredLucene40Postings), n_d1=PostingsFormat(name=Direct), rnd_b=PostingsFormat(name=Memory doPackFST= true), intDefault=PostingsFormat(name=TestBloomFilteredLucene40Postings), n_td1=PostingsFormat(name=TestBloomFilteredLucene40Postings), timestamp=PostingsFormat(name=Direct), id=PostingsFormat(name=Memory doPackFST= true), range_facet_sl=PostingsFormat(name=Memory doPackFST= true), range_facet_si=PostingsFormat(name=Direct), oddField_s=PostingsFormat(name=Memory doPackFST= true), sequence_i=PostingsFormat(name=Memory doPackFST= true), name=PostingsFormat(name=Memory doPackFST= true), foo_i=PostingsFormat(name=TestBloomFilteredLucene40Postings), regex_dup_B_s=PostingsFormat(name=Direct), multiDefault=PostingsFormat(name=Direct), n_tf1=PostingsFormat(name=Direct), n_dt1=PostingsFormat(name=TestBloomFilteredLucene40Postings), genre_s=PostingsFormat(name=Memory doPackFST= true), author_t=PostingsFormat(name=TestBloomFilteredLucene40Postings), n_ti1=PostingsFormat(name=Memory doPackFST= true), range_facet_l=PostingsFormat(name=Direct), text=MockVariableIntBlock(baseBlockSize=41), _version_=PostingsFormat(name=TestBloomFilteredLucene40Postings), val_i=PostingsFormat(name=Memory doPackFST= true), SubjectTerms_mfacet=PostingsFormat(name=TestBloomFilteredLucene40Postings), series_t=PostingsFormat(name=TestBloomFilteredLucene40Postings), a_t=PostingsFormat(name=Direct), n_tdt1=PostingsFormat(name=TestBloomFilteredLucene40Postings), regex_dup_A_s=MockVariableIntBlock(baseBlockSize=41), price=MockVariableIntBlock(baseBlockSize=41), other_tl1=PostingsFormat(name=TestBloomFilteredLucene40Postings), n_l1=PostingsFormat(name=Direct), a_si=PostingsFormat(name=TestBloomFilteredLucene40Postings), inStock=MockVariableIntBlock(baseBlockSize=41)}, sim=RandomSimilarityProvider(queryNorm=true,coord=no): {}, locale=es_CR, timezone=America/Rosario
[junit4:junit4]   2> NOTE: FreeBSD 9.0-RELEASE amd64/Oracle Corporation 1.7.0_06 (64-bit)/cpus=16,threads=1,free=157974624,total=449839104
[junit4:junit4]   2> NOTE: All tests run in this JVM: [TestStressReorder, SampleTest, AlternateDirectoryTest, TestQuerySenderNoQuery, IndexBasedSpellCheckerTest, TestWordDelimiterFilterFactory, BadComponentTest, TestIndexSearcher, CSVRequestHandlerTest, SimplePostToolTest, SpatialFilterTest, PreAnalyzedFieldTest, DateFieldTest, FastVectorHighlighterTest, TestLuceneMatchVersion, SimpleFacetsTest, TestFastLRUCache, TestQueryTypes, NotRequiredUniqueKeyTest, TestPerFieldSimilarity, TestElisionMultitermQuery, TestExtendedDismaxParser, NoCacheHeaderTest, TestJmxMonitoredMap, TestSuggestSpellingConverter, SolrCoreCheckLockOnStartupTest, DirectUpdateHandlerOptimizeTest, CircularListTest, TestIndexingPerformance, DateMathParserTest, TestReload, TestConfig, MBeansHandlerTest, SpellCheckCollatorTest, LoggingHandlerTest, TestStressVersions, SolrCmdDistributorTest, SolrPluginUtilsTest, DistributedTermsComponentTest, DistributedSpellCheckComponentTest, TestPHPSerializedResponseWriter, TestLMDirichletSimilarityFactory, TestSolr4Spatial, CurrencyFieldTest, SOLR749Test, SearchHandlerTest, QueryElevationComponentTest, RequestHandlersTest, UniqFieldsUpdateProcessorFactoryTest, TestFastOutputStream, JsonLoaderTest, UpdateRequestProcessorFactoryTest, SpellCheckComponentTest, DirectSolrConnectionTest, BasicDistributedZkTest]
[junit4:junit4] Completed on J0 in 599.86s, 1 test, 1 error <<< FAILURES!

[...truncated 332 lines...]
BUILD FAILED
/usr/home/hudson/hudson-slave/workspace/Lucene-Solr-Tests-4.x-java7/build.xml:38: The following error occurred while executing this line:
/usr/home/hudson/hudson-slave/workspace/Lucene-Solr-Tests-4.x-java7/solr/build.xml:180: The following error occurred while executing this line:
/usr/home/hudson/hudson-slave/workspace/Lucene-Solr-Tests-4.x-java7/lucene/module-build.xml:61: The following error occurred while executing this line:
/usr/home/hudson/hudson-slave/workspace/Lucene-Solr-Tests-4.x-java7/lucene/common-build.xml:1143: The following error occurred while executing this line:
/usr/home/hudson/hudson-slave/workspace/Lucene-Solr-Tests-4.x-java7/lucene/common-build.xml:816: There were test failures: 231 suites, 960 tests, 1 error, 21 ignored (3 assumptions)

Total time: 34 minutes 13 seconds
Build step 'Invoke Ant' marked build as failure
Recording test results
Email was triggered for: Failure
Sending email for trigger: Failure



Mime
View raw message