lucene-dev mailing list archives

Site index · List index
Message view « Date » · « Thread »
Top « Date » · « Thread »
From Charlie Cron <hudsonsevilt...@gmail.com>
Subject Build failed in Jenkins: fast-io-beasting #6014
Date Sat, 27 Oct 2012 14:03:13 GMT
See <http://sierranevada.servebeer.com/job/fast-io-beasting/6014/>

------------------------------------------
[...truncated 17349 lines...]
[junit4:junit4]   2> 41853 T226 C17 UPDATE [collection1] webapp=/solr path=/update params={wt=javabin&version=2}
{add=[383]} 0 1
[junit4:junit4]   2> 41856 T227 C17 UPDATE [collection1] webapp=/solr path=/update params={wt=javabin&version=2}
{add=[384]} 0 1
[junit4:junit4]   2> 41859 T224 C17 UPDATE [collection1] webapp=/solr path=/update params={wt=javabin&version=2}
{add=[385]} 0 1
[junit4:junit4]   2> 41862 T229 C17 UPDATE [collection1] webapp=/solr path=/update params={wt=javabin&version=2}
{add=[386]} 0 0
[junit4:junit4]   2> 41866 T226 C17 UPDATE [collection1] webapp=/solr path=/update params={wt=javabin&version=2}
{add=[387]} 0 0
[junit4:junit4]   2> 41873 T227 C17 UPDATE [collection1] webapp=/solr path=/update params={wt=javabin&version=2}
{add=[388]} 0 1
[junit4:junit4]   2> 41876 T224 C17 UPDATE [collection1] webapp=/solr path=/update params={wt=javabin&version=2}
{add=[389]} 0 0
[junit4:junit4]   2> 41879 T229 C17 UPDATE [collection1] webapp=/solr path=/update params={wt=javabin&version=2}
{add=[390]} 0 0
[junit4:junit4]   2> 41882 T226 C17 UPDATE [collection1] webapp=/solr path=/update params={wt=javabin&version=2}
{add=[391]} 0 0
[junit4:junit4]   2> 41885 T227 C17 UPDATE [collection1] webapp=/solr path=/update params={wt=javabin&version=2}
{add=[392]} 0 0
[junit4:junit4]   2> 41888 T224 C17 UPDATE [collection1] webapp=/solr path=/update params={wt=javabin&version=2}
{add=[393]} 0 0
[junit4:junit4]   2> 41891 T229 C17 UPDATE [collection1] webapp=/solr path=/update params={wt=javabin&version=2}
{add=[394]} 0 0
[junit4:junit4]   2> 41894 T226 C17 UPDATE [collection1] webapp=/solr path=/update params={wt=javabin&version=2}
{add=[395]} 0 0
[junit4:junit4]   2> 41897 T227 C17 UPDATE [collection1] webapp=/solr path=/update params={wt=javabin&version=2}
{add=[396]} 0 0
[junit4:junit4]   2> 41900 T224 C17 UPDATE [collection1] webapp=/solr path=/update params={wt=javabin&version=2}
{add=[397]} 0 0
[junit4:junit4]   2> 41903 T229 C17 UPDATE [collection1] webapp=/solr path=/update params={wt=javabin&version=2}
{add=[398]} 0 0
[junit4:junit4]   2> 41906 T226 C17 UPDATE [collection1] webapp=/solr path=/update params={wt=javabin&version=2}
{add=[399]} 0 0
[junit4:junit4]   2> 41913 T227 C17 UPDATE [collection1] webapp=/solr path=/update params={wt=javabin&version=2}
{add=[400]} 0 0
[junit4:junit4]   2> 41916 T224 C17 UPDATE [collection1] webapp=/solr path=/update params={wt=javabin&version=2}
{add=[401]} 0 0
[junit4:junit4]   2> 41923 T229 C17 UPDATE [collection1] webapp=/solr path=/update params={wt=javabin&version=2}
{add=[402]} 0 0
[junit4:junit4]   2> 41929 T226 C17 UPDATE [collection1] webapp=/solr path=/update params={wt=javabin&version=2}
{add=[403]} 0 0
[junit4:junit4]   2> 41932 T227 C17 UPDATE [collection1] webapp=/solr path=/update params={wt=javabin&version=2}
{add=[404]} 0 0
[junit4:junit4]   2> 41936 T224 C17 UPDATE [collection1] webapp=/solr path=/update params={wt=javabin&version=2}
{add=[405]} 0 0
[junit4:junit4]   2> 41943 T229 C17 UPDATE [collection1] webapp=/solr path=/update params={wt=javabin&version=2}
{add=[406]} 0 1
[junit4:junit4]   2> 41945 T226 C17 UPDATE [collection1] webapp=/solr path=/update params={wt=javabin&version=2}
{add=[407]} 0 0
[junit4:junit4]   2> 41952 T227 C17 UPDATE [collection1] webapp=/solr path=/update params={wt=javabin&version=2}
{add=[408]} 0 0
[junit4:junit4]   2> 41958 T224 C17 UPDATE [collection1] webapp=/solr path=/update params={wt=javabin&version=2}
{add=[409]} 0 1
[junit4:junit4]   2> 41961 T229 C17 UPDATE [collection1] webapp=/solr path=/update params={wt=javabin&version=2}
{add=[410]} 0 1
[junit4:junit4]   2> 41965 T226 C17 UPDATE [collection1] webapp=/solr path=/update params={wt=javabin&version=2}
{add=[411]} 0 0
[junit4:junit4]   2> 41969 T227 C17 UPDATE [collection1] webapp=/solr path=/update params={wt=javabin&version=2}
{add=[412]} 0 1
[junit4:junit4]   2> 41972 T224 C17 UPDATE [collection1] webapp=/solr path=/update params={wt=javabin&version=2}
{add=[413]} 0 0
[junit4:junit4]   2> 41976 T229 C17 UPDATE [collection1] webapp=/solr path=/update params={wt=javabin&version=2}
{add=[414]} 0 0
[junit4:junit4]   2> 41980 T226 C17 UPDATE [collection1] webapp=/solr path=/update params={wt=javabin&version=2}
{add=[415]} 0 0
[junit4:junit4]   2> 41983 T227 C17 UPDATE [collection1] webapp=/solr path=/update params={wt=javabin&version=2}
{add=[416]} 0 0
[junit4:junit4]   2> 41987 T224 C17 UPDATE [collection1] webapp=/solr path=/update params={wt=javabin&version=2}
{add=[417]} 0 0
[junit4:junit4]   2> 41991 T229 C17 UPDATE [collection1] webapp=/solr path=/update params={wt=javabin&version=2}
{add=[418]} 0 0
[junit4:junit4]   2> 41994 T226 C17 UPDATE [collection1] webapp=/solr path=/update params={wt=javabin&version=2}
{add=[419]} 0 0
[junit4:junit4]   2> 41997 T227 C17 UPDATE [collection1] webapp=/solr path=/update params={wt=javabin&version=2}
{add=[420]} 0 0
[junit4:junit4]   2> 42001 T224 C17 UPDATE [collection1] webapp=/solr path=/update params={wt=javabin&version=2}
{add=[421]} 0 1
[junit4:junit4]   2> 42008 T229 C17 UPDATE [collection1] webapp=/solr path=/update params={wt=javabin&version=2}
{add=[422]} 0 0
[junit4:junit4]   2> 42013 T226 C17 UPDATE [collection1] webapp=/solr path=/update params={wt=javabin&version=2}
{add=[423]} 0 0
[junit4:junit4]   2> 42017 T227 C17 UPDATE [collection1] webapp=/solr path=/update params={wt=javabin&version=2}
{add=[424]} 0 0
[junit4:junit4]   2> 42020 T224 C17 UPDATE [collection1] webapp=/solr path=/update params={wt=javabin&version=2}
{add=[425]} 0 0
[junit4:junit4]   2> 42024 T229 C17 UPDATE [collection1] webapp=/solr path=/update params={wt=javabin&version=2}
{add=[426]} 0 0
[junit4:junit4]   2> 42027 T226 C17 UPDATE [collection1] webapp=/solr path=/update params={wt=javabin&version=2}
{add=[427]} 0 0
[junit4:junit4]   2> 42030 T227 C17 UPDATE [collection1] webapp=/solr path=/update params={wt=javabin&version=2}
{add=[428]} 0 0
[junit4:junit4]   2> 42033 T224 C17 UPDATE [collection1] webapp=/solr path=/update params={wt=javabin&version=2}
{add=[429]} 0 0
[junit4:junit4]   2> 42039 T229 C17 UPDATE [collection1] webapp=/solr path=/update params={wt=javabin&version=2}
{add=[430]} 0 0
[junit4:junit4]   2> 42042 T226 C17 UPDATE [collection1] webapp=/solr path=/update params={wt=javabin&version=2}
{add=[431]} 0 0
[junit4:junit4]   2> 42048 T227 C17 UPDATE [collection1] webapp=/solr path=/update params={wt=javabin&version=2}
{add=[432]} 0 0
[junit4:junit4]   2> 42051 T224 C17 UPDATE [collection1] webapp=/solr path=/update params={wt=javabin&version=2}
{add=[433]} 0 0
[junit4:junit4]   2> 42055 T229 C17 UPDATE [collection1] webapp=/solr path=/update params={wt=javabin&version=2}
{add=[434]} 0 0
[junit4:junit4]   2> 42063 T226 C17 UPDATE [collection1] webapp=/solr path=/update params={wt=javabin&version=2}
{add=[435]} 0 1
[junit4:junit4]   2> 42067 T227 C17 UPDATE [collection1] webapp=/solr path=/update params={wt=javabin&version=2}
{add=[436]} 0 0
[junit4:junit4]   2> 42070 T224 C17 UPDATE [collection1] webapp=/solr path=/update params={wt=javabin&version=2}
{add=[437]} 0 0
[junit4:junit4]   2> 42074 T229 C17 UPDATE [collection1] webapp=/solr path=/update params={wt=javabin&version=2}
{add=[438]} 0 0
[junit4:junit4]   2> 42082 T226 C17 UPDATE [collection1] webapp=/solr path=/update params={wt=javabin&version=2}
{add=[439]} 0 0
[junit4:junit4]   2> 42085 T227 C17 UPDATE [collection1] webapp=/solr path=/update params={wt=javabin&version=2}
{add=[440]} 0 0
[junit4:junit4]   2> 42089 T224 C17 UPDATE [collection1] webapp=/solr path=/update params={wt=javabin&version=2}
{add=[441]} 0 1
[junit4:junit4]   2> 42092 T229 C17 UPDATE [collection1] webapp=/solr path=/update params={wt=javabin&version=2}
{add=[442]} 0 0
[junit4:junit4]   2> 42099 T226 C17 UPDATE [collection1] webapp=/solr path=/update params={wt=javabin&version=2}
{add=[443]} 0 0
[junit4:junit4]   2> 42104 T227 C17 UPDATE [collection1] webapp=/solr path=/update params={wt=javabin&version=2}
{add=[444]} 0 0
[junit4:junit4]   2> 42108 T224 C17 UPDATE [collection1] webapp=/solr path=/update params={wt=javabin&version=2}
{add=[445]} 0 1
[junit4:junit4]   2> 42111 T229 C17 UPDATE [collection1] webapp=/solr path=/update params={wt=javabin&version=2}
{add=[446]} 0 0
[junit4:junit4]   2> 42117 T226 C17 UPDATE [collection1] webapp=/solr path=/update params={wt=javabin&version=2}
{add=[447]} 0 0
[junit4:junit4]   2> 42123 T227 C17 UPDATE [collection1] webapp=/solr path=/update params={wt=javabin&version=2}
{add=[448]} 0 1
[junit4:junit4]   2> 42126 T224 C17 UPDATE [collection1] webapp=/solr path=/update params={wt=javabin&version=2}
{add=[449]} 0 0
[junit4:junit4]   2> 42129 T229 C17 UPDATE [collection1] webapp=/solr path=/update params={wt=javabin&version=2}
{add=[450]} 0 0
[junit4:junit4]   2> 42132 T226 C17 UPDATE [collection1] webapp=/solr path=/update params={wt=javabin&version=2}
{add=[451]} 0 0
[junit4:junit4]   2> 42137 T227 C17 UPDATE [collection1] webapp=/solr path=/update params={wt=javabin&version=2}
{add=[452]} 0 1
[junit4:junit4]   2> 42140 T229 C17 UPDATE [collection1] webapp=/solr path=/update params={wt=javabin&version=2}
{add=[453]} 0 1
[junit4:junit4]   2> 42142 T226 C17 UPDATE [collection1] webapp=/solr path=/update params={wt=javabin&version=2}
{add=[454]} 0 0
[junit4:junit4]   2> 42145 T224 C17 UPDATE [collection1] webapp=/solr path=/update params={wt=javabin&version=2}
{add=[455]} 0 0
[junit4:junit4]   2> 42148 T229 C17 UPDATE [collection1] webapp=/solr path=/update params={wt=javabin&version=2}
{add=[456]} 0 0
[junit4:junit4]   2> 42151 T226 C17 UPDATE [collection1] webapp=/solr path=/update params={wt=javabin&version=2}
{add=[457]} 0 0
[junit4:junit4]   2> 42154 T224 C17 UPDATE [collection1] webapp=/solr path=/update params={wt=javabin&version=2}
{add=[458]} 0 0
[junit4:junit4]   2> 42157 T227 C17 UPDATE [collection1] webapp=/solr path=/update params={wt=javabin&version=2}
{add=[459]} 0 0
[junit4:junit4]   2> 42160 T229 C17 UPDATE [collection1] webapp=/solr path=/update params={wt=javabin&version=2}
{add=[460]} 0 0
[junit4:junit4]   2> 42163 T226 C17 UPDATE [collection1] webapp=/solr path=/update params={wt=javabin&version=2}
{add=[461]} 0 0
[junit4:junit4]   2> 42166 T224 C17 UPDATE [collection1] webapp=/solr path=/update params={wt=javabin&version=2}
{add=[462]} 0 0
[junit4:junit4]   2> 42169 T227 C17 UPDATE [collection1] webapp=/solr path=/update params={wt=javabin&version=2}
{add=[463]} 0 0
[junit4:junit4]   2> 42172 T229 C17 UPDATE [collection1] webapp=/solr path=/update params={wt=javabin&version=2}
{add=[464]} 0 0
[junit4:junit4]   2> 42176 T226 C17 UPDATE [collection1] webapp=/solr path=/update params={wt=javabin&version=2}
{add=[465]} 0 0
[junit4:junit4]   2> 42181 T224 C17 UPDATE [collection1] webapp=/solr path=/update params={wt=javabin&version=2}
{add=[466]} 0 0
[junit4:junit4]   2> 42184 T227 C17 UPDATE [collection1] webapp=/solr path=/update params={wt=javabin&version=2}
{add=[467]} 0 0
[junit4:junit4]   2> 42188 T229 C17 UPDATE [collection1] webapp=/solr path=/update params={wt=javabin&version=2}
{add=[468]} 0 0
[junit4:junit4]   2> 42191 T226 C17 UPDATE [collection1] webapp=/solr path=/update params={wt=javabin&version=2}
{add=[469]} 0 0
[junit4:junit4]   2> 42194 T224 C17 UPDATE [collection1] webapp=/solr path=/update params={wt=javabin&version=2}
{add=[470]} 0 0
[junit4:junit4]   2> 42197 T227 C17 UPDATE [collection1] webapp=/solr path=/update params={wt=javabin&version=2}
{add=[471]} 0 0
[junit4:junit4]   2> 42200 T229 C17 UPDATE [collection1] webapp=/solr path=/update params={wt=javabin&version=2}
{add=[472]} 0 0
[junit4:junit4]   2> 42203 T226 C17 UPDATE [collection1] webapp=/solr path=/update params={wt=javabin&version=2}
{add=[473]} 0 1
[junit4:junit4]   2> 42206 T224 C17 UPDATE [collection1] webapp=/solr path=/update params={wt=javabin&version=2}
{add=[474]} 0 1
[junit4:junit4]   2> 42209 T227 C17 UPDATE [collection1] webapp=/solr path=/update params={wt=javabin&version=2}
{add=[475]} 0 1
[junit4:junit4]   2> 42212 T229 C17 UPDATE [collection1] webapp=/solr path=/update params={wt=javabin&version=2}
{add=[476]} 0 1
[junit4:junit4]   2> 42215 T226 C17 UPDATE [collection1] webapp=/solr path=/update params={wt=javabin&version=2}
{add=[477]} 0 0
[junit4:junit4]   2> 42217 T224 C17 UPDATE [collection1] webapp=/solr path=/update params={wt=javabin&version=2}
{add=[478]} 0 0
[junit4:junit4]   2> 42220 T227 C17 UPDATE [collection1] webapp=/solr path=/update params={wt=javabin&version=2}
{add=[479]} 0 0
[junit4:junit4]   2> 42223 T229 C17 UPDATE [collection1] webapp=/solr path=/update params={wt=javabin&version=2}
{add=[480]} 0 0
[junit4:junit4]   2> 42226 T226 C17 UPDATE [collection1] webapp=/solr path=/update params={wt=javabin&version=2}
{add=[481]} 0 0
[junit4:junit4]   2> 42229 T224 C17 UPDATE [collection1] webapp=/solr path=/update params={wt=javabin&version=2}
{add=[482]} 0 0
[junit4:junit4]   2> 42232 T227 C17 UPDATE [collection1] webapp=/solr path=/update params={wt=javabin&version=2}
{add=[483]} 0 0
[junit4:junit4]   2> 42235 T229 C17 UPDATE [collection1] webapp=/solr path=/update params={wt=javabin&version=2}
{add=[484]} 0 0
[junit4:junit4]   2> 42238 T226 C17 UPDATE [collection1] webapp=/solr path=/update params={wt=javabin&version=2}
{add=[485]} 0 1
[junit4:junit4]   2> 42241 T224 C17 UPDATE [collection1] webapp=/solr path=/update params={wt=javabin&version=2}
{add=[486]} 0 1
[junit4:junit4]   2> 42244 T227 C17 UPDATE [collection1] webapp=/solr path=/update params={wt=javabin&version=2}
{add=[487]} 0 1
[junit4:junit4]   2> 42246 T229 C17 UPDATE [collection1] webapp=/solr path=/update params={wt=javabin&version=2}
{add=[488]} 0 0
[junit4:junit4]   2> 42250 T226 C17 UPDATE [collection1] webapp=/solr path=/update params={wt=javabin&version=2}
{add=[489]} 0 1
[junit4:junit4]   2> 42252 T224 C17 UPDATE [collection1] webapp=/solr path=/update params={wt=javabin&version=2}
{add=[490]} 0 0
[junit4:junit4]   2> 42258 T227 C17 UPDATE [collection1] webapp=/solr path=/update params={wt=javabin&version=2}
{add=[491]} 0 0
[junit4:junit4]   2> 42261 T229 C17 UPDATE [collection1] webapp=/solr path=/update params={wt=javabin&version=2}
{add=[492]} 0 1
[junit4:junit4]   2> 42264 T226 C17 oasu.DirectUpdateHandler2.commit start commit{flags=0,_version_=0,optimize=false,openSearcher=true,waitSearcher=true,expungeDeletes=false,softCommit=false}
[junit4:junit4]   2> 42323 T226 C17 oasc.SolrDeletionPolicy.onCommit SolrDeletionPolicy.onCommit:
commits:num=2
[junit4:junit4]   2> 		commit{dir=<http://sierranevada.servebeer.com/job/fast-io-beasting/ws/solr/build/solr-core/test/J5/org.apache.solr.handler.TestReplicationHandler$SolrInstance-1351346406342/master/collection1/data/index,segFN=segments_i,generation=18,filenames=[_a.tim,>
_a_nrm.cfe, _a.tip, _a.doc, _a.fdt, _a.si, _a_nrm.cfs, segments_i, _a.fnm, _a.fdx]
[junit4:junit4]   2> 		commit{dir=<http://sierranevada.servebeer.com/job/fast-io-beasting/ws/solr/build/solr-core/test/J5/org.apache.solr.handler.TestReplicationHandler$SolrInstance-1351346406342/master/collection1/data/index,segFN=segments_j,generation=19,filenames=[_b.si,>
_b.doc, _b.tim, _b_nrm.cfe, _b.tip, _b.fnm, _b.fdt, _b_nrm.cfs, segments_j, _b.fdx]
[junit4:junit4]   2> 42323 T226 C17 oasc.SolrDeletionPolicy.updateCommits newest commit
= 19
[junit4:junit4]   2> 42328 T226 C17 oass.SolrIndexSearcher.<init> Opening Searcher@49deadf0
main
[junit4:junit4]   2> 42329 T230 oasc.SolrCore.registerSearcher [collection1] Registered
new searcher Searcher@49deadf0 main{StandardDirectoryReader(segments_j:35 _b(4.1):C493)}
[junit4:junit4]   2> 42329 T226 C17 oasu.DirectUpdateHandler2.commit end_commit_flush
[junit4:junit4]   2> 42330 T226 C17 UPDATE [collection1] webapp=/solr path=/update params={waitSearcher=true&wt=javabin&commit=true&softCommit=false&version=2}
{commit=} 0 67
[junit4:junit4]   2> 42336 T224 C17 REQ [collection1] webapp=/solr path=/replication params={command=details}
status=0 QTime=1 
[junit4:junit4]   2> 42352 T227 C17 REQ [collection1] webapp=/solr path=/replication params={command=backup&numberToKeep=1}
status=0 QTime=12 
[junit4:junit4]   2> 42540 T229 C17 REQ [collection1] webapp=/solr path=/replication params={command=details}
status=0 QTime=1 
[junit4:junit4]   2> 42659 T219 oash.SnapPuller.fetchLatestIndex SEVERE Master at: http://127.0.0.1:49637/solr
is not available. Index fetch failed. Exception: org.apache.solr.client.solrj.SolrServerException:
Server refused connection at: http://127.0.0.1:49637/solr
[junit4:junit4]   2> 43553 T224 C17 REQ [collection1] webapp=/solr path=/replication params={command=details}
status=0 QTime=1 
[junit4:junit4]   2> 43564 T226 C17 REQ [collection1] webapp=/solr path=/replication params={command=backup&numberToKeep=1}
status=0 QTime=1 
[junit4:junit4]   2> 43659 T219 oash.SnapPuller.fetchLatestIndex SEVERE Master at: http://127.0.0.1:49637/solr
is not available. Index fetch failed. Exception: org.apache.solr.client.solrj.SolrServerException:
Server refused connection at: http://127.0.0.1:49637/solr
[junit4:junit4]   2> 43760 T229 C17 REQ [collection1] webapp=/solr path=/replication params={command=details}
status=0 QTime=1 
[junit4:junit4]   2> 43764 T16 oas.SolrTestCaseJ4.tearDown ###Ending test
[junit4:junit4]   1> replicate slave to master
[junit4:junit4]   2> 43792 T16 oasc.CoreContainer.shutdown Shutting down CoreContainer
instance=518536343
[junit4:junit4]   2> 43792 T16 oasc.SolrCore.close [collection1]  CLOSING SolrCore org.apache.solr.core.SolrCore@774943d6
[junit4:junit4]   2> 43793 T16 oasu.DirectUpdateHandler2.close closing DirectUpdateHandler2{commits=1,autocommits=0,soft
autocommits=0,optimizes=0,rollbacks=0,expungeDeletes=0,docsPending=0,adds=0,deletesById=0,deletesByQuery=0,errors=0,cumulative_adds=493,cumulative_deletesById=0,cumulative_deletesByQuery=1,cumulative_errors=0}
[junit4:junit4]   2> 43794 T16 oasc.SolrCore.decrefSolrCoreState Closing SolrCoreState
[junit4:junit4]   2> 43794 T16 oasu.DefaultSolrCoreState.closeIndexWriter SolrCoreState
ref count has reached 0 - closing IndexWriter
[junit4:junit4]   2> 43795 T16 oasu.DefaultSolrCoreState.closeIndexWriter closing IndexWriter
with IndexWriterCloser
[junit4:junit4]   2> 43796 T16 oasc.SolrCore.closeSearcher [collection1] Closing main searcher
on request.
[junit4:junit4]   2> 43796 T16 oejsh.ContextHandler.doStop stopped o.e.j.s.ServletContextHandler{/solr,null}
[junit4:junit4]   2> 43869 T16 oasc.CoreContainer.shutdown Shutting down CoreContainer
instance=1944078901
[junit4:junit4]   2> 43870 T16 oasc.SolrCore.close [collection1]  CLOSING SolrCore org.apache.solr.core.SolrCore@3de5627c
[junit4:junit4]   2> 43870 T16 oasu.DirectUpdateHandler2.close closing DirectUpdateHandler2{commits=2,autocommits=0,soft
autocommits=0,optimizes=0,rollbacks=0,expungeDeletes=0,docsPending=0,adds=0,deletesById=0,deletesByQuery=0,errors=0,cumulative_adds=1,cumulative_deletesById=0,cumulative_deletesByQuery=0,cumulative_errors=0}
[junit4:junit4]   2> 43871 T16 oasc.SolrCore.decrefSolrCoreState Closing SolrCoreState
[junit4:junit4]   2> 43871 T16 oasu.DefaultSolrCoreState.closeIndexWriter SolrCoreState
ref count has reached 0 - closing IndexWriter
[junit4:junit4]   2> 43871 T16 oasu.DefaultSolrCoreState.closeIndexWriter closing IndexWriter
with IndexWriterCloser
[junit4:junit4]   2> 43872 T16 oasc.SolrCore.closeSearcher [collection1] Closing main searcher
on request.
[junit4:junit4]   2> 43873 T16 oejsh.ContextHandler.doStop stopped o.e.j.s.ServletContextHandler{/solr,null}
[junit4:junit4]   2> 43929 T16 oas.SolrTestCaseJ4.deleteCore ###deleteCore
[junit4:junit4]   2> 164950 T16 oas.SolrTestCaseJ4.endTrackingSearchers SEVERE ERROR: SolrIndexSearcher
opens=61 closes=60
[junit4:junit4]   2> NOTE: test params are: codec=Asserting, sim=DefaultSimilarity, locale=es_BO,
timezone=Africa/Libreville
[junit4:junit4]   2> NOTE: Linux 3.2.0-24-generic amd64/Sun Microsystems Inc. 1.6.0_27
(64-bit)/cpus=8,threads=1,free=225634440,total=283377664
[junit4:junit4]   2> NOTE: All tests run in this JVM: [TestLFUCache, TestDefaultSimilarityFactory,
TestReplicationHandler]
[junit4:junit4]   2> NOTE: reproduce with: ant test  -Dtestcase=TestReplicationHandler
-Dtests.seed=97040F007E7794EF -Dtests.slow=true -Dtests.locale=es_BO -Dtests.timezone=Africa/Libreville
-Dtests.file.encoding=US-ASCII
[junit4:junit4] ERROR   0.00s J5 | TestReplicationHandler (suite) <<<
[junit4:junit4]    > Throwable #1: java.lang.AssertionError: ERROR: SolrIndexSearcher opens=61
closes=60
[junit4:junit4]    > 	at __randomizedtesting.SeedInfo.seed([97040F007E7794EF]:0)
[junit4:junit4]    > 	at org.junit.Assert.fail(Assert.java:93)
[junit4:junit4]    > 	at org.apache.solr.SolrTestCaseJ4.endTrackingSearchers(SolrTestCaseJ4.java:242)
[junit4:junit4]    > 	at org.apache.solr.SolrTestCaseJ4.afterClass(SolrTestCaseJ4.java:97)
[junit4:junit4]    > 	at sun.reflect.NativeMethodAccessorImpl.invoke0(Native Method)
[junit4:junit4]    > 	at sun.reflect.NativeMethodAccessorImpl.invoke(NativeMethodAccessorImpl.java:39)
[junit4:junit4]    > 	at sun.reflect.DelegatingMethodAccessorImpl.invoke(DelegatingMethodAccessorImpl.java:25)
[junit4:junit4]    > 	at java.lang.reflect.Method.invoke(Method.java:597)
[junit4:junit4]    > 	at com.carrotsearch.randomizedtesting.RandomizedRunner.invoke(RandomizedRunner.java:1559)
[junit4:junit4]    > 	at com.carrotsearch.randomizedtesting.RandomizedRunner.access$600(RandomizedRunner.java:79)
[junit4:junit4]    > 	at com.carrotsearch.randomizedtesting.RandomizedRunner$5.evaluate(RandomizedRunner.java:700)
[junit4:junit4]    > 	at com.carrotsearch.randomizedtesting.rules.StatementAdapter.evaluate(StatementAdapter.java:36)
[junit4:junit4]    > 	at com.carrotsearch.randomizedtesting.rules.SystemPropertiesRestoreRule$1.evaluate(SystemPropertiesRestoreRule.java:53)
[junit4:junit4]    > 	at org.apache.lucene.util.AbstractBeforeAfterRule$1.evaluate(AbstractBeforeAfterRule.java:45)
[junit4:junit4]    > 	at org.apache.lucene.util.TestRuleStoreClassName$1.evaluate(TestRuleStoreClassName.java:42)
[junit4:junit4]    > 	at com.carrotsearch.randomizedtesting.rules.SystemPropertiesInvariantRule$1.evaluate(SystemPropertiesInvariantRule.java:55)
[junit4:junit4]    > 	at com.carrotsearch.randomizedtesting.rules.NoShadowingOrOverridesOnMethodsRule$1.evaluate(NoShadowingOrOverridesOnMethodsRule.java:39)
[junit4:junit4]    > 	at com.carrotsearch.randomizedtesting.rules.NoShadowingOrOverridesOnMethodsRule$1.evaluate(NoShadowingOrOverridesOnMethodsRule.java:39)
[junit4:junit4]    > 	at com.carrotsearch.randomizedtesting.rules.StatementAdapter.evaluate(StatementAdapter.java:36)
[junit4:junit4]    > 	at org.apache.lucene.util.TestRuleAssertionsRequired$1.evaluate(TestRuleAssertionsRequired.java:43)
[junit4:junit4]    > 	at org.apache.lucene.util.TestRuleMarkFailure$1.evaluate(TestRuleMarkFailure.java:48)
[junit4:junit4]    > 	at org.apache.lucene.util.TestRuleIgnoreAfterMaxFailures$1.evaluate(TestRuleIgnoreAfterMaxFailures.java:70)
[junit4:junit4]    > 	at org.apache.lucene.util.TestRuleIgnoreTestSuites$1.evaluate(TestRuleIgnoreTestSuites.java:55)
[junit4:junit4]    > 	at com.carrotsearch.randomizedtesting.rules.StatementAdapter.evaluate(StatementAdapter.java:36)
[junit4:junit4]    > 	at com.carrotsearch.randomizedtesting.ThreadLeakControl$StatementRunner.run(ThreadLeakControl.java:358)
[junit4:junit4]    > 	at java.lang.Thread.run(Thread.java:662)
[junit4:junit4] Completed on J5 in 165.07s, 1 test, 1 failure <<< FAILURES!
[junit4:junit4] 
[junit4:junit4] Suite: org.apache.solr.cloud.ZkSolrClientTest
[junit4:junit4] Completed on J5 in 7.24s, 4 tests
[junit4:junit4] 
[junit4:junit4] Suite: org.apache.solr.cloud.ZkControllerTest
[junit4:junit4] Completed on J5 in 3.33s, 2 tests
[junit4:junit4] 
[junit4:junit4] Suite: org.apache.solr.request.SimpleFacetsTest
[junit4:junit4] Completed on J5 in 3.91s, 32 tests
[junit4:junit4] 
[junit4:junit4] Suite: org.apache.solr.cloud.ChaosMonkeySafeLeaderTest
[junit4:junit4] Completed on J5 in 0.00s, 0 tests
[junit4:junit4] 
[junit4:junit4] Suite: org.apache.solr.schema.RequiredFieldsTest
[junit4:junit4] Completed on J5 in 0.49s, 3 tests
[junit4:junit4] 
[junit4:junit4] Suite: org.apache.solr.search.TestExtendedDismaxParser
[junit4:junit4] Completed on J5 in 4.55s, 10 tests
[junit4:junit4] 
[junit4:junit4] Suite: org.apache.solr.update.DirectUpdateHandlerOptimizeTest
[junit4:junit4] Completed on J5 in 0.47s, 1 test
[junit4:junit4] 
[junit4:junit4] Suite: org.apache.solr.search.TestSolrJ
[junit4:junit4] Completed on J5 in 0.01s, 1 test
[junit4:junit4] 
[junit4:junit4] Suite: org.apache.solr.schema.OpenExchangeRatesOrgProviderTest
[junit4:junit4] Completed on J5 in 0.05s, 5 tests
[junit4:junit4] 
[junit4:junit4] Suite: org.apache.solr.spelling.SpellingQueryConverterTest
[junit4:junit4] Completed on J5 in 0.02s, 5 tests
[junit4:junit4] 
[junit4:junit4] Suite: org.apache.solr.search.similarities.TestPerFieldSimilarity
[junit4:junit4] Completed on J5 in 0.08s, 7 tests
[junit4:junit4] 
[junit4:junit4] Suite: org.apache.solr.analysis.TestReversedWildcardFilterFactory
[junit4:junit4] Completed on J5 in 0.41s, 4 tests
[junit4:junit4] 
[junit4:junit4] Suite: org.apache.solr.handler.component.BadComponentTest
[junit4:junit4] Completed on J5 in 0.33s, 1 test
[junit4:junit4] 
[junit4:junit4] Suite: org.apache.solr.handler.admin.MBeansHandlerTest
[junit4:junit4] Completed on J5 in 0.37s, 1 test
[junit4:junit4] 
[junit4:junit4] 
[junit4:junit4] Tests with failures:
[junit4:junit4]   - org.apache.solr.update.SoftAutoCommitTest.testSoftAndHardCommitMaxTimeDelete
[junit4:junit4]   - org.apache.solr.handler.TestReplicationHandler (suite)
[junit4:junit4] 
[junit4:junit4] 
[junit4:junit4] JVM J0:     1.10 ..   162.18 =   161.08s
[junit4:junit4] JVM J1:     0.87 ..   123.59 =   122.73s
[junit4:junit4] JVM J2:     1.10 ..   151.40 =   150.29s
[junit4:junit4] JVM J3:     0.87 ..   121.79 =   120.92s
[junit4:junit4] JVM J4:     0.87 ..   122.07 =   121.21s
[junit4:junit4] JVM J5:     0.87 ..   193.14 =   192.27s
[junit4:junit4] JVM J6:     1.10 ..   122.68 =   121.57s
[junit4:junit4] JVM J7:     1.10 ..   123.73 =   122.63s
[junit4:junit4] Execution time total: 3 minutes 13 seconds
[junit4:junit4] Tests summary: 233 suites, 965 tests, 1 suite-level error, 1 failure, 7 ignored
(2 assumptions)

BUILD FAILED
<http://sierranevada.servebeer.com/job/fast-io-beasting/ws/build.xml>:39: The following
error occurred while executing this line:
<http://sierranevada.servebeer.com/job/fast-io-beasting/ws/solr/build.xml>:178: The
following error occurred while executing this line:
<http://sierranevada.servebeer.com/job/fast-io-beasting/ws/lucene/module-build.xml>:61:
The following error occurred while executing this line:
<http://sierranevada.servebeer.com/job/fast-io-beasting/ws/lucene/common-build.xml>:1159:
The following error occurred while executing this line:
<http://sierranevada.servebeer.com/job/fast-io-beasting/ws/lucene/common-build.xml>:827:
There were test failures: 233 suites, 965 tests, 1 suite-level error, 1 failure, 7 ignored
(2 assumptions)

Total time: 8 minutes 10 seconds
Build step 'Invoke Ant' marked build as failure

---------------------------------------------------------------------
To unsubscribe, e-mail: dev-unsubscribe@lucene.apache.org
For additional commands, e-mail: dev-help@lucene.apache.org


Mime
View raw message