lucene-dev mailing list archives

Site index · List index
Message view « Date » · « Thread »
Top « Date » · « Thread »
From Policeman Jenkins Server <jenk...@sd-datasolutions.de>
Subject [JENKINS] Lucene-Solr-trunk-Windows (32bit/jdk1.6.0_35) - Build # 1365 - Still Failing!
Date Tue, 30 Oct 2012 07:42:54 GMT
Build: http://jenkins.sd-datasolutions.de/job/Lucene-Solr-trunk-Windows/1365/
Java: 32bit/jdk1.6.0_35 -server -XX:+UseConcMarkSweepGC

2 tests failed.
FAILED:  junit.framework.TestSuite.org.apache.solr.client.solrj.embedded.TestSolrProperties

Error Message:
2 threads leaked from SUITE scope at org.apache.solr.client.solrj.embedded.TestSolrProperties:     1) Thread[id=14, name=metrics-meter-tick-thread-1, state=TIMED_WAITING, group=TGRP-TestSolrProperties]         at sun.misc.Unsafe.park(Native Method)         at java.util.concurrent.locks.LockSupport.parkNanos(LockSupport.java:196)         at java.util.concurrent.locks.AbstractQueuedSynchronizer$ConditionObject.awaitNanos(AbstractQueuedSynchronizer.java:2025)         at java.util.concurrent.DelayQueue.take(DelayQueue.java:164)         at java.util.concurrent.ScheduledThreadPoolExecutor$DelayedWorkQueue.take(ScheduledThreadPoolExecutor.java:609)         at java.util.concurrent.ScheduledThreadPoolExecutor$DelayedWorkQueue.take(ScheduledThreadPoolExecutor.java:602)         at java.util.concurrent.ThreadPoolExecutor.getTask(ThreadPoolExecutor.java:947)         at java.util.concurrent.ThreadPoolExecutor$Worker.run(ThreadPoolExecutor.java:907)         at java.lang.Thread.run(Thread.java:662)    2) Thread[id=15, name=metrics-meter-tick-thread-2, state=TIMED_WAITING, group=TGRP-TestSolrProperties]         at sun.misc.Unsafe.park(Native Method)         at java.util.concurrent.locks.LockSupport.parkNanos(LockSupport.java:196)         at java.util.concurrent.locks.AbstractQueuedSynchronizer$ConditionObject.awaitNanos(AbstractQueuedSynchronizer.java:2025)         at java.util.concurrent.DelayQueue.take(DelayQueue.java:164)         at java.util.concurrent.ScheduledThreadPoolExecutor$DelayedWorkQueue.take(ScheduledThreadPoolExecutor.java:609)         at java.util.concurrent.ScheduledThreadPoolExecutor$DelayedWorkQueue.take(ScheduledThreadPoolExecutor.java:602)         at java.util.concurrent.ThreadPoolExecutor.getTask(ThreadPoolExecutor.java:947)         at java.util.concurrent.ThreadPoolExecutor$Worker.run(ThreadPoolExecutor.java:907)         at java.lang.Thread.run(Thread.java:662)

Stack Trace:
com.carrotsearch.randomizedtesting.ThreadLeakError: 2 threads leaked from SUITE scope at org.apache.solr.client.solrj.embedded.TestSolrProperties: 
   1) Thread[id=14, name=metrics-meter-tick-thread-1, state=TIMED_WAITING, group=TGRP-TestSolrProperties]
        at sun.misc.Unsafe.park(Native Method)
        at java.util.concurrent.locks.LockSupport.parkNanos(LockSupport.java:196)
        at java.util.concurrent.locks.AbstractQueuedSynchronizer$ConditionObject.awaitNanos(AbstractQueuedSynchronizer.java:2025)
        at java.util.concurrent.DelayQueue.take(DelayQueue.java:164)
        at java.util.concurrent.ScheduledThreadPoolExecutor$DelayedWorkQueue.take(ScheduledThreadPoolExecutor.java:609)
        at java.util.concurrent.ScheduledThreadPoolExecutor$DelayedWorkQueue.take(ScheduledThreadPoolExecutor.java:602)
        at java.util.concurrent.ThreadPoolExecutor.getTask(ThreadPoolExecutor.java:947)
        at java.util.concurrent.ThreadPoolExecutor$Worker.run(ThreadPoolExecutor.java:907)
        at java.lang.Thread.run(Thread.java:662)
   2) Thread[id=15, name=metrics-meter-tick-thread-2, state=TIMED_WAITING, group=TGRP-TestSolrProperties]
        at sun.misc.Unsafe.park(Native Method)
        at java.util.concurrent.locks.LockSupport.parkNanos(LockSupport.java:196)
        at java.util.concurrent.locks.AbstractQueuedSynchronizer$ConditionObject.awaitNanos(AbstractQueuedSynchronizer.java:2025)
        at java.util.concurrent.DelayQueue.take(DelayQueue.java:164)
        at java.util.concurrent.ScheduledThreadPoolExecutor$DelayedWorkQueue.take(ScheduledThreadPoolExecutor.java:609)
        at java.util.concurrent.ScheduledThreadPoolExecutor$DelayedWorkQueue.take(ScheduledThreadPoolExecutor.java:602)
        at java.util.concurrent.ThreadPoolExecutor.getTask(ThreadPoolExecutor.java:947)
        at java.util.concurrent.ThreadPoolExecutor$Worker.run(ThreadPoolExecutor.java:907)
        at java.lang.Thread.run(Thread.java:662)
	at __randomizedtesting.SeedInfo.seed([CF0ECA1AF8D51888]:0)


FAILED:  junit.framework.TestSuite.org.apache.solr.client.solrj.embedded.TestSolrProperties

Error Message:
There are still zombie threads that couldn't be terminated:    1) Thread[id=14, name=metrics-meter-tick-thread-1, state=TIMED_WAITING, group=TGRP-TestSolrProperties]         at sun.misc.Unsafe.park(Native Method)         at java.util.concurrent.locks.LockSupport.parkNanos(LockSupport.java:196)         at java.util.concurrent.locks.AbstractQueuedSynchronizer$ConditionObject.awaitNanos(AbstractQueuedSynchronizer.java:2025)         at java.util.concurrent.DelayQueue.take(DelayQueue.java:164)         at java.util.concurrent.ScheduledThreadPoolExecutor$DelayedWorkQueue.take(ScheduledThreadPoolExecutor.java:609)         at java.util.concurrent.ScheduledThreadPoolExecutor$DelayedWorkQueue.take(ScheduledThreadPoolExecutor.java:602)         at java.util.concurrent.ThreadPoolExecutor.getTask(ThreadPoolExecutor.java:947)         at java.util.concurrent.ThreadPoolExecutor$Worker.run(ThreadPoolExecutor.java:907)         at java.lang.Thread.run(Thread.java:662)    2) Thread[id=15, name=metrics-meter-tick-thread-2, state=TIMED_WAITING, group=TGRP-TestSolrProperties]         at sun.misc.Unsafe.park(Native Method)         at java.util.concurrent.locks.LockSupport.parkNanos(LockSupport.java:196)         at java.util.concurrent.locks.AbstractQueuedSynchronizer$ConditionObject.awaitNanos(AbstractQueuedSynchronizer.java:2025)         at java.util.concurrent.DelayQueue.take(DelayQueue.java:164)         at java.util.concurrent.ScheduledThreadPoolExecutor$DelayedWorkQueue.take(ScheduledThreadPoolExecutor.java:609)         at java.util.concurrent.ScheduledThreadPoolExecutor$DelayedWorkQueue.take(ScheduledThreadPoolExecutor.java:602)         at java.util.concurrent.ThreadPoolExecutor.getTask(ThreadPoolExecutor.java:947)         at java.util.concurrent.ThreadPoolExecutor$Worker.run(ThreadPoolExecutor.java:907)         at java.lang.Thread.run(Thread.java:662)

Stack Trace:
com.carrotsearch.randomizedtesting.ThreadLeakError: There are still zombie threads that couldn't be terminated:
   1) Thread[id=14, name=metrics-meter-tick-thread-1, state=TIMED_WAITING, group=TGRP-TestSolrProperties]
        at sun.misc.Unsafe.park(Native Method)
        at java.util.concurrent.locks.LockSupport.parkNanos(LockSupport.java:196)
        at java.util.concurrent.locks.AbstractQueuedSynchronizer$ConditionObject.awaitNanos(AbstractQueuedSynchronizer.java:2025)
        at java.util.concurrent.DelayQueue.take(DelayQueue.java:164)
        at java.util.concurrent.ScheduledThreadPoolExecutor$DelayedWorkQueue.take(ScheduledThreadPoolExecutor.java:609)
        at java.util.concurrent.ScheduledThreadPoolExecutor$DelayedWorkQueue.take(ScheduledThreadPoolExecutor.java:602)
        at java.util.concurrent.ThreadPoolExecutor.getTask(ThreadPoolExecutor.java:947)
        at java.util.concurrent.ThreadPoolExecutor$Worker.run(ThreadPoolExecutor.java:907)
        at java.lang.Thread.run(Thread.java:662)
   2) Thread[id=15, name=metrics-meter-tick-thread-2, state=TIMED_WAITING, group=TGRP-TestSolrProperties]
        at sun.misc.Unsafe.park(Native Method)
        at java.util.concurrent.locks.LockSupport.parkNanos(LockSupport.java:196)
        at java.util.concurrent.locks.AbstractQueuedSynchronizer$ConditionObject.awaitNanos(AbstractQueuedSynchronizer.java:2025)
        at java.util.concurrent.DelayQueue.take(DelayQueue.java:164)
        at java.util.concurrent.ScheduledThreadPoolExecutor$DelayedWorkQueue.take(ScheduledThreadPoolExecutor.java:609)
        at java.util.concurrent.ScheduledThreadPoolExecutor$DelayedWorkQueue.take(ScheduledThreadPoolExecutor.java:602)
        at java.util.concurrent.ThreadPoolExecutor.getTask(ThreadPoolExecutor.java:947)
        at java.util.concurrent.ThreadPoolExecutor$Worker.run(ThreadPoolExecutor.java:907)
        at java.lang.Thread.run(Thread.java:662)
	at __randomizedtesting.SeedInfo.seed([CF0ECA1AF8D51888]:0)




Build Log:
[...truncated 8696 lines...]
[junit4:junit4] Suite: org.apache.solr.client.solrj.embedded.TestSolrProperties
[junit4:junit4]   2> -22 T12 oasc.CoreContainer.<init> New CoreContainer 25257701
[junit4:junit4]   2> 20 T12 oasc.CoreContainer.load Loading CoreContainer using Solr Home: 'C:\Users\JenkinsSlave\workspace\Lucene-Solr-trunk-Windows\solr\solrj\src\test-files\solrj\solr\shared'
[junit4:junit4]   2> 75 T12 oasc.SolrResourceLoader.<init> new SolrResourceLoader for directory: 'C:\Users\JenkinsSlave\workspace\Lucene-Solr-trunk-Windows\solr\solrj\src\test-files\solrj\solr\shared\'
[junit4:junit4]   2> 758 T12 oasc.CoreContainer.load Registering Log Listener
[junit4:junit4]   2> 1079 T12 oasc.CoreContainer.create Creating SolrCore 'collection1' using instanceDir: C:\Users\JenkinsSlave\workspace\Lucene-Solr-trunk-Windows\solr\solrj\src\test-files\solrj\solr\shared\.
[junit4:junit4]   2> 1082 T12 oasc.SolrResourceLoader.<init> new SolrResourceLoader for directory: 'C:\Users\JenkinsSlave\workspace\Lucene-Solr-trunk-Windows\solr\solrj\src\test-files\solrj\solr\shared\.\'
[junit4:junit4]   2> 1203 T12 oasc.SolrConfig.<init> Using Lucene MatchVersion: LUCENE_50
[junit4:junit4]   2> 1514 T12 oasc.SolrConfig.<init> Loaded SolrConfig: solrconfig.xml
[junit4:junit4]   2> 1550 T12 oass.IndexSchema.readSchema Reading Solr Schema
[junit4:junit4]   2> 1567 T12 oass.IndexSchema.readSchema Schema name=example core 
[junit4:junit4]   2> 1844 T12 oass.IndexSchema.readSchema default search field in schema is name
[junit4:junit4]   2> 1847 T12 oass.IndexSchema.readSchema query parser default operator is OR
[junit4:junit4]   2> 1852 T12 oass.IndexSchema.readSchema unique key field: id
[junit4:junit4]   2> 2075 T12 oasc.SolrCore.<init> [collection1] Opening new SolrCore at C:\Users\JenkinsSlave\workspace\Lucene-Solr-trunk-Windows\solr\solrj\src\test-files\solrj\solr\shared\.\, dataDir=C:\Users\JenkinsSlave\workspace\Lucene-Solr-trunk-Windows\solr\build\solr-solrj\test\J0\.\solrtest-TestSolrProperties-1351582929645/data/-1.3\
[junit4:junit4]   2> 2076 T12 oasc.SolrCore.<init> JMX monitoring not detected for core: collection1
[junit4:junit4]   2> 2099 T12 oasc.SolrCore.initDirectoryFactory org.apache.solr.core.MockDirectoryFactory
[junit4:junit4]   2> 2214 T12 oasc.CachingDirectoryFactory.injectLockFactory WARNING No lockType configured for MockDirWrapper(org.apache.lucene.store.RAMDirectory@20c906 lockFactory=org.apache.lucene.store.SingleInstanceLockFactory@6db33c) assuming 'simple'
[junit4:junit4]   2> 2219 T12 oasc.CachingDirectoryFactory.get return new directory for C:\Users\JenkinsSlave\workspace\Lucene-Solr-trunk-Windows\solr\build\solr-solrj\test\J0\.\solrtest-TestSolrProperties-1351582929645\data\-1.3 forceNew:false
[junit4:junit4]   2> 2220 T12 oasc.CachingDirectoryFactory.close Releasing directory:C:\Users\JenkinsSlave\workspace\Lucene-Solr-trunk-Windows\solr\build\solr-solrj\test\J0\.\solrtest-TestSolrProperties-1351582929645\data\-1.3
[junit4:junit4]   2> 2220 T12 oasc.SolrCore.getNewIndexDir New index directory detected: old=null new=C:\Users\JenkinsSlave\workspace\Lucene-Solr-trunk-Windows\solr\build\solr-solrj\test\J0\.\solrtest-TestSolrProperties-1351582929645/data/-1.3\index/
[junit4:junit4]   2> 2223 T12 oasc.SolrCore.initIndex WARNING [collection1] Solr index directory 'C:\Users\JenkinsSlave\workspace\Lucene-Solr-trunk-Windows\solr\build\solr-solrj\test\J0\.\solrtest-TestSolrProperties-1351582929645\data\-1.3\index' doesn't exist. Creating new index...
[junit4:junit4]   2> 2247 T12 oasc.CachingDirectoryFactory.get return new directory for C:\Users\JenkinsSlave\workspace\Lucene-Solr-trunk-Windows\solr\build\solr-solrj\test\J0\.\solrtest-TestSolrProperties-1351582929645\data\-1.3\index forceNew:false
[junit4:junit4]   2> 2601 T12 oasc.SolrDeletionPolicy.onCommit SolrDeletionPolicy.onCommit: commits:num=1
[junit4:junit4]   2> 		commit{dir=MockDirWrapper(org.apache.lucene.store.RAMDirectory@12b3349 lockFactory=org.apache.lucene.store.NativeFSLockFactory@1148603),segFN=segments_1,generation=1,filenames=[segments_1]
[junit4:junit4]   2> 2601 T12 oasc.SolrDeletionPolicy.updateCommits newest commit = 1[segments_1]
[junit4:junit4]   2> 2606 T12 oasc.CachingDirectoryFactory.close Releasing directory:C:\Users\JenkinsSlave\workspace\Lucene-Solr-trunk-Windows\solr\build\solr-solrj\test\J0\.\solrtest-TestSolrProperties-1351582929645\data\-1.3\index
[junit4:junit4]   2> 3492 T12 oasc.RequestHandlers.initHandlersFromConfig created standard: solr.StandardRequestHandler
[junit4:junit4]   2> 3520 T12 oasc.RequestHandlers.initHandlersFromConfig created /update: solr.UpdateRequestHandler
[junit4:junit4]   2> 3525 T12 oasc.RequestHandlers.initHandlersFromConfig created /admin/: org.apache.solr.handler.admin.AdminHandlers
[junit4:junit4]   2> 3620 T12 oashl.XMLLoader.init xsltCacheLifetimeSeconds=60
[junit4:junit4]   2> 3649 T12 oasc.CachingDirectoryFactory.close Releasing directory:C:\Users\JenkinsSlave\workspace\Lucene-Solr-trunk-Windows\solr\build\solr-solrj\test\J0\.\solrtest-TestSolrProperties-1351582929645\data\-1.3
[junit4:junit4]   2> 3700 T12 oass.SolrIndexSearcher.<init> Opening Searcher@21447f main
[junit4:junit4]   2> 3785 T12 oasu.CommitTracker.<init> Hard AutoCommit: disabled
[junit4:junit4]   2> 3786 T12 oasu.CommitTracker.<init> Soft AutoCommit: disabled
[junit4:junit4]   2> 3879 T12 oashc.HttpShardHandlerFactory.getParameter Setting socketTimeout to: 0
[junit4:junit4]   2> 3879 T12 oashc.HttpShardHandlerFactory.getParameter Setting urlScheme to: http://
[junit4:junit4]   2> 3879 T12 oashc.HttpShardHandlerFactory.getParameter Setting connTimeout to: 0
[junit4:junit4]   2> 3880 T12 oashc.HttpShardHandlerFactory.getParameter Setting maxConnectionsPerHost to: 20
[junit4:junit4]   2> 3881 T12 oashc.HttpShardHandlerFactory.getParameter Setting corePoolSize to: 0
[junit4:junit4]   2> 3881 T12 oashc.HttpShardHandlerFactory.getParameter Setting maximumPoolSize to: 2147483647
[junit4:junit4]   2> 3881 T12 oashc.HttpShardHandlerFactory.getParameter Setting maxThreadIdleTime to: 5
[junit4:junit4]   2> 3883 T12 oashc.HttpShardHandlerFactory.getParameter Setting sizeOfQueue to: -1
[junit4:junit4]   2> 3883 T12 oashc.HttpShardHandlerFactory.getParameter Setting fairnessPolicy to: false
[junit4:junit4]   2> 3913 T12 oascsi.HttpClientUtil.createClient Creating new http client, config:maxConnectionsPerHost=20&maxConnections=10000&socketTimeout=0&connTimeout=0&retry=false
[junit4:junit4]   2> 4339 T12 oasc.CoreContainer.register registering core: collection1
[junit4:junit4]   2> 4339 T16 oasc.SolrCore.registerSearcher [collection1] Registered new searcher Searcher@21447f main{StandardDirectoryReader(segments_1:1)}
[junit4:junit4]   2> 4346 T12 oasc.CoreContainer.create Creating SolrCore 'core0' using instanceDir: C:\Users\JenkinsSlave\workspace\Lucene-Solr-trunk-Windows\solr\solrj\src\test-files\solrj\solr\shared\.
[junit4:junit4]   2> 4348 T12 oasc.SolrResourceLoader.<init> new SolrResourceLoader for directory: 'C:\Users\JenkinsSlave\workspace\Lucene-Solr-trunk-Windows\solr\solrj\src\test-files\solrj\solr\shared\.\'
[junit4:junit4]   2> 4445 T12 oasc.SolrConfig.<init> Using Lucene MatchVersion: LUCENE_50
[junit4:junit4]   2> 4553 T12 oasc.SolrConfig.<init> Loaded SolrConfig: solrconfig.xml
[junit4:junit4]   2> 4554 T12 oass.IndexSchema.readSchema Reading Solr Schema
[junit4:junit4]   2> 4564 T12 oass.IndexSchema.readSchema Schema name=example core EN
[junit4:junit4]   2> 4676 T12 oass.IndexSchema.readSchema default search field in schema is name
[junit4:junit4]   2> 4679 T12 oass.IndexSchema.readSchema query parser default operator is OR
[junit4:junit4]   2> 4682 T12 oass.IndexSchema.readSchema unique key field: id
[junit4:junit4]   2> 4688 T12 oasc.SolrCore.<init> [core0] Opening new SolrCore at C:\Users\JenkinsSlave\workspace\Lucene-Solr-trunk-Windows\solr\solrj\src\test-files\solrj\solr\shared\.\, dataDir=C:\Users\JenkinsSlave\workspace\Lucene-Solr-trunk-Windows\solr\build\solr-solrj\test\J0\.\solrtest-TestSolrProperties-1351582929645/data/EN-3.5\
[junit4:junit4]   2> 4688 T12 oasc.SolrCore.<init> JMX monitoring not detected for core: core0
[junit4:junit4]   2> 4688 T12 oasc.SolrCore.initDirectoryFactory org.apache.solr.core.MockDirectoryFactory
[junit4:junit4]   2> 4694 T12 oasc.CachingDirectoryFactory.injectLockFactory WARNING No lockType configured for MockDirWrapper(org.apache.lucene.store.RAMDirectory@15a3a1 lockFactory=org.apache.lucene.store.SingleInstanceLockFactory@a9a32c) assuming 'simple'
[junit4:junit4]   2> 4695 T12 oasc.CachingDirectoryFactory.get return new directory for C:\Users\JenkinsSlave\workspace\Lucene-Solr-trunk-Windows\solr\build\solr-solrj\test\J0\.\solrtest-TestSolrProperties-1351582929645\data\EN-3.5 forceNew:false
[junit4:junit4]   2> 4695 T12 oasc.CachingDirectoryFactory.close Releasing directory:C:\Users\JenkinsSlave\workspace\Lucene-Solr-trunk-Windows\solr\build\solr-solrj\test\J0\.\solrtest-TestSolrProperties-1351582929645\data\EN-3.5
[junit4:junit4]   2> 4695 T12 oasc.SolrCore.getNewIndexDir New index directory detected: old=null new=C:\Users\JenkinsSlave\workspace\Lucene-Solr-trunk-Windows\solr\build\solr-solrj\test\J0\.\solrtest-TestSolrProperties-1351582929645/data/EN-3.5\index/
[junit4:junit4]   2> 4697 T12 oasc.SolrCore.initIndex WARNING [core0] Solr index directory 'C:\Users\JenkinsSlave\workspace\Lucene-Solr-trunk-Windows\solr\build\solr-solrj\test\J0\.\solrtest-TestSolrProperties-1351582929645\data\EN-3.5\index' doesn't exist. Creating new index...
[junit4:junit4]   2> 4697 T12 oasc.CachingDirectoryFactory.get return new directory for C:\Users\JenkinsSlave\workspace\Lucene-Solr-trunk-Windows\solr\build\solr-solrj\test\J0\.\solrtest-TestSolrProperties-1351582929645\data\EN-3.5\index forceNew:false
[junit4:junit4]   2> 4706 T12 oasc.SolrDeletionPolicy.onCommit SolrDeletionPolicy.onCommit: commits:num=1
[junit4:junit4]   2> 		commit{dir=MockDirWrapper(org.apache.lucene.store.RAMDirectory@114d18f lockFactory=org.apache.lucene.store.NativeFSLockFactory@18bbb61),segFN=segments_1,generation=1,filenames=[segments_1]
[junit4:junit4]   2> 4706 T12 oasc.SolrDeletionPolicy.updateCommits newest commit = 1[segments_1]
[junit4:junit4]   2> 4708 T12 oasc.CachingDirectoryFactory.close Releasing directory:C:\Users\JenkinsSlave\workspace\Lucene-Solr-trunk-Windows\solr\build\solr-solrj\test\J0\.\solrtest-TestSolrProperties-1351582929645\data\EN-3.5\index
[junit4:junit4]   2> 4712 T12 oasc.RequestHandlers.initHandlersFromConfig created standard: solr.StandardRequestHandler
[junit4:junit4]   2> 4713 T12 oasc.RequestHandlers.initHandlersFromConfig created /update: solr.UpdateRequestHandler
[junit4:junit4]   2> 4713 T12 oasc.RequestHandlers.initHandlersFromConfig created /admin/: org.apache.solr.handler.admin.AdminHandlers
[junit4:junit4]   2> 4722 T12 oashl.XMLLoader.init xsltCacheLifetimeSeconds=60
[junit4:junit4]   2> 4750 T12 oasc.CachingDirectoryFactory.close Releasing directory:C:\Users\JenkinsSlave\workspace\Lucene-Solr-trunk-Windows\solr\build\solr-solrj\test\J0\.\solrtest-TestSolrProperties-1351582929645\data\EN-3.5
[junit4:junit4]   2> 4750 T12 oass.SolrIndexSearcher.<init> Opening Searcher@300429 main
[junit4:junit4]   2> 4751 T12 oasu.CommitTracker.<init> Hard AutoCommit: disabled
[junit4:junit4]   2> 4751 T12 oasu.CommitTracker.<init> Soft AutoCommit: disabled
[junit4:junit4]   2> 4766 T12 oasc.CoreContainer.register registering core: core0
[junit4:junit4]   2> 4770 T12 oasc.CoreContainer.create Creating SolrCore 'core1' using instanceDir: C:\Users\JenkinsSlave\workspace\Lucene-Solr-trunk-Windows\solr\solrj\src\test-files\solrj\solr\shared\.
[junit4:junit4]   2> 4771 T12 oasc.SolrResourceLoader.<init> new SolrResourceLoader for directory: 'C:\Users\JenkinsSlave\workspace\Lucene-Solr-trunk-Windows\solr\solrj\src\test-files\solrj\solr\shared\.\'
[junit4:junit4]   2> 4780 T17 oasc.SolrCore.registerSearcher [core0] Registered new searcher Searcher@300429 main{StandardDirectoryReader(segments_1:1)}
[junit4:junit4]   2> 4863 T12 oasc.SolrConfig.<init> Using Lucene MatchVersion: LUCENE_50
[junit4:junit4]   2> 4991 T12 oasc.SolrConfig.<init> Loaded SolrConfig: solrconfig.xml
[junit4:junit4]   2> 4992 T12 oass.IndexSchema.readSchema Reading Solr Schema
[junit4:junit4]   2> 5001 T12 oass.IndexSchema.readSchema Schema name=example core FR
[junit4:junit4]   2> 5062 T12 oass.IndexSchema.readSchema default search field in schema is name
[junit4:junit4]   2> 5064 T12 oass.IndexSchema.readSchema query parser default operator is OR
[junit4:junit4]   2> 5065 T12 oass.IndexSchema.readSchema unique key field: id
[junit4:junit4]   2> 5070 T12 oasc.SolrCore.<init> [core1] Opening new SolrCore at C:\Users\JenkinsSlave\workspace\Lucene-Solr-trunk-Windows\solr\solrj\src\test-files\solrj\solr\shared\.\, dataDir=C:\Users\JenkinsSlave\workspace\Lucene-Solr-trunk-Windows\solr\build\solr-solrj\test\J0\.\solrtest-TestSolrProperties-1351582929645/data/FR-2.4\
[junit4:junit4]   2> 5070 T12 oasc.SolrCore.<init> JMX monitoring not detected for core: core1
[junit4:junit4]   2> 5070 T12 oasc.SolrCore.initDirectoryFactory org.apache.solr.core.MockDirectoryFactory
[junit4:junit4]   2> 5071 T12 oasc.CachingDirectoryFactory.injectLockFactory WARNING No lockType configured for MockDirWrapper(org.apache.lucene.store.RAMDirectory@e8f8c5 lockFactory=org.apache.lucene.store.SingleInstanceLockFactory@1248979) assuming 'simple'
[junit4:junit4]   2> 5071 T12 oasc.CachingDirectoryFactory.get return new directory for C:\Users\JenkinsSlave\workspace\Lucene-Solr-trunk-Windows\solr\build\solr-solrj\test\J0\.\solrtest-TestSolrProperties-1351582929645\data\FR-2.4 forceNew:false
[junit4:junit4]   2> 5072 T12 oasc.CachingDirectoryFactory.close Releasing directory:C:\Users\JenkinsSlave\workspace\Lucene-Solr-trunk-Windows\solr\build\solr-solrj\test\J0\.\solrtest-TestSolrProperties-1351582929645\data\FR-2.4
[junit4:junit4]   2> 5072 T12 oasc.SolrCore.getNewIndexDir New index directory detected: old=null new=C:\Users\JenkinsSlave\workspace\Lucene-Solr-trunk-Windows\solr\build\solr-solrj\test\J0\.\solrtest-TestSolrProperties-1351582929645/data/FR-2.4\index/
[junit4:junit4]   2> 5073 T12 oasc.SolrCore.initIndex WARNING [core1] Solr index directory 'C:\Users\JenkinsSlave\workspace\Lucene-Solr-trunk-Windows\solr\build\solr-solrj\test\J0\.\solrtest-TestSolrProperties-1351582929645\data\FR-2.4\index' doesn't exist. Creating new index...
[junit4:junit4]   2> 5074 T12 oasc.CachingDirectoryFactory.get return new directory for C:\Users\JenkinsSlave\workspace\Lucene-Solr-trunk-Windows\solr\build\solr-solrj\test\J0\.\solrtest-TestSolrProperties-1351582929645\data\FR-2.4\index forceNew:false
[junit4:junit4]   2> 5076 T12 oasc.SolrDeletionPolicy.onCommit SolrDeletionPolicy.onCommit: commits:num=1
[junit4:junit4]   2> 		commit{dir=MockDirWrapper(org.apache.lucene.store.RAMDirectory@c9f997 lockFactory=org.apache.lucene.store.NativeFSLockFactory@115512),segFN=segments_1,generation=1,filenames=[segments_1]
[junit4:junit4]   2> 5077 T12 oasc.SolrDeletionPolicy.updateCommits newest commit = 1[segments_1]
[junit4:junit4]   2> 5078 T12 oasc.CachingDirectoryFactory.close Releasing directory:C:\Users\JenkinsSlave\workspace\Lucene-Solr-trunk-Windows\solr\build\solr-solrj\test\J0\.\solrtest-TestSolrProperties-1351582929645\data\FR-2.4\index
[junit4:junit4]   2> 5080 T12 oasc.RequestHandlers.initHandlersFromConfig created standard: solr.StandardRequestHandler
[junit4:junit4]   2> 5081 T12 oasc.RequestHandlers.initHandlersFromConfig created /update: solr.UpdateRequestHandler
[junit4:junit4]   2> 5082 T12 oasc.RequestHandlers.initHandlersFromConfig created /admin/: org.apache.solr.handler.admin.AdminHandlers
[junit4:junit4]   2> 5088 T12 oashl.XMLLoader.init xsltCacheLifetimeSeconds=60
[junit4:junit4]   2> 5095 T12 oasc.CachingDirectoryFactory.close Releasing directory:C:\Users\JenkinsSlave\workspace\Lucene-Solr-trunk-Windows\solr\build\solr-solrj\test\J0\.\solrtest-TestSolrProperties-1351582929645\data\FR-2.4
[junit4:junit4]   2> 5096 T12 oass.SolrIndexSearcher.<init> Opening Searcher@44006e main
[junit4:junit4]   2> 5097 T12 oasu.CommitTracker.<init> Hard AutoCommit: disabled
[junit4:junit4]   2> 5097 T12 oasu.CommitTracker.<init> Soft AutoCommit: disabled
[junit4:junit4]   2> 5107 T12 oasc.CoreContainer.register registering core: core1
[junit4:junit4]   2> 5145 T18 oasc.SolrCore.registerSearcher [core1] Registered new searcher Searcher@44006e main{StandardDirectoryReader(segments_1:1)}
[junit4:junit4]   2> ASYNC  NEW_CORE C0 name=core0 org.apache.solr.core.SolrCore@14ce5eb
[junit4:junit4]   2> 5577 T12 C0 oasu.DirectUpdateHandler2.deleteAll [core0] REMOVING ALL DOCUMENTS FROM INDEX
[junit4:junit4]   2> 5581 T12 C0 oasc.CachingDirectoryFactory.close Releasing directory:C:\Users\JenkinsSlave\workspace\Lucene-Solr-trunk-Windows\solr\build\solr-solrj\test\J0\.\solrtest-TestSolrProperties-1351582929645\data\EN-3.5
[junit4:junit4]   2> 5587 T12 C0 oasc.SolrDeletionPolicy.onInit SolrDeletionPolicy.onInit: commits:num=1
[junit4:junit4]   2> 		commit{dir=MockDirWrapper(org.apache.lucene.store.RAMDirectory@114d18f lockFactory=org.apache.lucene.store.NativeFSLockFactory@18bbb61),segFN=segments_1,generation=1,filenames=[segments_1]
[junit4:junit4]   2> 5588 T12 C0 oasc.SolrDeletionPolicy.updateCommits newest commit = 1[segments_1]
[junit4:junit4]   2> 5596 T12 C0 oasu.DirectUpdateHandler2.commit start commit{flags=0,_version_=0,optimize=false,openSearcher=true,waitSearcher=true,expungeDeletes=false,softCommit=false}
[junit4:junit4]   2> 5597 T12 C0 oasc.SolrDeletionPolicy.onCommit SolrDeletionPolicy.onCommit: commits:num=2
[junit4:junit4]   2> 		commit{dir=MockDirWrapper(org.apache.lucene.store.RAMDirectory@114d18f lockFactory=org.apache.lucene.store.NativeFSLockFactory@18bbb61),segFN=segments_1,generation=1,filenames=[segments_1]
[junit4:junit4]   2> 		commit{dir=MockDirWrapper(org.apache.lucene.store.RAMDirectory@114d18f lockFactory=org.apache.lucene.store.NativeFSLockFactory@18bbb61),segFN=segments_2,generation=2,filenames=[segments_2]
[junit4:junit4]   2> 5597 T12 C0 oasc.SolrDeletionPolicy.updateCommits newest commit = 2[segments_2]
[junit4:junit4]   2> 5599 T12 C0 oasc.CachingDirectoryFactory.close Releasing directory:C:\Users\JenkinsSlave\workspace\Lucene-Solr-trunk-Windows\solr\build\solr-solrj\test\J0\.\solrtest-TestSolrProperties-1351582929645\data\EN-3.5
[junit4:junit4]   2> 5604 T12 C0 oass.SolrIndexSearcher.<init> Opening Searcher@24bfaa main
[junit4:junit4]   2> 5609 T12 C0 oasu.DirectUpdateHandler2.commit end_commit_flush
[junit4:junit4]   2> 5614 T17 oasc.SolrCore.registerSearcher [core0] Registered new searcher Searcher@24bfaa main{StandardDirectoryReader(segments_2:2)}
[junit4:junit4]   2> 5615 T17 oasc.CachingDirectoryFactory.close Releasing directory:C:\Users\JenkinsSlave\workspace\Lucene-Solr-trunk-Windows\solr\build\solr-solrj\test\J0\.\solrtest-TestSolrProperties-1351582929645\data\EN-3.5\index
[junit4:junit4]   2> 5616 T12 C0 UPDATE [core0] webapp=null path=/update params={commit=true&softCommit=false&waitSearcher=true} {deleteByQuery=*:*,commit=} 0 417
[junit4:junit4]   2> ASYNC  NEW_CORE C1 name=core1 org.apache.solr.core.SolrCore@1a9883d
[junit4:junit4]   2> 5657 T12 C1 oasu.DirectUpdateHandler2.deleteAll [core1] REMOVING ALL DOCUMENTS FROM INDEX
[junit4:junit4]   2> 5658 T12 C1 oasc.CachingDirectoryFactory.close Releasing directory:C:\Users\JenkinsSlave\workspace\Lucene-Solr-trunk-Windows\solr\build\solr-solrj\test\J0\.\solrtest-TestSolrProperties-1351582929645\data\FR-2.4
[junit4:junit4]   2> 5663 T12 C1 oasc.SolrDeletionPolicy.onInit SolrDeletionPolicy.onInit: commits:num=1
[junit4:junit4]   2> 		commit{dir=MockDirWrapper(org.apache.lucene.store.RAMDirectory@c9f997 lockFactory=org.apache.lucene.store.NativeFSLockFactory@115512),segFN=segments_1,generation=1,filenames=[segments_1]
[junit4:junit4]   2> 5663 T12 C1 oasc.SolrDeletionPolicy.updateCommits newest commit = 1[segments_1]
[junit4:junit4]   2> 5664 T12 C1 oasu.DirectUpdateHandler2.commit start commit{flags=0,_version_=0,optimize=false,openSearcher=true,waitSearcher=true,expungeDeletes=false,softCommit=false}
[junit4:junit4]   2> 5665 T12 C1 oasc.SolrDeletionPolicy.onCommit SolrDeletionPolicy.onCommit: commits:num=2
[junit4:junit4]   2> 		commit{dir=MockDirWrapper(org.apache.lucene.store.RAMDirectory@c9f997 lockFactory=org.apache.lucene.store.NativeFSLockFactory@115512),segFN=segments_1,generation=1,filenames=[segments_1]
[junit4:junit4]   2> 		commit{dir=MockDirWrapper(org.apache.lucene.store.RAMDirectory@c9f997 lockFactory=org.apache.lucene.store.NativeFSLockFactory@115512),segFN=segments_2,generation=2,filenames=[segments_2]
[junit4:junit4]   2> 5666 T12 C1 oasc.SolrDeletionPolicy.updateCommits newest commit = 2[segments_2]
[junit4:junit4]   2> 5666 T12 C1 oasc.CachingDirectoryFactory.close Releasing directory:C:\Users\JenkinsSlave\workspace\Lucene-Solr-trunk-Windows\solr\build\solr-solrj\test\J0\.\solrtest-TestSolrProperties-1351582929645\data\FR-2.4
[junit4:junit4]   2> 5667 T12 C1 oass.SolrIndexSearcher.<init> Opening Searcher@19977bd main
[junit4:junit4]   2> 5668 T12 C1 oasu.DirectUpdateHandler2.commit end_commit_flush
[junit4:junit4]   2> 5668 T18 oasc.SolrCore.registerSearcher [core1] Registered new searcher Searcher@19977bd main{StandardDirectoryReader(segments_2:2)}
[junit4:junit4]   2> 5669 T18 oasc.CachingDirectoryFactory.close Releasing directory:C:\Users\JenkinsSlave\workspace\Lucene-Solr-trunk-Windows\solr\build\solr-solrj\test\J0\.\solrtest-TestSolrProperties-1351582929645\data\FR-2.4\index
[junit4:junit4]   2> 5669 T12 C1 UPDATE [core1] webapp=null path=/update params={commit=true&softCommit=false&waitSearcher=true} {deleteByQuery=*:*,commit=} 0 12
[junit4:junit4]   2> 6092 T12 C0 oasu.DirectUpdateHandler2.commit start commit{flags=0,_version_=0,optimize=false,openSearcher=true,waitSearcher=true,expungeDeletes=false,softCommit=false}
[junit4:junit4]   2> 6382 T12 C0 oasc.SolrDeletionPolicy.onCommit SolrDeletionPolicy.onCommit: commits:num=2
[junit4:junit4]   2> 		commit{dir=MockDirWrapper(org.apache.lucene.store.RAMDirectory@114d18f lockFactory=org.apache.lucene.store.NativeFSLockFactory@18bbb61),segFN=segments_2,generation=2,filenames=[segments_2]
[junit4:junit4]   2> 		commit{dir=MockDirWrapper(org.apache.lucene.store.RAMDirectory@114d18f lockFactory=org.apache.lucene.store.NativeFSLockFactory@18bbb61),segFN=segments_3,generation=3,filenames=[_0.fnm, _0_Lucene41_0.doc, _0_Lucene41_0.pos, _0_nrm.cfe, _0.fdx, _0_nrm.cfs, _0.si, _0_Lucene41_0.tim, _0.fdt, _0_Lucene41_0.tip, segments_3]
[junit4:junit4]   2> 6384 T12 C0 oasc.SolrDeletionPolicy.updateCommits newest commit = 3[_0.fnm, _0_Lucene41_0.doc, _0_Lucene41_0.pos, _0_nrm.cfe, _0.fdx, _0_nrm.cfs, _0.si, _0_Lucene41_0.tim, _0.fdt, _0_Lucene41_0.tip, segments_3]
[junit4:junit4]   2> 6385 T12 C0 oasc.CachingDirectoryFactory.close Releasing directory:C:\Users\JenkinsSlave\workspace\Lucene-Solr-trunk-Windows\solr\build\solr-solrj\test\J0\.\solrtest-TestSolrProperties-1351582929645\data\EN-3.5
[junit4:junit4]   2> 6525 T12 C0 oass.SolrIndexSearcher.<init> Opening Searcher@1057305 main
[junit4:junit4]   2> 6526 T12 C0 oasu.DirectUpdateHandler2.commit end_commit_flush
[junit4:junit4]   2> 6526 T17 oasc.SolrCore.registerSearcher [core0] Registered new searcher Searcher@1057305 main{StandardDirectoryReader(segments_3:4 _0(5.0):C1)}
[junit4:junit4]   2> 6529 T17 oasc.CachingDirectoryFactory.close Releasing directory:C:\Users\JenkinsSlave\workspace\Lucene-Solr-trunk-Windows\solr\build\solr-solrj\test\J0\.\solrtest-TestSolrProperties-1351582929645\data\EN-3.5\index
[junit4:junit4]   2> 6529 T12 C0 UPDATE [core0] webapp=null path=/update params={commit=true&softCommit=false&waitSearcher=true} {add=[AAA],commit=} 0 851
[junit4:junit4]   2> 6533 T12 C1 UPDATE [core1] webapp=null path=/update params={commit=true&softCommit=false&waitSearcher=true} {} 0 4
[junit4:junit4]   2> 6534 T12 C1 oasc.SolrException.log Ignoring exception matching unknown field
[junit4:junit4]   2> 6536 T12 C1 oasu.DirectUpdateHandler2.commit start commit{flags=0,_version_=0,optimize=false,openSearcher=true,waitSearcher=true,expungeDeletes=false,softCommit=false}
[junit4:junit4]   2> 6542 T12 C1 oasc.SolrDeletionPolicy.onCommit SolrDeletionPolicy.onCommit: commits:num=2
[junit4:junit4]   2> 		commit{dir=MockDirWrapper(org.apache.lucene.store.RAMDirectory@c9f997 lockFactory=org.apache.lucene.store.NativeFSLockFactory@115512),segFN=segments_2,generation=2,filenames=[segments_2]
[junit4:junit4]   2> 		commit{dir=MockDirWrapper(org.apache.lucene.store.RAMDirectory@c9f997 lockFactory=org.apache.lucene.store.NativeFSLockFactory@115512),segFN=segments_3,generation=3,filenames=[_0.fnm, _0_Lucene41_0.doc, _0_Lucene41_0.pos, _0_nrm.cfe, _0_1.del, _0.fdx, _0_nrm.cfs, _0.si, _0_Lucene41_0.tim, _0.fdt, _0_Lucene41_0.tip, segments_3]
[junit4:junit4]   2> 6543 T12 C1 oasc.SolrDeletionPolicy.updateCommits newest commit = 3[_0.fnm, _0_Lucene41_0.doc, _0_Lucene41_0.pos, _0_nrm.cfe, _0_1.del, _0.fdx, _0_nrm.cfs, _0.si, _0_Lucene41_0.tim, _0.fdt, _0_Lucene41_0.tip, segments_3]
[junit4:junit4]   2> 6543 T12 C1 oasc.CachingDirectoryFactory.close Releasing directory:C:\Users\JenkinsSlave\workspace\Lucene-Solr-trunk-Windows\solr\build\solr-solrj\test\J0\.\solrtest-TestSolrProperties-1351582929645\data\FR-2.4
[junit4:junit4]   2> 6545 T12 C1 oass.SolrIndexSearcher.<init> Opening Searcher@9e75f6 main
[junit4:junit4]   2> 6546 T12 C1 oasu.DirectUpdateHandler2.commit end_commit_flush
[junit4:junit4]   2> 6546 T18 oasc.SolrCore.registerSearcher [core1] Registered new searcher Searcher@9e75f6 main{StandardDirectoryReader(segments_3:4 _0(5.0):C2/1)}
[junit4:junit4]   2> 6547 T18 oasc.CachingDirectoryFactory.close Releasing directory:C:\Users\JenkinsSlave\workspace\Lucene-Solr-trunk-Windows\solr\build\solr-solrj\test\J0\.\solrtest-TestSolrProperties-1351582929645\data\FR-2.4\index
[junit4:junit4]   2> 6548 T12 C1 UPDATE [core1] webapp=null path=/update params={commit=true&softCommit=false&waitSearcher=true} {add=[BBB, BBB],commit=} 0 14
[junit4:junit4]   2> 6548 T12 C0 UPDATE [core0] webapp=null path=/update params={commit=true&softCommit=false&waitSearcher=true} {} 0 0
[junit4:junit4]   2> 6549 T12 C0 oasc.SolrException.log Ignoring exception matching unknown field
[junit4:junit4]   2> 6693 T12 C0 REQ [core0] webapp=null path=/select params={q=id%3AAAA} hits=1 status=0 QTime=133 
[junit4:junit4]   2> 6720 T12 C1 REQ [core1] webapp=null path=/select params={q=id%3AAAA} hits=0 status=0 QTime=2 
[junit4:junit4]   2> 6720 T12 C0 REQ [core0] webapp=null path=/select params={q=id%3AAAA} hits=1 status=0 QTime=0 
[junit4:junit4]   2> 6722 T12 C0 REQ [core0] webapp=null path=/select params={q=id%3ABBB} hits=0 status=0 QTime=0 
[junit4:junit4]   2> 6723 T12 C1 REQ [core1] webapp=null path=/select params={q=id%3AAAA} hits=0 status=0 QTime=0 
[junit4:junit4]   2> 6723 T12 C1 REQ [core1] webapp=null path=/select params={q=id%3ABBB} hits=1 status=0 QTime=0 
[junit4:junit4]   2> 6737 T12 C0 oasc.CachingDirectoryFactory.close Releasing directory:C:\Users\JenkinsSlave\workspace\Lucene-Solr-trunk-Windows\solr\build\solr-solrj\test\J0\.\solrtest-TestSolrProperties-1351582929645\data\EN-3.5\index
[junit4:junit4]   2> 6744 T12 C0 REQ [core0] webapp=null path=/admin/cores params={action=STATUS&core=core0} status=0 QTime=14 
[junit4:junit4]   2> 6745 T12 C0 oasc.CoreContainer.reload Reloading SolrCore 'core0' using instanceDir: C:\Users\JenkinsSlave\workspace\Lucene-Solr-trunk-Windows\solr\solrj\src\test-files\solrj\solr\shared\.
[junit4:junit4]   2> 6747 T12 C0 oasc.SolrResourceLoader.<init> new SolrResourceLoader for directory: 'C:\Users\JenkinsSlave\workspace\Lucene-Solr-trunk-Windows\solr\solrj\src\test-files\solrj\solr\shared\.\'
[junit4:junit4]   2> 6820 T12 C0 oasc.SolrConfig.<init> Using Lucene MatchVersion: LUCENE_50
[junit4:junit4]   2> 6928 T12 C0 oasc.SolrConfig.<init> Loaded SolrConfig: solrconfig.xml
[junit4:junit4]   2> 6929 T12 C0 oass.IndexSchema.readSchema Reading Solr Schema
[junit4:junit4]   2> 6937 T12 C0 oass.IndexSchema.readSchema Schema name=example core EN
[junit4:junit4]   2> 7000 T12 C0 oass.IndexSchema.readSchema default search field in schema is name
[junit4:junit4]   2> 7001 T12 C0 oass.IndexSchema.readSchema query parser default operator is OR
[junit4:junit4]   2> 7004 T12 C0 oass.IndexSchema.readSchema unique key field: id
[junit4:junit4]   2> 7008 T12 C0 oasc.SolrCore.<init> [core0] Opening new SolrCore at C:\Users\JenkinsSlave\workspace\Lucene-Solr-trunk-Windows\solr\solrj\src\test-files\solrj\solr\shared\.\, dataDir=C:\Users\JenkinsSlave\workspace\Lucene-Solr-trunk-Windows\solr\build\solr-solrj\test\J0\.\solrtest-TestSolrProperties-1351582929645/data/EN-3.5\
[junit4:junit4]   2> 7008 T12 C0 oasc.SolrCore.<init> JMX monitoring not detected for core: core0
[junit4:junit4]   2> 7008 T12 C0 oasc.CachingDirectoryFactory.close Releasing directory:C:\Users\JenkinsSlave\workspace\Lucene-Solr-trunk-Windows\solr\build\solr-solrj\test\J0\.\solrtest-TestSolrProperties-1351582929645\data\EN-3.5
[junit4:junit4]   2> 7010 T12 C0 oasc.SolrCore.getNewIndexDir New index directory detected: old=null new=C:\Users\JenkinsSlave\workspace\Lucene-Solr-trunk-Windows\solr\build\solr-solrj\test\J0\.\solrtest-TestSolrProperties-1351582929645/data/EN-3.5\index/
[junit4:junit4]   2> 7013 T12 C0 oasc.RequestHandlers.initHandlersFromConfig created standard: solr.StandardRequestHandler
[junit4:junit4]   2> 7015 T12 C0 oasc.RequestHandlers.initHandlersFromConfig created /update: solr.UpdateRequestHandler
[junit4:junit4]   2> 7015 T12 C0 oasc.RequestHandlers.initHandlersFromConfig created /admin/: org.apache.solr.handler.admin.AdminHandlers
[junit4:junit4]   2> 7020 T12 C0 oashl.XMLLoader.init xsltCacheLifetimeSeconds=60
[junit4:junit4]   2> 7064 T12 C0 oasc.CachingDirectoryFactory.close Releasing directory:C:\Users\JenkinsSlave\workspace\Lucene-Solr-trunk-Windows\solr\build\solr-solrj\test\J0\.\solrtest-TestSolrProperties-1351582929645\data\EN-3.5
[junit4:junit4]   2> 7070 T12 C0 oass.SolrIndexSearcher.<init> Opening Searcher@5da37c main
[junit4:junit4]   2> 7071 T12 C0 oasu.CommitTracker.<init> Hard AutoCommit: disabled
[junit4:junit4]   2> 7073 T12 C0 oasu.CommitTracker.<init> Soft AutoCommit: disabled
[junit4:junit4]   2> 7081 T12 C0 oasc.CoreContainer.register replacing core: core0
[junit4:junit4]   2> 7081 T12 C0 REQ [core0] webapp=null path=/admin/cores params={action=RELOAD&core=core0} status=0 QTime=336 
[junit4:junit4]   2> 7083 T12 C0 oasc.SolrCore.close [core0]  CLOSING SolrCore org.apache.solr.core.SolrCore@14ce5eb
[junit4:junit4]   2> 7083 T12 C0 oasu.DirectUpdateHandler2.close closing DirectUpdateHandler2{commits=2,autocommits=0,soft autocommits=0,optimizes=0,rollbacks=0,expungeDeletes=0,docsPending=0,adds=1,deletesById=0,deletesByQuery=0,errors=1,cumulative_adds=2,cumulative_deletesById=0,cumulative_deletesByQuery=1,cumulative_errors=1}
[junit4:junit4]   2> 7085 T19 oasc.SolrCore.registerSearcher [core0] Registered new searcher Searcher@5da37c main{StandardDirectoryReader(segments_3:4:nrt _0(5.0):C1)}
[junit4:junit4]   2> 7087 T12 C0 oasc.SolrCore.closeSearcher [core0] Closing main searcher on request.
[junit4:junit4]   2> 7088 T12 C0 oasc.CachingDirectoryFactory.close Releasing directory:C:\Users\JenkinsSlave\workspace\Lucene-Solr-trunk-Windows\solr\build\solr-solrj\test\J0\.\solrtest-TestSolrProperties-1351582929645\data\EN-3.5\index
[junit4:junit4]   2> ASYNC  NEW_CORE C2 name=core0 org.apache.solr.core.SolrCore@6c2a78
[junit4:junit4]   2> 7089 T12 C2 oasc.CachingDirectoryFactory.close Releasing directory:C:\Users\JenkinsSlave\workspace\Lucene-Solr-trunk-Windows\solr\build\solr-solrj\test\J0\.\solrtest-TestSolrProperties-1351582929645\data\EN-3.5\index
[junit4:junit4]   2> 7089 T12 C2 REQ [core0] webapp=null path=/admin/cores params={action=STATUS&core=core0} status=0 QTime=0 
[junit4:junit4]   2> 7094 T12 C2 oasc.CoreContainer.persistFile Persisting cores config to .\solrtest-TestSolrProperties-1351582929645\solr-persist.xml
[junit4:junit4]   2> 7123 T12 C2 oasc.SolrXMLSerializer.persistFile Persisting cores config to .\solrtest-TestSolrProperties-1351582929645\solr-persist.xml
[junit4:junit4]   2> 7126 T12 C2 REQ [core0] webapp=null path=/admin/cores params={action=PERSIST&file=solr-persist.xml} status=0 QTime=32 
[junit4:junit4]   2> 7148 T12 C2 oasc.CoreContainer.register registering core: renamed_core
[junit4:junit4]   2> 7149 T12 C2 oasc.CoreContainer.persistFile Persisting cores config to .\solrtest-TestSolrProperties-1351582929645\solr.xml
[junit4:junit4]   2> 7209 T12 C2 oasc.SolrXMLSerializer.persistFile Persisting cores config to .\solrtest-TestSolrProperties-1351582929645\solr.xml
[junit4:junit4]   2> 7213 T12 C2 REQ [renamed_core] webapp=null path=/admin/cores params={action=RENAME&core=core0&other=renamed_core} status=0 QTime=65 
[junit4:junit4]   2> 7214 T12 C2 oasc.CoreContainer.persistFile Persisting cores config to .\solrtest-TestSolrProperties-1351582929645\solr-persist.xml
[junit4:junit4]   2> 7240 T12 C2 oasc.SolrXMLSerializer.persistFile Persisting cores config to .\solrtest-TestSolrProperties-1351582929645\solr-persist.xml
[junit4:junit4]   2> 7246 T12 C2 REQ [renamed_core] webapp=null path=/admin/cores params={action=PERSIST&file=solr-persist.xml} status=0 QTime=32 
[junit4:junit4]   2> 7262 T12 C2 oasc.CoreContainer.create Creating SolrCore 'newCore' using instanceDir: C:\Users\JenkinsSlave\workspace\Lucene-Solr-trunk-Windows\solr\solrj\src\test-files\solrj\solr\shared
[junit4:junit4]   2> 7263 T12 C2 oasc.SolrResourceLoader.<init> new SolrResourceLoader for directory: 'C:\Users\JenkinsSlave\workspace\Lucene-Solr-trunk-Windows\solr\solrj\src\test-files\solrj\solr\shared\'
[junit4:junit4]   2> 7378 T12 C2 oasc.SolrConfig.<init> Using Lucene MatchVersion: LUCENE_50
[junit4:junit4]   2> 7456 T12 C2 oasc.SolrConfig.<init> Loaded SolrConfig: solrconfig.xml
[junit4:junit4]   2> 7457 T12 C2 oass.IndexSchema.readSchema Reading Solr Schema
[junit4:junit4]   2> 7466 T12 C2 oass.IndexSchema.readSchema Schema name=example core 
[junit4:junit4]   2> 7553 T12 C2 oass.IndexSchema.readSchema default search field in schema is name
[junit4:junit4]   2> 7556 T12 C2 oass.IndexSchema.readSchema query parser default operator is OR
[junit4:junit4]   2> 7558 T12 C2 oass.IndexSchema.readSchema unique key field: id
[junit4:junit4]   2> 7573 T12 C2 oasc.SolrCore.<init> [newCore] Opening new SolrCore at C:\Users\JenkinsSlave\workspace\Lucene-Solr-trunk-Windows\solr\solrj\src\test-files\solrj\solr\shared\, dataDir=C:\Users\JenkinsSlave\workspace\Lucene-Solr-trunk-Windows\solr\build\solr-solrj\test\J0\.\solrtest-TestSolrProperties-1351582929645/data/-1.3\
[junit4:junit4]   2> 7573 T12 C2 oasc.SolrCore.<init> JMX monitoring not detected for core: newCore
[junit4:junit4]   2> 7575 T12 C2 oasc.SolrCore.initDirectoryFactory org.apache.solr.core.MockDirectoryFactory
[junit4:junit4]   2> 7575 T12 C2 oasc.CachingDirectoryFactory.injectLockFactory WARNING No lockType configured for MockDirWrapper(org.apache.lucene.store.RAMDirectory@102ae84 lockFactory=org.apache.lucene.store.SingleInstanceLockFactory@10f8ee4) assuming 'simple'
[junit4:junit4]   2> 7576 T12 C2 oasc.CachingDirectoryFactory.get return new directory for C:\Users\JenkinsSlave\workspace\Lucene-Solr-trunk-Windows\solr\build\solr-solrj\test\J0\.\solrtest-TestSolrProperties-1351582929645\data\-1.3 forceNew:false
[junit4:junit4]   2> 7576 T12 C2 oasc.CachingDirectoryFactory.close Releasing directory:C:\Users\JenkinsSlave\workspace\Lucene-Solr-trunk-Windows\solr\build\solr-solrj\test\J0\.\solrtest-TestSolrProperties-1351582929645\data\-1.3
[junit4:junit4]   2> 7576 T12 C2 oasc.SolrCore.getNewIndexDir New index directory detected: old=null new=C:\Users\JenkinsSlave\workspace\Lucene-Solr-trunk-Windows\solr\build\solr-solrj\test\J0\.\solrtest-TestSolrProperties-1351582929645/data/-1.3\index/
[junit4:junit4]   2> 7578 T12 C2 oasc.SolrCore.initIndex WARNING [newCore] Solr index directory 'C:\Users\JenkinsSlave\workspace\Lucene-Solr-trunk-Windows\solr\build\solr-solrj\test\J0\.\solrtest-TestSolrProperties-1351582929645\data\-1.3\index' doesn't exist. Creating new index...
[junit4:junit4]   2> 7578 T12 C2 oasc.CachingDirectoryFactory.get return new directory for C:\Users\JenkinsSlave\workspace\Lucene-Solr-trunk-Windows\solr\build\solr-solrj\test\J0\.\solrtest-TestSolrProperties-1351582929645\data\-1.3\index forceNew:false
[junit4:junit4]   2> 7583 T12 C2 oasc.SolrDeletionPolicy.onCommit SolrDeletionPolicy.onCommit: commits:num=1
[junit4:junit4]   2> 		commit{dir=MockDirWrapper(org.apache.lucene.store.RAMDirectory@15c13ef lockFactory=org.apache.lucene.store.NativeFSLockFactory@17aa2a8),segFN=segments_1,generation=1,filenames=[segments_1]
[junit4:junit4]   2> 7583 T12 C2 oasc.SolrDeletionPolicy.updateCommits newest commit = 1[segments_1]
[junit4:junit4]   2> 7584 T12 C2 oasc.CachingDirectoryFactory.close Releasing directory:C:\Users\JenkinsSlave\workspace\Lucene-Solr-trunk-Windows\solr\build\solr-solrj\test\J0\.\solrtest-TestSolrProperties-1351582929645\data\-1.3\index
[junit4:junit4]   2> 7585 T12 C2 oasc.RequestHandlers.initHandlersFromConfig created standard: solr.StandardRequestHandler
[junit4:junit4]   2> 7589 T12 C2 oasc.RequestHandlers.initHandlersFromConfig created /update: solr.UpdateRequestHandler
[junit4:junit4]   2> 7590 T12 C2 oasc.RequestHandlers.initHandlersFromConfig created /admin/: org.apache.solr.handler.admin.AdminHandlers
[junit4:junit4]   2> 7596 T12 C2 oashl.XMLLoader.init xsltCacheLifetimeSeconds=60
[junit4:junit4]   2> 7605 T12 C2 oasc.CachingDirectoryFactory.close Releasing directory:C:\Users\JenkinsSlave\workspace\Lucene-Solr-trunk-Windows\solr\build\solr-solrj\test\J0\.\solrtest-TestSolrProperties-1351582929645\data\-1.3
[junit4:junit4]   2> 7606 T12 C2 oass.SolrIndexSearcher.<init> Opening Searcher@7b21ea main
[junit4:junit4]   2> 7606 T12 C2 oasu.CommitTracker.<init> Hard AutoCommit: disabled
[junit4:junit4]   2> 7607 T12 C2 oasu.CommitTracker.<init> Soft AutoCommit: disabled
[junit4:junit4]   2> 7620 T12 C2 oasc.CoreContainer.register registering core: newCore
[junit4:junit4]   2> 7620 T12 C2 oasc.CoreContainer.persistFile Persisting cores config to .\solrtest-TestSolrProperties-1351582929645\solr.xml
[junit4:junit4]   2> 7640 T12 C2 oasc.SolrXMLSerializer.persistFile Persisting cores config to .\solrtest-TestSolrProperties-1351582929645\solr.xml
[junit4:junit4]   2> 7646 T20 oasc.SolrCore.registerSearcher [newCore] Registered new searcher Searcher@7b21ea main{StandardDirectoryReader(segments_1:1)}
[junit4:junit4]   2> 7647 T12 C2 REQ [renamed_core] webapp=null path=/admin/cores params={action=CREATE&name=newCore&instanceDir=C%3A%5CUsers%5CJenkinsSlave%5Cworkspace%5CLucene-Solr-trunk-Windows%5Csolr%5Csolrj%5Csrc%5Ctest-files%5Csolrj%5Csolr%5Cshared} status=0 QTime=386 
[junit4:junit4]   2> 7648 T12 C2 oasc.CoreContainer.persistFile Persisting cores config to .\solrtest-TestSolrProperties-1351582929645\solr-persist.xml
[junit4:junit4]   2> 7669 T12 C2 oasc.SolrXMLSerializer.persistFile Persisting cores config to .\solrtest-TestSolrProperties-1351582929645\solr-persist.xml
[junit4:junit4]   2> 7676 T12 C2 REQ [renamed_core] webapp=null path=/admin/cores params={action=PERSIST&file=solr-persist.xml} status=0 QTime=28 
[junit4:junit4]   2> 7685 T12 oasc.CoreContainer.shutdown Shutting down CoreContainer instance=25257701
[junit4:junit4]   2> 7685 T12 oasc.SolrCore.close [collection1]  CLOSING SolrCore org.apache.solr.core.SolrCore@9319d9
[junit4:junit4]   2> 7686 T12 oasu.DirectUpdateHandler2.close closing DirectUpdateHandler2{commits=0,autocommits=0,soft autocommits=0,optimizes=0,rollbacks=0,expungeDeletes=0,docsPending=0,adds=0,deletesById=0,deletesByQuery=0,errors=0,cumulative_adds=0,cumulative_deletesById=0,cumulative_deletesByQuery=0,cumulative_errors=0}
[junit4:junit4]   2> 7686 T12 oasc.SolrCore.decrefSolrCoreState Closing SolrCoreState
[junit4:junit4]   2> 7688 T12 oasu.DefaultSolrCoreState.closeIndexWriter SolrCoreState ref count has reached 0 - closing IndexWriter
[junit4:junit4]   2> 7688 T12 oasu.DefaultSolrCoreState.closeIndexWriter closing IndexWriter with IndexWriterCloser
[junit4:junit4]   2> 7689 T12 oasc.SolrCore.closeSearcher [collection1] Closing main searcher on request.
[junit4:junit4]   2> 7689 T12 oasc.CachingDirectoryFactory.close Releasing directory:C:\Users\JenkinsSlave\workspace\Lucene-Solr-trunk-Windows\solr\build\solr-solrj\test\J0\.\solrtest-TestSolrProperties-1351582929645\data\-1.3\index
[junit4:junit4]   2> 7690 T12 oasc.SolrCore.close [core1]  CLOSING SolrCore org.apache.solr.core.SolrCore@1a9883d
[junit4:junit4]   2> 7690 T12 oasu.DirectUpdateHandler2.close closing DirectUpdateHandler2{commits=2,autocommits=0,soft autocommits=0,optimizes=0,rollbacks=0,expungeDeletes=0,docsPending=0,adds=0,deletesById=0,deletesByQuery=0,errors=1,cumulative_adds=3,cumulative_deletesById=0,cumulative_deletesByQuery=1,cumulative_errors=1}
[junit4:junit4]   2> 7690 T12 oasc.SolrCore.decrefSolrCoreState Closing SolrCoreState
[junit4:junit4]   2> 7691 T12 oasu.DefaultSolrCoreState.closeIndexWriter SolrCoreState ref count has reached 0 - closing IndexWriter
[junit4:junit4]   2> 7691 T12 oasu.DefaultSolrCoreState.closeIndexWriter closing IndexWriter with IndexWriterCloser
[junit4:junit4]   2> 7693 T12 C1 oasc.CachingDirectoryFactory.close Releasing directory:C:\Users\JenkinsSlave\workspace\Lucene-Solr-trunk-Windows\solr\build\solr-solrj\test\J0\.\solrtest-TestSolrProperties-1351582929645\data\FR-2.4\index
[junit4:junit4]   2> 7694 T12 oasc.SolrCore.closeSearcher [core1] Closing main searcher on request.
[junit4:junit4]   2> 7694 T12 oasc.CachingDirectoryFactory.close Releasing directory:C:\Users\JenkinsSlave\workspace\Lucene-Solr-trunk-Windows\solr\build\solr-solrj\test\J0\.\solrtest-TestSolrProperties-1351582929645\data\FR-2.4\index
[junit4:junit4]   2> 7694 T12 oasc.SolrCore.close [renamed_core]  CLOSING SolrCore org.apache.solr.core.SolrCore@6c2a78
[junit4:junit4]   2> 7695 T12 oasu.DirectUpdateHandler2.close closing DirectUpdateHandler2{commits=0,autocommits=0,soft autocommits=0,optimizes=0,rollbacks=0,expungeDeletes=0,docsPending=0,adds=0,deletesById=0,deletesByQuery=0,errors=0,cumulative_adds=0,cumulative_deletesById=0,cumulative_deletesByQuery=0,cumulative_errors=0}
[junit4:junit4]   2> 7696 T12 oasc.SolrCore.decrefSolrCoreState Closing SolrCoreState
[junit4:junit4]   2> 7696 T12 oasu.DefaultSolrCoreState.closeIndexWriter SolrCoreState ref count has reached 0 - closing IndexWriter
[junit4:junit4]   2> 7696 T12 oasu.DefaultSolrCoreState.closeIndexWriter closing IndexWriter with IndexWriterCloser
[junit4:junit4]   2> 7700 T12 C2 oasc.CachingDirectoryFactory.close Releasing directory:C:\Users\JenkinsSlave\workspace\Lucene-Solr-trunk-Windows\solr\build\solr-solrj\test\J0\.\solrtest-TestSolrProperties-1351582929645\data\EN-3.5\index
[junit4:junit4]   2> 7702 T12 oasc.SolrCore.closeSearcher [renamed_core] Closing main searcher on request.
[junit4:junit4]   2> 7702 T12 oasc.CachingDirectoryFactory.close Releasing directory:C:\Users\JenkinsSlave\workspace\Lucene-Solr-trunk-Windows\solr\build\solr-solrj\test\J0\.\solrtest-TestSolrProperties-1351582929645\data\EN-3.5\index
[junit4:junit4]   2> 7703 T12 oasc.SolrCore.close [newCore]  CLOSING SolrCore org.apache.solr.core.SolrCore@17b79a6
[junit4:junit4]   2> 7703 T12 oasu.DirectUpdateHandler2.close closing DirectUpdateHandler2{commits=0,autocommits=0,soft autocommits=0,optimizes=0,rollbacks=0,expungeDeletes=0,docsPending=0,adds=0,deletesById=0,deletesByQuery=0,errors=0,cumulative_adds=0,cumulative_deletesById=0,cumulative_deletesByQuery=0,cumulative_errors=0}
[junit4:junit4]   2> 7703 T12 oasc.SolrCore.decrefSolrCoreState Closing SolrCoreState
[junit4:junit4]   2> 7704 T12 oasu.DefaultSolrCoreState.closeIndexWriter SolrCoreState ref count has reached 0 - closing IndexWriter
[junit4:junit4]   2> 7704 T12 oasu.DefaultSolrCoreState.closeIndexWriter closing IndexWriter with IndexWriterCloser
[junit4:junit4]   2> 7706 T12 oasc.SolrCore.closeSearcher [newCore] Closing main searcher on request.
[junit4:junit4]   2> 7706 T12 oasc.CachingDirectoryFactory.close Releasing directory:C:\Users\JenkinsSlave\workspace\Lucene-Solr-trunk-Windows\solr\build\solr-solrj\test\J0\.\solrtest-TestSolrProperties-1351582929645\data\-1.3\index
[junit4:junit4]   2> 7709 T12 oasc.CoreContainer.<init> New CoreContainer 9550256
[junit4:junit4]   2> 7710 T12 oasc.CoreContainer.load Loading CoreContainer using Solr Home: 'C:\Users\JenkinsSlave\workspace\Lucene-Solr-trunk-Windows\solr\solrj\src\test-files\solrj\solr\shared'
[junit4:junit4]   2> 7710 T12 oasc.SolrResourceLoader.<init> new SolrResourceLoader for directory: 'C:\Users\JenkinsSlave\workspace\Lucene-Solr-trunk-Windows\solr\solrj\src\test-files\solrj\solr\shared\'
[junit4:junit4]   2> 7749 T12 oasc.CoreContainer.load Registering Log Listener
[junit4:junit4]   2> 7785 T12 oasc.CoreContainer.create Creating SolrCore 'collection1' using instanceDir: C:\Users\JenkinsSlave\workspace\Lucene-Solr-trunk-Windows\solr\solrj\src\test-files\solrj\solr\shared\.
[junit4:junit4]   2> 7786 T12 oasc.SolrResourceLoader.<init> new SolrResourceLoader for directory: 'C:\Users\JenkinsSlave\workspace\Lucene-Solr-trunk-Windows\solr\solrj\src\test-files\solrj\solr\shared\.\'
[junit4:junit4]   2> 7837 T12 oasc.SolrConfig.<init> Using Lucene MatchVersion: LUCENE_50
[junit4:junit4]   2> 7908 T12 oasc.SolrConfig.<init> Loaded SolrConfig: solrconfig.xml
[junit4:junit4]   2> 7909 T12 oass.IndexSchema.readSchema Reading Solr Schema
[junit4:junit4]   2> 7915 T12 oass.IndexSchema.readSchema Schema name=example core 
[junit4:junit4]   2> 7966 T12 oass.IndexSchema.readSchema default search field in schema is name
[junit4:junit4]   2> 7969 T12 oass.IndexSchema.readSchema query parser default operator is OR
[junit4:junit4]   2> 7971 T12 oass.IndexSchema.readSchema unique key field: id
[junit4:junit4]   2> 7974 T12 oasc.SolrCore.<init> [collection1] Opening new SolrCore at C:\Users\JenkinsSlave\workspace\Lucene-Solr-trunk-Windows\solr\solrj\src\test-files\solrj\solr\shared\.\, dataDir=C:\Users\JenkinsSlave\workspace\Lucene-Solr-trunk-Windows\solr\build\solr-solrj\test\J0\.\solrtest-TestSolrProperties-1351582929645/data/-1.3\
[junit4:junit4]   2> 7974 T12 oasc.SolrCore.<init> JMX monitoring not detected for core: collection1
[junit4:junit4]   2> 7975 T12 oasc.SolrCore.initDirectoryFactory org.apache.solr.core.MockDirectoryFactory
[junit4:junit4]   2> 7975 T12 oasc.CachingDirectoryFactory.injectLockFactory WARNING No lockType configured for MockDirWrapper(org.apache.lucene.store.RAMDirectory@9a99eb lockFactory=org.apache.lucene.store.SingleInstanceLockFactory@1ef45e0) assuming 'simple'
[junit4:junit4]   2> 7976 T12 oasc.CachingDirectoryFactory.get return new directory for C:\Users\JenkinsSlave\workspace\Lucene-Solr-trunk-Windows\solr\build\solr-solrj\test\J0\.\solrtest-TestSolrProperties-1351582929645\data\-1.3 forceNew:false
[junit4:junit4]   2> 7976 T12 oasc.CachingDirectoryFactory.close Releasing directory:C:\Users\JenkinsSlave\workspace\Lucene-Solr-trunk-Windows\solr\build\solr-solrj\test\J0\.\solrtest-TestSolrProperties-1351582929645\data\-1.3
[junit4:junit4]   2> 7978 T12 oasc.SolrCore.getNewIndexDir New index directory detected: old=null new=C:\Users\JenkinsSlave\workspace\Lucene-Solr-trunk-Windows\solr\build\solr-solrj\test\J0\.\solrtest-TestSolrProperties-1351582929645/data/-1.3\index/
[junit4:junit4]   2> 7979 T12 oasc.SolrCore.initIndex WARNING [collection1] Solr index directory 'C:\Users\JenkinsSlave\workspace\Lucene-Solr-trunk-Windows\solr\build\solr-solrj\test\J0\.\solrtest-TestSolrProperties-1351582929645\data\-1.3\index' doesn't exist. Creating new index...
[junit4:junit4]   2> 7980 T12 oasc.CachingDirectoryFactory.get return new directory for C:\Users\JenkinsSlave\workspace\Lucene-Solr-trunk-Windows\solr\build\solr-solrj\test\J0\.\solrtest-TestSolrProperties-1351582929645\data\-1.3\index forceNew:false
[junit4:junit4]   2> 7984 T12 oasc.SolrDeletionPolicy.onCommit SolrDeletionPolicy.onCommit: commits:num=1
[junit4:junit4]   2> 		commit{dir=MockDirWrapper(org.apache.lucene.store.RAMDirectory@f4ca49 lockFactory=org.apache.lucene.store.NativeFSLockFactory@f3770c),segFN=segments_1,generation=1,filenames=[segments_1]
[junit4:junit4]   2> 7984 T12 oasc.SolrDeletionPolicy.updateCommits newest commit = 1[segments_1]
[junit4:junit4]   2> 7985 T12 oasc.CachingDirectoryFactory.close Releasing directory:C:\Users\JenkinsSlave\workspace\Lucene-Solr-trunk-Windows\solr\build\solr-solrj\test\J0\.\solrtest-TestSolrProperties-1351582929645\data\-1.3\index
[junit4:junit4]   2> 7988 T12 oasc.RequestHandlers.initHandlersFromConfig created standard: solr.StandardRequestHandler
[junit4:junit4]   2> 7990 T12 oasc.RequestHandlers.initHandlersFromConfig created /update: solr.UpdateRequestHandler
[junit4:junit4]   2> 7990 T12 oasc.RequestHandlers.initHandlersFromConfig created /admin/: org.apache.solr.handler.admin.AdminHandlers
[junit4:junit4]   2> 7997 T12 oashl.XMLLoader.init xsltCacheLifetimeSeconds=60
[junit4:junit4]   2> 8005 T12 oasc.CachingDirectoryFactory.close Releasing directory:C:\Users\JenkinsSlave\workspace\Lucene-Solr-trunk-Windows\solr\build\solr-solrj\test\J0\.\solrtest-TestSolrProperties-1351582929645\data\-1.3
[junit4:junit4]   2> 8006 T12 oass.SolrIndexSearcher.<init> Opening Searcher@48cd13 main
[junit4:junit4]   2> 8006 T12 oasu.CommitTracker.<init> Hard AutoCommit: disabled
[junit4:junit4]   2> 8007 T12 oasu.CommitTracker.<init> Soft AutoCommit: disabled
[junit4:junit4]   2> 8007 T12 oashc.HttpShardHandlerFactory.getParameter Setting socketTimeout to: 0
[junit4:junit4]   2> 8007 T12 oashc.HttpShardHandlerFactory.getParameter Setting urlScheme to: http://
[junit4:junit4]   2> 8008 T12 oashc.HttpShardHandlerFactory.getParameter Setting connTimeout to: 0
[junit4:junit4]   2> 8009 T12 oashc.HttpShardHandlerFactory.getParameter Setting maxConnectionsPerHost to: 20
[junit4:junit4]   2> 8009 T12 oashc.HttpShardHandlerFactory.getParameter Setting corePoolSize to: 0
[junit4:junit4]   2> 8009 T12 oashc.HttpShardHandlerFactory.getParameter Setting maximumPoolSize to: 2147483647
[junit4:junit4]   2> 8009 T12 oashc.HttpShardHandlerFactory.getParameter Setting maxThreadIdleTime to: 5
[junit4:junit4]   2> 8010 T12 oashc.HttpShardHandlerFactory.getParameter Setting sizeOfQueue to: -1
[junit4:junit4]   2> 8010 T12 oashc.HttpShardHandlerFactory.getParameter Setting fairnessPolicy to: false
[junit4:junit4]   2> 8010 T12 oascsi.HttpClientUtil.createClient Creating new http client, config:maxConnectionsPerHost=20&maxConnections=10000&socketTimeout=0&connTimeout=0&retry=false
[junit4:junit4]   2> 8032 T21 oasc.SolrCore.registerSearcher [collection1] Registered new searcher Searcher@48cd13 main{StandardDirectoryReader(segments_1:1)}
[junit4:junit4]   2> 8032 T12 oasc.CoreContainer.register registering core: collection1
[junit4:junit4]   2> 8034 T12 oasc.CoreContainer.create Creating SolrCore 'core1' using instanceDir: C:\Users\JenkinsSlave\workspace\Lucene-Solr-trunk-Windows\solr\solrj\src\test-files\solrj\solr\shared\.
[junit4:junit4]   2> 8036 T12 oasc.SolrResourceLoader.<init> new SolrResourceLoader for directory: 'C:\Users\JenkinsSlave\workspace\Lucene-Solr-trunk-Windows\solr\solrj\src\test-files\solrj\solr\shared\.\'
[junit4:junit4]   2> 8104 T12 oasc.SolrConfig.<init> Using Lucene MatchVersion: LUCENE_50
[junit4:junit4]   2> 8164 T12 oasc.SolrConfig.<init> Loaded SolrConfig: solrconfig.xml
[junit4:junit4]   2> 8166 T12 oass.IndexSchema.readSchema Reading Solr Schema
[junit4:junit4]   2> 8172 T12 oass.IndexSchema.readSchema Schema name=example core FR
[junit4:junit4]   2> 8220 T12 oass.IndexSchema.readSchema default search field in schema is name
[junit4:junit4]   2> 8221 T12 oass.IndexSchema.readSchema query parser default operator is OR
[junit4:junit4]   2> 8222 T12 oass.IndexSchema.readSchema unique key field: id
[junit4:junit4]   2> 8225 T12 oasc.SolrCore.<init> [core1] Opening new SolrCore at C:\Users\JenkinsSlave\workspace\Lucene-Solr-trunk-Windows\solr\solrj\src\test-files\solrj\solr\shared\.\, dataDir=C:\Users\JenkinsSlave\workspace\Lucene-Solr-trunk-Windows\solr\build\solr-solrj\test\J0\.\solrtest-TestSolrProperties-1351582929645/data/FR-2.4\
[junit4:junit4]   2> 8225 T12 oasc.SolrCore.<init> JMX monitoring not detected for core: core1
[junit4:junit4]   2> 8226 T12 oasc.SolrCore.initDirectoryFactory org.apache.solr.core.MockDirectoryFactory
[junit4:junit4]   2> 8226 T12 oasc.CachingDirectoryFactory.injectLockFactory WARNING No lockType configured for MockDirWrapper(org.apache.lucene.store.RAMDirectory@e90e23 lockFactory=org.apache.lucene.store.SingleInstanceLockFactory@9f2588) assuming 'simple'
[junit4:junit4]   2> 8226 T12 oasc.CachingDirectoryFactory.get return new directory for C:\Users\JenkinsSlave\workspace\Lucene-Solr-trunk-Windows\solr\build\solr-solrj\test\J0\.\solrtest-TestSolrProperties-1351582929645\data\FR-2.4 forceNew:false
[junit4:junit4]   2> 8227 T12 oasc.CachingDirectoryFactory.close Releasing directory:C:\Users\JenkinsSlave\workspace\Lucene-Solr-trunk-Windows\solr\build\solr-solrj\test\J0\.\solrtest-TestSolrProperties-1351582929645\data\FR-2.4
[junit4:junit4]   2> 8227 T12 oasc.SolrCore.getNewIndexDir New index directory detected: old=null new=C:\Users\JenkinsSlave\workspace\Lucene-Solr-trunk-Windows\solr\build\solr-solrj\test\J0\.\solrtest-TestSolrProperties-1351582929645/data/FR-2.4\index/
[junit4:junit4]   2> 8228 T12 oasc.SolrCore.initIndex WARNING [core1] Solr index directory 'C:\Users\JenkinsSlave\workspace\Lucene-Solr-trunk-Windows\solr\build\solr-solrj\test\J0\.\solrtest-TestSolrProperties-1351582929645\data\FR-2.4\index' doesn't exist. Creating new index...
[junit4:junit4]   2> 8228 T12 oasc.CachingDirectoryFactory.get return new directory for C:\Users\JenkinsSlave\workspace\Lucene-Solr-trunk-Windows\solr\build\solr-solrj\test\J0\.\solrtest-TestSolrProperties-1351582929645\data\FR-2.4\index forceNew:false
[junit4:junit4]   2> 8230 T12 oasc.SolrDeletionPolicy.onCommit SolrDeletionPolicy.onCommit: commits:num=1
[junit4:junit4]   2> 		commit{dir=MockDirWrapper(org.apache.lucene.store.RAMDirectory@514f7f lockFactory=org.apache.lucene.store.NativeFSLockFactory@112d7ae),segFN=segments_1,generation=1,filenames=[segments_1]
[junit4:junit4]   2> 8230 T12 oasc.SolrDeletionPolicy.updateCommits newest commit = 1[segments_1]
[junit4:junit4]   2> 8232 T12 oasc.CachingDirectoryFactory.close Releasing directory:C:\Users\JenkinsSlave\workspace\Lucene-Solr-trunk-Windows\solr\build\solr-solrj\test\J0\.\solrtest-TestSolrProperties-1351582929645\data\FR-2.4\index
[junit4:junit4]   2> 8233 T12 oasc.RequestHandlers.initHandlersFromConfig created standard: solr.StandardRequestHandler
[junit4:junit4]   2> 8234 T12 oasc.RequestHandlers.initHandlersFromConfig created /update: solr.UpdateRequestHandler
[junit4:junit4]   2> 8234 T12 oasc.RequestHandlers.initHandlersFromConfig created /admin/: org.apache.solr.handler.admin.AdminHandlers
[junit4:junit4]   2> 8239 T12 oashl.XMLLoader.init xsltCacheLifetimeSeconds=60
[junit4:junit4]   2> 8244 T12 oasc.CachingDirectoryFactory.close Releasing directory:C:\Users\JenkinsSlave\workspace\Lucene-Solr-trunk-Windows\solr\build\solr-solrj\test\J0\.\solrtest-TestSolrProperties-1351582929645\data\FR-2.4
[junit4:junit4]   2> 8245 T12 oass.SolrIndexSearcher.<init> Opening Searcher@fe30af main
[junit4:junit4]   2> 8246 T12 oasu.CommitTracker.<init> Hard AutoCommit: disabled
[junit4:junit4]   2> 8246 T12 oasu.CommitTracker.<init> Soft AutoCommit: disabled
[junit4:junit4]   2> 8256 T22 oasc.SolrCore.registerSearcher [core1] Registered new searcher Searcher@fe30af main{StandardDirectoryReader(segments_1:1)}
[junit4:junit4]   2> 8256 T12 oasc.CoreContainer.register registering core: core1
[junit4:junit4]   2> 8258 T12 oasc.CoreContainer.create Creating SolrCore 'renamed_core' using instanceDir: C:\Users\JenkinsSlave\workspace\Lucene-Solr-trunk-Windows\solr\solrj\src\test-files\solrj\solr\shared\.
[junit4:junit4]   2> 8259 T12 oasc.SolrResourceLoader.<init> new SolrResourceLoader for directory: 'C:\Users\JenkinsSlave\workspace\Lucene-Solr-trunk-Windows\solr\solrj\src\test-files\solrj\solr\shared\.\'
[junit4:junit4]   2> 8328 T12 oasc.SolrConfig.<init> Using Lucene MatchVersion: LUCENE_50
[junit4:junit4]   2> 8391 T12 oasc.SolrConfig.<init> Loaded SolrConfig: solrconfig.xml
[junit4:junit4]   2> 8392 T12 oass.IndexSchema.readSchema Reading Solr Schema
[junit4:junit4]   2> 8398 T12 oass.IndexSchema.readSchema Schema name=example core EN
[junit4:junit4]   2> 8459 T12 oass.IndexSchema.readSchema default search field in schema is name
[junit4:junit4]   2> 8462 T12 oass.IndexSchema.readSchema query parser default operator is OR
[junit4:junit4]   2> 8463 T12 oass.IndexSchema.readSchema unique key field: id
[junit4:junit4]   2> 8468 T12 oasc.SolrCore.<init> [renamed_core] Opening new SolrCore at C:\Users\JenkinsSlave\workspace\Lucene-Solr-trunk-Windows\solr\solrj\src\test-files\solrj\solr\shared\.\, dataDir=C:\Users\JenkinsSlave\workspace\Lucene-Solr-trunk-Windows\solr\build\solr-solrj\test\J0\.\solrtest-TestSolrProperties-1351582929645/data/EN-3.5\
[junit4:junit4]   2> 8468 T12 oasc.SolrCore.<init> JMX monitoring not detected for core: renamed_core
[junit4:junit4]   2> 8468 T12 oasc.SolrCore.initDirectoryFactory org.apache.solr.core.MockDirectoryFactory
[junit4:junit4]   2> 8469 T12 oasc.CachingDirectoryFactory.injectLockFactory WARNING No lockType configured for MockDirWrapper(org.apache.lucene.store.RAMDirectory@18f729c lockFactory=org.apache.lucene.store.SingleInstanceLockFactory@ad97f5) assuming 'simple'
[junit4:junit4]   2> 8469 T12 oasc.CachingDirectoryFactory.get return new directory for C:\Users\JenkinsSlave\workspace\Lucene-Solr-trunk-Windows\solr\build\solr-solrj\test\J0\.\solrtest-TestSolrProperties-1351582929645\data\EN-3.5 forceNew:false
[junit4:junit4]   2> 8470 T12 oasc.CachingDirectoryFactory.close Releasing directory:C:\Users\JenkinsSlave\workspace\Lucene-Solr-trunk-Windows\solr\build\solr-solrj\test\J0\.\solrtest-TestSolrProperties-1351582929645\data\EN-3.5
[junit4:junit4]   2> 8470 T12 oasc.SolrCore.getNewIndexDir New index directory detected: old=null new=C:\Users\JenkinsSlave\workspace\Lucene-Solr-trunk-Windows\solr\build\solr-solrj\test\J0\.\solrtest-TestSolrProperties-1351582929645/data/EN-3.5\index/
[junit4:junit4]   2> 8473 T12 oasc.SolrCore.initIndex WARNING [renamed_core] Solr index directory 'C:\Users\JenkinsSlave\workspace\Lucene-Solr-trunk-Windows\solr\build\solr-solrj\test\J0\.\solrtest-TestSolrProperties-1351582929645\data\EN-3.5\index' doesn't exist. Creating new index...
[junit4:junit4]   2> 8473 T12 oasc.CachingDirectoryFactory.get return new directory for C:\Users\JenkinsSlave\workspace\Lucene-Solr-trunk-Windows\solr\build\solr-solrj\test\J0\.\solrtest-TestSolrProperties-1351582929645\data\EN-3.5\index forceNew:false
[junit4:junit4]   2> 8477 T12 oasc.SolrDeletionPolicy.onCommit SolrDeletionPolicy.onCommit: commits:num=1
[junit4:junit4]   2> 		commit{dir=MockDirWrapper(org.apache.lucene.store.RAMDirectory@17414c8 lockFactory=org.apache.lucene.store.NativeFSLockFactory@14fa0ef),segFN=segments_1,generation=1,filenames=[segments_1]
[junit4:junit4]   2> 8477 T12 oasc.SolrDeletionPolicy.updateCommits newest commit = 1[segments_1]
[junit4:junit4]   2> 8478 T12 oasc.CachingDirectoryFactory.close Releasing directory:C:\Users\JenkinsSlave\workspace\Lucene-Solr-trunk-Windows\solr\build\solr-solrj\test\J0\.\solrtest-TestSolrProperties-1351582929645\data\EN-3.5\index
[junit4:junit4]   2> 8479 T12 oasc.RequestHandlers.initHandlersFromConfig created standard: solr.StandardRequestHandler
[junit4:junit4]   2> 8480 T12 oasc.RequestHandlers.initHandlersFromConfig created /update: solr.UpdateRequestHandler
[junit4:junit4]   2> 8480 T12 oasc.RequestHandlers.initHandlersFromConfig created /admin/: org.apache.solr.handler.admin.AdminHandlers
[junit4:junit4]   2> 8489 T12 oashl.XMLLoader.init xsltCacheLifetimeSeconds=60
[junit4:junit4]   2> 8493 T12 oasc.CachingDirectoryFactory.close Releasing directory:C:\Users\JenkinsSlave\workspace\Lucene-Solr-trunk-Windows\solr\build\solr-solrj\test\J0\.\solrtest-TestSolrProperties-1351582929645\data\EN-3.5
[junit4:junit4]   2> 8494 T12 oass.SolrIndexSearcher.<init> Opening Searcher@1eb7d25 main
[junit4:junit4]   2> 8497 T12 oasu.CommitTracker.<init> Hard AutoCommit: disabled
[junit4:junit4]   2> 8501 T12 oasu.CommitTracker.<init> Soft AutoCommit: disabled
[junit4:junit4]   2> 8514 T23 oasc.SolrCore.registerSearcher [renamed_core] Registered new searcher Searcher@1eb7d25 main{StandardDirectoryReader(segments_1:1)}
[junit4:junit4]   2> 8514 T12 oasc.CoreContainer.register registering core: renamed_core
[junit4:junit4]   2> 8515 T12 oasc.CoreContainer.create Creating SolrCore 'newCore' using instanceDir: C:\Users\JenkinsSlave\workspace\Lucene-Solr-trunk-Windows\solr\solrj\src\test-files\solrj\solr\shared
[junit4:junit4]   2> 8516 T12 oasc.SolrResourceLoader.<init> new SolrResourceLoader for directory: 'C:\Users\JenkinsSlave\workspace\Lucene-Solr-trunk-Windows\solr\solrj\src\test-files\solrj\solr\shared\'
[junit4:junit4]   2> 8586 T12 oasc.SolrConfig.<init> Using Lucene MatchVersion: LUCENE_50
[junit4:junit4]   2> 8656 T12 oasc.SolrConfig.<init> Loaded SolrConfig: solrconfig.xml
[junit4:junit4]   2> 8657 T12 oass.IndexSchema.readSchema Reading Solr Schema
[junit4:junit4]   2> 8664 T12 oass.IndexSchema.readSchema Schema name=example core 
[junit4:junit4]   2> 8713 T12 oass.IndexSchema.readSchema default search field in schema is name
[junit4:junit4]   2> 8715 T12 oass.IndexSchema.readSchema query parser default operator is OR
[junit4:junit4]   2> 8717 T12 oass.IndexSchema.readSchema unique key field: id
[junit4:junit4]   2> 8722 T12 oasc.SolrCore.<init> [newCore] Opening new SolrCore at C:\Users\JenkinsSlave\workspace\Lucene-Solr-trunk-Windows\solr\solrj\src\test-files\solrj\solr\shared\, dataDir=C:\Users\JenkinsSlave\workspace\Lucene-Solr-trunk-Windows\solr\build\solr-solrj\test\J0\.\solrtest-TestSolrProperties-1351582929645/data/-1.3\
[junit4:junit4]   2> 8722 T12 oasc.SolrCore.<init> JMX monitoring not detected for core: newCore
[junit4:junit4]   2> 8723 T12 oasc.SolrCore.initDirectoryFactory org.apache.solr.core.MockDirectoryFactory
[junit4:junit4]   2> 8723 T12 oasc.CachingDirectoryFactory.injectLockFactory WARNING No lockType configured for MockDirWrapper(org.apache.lucene.store.RAMDirectory@19e733e lockFactory=org.apache.lucene.store.SingleInstanceLockFactory@1a01f91) assuming 'simple'
[junit4:junit4]   2> 8724 T12 oasc.CachingDirectoryFactory.get return new directory for C:\Users\JenkinsSlave\workspace\Lucene-Solr-trunk-Windows\solr\build\solr-solrj\test\J0\.\solrtest-TestSolrProperties-1351582929645\data\-1.3 forceNew:false
[junit4:junit4]   2> 8724 T12 oasc.CachingDirectoryFactory.close Releasing directory:C:\Users\JenkinsSlave\workspace\Lucene-Solr-trunk-Windows\solr\build\solr-solrj\test\J0\.\solrtest-TestSolrProperties-1351582929645\data\-1.3
[junit4:junit4]   2> 8724 T12 oasc.SolrCore.getNewIndexDir New index directory detected: old=null new=C:\Users\JenkinsSlave\workspace\Lucene-Solr-trunk-Windows\solr\build\solr-solrj\test\J0\.\solrtest-TestSolrProperties-1351582929645/data/-1.3\index/
[junit4:junit4]   2> 8725 T12 oasc.SolrCore.initIndex WARNING [newCore] Solr index directory 'C:\Users\JenkinsSlave\workspace\Lucene-Solr-trunk-Windows\solr\build\solr-solrj\test\J0\.\solrtest-TestSolrProperties-1351582929645\data\-1.3\index' doesn't exist. Creating new index...
[junit4:junit4]   2> 8728 T12 oasc.CachingDirectoryFactory.get return new directory for C:\Users\JenkinsSlave\workspace\Lucene-Solr-trunk-Windows\solr\build\solr-solrj\test\J0\.\solrtest-TestSolrProperties-1351582929645\data\-1.3\index forceNew:false
[junit4:junit4]   2> 8730 T12 oasc.SolrDeletionPolicy.onCommit SolrDeletionPolicy.onCommit: commits:num=1
[junit4:junit4]   2> 		commit{dir=MockDirWrapper(org.apache.lucene.store.RAMDirectory@1a0eec3 lockFactory=org.apache.lucene.store.NativeFSLockFactory@b5d05b),segFN=segments_1,generation=1,filenames=[segments_1]
[junit4:junit4]   2> 8730 T12 oasc.SolrDeletionPolicy.updateCommits newest commit = 1[segments_1]
[junit4:junit4]   2> 8731 T12 oasc.CachingDirectoryFactory.close Releasing directory:C:\Users\JenkinsSlave\workspace\Lucene-Solr-trunk-Windows\solr\build\solr-solrj\test\J0\.\solrtest-TestSolrProperties-1351582929645\data\-1.3\index
[junit4:junit4]   2> 8733 T12 oasc.RequestHandlers.initHandlersFromConfig created standard: solr.StandardRequestHandler
[junit4:junit4]   2> 8734 T12 oasc.RequestHandlers.initHandlersFromConfig created /update: solr.UpdateRequestHandler
[junit4:junit4]   2> 8734 T12 oasc.RequestHandlers.initHandlersFromConfig created /admin/: org.apache.solr.handler.admin.AdminHandlers
[junit4:junit4]   2> 8740 T12 oashl.XMLLoader.init xsltCacheLifetimeSeconds=60
[junit4:junit4]   2> 8746 T12 oasc.CachingDirectoryFactory.close Releasing directory:C:\Users\JenkinsSlave\workspace\Lucene-Solr-trunk-Windows\solr\build\solr-solrj\test\J0\.\solrtest-TestSolrProperties-1351582929645\data\-1.3
[junit4:junit4]   2> 8747 T12 oass.SolrIndexSearcher.<init> Opening Searcher@58f769 main
[junit4:junit4]   2> 8748 T12 oasu.CommitTracker.<init> Hard AutoCommit: disabled
[junit4:junit4]   2> 8748 T12 oasu.CommitTracker.<init> Soft AutoCommit: disabled
[junit4:junit4]   2> 8759 T12 oasc.CoreContainer.register registering core: newCore
[junit4:junit4]   2> ASYNC  NEW_CORE C3 name=renamed_core org.apache.solr.core.SolrCore@731f3f
[junit4:junit4]   2> 8759 T12 C3 oasc.CoreContainer.persistFile Persisting cores config to .\solrtest-TestSolrProperties-1351582929645\solr-persist.xml
[junit4:junit4]   2> 8759 T24 oasc.SolrCore.registerSearcher [newCore] Registered new searcher Searcher@58f769 main{StandardDirectoryReader(segments_1:1)}
[junit4:junit4]   2> 8781 T12 C3 oasc.SolrXMLSerializer.persistFile Persisting cores config to .\solrtest-TestSolrProperties-1351582929645\solr-persist.xml
[junit4:junit4]   2> 8785 T12 C3 REQ [renamed_core] webapp=null path=/admin/cores params={action=PERSIST&file=solr-persist.xml} status=0 QTime=26 
[junit4:junit4]   2> 8787 T12 oasc.CoreContainer.shutdown Shutting down CoreContainer instance=9550256
[junit4:junit4]   2> 8787 T12 oasc.SolrCore.close [collection1]  CLOSING SolrCore org.apache.solr.core.SolrCore@162f16
[junit4:junit4]   2> 8787 T12 oasu.DirectUpdateHandler2.close closing DirectUpdateHandler2{commits=0,autocommits=0,soft autocommits=0,optimizes=0,rollbacks=0,expungeDeletes=0,docsPending=0,adds=0,deletesById=0,deletesByQuery=0,errors=0,cumulative_adds=0,cumulative_deletesById=0,cumulative_deletesByQuery=0,cumulative_errors=0}
[junit4:junit4]   2> 8788 T12 oasc.SolrCore.decrefSolrCoreState Closing SolrCoreState
[junit4:junit4]   2> 8788 T12 oasu.DefaultSolrCoreState.closeIndexWriter SolrCoreState ref count has reached 0 - closing IndexWriter
[junit4:junit4]   2> 8789 T12 oasu.DefaultSolrCoreState.closeIndexWriter closing IndexWriter with IndexWriterCloser
[junit4:junit4]   2> 8789 T12 oasc.SolrCore.closeSearcher [collection1] Closing main searcher on request.
[junit4:junit4]   2> 8790 T12 oasc.CachingDirectoryFactory.close Releasing directory:C:\Users\JenkinsSlave\workspace\Lucene-Solr-trunk-Windows\solr\build\solr-solrj\test\J0\.\solrtest-TestSolrProperties-1351582929645\data\-1.3\index
[junit4:junit4]   2> 8790 T12 oasc.SolrCore.close [core1]  CLOSING SolrCore org.apache.solr.core.SolrCore@1395dab
[junit4:junit4]   2> 8791 T12 oasu.DirectUpdateHandler2.close closing DirectUpdateHandler2{commits=0,autocommits=0,soft autocommits=0,optimizes=0,rollbacks=0,expungeDeletes=0,docsPending=0,adds=0,deletesById=0,deletesByQuery=0,errors=0,cumulative_adds=0,cumulative_deletesById=0,cumulative_deletesByQuery=0,cumulative_errors=0}
[junit4:junit4]   2> 8792 T12 oasc.SolrCore.decrefSolrCoreState Closing SolrCoreState
[junit4:junit4]   2> 8792 T12 oasu.DefaultSolrCoreState.closeIndexWriter SolrCoreState ref count has reached 0 - closing IndexWriter
[junit4:junit4]   2> 8793 T12 oasu.DefaultSolrCoreState.closeIndexWriter closing IndexWriter with IndexWriterCloser
[junit4:junit4]   2> 8793 T12 oasc.SolrCore.closeSearcher [core1] Closing main searcher on request.
[junit4:junit4]   2> 8794 T12 oasc.CachingDirectoryFactory.close Releasing directory:C:\Users\JenkinsSlave\workspace\Lucene-Solr-trunk-Windows\solr\build\solr-solrj\test\J0\.\solrtest-TestSolrProperties-1351582929645\data\FR-2.4\index
[junit4:junit4]   2> 8794 T12 oasc.SolrCore.close [renamed_core]  CLOSING SolrCore org.apache.solr.core.SolrCore@731f3f
[junit4:junit4]   2> 8794 T12 oasu.DirectUpdateHandler2.close closing DirectUpdateHandler2{commits=0,autocommits=0,soft autocommits=0,optimizes=0,rollbacks=0,expungeDeletes=0,docsPending=0,adds=0,deletesById=0,deletesByQuery=0,errors=0,cumulative_adds=0,cumulative_deletesById=0,cumulative_deletesByQuery=0,cumulative_errors=0}
[junit4:junit4]   2> 8795 T12 oasc.SolrCore.decrefSolrCoreState Closing SolrCoreState
[junit4:junit4]   2> 8795 T12 oasu.DefaultSolrCoreState.closeIndexWriter SolrCoreState ref count has reached 0 - closing IndexWriter
[junit4:junit4]   2> 8796 T12 oasu.DefaultSolrCoreState.closeIndexWriter closing IndexWriter with IndexWriterCloser
[junit4:junit4]   2> 8796 T12 oasc.SolrCore.closeSearcher [renamed_core] Closing main searcher on request.
[junit4:junit4]   2> 8796 T12 oasc.CachingDirectoryFactory.close Releasing directory:C:\Users\JenkinsSlave\workspace\Lucene-Solr-trunk-Windows\solr\build\solr-solrj\test\J0\.\solrtest-TestSolrProperties-1351582929645\data\EN-3.5\index
[junit4:junit4]   2> 8797 T12 oasc.SolrCore.close [newCore]  CLOSING SolrCore org.apache.solr.core.SolrCore@1eeb372
[junit4:junit4]   2> 8797 T12 oasu.DirectUpdateHandler2.close closing DirectUpdateHandler2{commits=0,autocommits=0,soft autocommits=0,optimizes=0,rollbacks=0,expungeDeletes=0,docsPending=0,adds=0,deletesById=0,deletesByQuery=0,errors=0,cumulative_adds=0,cumulative_deletesById=0,cumulative_deletesByQuery=0,cumulative_errors=0}
[junit4:junit4]   2> 8797 T12 oasc.SolrCore.decrefSolrCoreState Closing SolrCoreState
[junit4:junit4]   2> 8799 T12 oasu.DefaultSolrCoreState.closeIndexWriter SolrCoreState ref count has reached 0 - closing IndexWriter
[junit4:junit4]   2> 8799 T12 oasu.DefaultSolrCoreState.closeIndexWriter closing IndexWriter with IndexWriterCloser
[junit4:junit4]   2> 8800 T12 oasc.SolrCore.closeSearcher [newCore] Closing main searcher on request.
[junit4:junit4]   2> 8800 T12 oasc.CachingDirectoryFactory.close Releasing directory:C:\Users\JenkinsSlave\workspace\Lucene-Solr-trunk-Windows\solr\build\solr-solrj\test\J0\.\solrtest-TestSolrProperties-1351582929645\data\-1.3\index
[junit4:junit4]   2> 9000 T11 ccr.ThreadLeakControl.checkThreadLeaks WARNING Will linger awaiting termination of 2 leaked thread(s).
[junit4:junit4]   2> 29167 T11 ccr.ThreadLeakControl.checkThreadLeaks SEVERE 2 threads leaked from SUITE scope at org.apache.solr.client.solrj.embedded.TestSolrProperties: 
[junit4:junit4]   2> 	   1) Thread[id=14, name=metrics-meter-tick-thread-1, state=TIMED_WAITING, group=TGRP-TestSolrProperties]
[junit4:junit4]   2> 	        at sun.misc.Unsafe.park(Native Method)
[junit4:junit4]   2> 	        at java.util.concurrent.locks.LockSupport.parkNanos(LockSupport.java:196)
[junit4:junit4]   2> 	        at java.util.concurrent.locks.AbstractQueuedSynchronizer$ConditionObject.awaitNanos(AbstractQueuedSynchronizer.java:2025)
[junit4:junit4]   2> 	        at java.util.concurrent.DelayQueue.take(DelayQueue.java:164)
[junit4:junit4]   2> 	        at java.util.concurrent.ScheduledThreadPoolExecutor$DelayedWorkQueue.take(ScheduledThreadPoolExecutor.java:609)
[junit4:junit4]   2> 	        at java.util.concurrent.ScheduledThreadPoolExecutor$DelayedWorkQueue.take(ScheduledThreadPoolExecutor.java:602)
[junit4:junit4]   2> 	        at java.util.concurrent.ThreadPoolExecutor.getTask(ThreadPoolExecutor.java:947)
[junit4:junit4]   2> 	        at java.util.concurrent.ThreadPoolExecutor$Worker.run(ThreadPoolExecutor.java:907)
[junit4:junit4]   2> 	        at java.lang.Thread.run(Thread.java:662)
[junit4:junit4]   2> 	   2) Thread[id=15, name=metrics-meter-tick-thread-2, state=TIMED_WAITING, group=TGRP-TestSolrProperties]
[junit4:junit4]   2> 	        at sun.misc.Unsafe.park(Native Method)
[junit4:junit4]   2> 	        at java.util.concurrent.locks.LockSupport.parkNanos(LockSupport.java:196)
[junit4:junit4]   2> 	        at java.util.concurrent.locks.AbstractQueuedSynchronizer$ConditionObject.awaitNanos(AbstractQueuedSynchronizer.java:2025)
[junit4:junit4]   2> 	        at java.util.concurrent.DelayQueue.take(DelayQueue.java:164)
[junit4:junit4]   2> 	        at java.util.concurrent.ScheduledThreadPoolExecutor$DelayedWorkQueue.take(ScheduledThreadPoolExecutor.java:609)
[junit4:junit4]   2> 	        at java.util.concurrent.ScheduledThreadPoolExecutor$DelayedWorkQueue.take(ScheduledThreadPoolExecutor.java:602)
[junit4:junit4]   2> 	        at java.util.concurrent.ThreadPoolExecutor.getTask(ThreadPoolExecutor.java:947)
[junit4:junit4]   2> 	        at java.util.concurrent.ThreadPoolExecutor$Worker.run(ThreadPoolExecutor.java:907)
[junit4:junit4]   2> 	        at java.lang.Thread.run(Thread.java:662)
[junit4:junit4]   2> 29169 T11 ccr.ThreadLeakControl.tryToInterruptAll Starting to interrupt leaked threads:
[junit4:junit4]   2> 	   1) Thread[id=14, name=metrics-meter-tick-thread-1, state=TIMED_WAITING, group=TGRP-TestSolrProperties]
[junit4:junit4]   2> 	   2) Thread[id=15, name=metrics-meter-tick-thread-2, state=TIMED_WAITING, group=TGRP-TestSolrProperties]
[junit4:junit4]   2> 32182 T11 ccr.ThreadLeakControl.tryToInterruptAll SEVERE There are still zombie threads that couldn't be terminated:
[junit4:junit4]   2> 	   1) Thread[id=14, name=metrics-meter-tick-thread-1, state=TIMED_WAITING, group=TGRP-TestSolrProperties]
[junit4:junit4]   2> 	        at sun.misc.Unsafe.park(Native Method)
[junit4:junit4]   2> 	        at java.util.concurrent.locks.LockSupport.parkNanos(LockSupport.java:196)
[junit4:junit4]   2> 	        at java.util.concurrent.locks.AbstractQueuedSynchronizer$ConditionObject.awaitNanos(AbstractQueuedSynchronizer.java:2025)
[junit4:junit4]   2> 	        at java.util.concurrent.DelayQueue.take(DelayQueue.java:164)
[junit4:junit4]   2> 	        at java.util.concurrent.ScheduledThreadPoolExecutor$DelayedWorkQueue.take(ScheduledThreadPoolExecutor.java:609)
[junit4:junit4]   2> 	        at java.util.concurrent.ScheduledThreadPoolExecutor$DelayedWorkQueue.take(ScheduledThreadPoolExecutor.java:602)
[junit4:junit4]   2> 	        at java.util.concurrent.ThreadPoolExecutor.getTask(ThreadPoolExecutor.java:947)
[junit4:junit4]   2> 	        at java.util.concurrent.ThreadPoolExecutor$Worker.run(ThreadPoolExecutor.java:907)
[junit4:junit4]   2> 	        at java.lang.Thread.run(Thread.java:662)
[junit4:junit4]   2> 	   2) Thread[id=15, name=metrics-meter-tick-thread-2, state=TIMED_WAITING, group=TGRP-TestSolrProperties]
[junit4:junit4]   2> 	        at sun.misc.Unsafe.park(Native Method)
[junit4:junit4]   2> 	        at java.util.concurrent.locks.LockSupport.parkNanos(LockSupport.java:196)
[junit4:junit4]   2> 	        at java.util.concurrent.locks.AbstractQueuedSynchronizer$ConditionObject.awaitNanos(AbstractQueuedSynchronizer.java:2025)
[junit4:junit4]   2> 	        at java.util.concurrent.DelayQueue.take(DelayQueue.java:164)
[junit4:junit4]   2> 	        at java.util.concurrent.ScheduledThreadPoolExecutor$DelayedWorkQueue.take(ScheduledThreadPoolExecutor.java:609)
[junit4:junit4]   2> 	        at java.util.concurrent.ScheduledThreadPoolExecutor$DelayedWorkQueue.take(ScheduledThreadPoolExecutor.java:602)
[junit4:junit4]   2> 	        at java.util.concurrent.ThreadPoolExecutor.getTask(ThreadPoolExecutor.java:947)
[junit4:junit4]   2> 	        at java.util.concurrent.ThreadPoolExecutor$Worker.run(ThreadPoolExecutor.java:907)
[junit4:junit4]   2> 	        at java.lang.Thread.run(Thread.java:662)
[junit4:junit4]   2> NOTE: test params are: codec=Compressing(storedFieldsFormat=CompressingStoredFieldsFormat(compressionMode=FAST, chunkSize=2, storedFieldsIndex=MEMORY_CHUNK)), sim=DefaultSimilarity, locale=de_DE, timezone=America/St_Lucia
[junit4:junit4]   2> NOTE: Windows 7 6.1 x86/Sun Microsystems Inc. 1.6.0_35 (32-bit)/cpus=2,threads=3,free=51875328,total=65470464
[junit4:junit4]   2> NOTE: All tests run in this JVM: [TestSolrProperties]
[junit4:junit4]   2> NOTE: reproduce with: ant test  -Dtestcase=TestSolrProperties -Dtests.seed=CF0ECA1AF8D51888 -Dtests.slow=true -Dtests.locale=de_DE -Dtests.timezone=America/St_Lucia -Dtests.file.encoding=ISO-8859-1
[junit4:junit4] ERROR   0.00s | TestSolrProperties (suite) <<<
[junit4:junit4]    > Throwable #1: com.carrotsearch.randomizedtesting.ThreadLeakError: 2 threads leaked from SUITE scope at org.apache.solr.client.solrj.embedded.TestSolrProperties: 
[junit4:junit4]    >    1) Thread[id=14, name=metrics-meter-tick-thread-1, state=TIMED_WAITING, group=TGRP-TestSolrProperties]
[junit4:junit4]    >         at sun.misc.Unsafe.park(Native Method)
[junit4:junit4]    >         at java.util.concurrent.locks.LockSupport.parkNanos(LockSupport.java:196)
[junit4:junit4]    >         at java.util.concurrent.locks.AbstractQueuedSynchronizer$ConditionObject.awaitNanos(AbstractQueuedSynchronizer.java:2025)
[junit4:junit4]    >         at java.util.concurrent.DelayQueue.take(DelayQueue.java:164)
[junit4:junit4]    >         at java.util.concurrent.ScheduledThreadPoolExecutor$DelayedWorkQueue.take(ScheduledThreadPoolExecutor.java:609)
[junit4:junit4]    >         at java.util.concurrent.ScheduledThreadPoolExecutor$DelayedWorkQueue.take(ScheduledThreadPoolExecutor.java:602)
[junit4:junit4]    >         at java.util.concurrent.ThreadPoolExecutor.getTask(ThreadPoolExecutor.java:947)
[junit4:junit4]    >         at java.util.concurrent.ThreadPoolExecutor$Worker.run(ThreadPoolExecutor.java:907)
[junit4:junit4]    >         at java.lang.Thread.run(Thread.java:662)
[junit4:junit4]    >    2) Thread[id=15, name=metrics-meter-tick-thread-2, state=TIMED_WAITING, group=TGRP-TestSolrProperties]
[junit4:junit4]    >         at sun.misc.Unsafe.park(Native Method)
[junit4:junit4]    >         at java.util.concurrent.locks.LockSupport.parkNanos(LockSupport.java:196)
[junit4:junit4]    >         at java.util.concurrent.locks.AbstractQueuedSynchronizer$ConditionObject.awaitNanos(AbstractQueuedSynchronizer.java:2025)
[junit4:junit4]    >         at java.util.concurrent.DelayQueue.take(DelayQueue.java:164)
[junit4:junit4]    >         at java.util.concurrent.ScheduledThreadPoolExecutor$DelayedWorkQueue.take(ScheduledThreadPoolExecutor.java:609)
[junit4:junit4]    >         at java.util.concurrent.ScheduledThreadPoolExecutor$DelayedWorkQueue.take(ScheduledThreadPoolExecutor.java:602)
[junit4:junit4]    >         at java.util.concurrent.ThreadPoolExecutor.getTask(ThreadPoolExecutor.java:947)
[junit4:junit4]    >         at java.util.concurrent.ThreadPoolExecutor$Worker.run(ThreadPoolExecutor.java:907)
[junit4:junit4]    >         at java.lang.Thread.run(Thread.java:662)
[junit4:junit4]    > 	at __randomizedtesting.SeedInfo.seed([CF0ECA1AF8D51888]:0)
[junit4:junit4]    > Throwable #2: com.carrotsearch.randomizedtesting.ThreadLeakError: There are still zombie threads that couldn't be terminated:
[junit4:junit4]    >    1) Thread[id=14, name=metrics-meter-tick-thread-1, state=TIMED_WAITING, group=TGRP-TestSolrProperties]
[junit4:junit4]    >         at sun.misc.Unsafe.park(Native Method)
[junit4:junit4]    >         at java.util.concurrent.locks.LockSupport.parkNanos(LockSupport.java:196)
[junit4:junit4]    >         at java.util.concurrent.locks.AbstractQueuedSynchronizer$ConditionObject.awaitNanos(AbstractQueuedSynchronizer.java:2025)
[junit4:junit4]    >         at java.util.concurrent.DelayQueue.take(DelayQueue.java:164)
[junit4:junit4]    >         at java.util.concurrent.ScheduledThreadPoolExecutor$DelayedWorkQueue.take(ScheduledThreadPoolExecutor.java:609)
[junit4:junit4]    >         at java.util.concurrent.ScheduledThreadPoolExecutor$DelayedWorkQueue.take(ScheduledThreadPoolExecutor.java:602)
[junit4:junit4]    >         at java.util.concurrent.ThreadPoolExecutor.getTask(ThreadPoolExecutor.java:947)
[junit4:junit4]    >         at java.util.concurrent.ThreadPoolExecutor$Worker.run(ThreadPoolExecutor.java:907)
[junit4:junit4]    >         at java.lang.Thread.run(Thread.java:662)
[junit4:junit4]    >    2) Thread[id=15, name=metrics-meter-tick-thread-2, state=TIMED_WAITING, group=TGRP-TestSolrProperties]
[junit4:junit4]    >         at sun.misc.Unsafe.park(Native Method)
[junit4:junit4]    >         at java.util.concurrent.locks.LockSupport.parkNanos(LockSupport.java:196)
[junit4:junit4]    >         at java.util.concurrent.locks.AbstractQueuedSynchronizer$ConditionObject.awaitNanos(AbstractQueuedSynchronizer.java:2025)
[junit4:junit4]    >         at java.util.concurrent.DelayQueue.take(DelayQueue.java:164)
[junit4:junit4]    >         at java.util.concurrent.ScheduledThreadPoolExecutor$DelayedWorkQueue.take(ScheduledThreadPoolExecutor.java:609)
[junit4:junit4]    >         at java.util.concurrent.ScheduledThreadPoolExecutor$DelayedWorkQueue.take(ScheduledThreadPoolExecutor.java:602)
[junit4:junit4]    >         at java.util.concurrent.ThreadPoolExecutor.getTask(ThreadPoolExecutor.java:947)
[junit4:junit4]    >         at java.util.concurrent.ThreadPoolExecutor$Worker.run(ThreadPoolExecutor.java:907)
[junit4:junit4]    >         at java.lang.Thread.run(Thread.java:662)
[junit4:junit4]    > 	at __randomizedtesting.SeedInfo.seed([CF0ECA1AF8D51888]:0)
[junit4:junit4] Completed in 33.52s, 1 test, 2 errors <<< FAILURES!

[...truncated 135 lines...]
BUILD FAILED
C:\Users\JenkinsSlave\workspace\Lucene-Solr-trunk-Windows\build.xml:335: The following error occurred while executing this line:
C:\Users\JenkinsSlave\workspace\Lucene-Solr-trunk-Windows\build.xml:39: The following error occurred while executing this line:
C:\Users\JenkinsSlave\workspace\Lucene-Solr-trunk-Windows\solr\build.xml:185: The following error occurred while executing this line:
C:\Users\JenkinsSlave\workspace\Lucene-Solr-trunk-Windows\lucene\module-build.xml:61: The following error occurred while executing this line:
C:\Users\JenkinsSlave\workspace\Lucene-Solr-trunk-Windows\lucene\common-build.xml:1159: The following error occurred while executing this line:
C:\Users\JenkinsSlave\workspace\Lucene-Solr-trunk-Windows\lucene\common-build.xml:827: There were test failures: 43 suites, 239 tests, 2 suite-level errors, 235 ignored

Total time: 40 minutes 11 seconds
Build step 'Invoke Ant' marked build as failure
Archiving artifacts
Recording test results
Description set: Java: 32bit/jdk1.6.0_35 -server -XX:+UseConcMarkSweepGC
Email was triggered for: Failure
Sending email for trigger: Failure



Mime
View raw message