lucene-dev mailing list archives

Site index · List index
Message view « Date » · « Thread »
Top « Date » · « Thread »
From Policeman Jenkins Server <jenk...@sd-datasolutions.de>
Subject [JENKINS] Lucene-Solr-trunk-Linux (32bit/ibm-j9-jdk7) - Build # 1890 - Failure!
Date Sat, 20 Oct 2012 20:49:11 GMT
Build: http://jenkins.sd-datasolutions.de/job/Lucene-Solr-trunk-Linux/1890/
Java: 32bit/ibm-j9-jdk7 -Xjit:exclude={org/apache/lucene/util/fst/FST.pack(IIF)Lorg/apache/lucene/util/fst/FST;}

1 tests failed.
REGRESSION:  org.apache.solr.update.AutoCommitTest.testCommitWithin

Error Message:
shouldn't find any query failed XPath: //result[@numFound=0]  xml response was: <?xml version="1.0" encoding="UTF-8"?> <response> <lst name="responseHeader"><int name="status">0</int><int name="QTime">3363</int></lst><result name="response" numFound="1" start="0"><doc><int name="id">529</int><int name="range_facet_si">529</int><arr name="range_facet_l"><long>529</long></arr><arr name="range_facet_sl"><long>529</long></arr><arr name="field_t"><str>what's inside?</str></arr><arr name="subject"><str>info</str></arr><int name="intDefault">42</int><date name="timestamp">2012-10-20T20:41:46.122Z</date><arr name="multiDefault"><str>muLti-Default</str></arr></doc></result> </response>   request was: q=id:529&start=0&qt=standard&version=2.2&rows=20

Stack Trace:
java.lang.AssertionError: shouldn't find any query failed XPath: //result[@numFound=0]
 xml response was: <?xml version="1.0" encoding="UTF-8"?>
<response>
<lst name="responseHeader"><int name="status">0</int><int name="QTime">3363</int></lst><result name="response" numFound="1" start="0"><doc><int name="id">529</int><int name="range_facet_si">529</int><arr name="range_facet_l"><long>529</long></arr><arr name="range_facet_sl"><long>529</long></arr><arr name="field_t"><str>what's inside?</str></arr><arr name="subject"><str>info</str></arr><int name="intDefault">42</int><date name="timestamp">2012-10-20T20:41:46.122Z</date><arr name="multiDefault"><str>muLti-Default</str></arr></doc></result>
</response>

 request was: q=id:529&start=0&qt=standard&version=2.2&rows=20
	at __randomizedtesting.SeedInfo.seed([93EA9D0997DADEFD:2938F27114F430E8]:0)
	at org.junit.Assert.fail(Assert.java:93)
	at org.apache.solr.util.AbstractSolrTestCase.assertQ(AbstractSolrTestCase.java:276)
	at org.apache.solr.update.AutoCommitTest.testCommitWithin(AutoCommitTest.java:287)
	at sun.reflect.NativeMethodAccessorImpl.invoke0(Native Method)
	at sun.reflect.NativeMethodAccessorImpl.invoke(NativeMethodAccessorImpl.java:88)
	at sun.reflect.DelegatingMethodAccessorImpl.invoke(DelegatingMethodAccessorImpl.java:55)
	at java.lang.reflect.Method.invoke(Method.java:613)
	at com.carrotsearch.randomizedtesting.RandomizedRunner.invoke(RandomizedRunner.java:1559)
	at com.carrotsearch.randomizedtesting.RandomizedRunner.access$600(RandomizedRunner.java:79)
	at com.carrotsearch.randomizedtesting.RandomizedRunner$6.evaluate(RandomizedRunner.java:737)
	at com.carrotsearch.randomizedtesting.RandomizedRunner$7.evaluate(RandomizedRunner.java:773)
	at com.carrotsearch.randomizedtesting.RandomizedRunner$8.evaluate(RandomizedRunner.java:787)
	at com.carrotsearch.randomizedtesting.rules.SystemPropertiesRestoreRule$1.evaluate(SystemPropertiesRestoreRule.java:53)
	at org.apache.lucene.util.TestRuleSetupTeardownChained$1.evaluate(TestRuleSetupTeardownChained.java:50)
	at org.apache.lucene.util.TestRuleFieldCacheSanity$1.evaluate(TestRuleFieldCacheSanity.java:51)
	at org.apache.lucene.util.AbstractBeforeAfterRule$1.evaluate(AbstractBeforeAfterRule.java:45)
	at com.carrotsearch.randomizedtesting.rules.SystemPropertiesInvariantRule$1.evaluate(SystemPropertiesInvariantRule.java:55)
	at org.apache.lucene.util.TestRuleThreadAndTestName$1.evaluate(TestRuleThreadAndTestName.java:48)
	at org.apache.lucene.util.TestRuleIgnoreAfterMaxFailures$1.evaluate(TestRuleIgnoreAfterMaxFailures.java:70)
	at org.apache.lucene.util.TestRuleMarkFailure$1.evaluate(TestRuleMarkFailure.java:48)
	at com.carrotsearch.randomizedtesting.rules.StatementAdapter.evaluate(StatementAdapter.java:36)
	at com.carrotsearch.randomizedtesting.ThreadLeakControl$StatementRunner.run(ThreadLeakControl.java:358)
	at com.carrotsearch.randomizedtesting.ThreadLeakControl.forkTimeoutingTask(ThreadLeakControl.java:782)
	at com.carrotsearch.randomizedtesting.ThreadLeakControl$3.evaluate(ThreadLeakControl.java:442)
	at com.carrotsearch.randomizedtesting.RandomizedRunner.runSingleTest(RandomizedRunner.java:746)
	at com.carrotsearch.randomizedtesting.RandomizedRunner$3.evaluate(RandomizedRunner.java:648)
	at com.carrotsearch.randomizedtesting.RandomizedRunner$4.evaluate(RandomizedRunner.java:682)
	at com.carrotsearch.randomizedtesting.RandomizedRunner$5.evaluate(RandomizedRunner.java:693)
	at com.carrotsearch.randomizedtesting.rules.StatementAdapter.evaluate(StatementAdapter.java:36)
	at com.carrotsearch.randomizedtesting.rules.SystemPropertiesRestoreRule$1.evaluate(SystemPropertiesRestoreRule.java:53)
	at org.apache.lucene.util.AbstractBeforeAfterRule$1.evaluate(AbstractBeforeAfterRule.java:45)
	at org.apache.lucene.util.TestRuleStoreClassName$1.evaluate(TestRuleStoreClassName.java:42)
	at com.carrotsearch.randomizedtesting.rules.SystemPropertiesInvariantRule$1.evaluate(SystemPropertiesInvariantRule.java:55)
	at com.carrotsearch.randomizedtesting.rules.NoShadowingOrOverridesOnMethodsRule$1.evaluate(NoShadowingOrOverridesOnMethodsRule.java:39)
	at com.carrotsearch.randomizedtesting.rules.NoShadowingOrOverridesOnMethodsRule$1.evaluate(NoShadowingOrOverridesOnMethodsRule.java:39)
	at com.carrotsearch.randomizedtesting.rules.StatementAdapter.evaluate(StatementAdapter.java:36)
	at org.apache.lucene.util.TestRuleAssertionsRequired$1.evaluate(TestRuleAssertionsRequired.java:43)
	at org.apache.lucene.util.TestRuleMarkFailure$1.evaluate(TestRuleMarkFailure.java:48)
	at org.apache.lucene.util.TestRuleIgnoreAfterMaxFailures$1.evaluate(TestRuleIgnoreAfterMaxFailures.java:70)
	at org.apache.lucene.util.TestRuleIgnoreTestSuites$1.evaluate(TestRuleIgnoreTestSuites.java:55)
	at com.carrotsearch.randomizedtesting.rules.StatementAdapter.evaluate(StatementAdapter.java:36)
	at com.carrotsearch.randomizedtesting.ThreadLeakControl$StatementRunner.run(ThreadLeakControl.java:358)
	at java.lang.Thread.run(Thread.java:777)




Build Log:
[...truncated 8540 lines...]
[junit4:junit4] Suite: org.apache.solr.update.AutoCommitTest
[junit4:junit4]   2> 351 T435 oasu.AbstractSolrTestCase.setUp ####SETUP_START testCommitWithin
[junit4:junit4]   2> 352 T435 oasc.SolrResourceLoader.<init> new SolrResourceLoader for directory: '/mnt/ssd/jenkins/workspace/Lucene-Solr-trunk-Linux/solr/build/solr-core/test-files/solr/collection1/'
[junit4:junit4]   2> 353 T435 oasc.SolrResourceLoader.replaceClassLoader Adding 'file:/mnt/ssd/jenkins/workspace/Lucene-Solr-trunk-Linux/solr/build/solr-core/test-files/solr/collection1/lib/README' to classloader
[junit4:junit4]   2> 354 T435 oasc.SolrResourceLoader.replaceClassLoader Adding 'file:/mnt/ssd/jenkins/workspace/Lucene-Solr-trunk-Linux/solr/build/solr-core/test-files/solr/collection1/lib/classes/' to classloader
[junit4:junit4]   2> 378 T435 oasc.SolrConfig.<init> Using Lucene MatchVersion: LUCENE_50
[junit4:junit4]   2> 419 T435 oasc.SolrConfig.<init> Loaded SolrConfig: solrconfig.xml
[junit4:junit4]   2> 420 T435 oass.IndexSchema.readSchema Reading Solr Schema
[junit4:junit4]   2> 425 T435 oass.IndexSchema.readSchema Schema name=test
[junit4:junit4]   2> 741 T435 oass.OpenExchangeRatesOrgProvider.init Initialized with rates=open-exchange-rates.json, refreshInterval=1440.
[junit4:junit4]   2> 747 T435 oass.IndexSchema.readSchema default search field in schema is text
[junit4:junit4]   2> 750 T435 oass.IndexSchema.readSchema unique key field: id
[junit4:junit4]   2> 755 T435 oass.FileExchangeRateProvider.reload Reloading exchange rates from file currency.xml
[junit4:junit4]   2> 759 T435 oass.FileExchangeRateProvider.reload Reloading exchange rates from file currency.xml
[junit4:junit4]   2> 762 T435 oass.OpenExchangeRatesOrgProvider.reload Reloading exchange rates from open-exchange-rates.json
[junit4:junit4]   2> 763 T435 oass.OpenExchangeRatesOrgProvider.reload Reloading exchange rates from open-exchange-rates.json
[junit4:junit4]   2> 764 T435 oasc.SolrResourceLoader.locateSolrHome JNDI not configured for solr (NoInitialContextEx)
[junit4:junit4]   2> 764 T435 oasc.SolrResourceLoader.locateSolrHome using system property solr.solr.home: /mnt/ssd/jenkins/workspace/Lucene-Solr-trunk-Linux/solr/build/solr-core/test-files/solr
[junit4:junit4]   2> 764 T435 oasc.SolrResourceLoader.<init> new SolrResourceLoader for directory: '/mnt/ssd/jenkins/workspace/Lucene-Solr-trunk-Linux/solr/build/solr-core/test-files/solr/'
[junit4:junit4]   2> 770 T435 oasc.CoreContainer.<init> New CoreContainer -380387680
[junit4:junit4]   2> 771 T435 oasc.SolrCore.<init> [collection1] Opening new SolrCore at /mnt/ssd/jenkins/workspace/Lucene-Solr-trunk-Linux/solr/build/solr-core/test-files/solr/collection1/, dataDir=/mnt/ssd/jenkins/workspace/Lucene-Solr-trunk-Linux/solr/build/solr-core/test/J0/./org.apache.solr.update.AutoCommitTest-1350765705149/
[junit4:junit4]   2> 771 T435 oasc.JmxMonitoredMap.<init> JMX monitoring is enabled. Adding Solr mbeans to JMX Server: com.sun.jmx.mbeanserver.JmxMBeanServer@ef976cc5
[junit4:junit4]   2> 772 T435 oasc.SolrCore.getNewIndexDir New index directory detected: old=null new=/mnt/ssd/jenkins/workspace/Lucene-Solr-trunk-Linux/solr/build/solr-core/test/J0/./org.apache.solr.update.AutoCommitTest-1350765705149/index/
[junit4:junit4]   2> 773 T435 oasc.SolrCore.initIndex WARNING [collection1] Solr index directory '/mnt/ssd/jenkins/workspace/Lucene-Solr-trunk-Linux/solr/build/solr-core/test/J0/./org.apache.solr.update.AutoCommitTest-1350765705149/index' doesn't exist. Creating new index...
[junit4:junit4]   2> 773 T435 oasc.CachingDirectoryFactory.get return new directory for /mnt/ssd/jenkins/workspace/Lucene-Solr-trunk-Linux/solr/build/solr-core/test/J0/./org.apache.solr.update.AutoCommitTest-1350765705149/index forceNew:false
[junit4:junit4]   2> 775 T435 oasc.SolrDeletionPolicy.onCommit SolrDeletionPolicy.onCommit: commits:num=1
[junit4:junit4]   2> 		commit{dir=MockDirWrapper(org.apache.lucene.store.RAMDirectory@78704f59 lockFactory=org.apache.lucene.store.NativeFSLockFactory@bfc4d04e),segFN=segments_1,generation=1,filenames=[segments_1]
[junit4:junit4]   2> 775 T435 oasc.SolrDeletionPolicy.updateCommits newest commit = 1
[junit4:junit4]   2> 776 T435 oasc.SolrCore.initWriters created xml: solr.XMLResponseWriter
[junit4:junit4]   2> 778 T435 oasup.UpdateRequestProcessorChain.init inserting DistributedUpdateProcessorFactory into updateRequestProcessorChain "dedupe"
[junit4:junit4]   2> 778 T435 oasup.UpdateRequestProcessorChain.init inserting DistributedUpdateProcessorFactory into updateRequestProcessorChain "dedupe-allfields"
[junit4:junit4]   2> 779 T435 oasup.UpdateRequestProcessorChain.init inserting DistributedUpdateProcessorFactory into updateRequestProcessorChain "stored_sig"
[junit4:junit4]   2> 779 T435 oasup.UpdateRequestProcessorChain.init inserting DistributedUpdateProcessorFactory into updateRequestProcessorChain "uniq-fields"
[junit4:junit4]   2> 780 T435 oasup.UpdateRequestProcessorChain.init inserting DistributedUpdateProcessorFactory into updateRequestProcessorChain "distrib-dup-test-chain-implicit"
[junit4:junit4]   2> 780 T435 oasc.RequestHandlers.initHandlersFromConfig adding lazy requestHandler: solr.ReplicationHandler
[junit4:junit4]   2> 781 T435 oasc.RequestHandlers.initHandlersFromConfig created /replication: solr.ReplicationHandler
[junit4:junit4]   2> 781 T435 oasc.RequestHandlers.initHandlersFromConfig created standard: solr.StandardRequestHandler
[junit4:junit4]   2> 782 T435 oasc.RequestHandlers.initHandlersFromConfig created /get: solr.RealTimeGetHandler
[junit4:junit4]   2> 783 T435 oasc.RequestHandlers.initHandlersFromConfig created dismax: solr.SearchHandler
[junit4:junit4]   2> 783 T435 oasc.RequestHandlers.initHandlersFromConfig created mock: org.apache.solr.core.MockQuerySenderListenerReqHandler
[junit4:junit4]   2> 784 T435 oasc.RequestHandlers.initHandlersFromConfig created /admin/: org.apache.solr.handler.admin.AdminHandlers
[junit4:junit4]   2> 784 T435 oasc.RequestHandlers.initHandlersFromConfig created defaults: solr.StandardRequestHandler
[junit4:junit4]   2> 785 T435 oasc.RequestHandlers.initHandlersFromConfig adding lazy requestHandler: solr.StandardRequestHandler
[junit4:junit4]   2> 785 T435 oasc.RequestHandlers.initHandlersFromConfig created lazy: solr.StandardRequestHandler
[junit4:junit4]   2> 786 T435 oasc.RequestHandlers.initHandlersFromConfig created /update: solr.UpdateRequestHandler
[junit4:junit4]   2> 786 T435 oasc.RequestHandlers.initHandlersFromConfig created /terms: org.apache.solr.handler.component.SearchHandler
[junit4:junit4]   2> 787 T435 oasc.RequestHandlers.initHandlersFromConfig created spellCheckCompRH: org.apache.solr.handler.component.SearchHandler
[junit4:junit4]   2> 787 T435 oasc.RequestHandlers.initHandlersFromConfig created spellCheckCompRH_Direct: org.apache.solr.handler.component.SearchHandler
[junit4:junit4]   2> 788 T435 oasc.RequestHandlers.initHandlersFromConfig created spellCheckWithWordbreak: org.apache.solr.handler.component.SearchHandler
[junit4:junit4]   2> 789 T435 oasc.RequestHandlers.initHandlersFromConfig created spellCheckWithWordbreak_Direct: org.apache.solr.handler.component.SearchHandler
[junit4:junit4]   2> 789 T435 oasc.RequestHandlers.initHandlersFromConfig created spellCheckCompRH1: org.apache.solr.handler.component.SearchHandler
[junit4:junit4]   2> 790 T435 oasc.RequestHandlers.initHandlersFromConfig created tvrh: org.apache.solr.handler.component.SearchHandler
[junit4:junit4]   2> 790 T435 oasc.RequestHandlers.initHandlersFromConfig created /mlt: solr.MoreLikeThisHandler
[junit4:junit4]   2> 791 T435 oasc.RequestHandlers.initHandlersFromConfig created /debug/dump: solr.DumpRequestHandler
[junit4:junit4]   2> 792 T435 oashl.XMLLoader.init xsltCacheLifetimeSeconds=60
[junit4:junit4]   2> 794 T435 oasc.SolrCore.initDeprecatedSupport WARNING solrconfig.xml uses deprecated <admin/gettableFiles>, Please update your config to use the ShowFileRequestHandler.
[junit4:junit4]   2> 795 T435 oasc.SolrCore.initDeprecatedSupport WARNING adding ShowFileRequestHandler with hidden files: [BAD-SCHEMA-NOT-INDEXED-BUT-TF.XML, SCHEMA-REQUIRED-FIELDS.XML, SOLRCONFIG-MASTER1-KEEPONEBACKUP.XML, BAD-SCHEMA-NONTEXT-ANALYZER.XML, SOLRCONFIG-PROPINJECT.XML, SOLRCONFIG-PROPINJECT-INDEXDEFAULT.XML, STOP-2.TXT, SCHEMA11.XML, BAD-SCHEMA-UNIQUEKEY-USES-DEFAULT.XML, SCHEMA15.XML, SOLRCONFIG-NATIVELOCK.XML, SCHEMA-SIM.XML, CONDITIONAL.UPDATEPROCESSOR.JS, BAD-SOLRCONFIG-MISSING-SCRIPTFILE.XML, SOLRCONFIG-SCRIPT-UPDATEPROCESSOR.XML, SOLRCONFIG-REPEATER.XML, SOLRCONFIG-SPELLCHECKER.XML, SOLRCONFIG-NOCACHE.XML, SCHEMA-CHARFILTERS.XML, SOLRCONFIG-SOLCOREPROPERTIES.XML, SOLRCONFIG_CODEC.XML, BAD-SCHEMA-EXTERNAL-FILEFIELD.XML, HYPHENATION.DTD, TRIVIAL.UPDATEPROCESSOR1.JS, SCHEMA.XML, SOLRCONFIG-MERGEPOLICY.XML, SOLRCONFIG-PHRASESUGGEST.XML, SOLRCONFIG-SLAVE1.XML, SOLRCONFIG-BASIC.XML, SCHEMA-LMJELINEKMERCER.XML, BAD-MP-SOLRCONFIG.XML, BAD-SCHEMA-DUP-FIELD.XML, BAD-SCHEMA-UNIQUEKEY-MULTIVALUED.XML, SOLRCONFIG-MASTER.XML, SOLRCONFIG-HIGHLIGHT.XML, SCHEMA-TFIDF.XML, SCHEMA-REPLICATION1.XML, SYNONYMS.TXT, SOLRCONFIG-ELEVATE.XML, STOPWITHBOM.TXT, SOLRCONFIG-QUERYSENDER.XML, WDFTYPES.TXT, SOLRCONFIG-SNIPPET-PROCESSOR.XML, SOLRCONFIG-DELPOLICY1.XML, BAD_SOLRCONFIG.XML, HUNSPELL-TEST.DIC, SCHEMA-NUMERIC.XML, SCHEMA-LUCENEMATCHVERSION.XML, KEEP-2.TXT, SCHEMA-STOP-KEEP.XML, SCHEMA-IB.XML, STOP-SNOWBALL.TXT, SOLRCONFIG-INDEXCONFIG.XML, SOLRCONFIG-SLAVE.XML, BAD-SCHEMA-NOT-INDEXED-BUT-NORMS.XML, STOPWORDSWRONGENCODING.TXT, THROW.ERROR.ON.ADD.UPDATEPROCESSOR.JS, STOPTYPES-1.TXT, SOLRCONFIG-SPELLCHECKCOMPONENT.XML, SOLRCONFIG-TLOG.XML, COMPOUNDDICTIONARY.TXT, DA_COMPOUNDDICTIONARY.TXT, SOLRCONFIG-TERMINDEX.XML, BAD-SOLRCONFIG-INVALID-SCRIPTFILE.XML, SCHEMASURROUND.XML, OPEN-EXCHANGE-RATES.JSON, BAD-SCHEMA-DUP-FIELDTYPE.XML, PHRASESUGGEST.TXT, BAD-SCHEMA-CURRENCY-FT-MULTIVALUED.XML, SOLRCONFIG-MASTER2.XML, OLD_SYNONYMS.TXT, BAD-SCHEMA-UNIQUEKEY-IS-COPYFIELD-DEST.XML, SCHEMA-NOT-REQUIRED-UNIQUE-KEY.XML, BAD-SCHEMA-CODEC-GLOBAL-VS-FT-MISMATCH.XML, SCHEMA-LMDIRICHLET.XML, BAD-SCHEMA-NOT-INDEXED-BUT-POS.XML, SCHEMA-REVERSED.XML, BAD-SCHEMA-CURRENCY-MULTIVALUED.XML, SCHEMA-FOLDING.XML, SOLRCONFIG-CACHING.XML, MAPPING-ISOLATIN1ACCENT.TXT, ADDFIELDS.UPDATEPROCESSOR.JS, SCHEMA-BM25.XML, STOP-1.TXT, SOLRCONFIG-ENABLEPLUGIN.XML, MISSING.FUNCTIONS.UPDATEPROCESSOR.JS, SCHEMA12.XML, SOLRCONFIG-TRANSFORMERS.XML, SCHEMA-COPYFIELD-TEST.XML, BAD-SCHEMA-DUP-DYNAMICFIELD.XML, CURRENCY.XML, DA_UTF8.XML, MISSLEADING.EXTENSION.UPDATEPROCESSOR.JS.TXT, SOLRCONFIG-SOLR-749.XML, STOPWORDS.TXT, HUNSPELL-TEST.AFF, SOLRCONFIG_PERF.XML, SOLRCONFIG-SIMPLELOCK.XML, FRENCHARTICLES.TXT, SOLRCONFIG-LAZYWRITER.XML, SOLRCONFIG-RESPONSE-LOG-COMPONENT.XML, SCHEMA-REPLICATION2.XML, SCHEMA-SNIPPET-TYPE.XML, SCHEMA-SPATIAL.XML, SOLRCONFIG-XINCLUDE.XML, SCHEMA-SPELLCHECKER.XML, XSLT, SOLRCONFIG-DELPOLICY2.XML, TRIVIAL.UPDATEPROCESSOR0.JS, KEEP-1.TXT, BAD-SCHEMA-CURRENCY-DYNAMIC-MULTIVALUED.XML, SCHEMA-TRIE.XML, SCHEMA-BINARYFIELD.XML, BAD-SCHEMA-OMIT-TF-BUT-NOT-POS.XML, SCHEMA-MINIMAL.XML, STOPTYPES-2.TXT, SCHEMA_CODEC.XML, STEMDICT.TXT, ELEVATE.XML, SCHEMA-COLLATE.XML, PROTWORDS.TXT, SCHEMA-XINCLUDE.XML, SCHEMA-SNIPPET-FIELD.XML, SOLRCONFIG-REQHANDLER.INCL, SCHEMA-PHRASESUGGEST.XML, SCHEMA-DFR.XML, BAD-SCHEMA-ANALYZER-CLASS-AND-NESTED.XML, SOLRCONFIG-MASTER1.XML, SOLRCONFIG-FUNCTIONQUERY.XML, SOLRCONFIG-MASTER3.XML, SOLRCONFIG-UPDATE-PROCESSOR-CHAINS.XML, SOLRCONFIG-ALTDIRECTORY.XML, BAD-SCHEMA-SIM-GLOBAL-VS-FT-MISMATCH.XML, SOLRCONFIG-QUERYSENDER-NOQUERY.XML, BAD-SOLRCONFIG-BOGUS-SCRIPTENGINE-NAME.XML]
[junit4:junit4]   2> 797 T435 oass.SolrIndexSearcher.<init> Opening Searcher@a896dbb5 main
[junit4:junit4]   2> 797 T435 oass.SolrIndexSearcher.getIndexDir WARNING WARNING: Directory impl does not support setting indexDir: org.apache.lucene.store.MockDirectoryWrapper
[junit4:junit4]   2> 798 T435 oasu.CommitTracker.<init> Hard AutoCommit: disabled
[junit4:junit4]   2> 798 T435 oasu.CommitTracker.<init> Soft AutoCommit: disabled
[junit4:junit4]   2> 799 T435 oashc.SpellCheckComponent.inform Initializing spell checkers
[junit4:junit4]   2> 802 T435 oass.DirectSolrSpellChecker.init init: {name=direct,classname=DirectSolrSpellChecker,field=lowerfilt,minQueryLength=3}
[junit4:junit4]   2> 818 T435 oashc.HttpShardHandlerFactory.getParameter Setting socketTimeout to: 0
[junit4:junit4]   2> 819 T435 oashc.HttpShardHandlerFactory.getParameter Setting urlScheme to: http://
[junit4:junit4]   2> 820 T435 oashc.HttpShardHandlerFactory.getParameter Setting connTimeout to: 0
[junit4:junit4]   2> 820 T435 oashc.HttpShardHandlerFactory.getParameter Setting maxConnectionsPerHost to: 20
[junit4:junit4]   2> 821 T435 oashc.HttpShardHandlerFactory.getParameter Setting corePoolSize to: 0
[junit4:junit4]   2> 821 T435 oashc.HttpShardHandlerFactory.getParameter Setting maximumPoolSize to: 2147483647
[junit4:junit4]   2> 821 T435 oashc.HttpShardHandlerFactory.getParameter Setting maxThreadIdleTime to: 5
[junit4:junit4]   2> 822 T435 oashc.HttpShardHandlerFactory.getParameter Setting sizeOfQueue to: -1
[junit4:junit4]   2> 822 T435 oashc.HttpShardHandlerFactory.getParameter Setting fairnessPolicy to: false
[junit4:junit4]   2> 823 T435 oascsi.HttpClientUtil.createClient Creating new http client, config:maxConnectionsPerHost=20&maxConnections=10000&socketTimeout=0&connTimeout=0&retry=false
[junit4:junit4]   2> 831 T436 oasc.SolrCore.registerSearcher [collection1] Registered new searcher Searcher@a896dbb5 main{StandardDirectoryReader(segments_1:1)}
[junit4:junit4]   2> 835 T435 oasc.CoreContainer.register registering core: collection1
[junit4:junit4]   2> 836 T435 oasu.AbstractSolrTestCase.setUp ####SETUP_END testCommitWithin
[junit4:junit4]   2> 1323 T435 oasc.SolrDeletionPolicy.onInit SolrDeletionPolicy.onInit: commits:num=1
[junit4:junit4]   2> 		commit{dir=MockDirWrapper(org.apache.lucene.store.RAMDirectory@78704f59 lockFactory=org.apache.lucene.store.NativeFSLockFactory@bfc4d04e),segFN=segments_1,generation=1,filenames=[segments_1]
[junit4:junit4]   2> 1324 T435 oasc.SolrDeletionPolicy.updateCommits newest commit = 1
[junit4:junit4]   2> 1325 T435 UPDATE [collection1] {add=[529]} 0 487
[junit4:junit4]   2> 2325 T437 oasu.DirectUpdateHandler2.commit start commit{flags=0,_version_=0,optimize=false,openSearcher=true,waitSearcher=true,expungeDeletes=false,softCommit=true}
[junit4:junit4]   2> 2329 T437 oass.SolrIndexSearcher.<init> Opening Searcher@fbe901ef main
[junit4:junit4]   2> 2329 T437 oass.SolrIndexSearcher.getIndexDir WARNING WARNING: Directory impl does not support setting indexDir: org.apache.lucene.store.MockDirectoryWrapper
[junit4:junit4]   2> 2330 T437 oasu.DirectUpdateHandler2.commit end_commit_flush
[junit4:junit4]   2> 2332 T436 oasc.SolrCore.registerSearcher [collection1] Registered new searcher Searcher@fbe901ef main{StandardDirectoryReader(segments_1:3:nrt _0(5.0):C1)}
[junit4:junit4]   2> ASYNC  NEW_CORE C26 name=collection1 org.apache.solr.core.SolrCore@f76bd7b0
[junit4:junit4]   2> 5123 T435 C26 REQ [collection1] webapp=null path=null params={q=id:529&start=0&qt=standard&version=2.2&rows=20} hits=1 status=0 QTime=3363 
[junit4:junit4]   2> 5152 T435 oasu.AbstractSolrTestCase.tearDown ####TEARDOWN_START testCommitWithin
[junit4:junit4]   2> 5153 T435 oasc.CoreContainer.shutdown Shutting down CoreContainer instance=-380387680
[junit4:junit4]   2> 5153 T435 oasc.SolrCore.close [collection1]  CLOSING SolrCore org.apache.solr.core.SolrCore@f76bd7b0
[junit4:junit4]   2> 5170 T435 oasu.DirectUpdateHandler2.close closing DirectUpdateHandler2{commits=1,autocommits=0,soft autocommits=1,optimizes=0,rollbacks=0,expungeDeletes=0,docsPending=1,adds=0,deletesById=0,deletesByQuery=0,errors=0,cumulative_adds=1,cumulative_deletesById=0,cumulative_deletesByQuery=0,cumulative_errors=0}
[junit4:junit4]   2> 5171 T435 oasc.SolrCore.decrefSolrCoreState Closing SolrCoreState
[junit4:junit4]   2> 5172 T435 oasu.DefaultSolrCoreState.closeIndexWriter SolrCoreState ref count has reached 0 - closing IndexWriter
[junit4:junit4]   2> 5172 T435 oasu.DefaultSolrCoreState.closeIndexWriter closing IndexWriter with IndexWriterCloser
[junit4:junit4]   2> 5174 T435 C26 oasc.SolrDeletionPolicy.onCommit SolrDeletionPolicy.onCommit: commits:num=2
[junit4:junit4]   2> 		commit{dir=MockDirWrapper(org.apache.lucene.store.RAMDirectory@78704f59 lockFactory=org.apache.lucene.store.NativeFSLockFactory@bfc4d04e),segFN=segments_1,generation=1,filenames=[segments_1]
[junit4:junit4]   2> 		commit{dir=MockDirWrapper(org.apache.lucene.store.RAMDirectory@78704f59 lockFactory=org.apache.lucene.store.NativeFSLockFactory@bfc4d04e),segFN=segments_2,generation=2,filenames=[_0_Lucene41WithOrds_0.doc, _0_MockRandom_0.frq, _0_MockVariableIntBlock_0.doc, _0_nrm.cfe, _0_Direct_0.doc, segments_2, _0_Lucene41WithOrds_0.tib, _0_MockRandom_0.doc, _0_MockVariableIntBlock_0.pyl, _0_Lucene41WithOrds_0.pos, _0_Lucene41WithOrds_0.tii, _0_nrm.cfs, _0_MockRandom_0.pyl, _0_MockVariableIntBlock_0.tib, _0.fnm, _0_MockVariableIntBlock_0.pos, _0_MockVariableIntBlock_0.tii, _0_MockRandom_0.tib, _0_MockVariableIntBlock_0.skp, _0_Direct_0.pos, _0_Direct_0.tim, _0_MockRandom_0.pos, _0_MockRandom_0.tii, _0_MockRandom_0.sd, _0.si, _0_Direct_0.tip, _0_MockRandom_0.skp, _0.fdt, _0_MockVariableIntBlock_0.frq, _0.fdx]
[junit4:junit4]   2> 5174 T435 C26 oasc.SolrDeletionPolicy.updateCommits newest commit = 2
[junit4:junit4]   2> 5176 T435 oasc.SolrCore.closeSearcher [collection1] Closing main searcher on request.
[junit4:junit4]   2> NOTE: reproduce with: ant test  -Dtestcase=AutoCommitTest -Dtests.method=testCommitWithin -Dtests.seed=93EA9D0997DADEFD -Dtests.multiplier=3 -Dtests.slow=true -Dtests.locale=ar_QA -Dtests.timezone=America/Rankin_Inlet -Dtests.file.encoding=ISO-8859-1
[junit4:junit4] FAILURE 4.85s J0 | AutoCommitTest.testCommitWithin <<<
[junit4:junit4]    > Throwable #1: java.lang.AssertionError: shouldn't find any query failed XPath: //result[@numFound=0]
[junit4:junit4]    >  xml response was: <?xml version="1.0" encoding="UTF-8"?>
[junit4:junit4]    > <response>
[junit4:junit4]    > <lst name="responseHeader"><int name="status">0</int><int name="QTime">3363</int></lst><result name="response" numFound="1" start="0"><doc><int name="id">529</int><int name="range_facet_si">529</int><arr name="range_facet_l"><long>529</long></arr><arr name="range_facet_sl"><long>529</long></arr><arr name="field_t"><str>what's inside?</str></arr><arr name="subject"><str>info</str></arr><int name="intDefault">42</int><date name="timestamp">2012-10-20T20:41:46.122Z</date><arr name="multiDefault"><str>muLti-Default</str></arr></doc></result>
[junit4:junit4]    > </response>
[junit4:junit4]    > 
[junit4:junit4]    >  request was: q=id:529&start=0&qt=standard&version=2.2&rows=20
[junit4:junit4]    > 	at __randomizedtesting.SeedInfo.seed([93EA9D0997DADEFD:2938F27114F430E8]:0)
[junit4:junit4]    > 	at org.junit.Assert.fail(Assert.java:93)
[junit4:junit4]    > 	at org.apache.solr.util.AbstractSolrTestCase.assertQ(AbstractSolrTestCase.java:276)
[junit4:junit4]    > 	at org.apache.solr.update.AutoCommitTest.testCommitWithin(AutoCommitTest.java:287)
[junit4:junit4]    > 	at sun.reflect.NativeMethodAccessorImpl.invoke0(Native Method)
[junit4:junit4]    > 	at sun.reflect.NativeMethodAccessorImpl.invoke(NativeMethodAccessorImpl.java:88)
[junit4:junit4]    > 	at sun.reflect.DelegatingMethodAccessorImpl.invoke(DelegatingMethodAccessorImpl.java:55)
[junit4:junit4]    > 	at java.lang.reflect.Method.invoke(Method.java:613)
[junit4:junit4]    > 	at com.carrotsearch.randomizedtesting.RandomizedRunner.invoke(RandomizedRunner.java:1559)
[junit4:junit4]    > 	at com.carrotsearch.randomizedtesting.RandomizedRunner.access$600(RandomizedRunner.java:79)
[junit4:junit4]    > 	at com.carrotsearch.randomizedtesting.RandomizedRunner$6.evaluate(RandomizedRunner.java:737)
[junit4:junit4]    > 	at com.carrotsearch.randomizedtesting.RandomizedRunner$7.evaluate(RandomizedRunner.java:773)
[junit4:junit4]    > 	at com.carrotsearch.randomizedtesting.RandomizedRunner$8.evaluate(RandomizedRunner.java:787)
[junit4:junit4]    > 	at com.carrotsearch.randomizedtesting.rules.SystemPropertiesRestoreRule$1.evaluate(SystemPropertiesRestoreRule.java:53)
[junit4:junit4]    > 	at org.apache.lucene.util.TestRuleSetupTeardownChained$1.evaluate(TestRuleSetupTeardownChained.java:50)
[junit4:junit4]    > 	at org.apache.lucene.util.TestRuleFieldCacheSanity$1.evaluate(TestRuleFieldCacheSanity.java:51)
[junit4:junit4]    > 	at org.apache.lucene.util.AbstractBeforeAfterRule$1.evaluate(AbstractBeforeAfterRule.java:45)
[junit4:junit4]    > 	at com.carrotsearch.randomizedtesting.rules.SystemPropertiesInvariantRule$1.evaluate(SystemPropertiesInvariantRule.java:55)
[junit4:junit4]    > 	at org.apache.lucene.util.TestRuleThreadAndTestName$1.evaluate(TestRuleThreadAndTestName.java:48)
[junit4:junit4]    > 	at org.apache.lucene.util.TestRuleIgnoreAfterMaxFailures$1.evaluate(TestRuleIgnoreAfterMaxFailures.java:70)
[junit4:junit4]    > 	at org.apache.lucene.util.TestRuleMarkFailure$1.evaluate(TestRuleMarkFailure.java:48)
[junit4:junit4]    > 	at com.carrotsearch.randomizedtesting.rules.StatementAdapter.evaluate(StatementAdapter.java:36)
[junit4:junit4]    > 	at com.carrotsearch.randomizedtesting.ThreadLeakControl$StatementRunner.run(ThreadLeakControl.java:358)
[junit4:junit4]    > 	at com.carrotsearch.randomizedtesting.ThreadLeakControl.forkTimeoutingTask(ThreadLeakControl.java:782)
[junit4:junit4]    > 	at com.carrotsearch.randomizedtesting.ThreadLeakControl$3.evaluate(ThreadLeakControl.java:442)
[junit4:junit4]    > 	at com.carrotsearch.randomizedtesting.RandomizedRunner.runSingleTest(RandomizedRunner.java:746)
[junit4:junit4]    > 	at com.carrotsearch.randomizedtesting.RandomizedRunner$3.evaluate(RandomizedRunner.java:648)
[junit4:junit4]    > 	at com.carrotsearch.randomizedtesting.RandomizedRunner$4.evaluate(RandomizedRunner.java:682)
[junit4:junit4]    > 	at com.carrotsearch.randomizedtesting.RandomizedRunner$5.evaluate(RandomizedRunner.java:693)
[junit4:junit4]    > 	at com.carrotsearch.randomizedtesting.rules.StatementAdapter.evaluate(StatementAdapter.java:36)
[junit4:junit4]    > 	at com.carrotsearch.randomizedtesting.rules.SystemPropertiesRestoreRule$1.evaluate(SystemPropertiesRestoreRule.java:53)
[junit4:junit4]    > 	at org.apache.lucene.util.AbstractBeforeAfterRule$1.evaluate(AbstractBeforeAfterRule.java:45)
[junit4:junit4]    > 	at org.apache.lucene.util.TestRuleStoreClassName$1.evaluate(TestRuleStoreClassName.java:42)
[junit4:junit4]    > 	at com.carrotsearch.randomizedtesting.rules.SystemPropertiesInvariantRule$1.evaluate(SystemPropertiesInvariantRule.java:55)
[junit4:junit4]    > 	at com.carrotsearch.randomizedtesting.rules.NoShadowingOrOverridesOnMethodsRule$1.evaluate(NoShadowingOrOverridesOnMethodsRule.java:39)
[junit4:junit4]    > 	at com.carrotsearch.randomizedtesting.rules.NoShadowingOrOverridesOnMethodsRule$1.evaluate(NoShadowingOrOverridesOnMethodsRule.java:39)
[junit4:junit4]    > 	at com.carrotsearch.randomizedtesting.rules.StatementAdapter.evaluate(StatementAdapter.java:36)
[junit4:junit4]    > 	at org.apache.lucene.util.TestRuleAssertionsRequired$1.evaluate(TestRuleAssertionsRequired.java:43)
[junit4:junit4]    > 	at org.apache.lucene.util.TestRuleMarkFailure$1.evaluate(TestRuleMarkFailure.java:48)
[junit4:junit4]    > 	at org.apache.lucene.util.TestRuleIgnoreAfterMaxFailures$1.evaluate(TestRuleIgnoreAfterMaxFailures.java:70)
[junit4:junit4]    > 	at org.apache.lucene.util.TestRuleIgnoreTestSuites$1.evaluate(TestRuleIgnoreTestSuites.java:55)
[junit4:junit4]    > 	at com.carrotsearch.randomizedtesting.rules.StatementAdapter.evaluate(StatementAdapter.java:36)
[junit4:junit4]    > 	at com.carrotsearch.randomizedtesting.ThreadLeakControl$StatementRunner.run(ThreadLeakControl.java:358)
[junit4:junit4]    > 	at java.lang.Thread.run(Thread.java:777)
[junit4:junit4]   2> 5205 T435 oasu.AbstractSolrTestCase.setUp ####SETUP_START testMaxDocs
[junit4:junit4]   2> 5206 T435 oasc.SolrResourceLoader.<init> new SolrResourceLoader for directory: '/mnt/ssd/jenkins/workspace/Lucene-Solr-trunk-Linux/solr/build/solr-core/test-files/solr/collection1/'
[junit4:junit4]   2> 5207 T435 oasc.SolrResourceLoader.replaceClassLoader Adding 'file:/mnt/ssd/jenkins/workspace/Lucene-Solr-trunk-Linux/solr/build/solr-core/test-files/solr/collection1/lib/README' to classloader
[junit4:junit4]   2> 5208 T435 oasc.SolrResourceLoader.replaceClassLoader Adding 'file:/mnt/ssd/jenkins/workspace/Lucene-Solr-trunk-Linux/solr/build/solr-core/test-files/solr/collection1/lib/classes/' to classloader
[junit4:junit4]   2> 5237 T435 oasc.SolrConfig.<init> Using Lucene MatchVersion: LUCENE_50
[junit4:junit4]   2> 5275 T435 oasc.SolrConfig.<init> Loaded SolrConfig: solrconfig.xml
[junit4:junit4]   2> 5275 T435 oass.IndexSchema.readSchema Reading Solr Schema
[junit4:junit4]   2> 5280 T435 oass.IndexSchema.readSchema Schema name=test
[junit4:junit4]   2> 5618 T435 oass.OpenExchangeRatesOrgProvider.init Initialized with rates=open-exchange-rates.json, refreshInterval=1440.
[junit4:junit4]   2> 5624 T435 oass.IndexSchema.readSchema default search field in schema is text
[junit4:junit4]   2> 5627 T435 oass.IndexSchema.readSchema unique key field: id
[junit4:junit4]   2> 5633 T435 oass.FileExchangeRateProvider.reload Reloading exchange rates from file currency.xml
[junit4:junit4]   2> 5636 T435 oass.FileExchangeRateProvider.reload Reloading exchange rates from file currency.xml
[junit4:junit4]   2> 5639 T435 oass.OpenExchangeRatesOrgProvider.reload Reloading exchange rates from open-exchange-rates.json
[junit4:junit4]   2> 5640 T435 oass.OpenExchangeRatesOrgProvider.reload Reloading exchange rates from open-exchange-rates.json
[junit4:junit4]   2> 5641 T435 oasc.SolrResourceLoader.locateSolrHome JNDI not configured for solr (NoInitialContextEx)
[junit4:junit4]   2> 5641 T435 oasc.SolrResourceLoader.locateSolrHome using system property solr.solr.home: /mnt/ssd/jenkins/workspace/Lucene-Solr-trunk-Linux/solr/build/solr-core/test-files/solr
[junit4:junit4]   2> 5642 T435 oasc.SolrResourceLoader.<init> new SolrResourceLoader for directory: '/mnt/ssd/jenkins/workspace/Lucene-Solr-trunk-Linux/solr/build/solr-core/test-files/solr/'
[junit4:junit4]   2> 5648 T435 oasc.CoreContainer.<init> New CoreContainer 1110250453
[junit4:junit4]   2> 5648 T435 oasc.SolrCore.<init> [collection1] Opening new SolrCore at /mnt/ssd/jenkins/workspace/Lucene-Solr-trunk-Linux/solr/build/solr-core/test-files/solr/collection1/, dataDir=/mnt/ssd/jenkins/workspace/Lucene-Solr-trunk-Linux/solr/build/solr-core/test/J0/./org.apache.solr.update.AutoCommitTest-1350765710002/
[junit4:junit4]   2> 5649 T435 oasc.JmxMonitoredMap.<init> JMX monitoring is enabled. Adding Solr mbeans to JMX Server: com.sun.jmx.mbeanserver.JmxMBeanServer@ef976cc5
[junit4:junit4]   2> 5649 T435 oasc.SolrCore.getNewIndexDir New index directory detected: old=null new=/mnt/ssd/jenkins/workspace/Lucene-Solr-trunk-Linux/solr/build/solr-core/test/J0/./org.apache.solr.update.AutoCommitTest-1350765710002/index/
[junit4:junit4]   2> 5650 T435 oasc.SolrCore.initIndex WARNING [collection1] Solr index directory '/mnt/ssd/jenkins/workspace/Lucene-Solr-trunk-Linux/solr/build/solr-core/test/J0/./org.apache.solr.update.AutoCommitTest-1350765710002/index' doesn't exist. Creating new index...
[junit4:junit4]   2> 5651 T435 oasc.CachingDirectoryFactory.get return new directory for /mnt/ssd/jenkins/workspace/Lucene-Solr-trunk-Linux/solr/build/solr-core/test/J0/./org.apache.solr.update.AutoCommitTest-1350765710002/index forceNew:false
[junit4:junit4]   2> 5652 T435 oasc.SolrDeletionPolicy.onCommit SolrDeletionPolicy.onCommit: commits:num=1
[junit4:junit4]   2> 		commit{dir=MockDirWrapper(NRTCachingDirectory(org.apache.lucene.store.RAMDirectory@91fab41f lockFactory=org.apache.lucene.store.NativeFSLockFactory@87e501fe; maxCacheMB=0.5927734375 maxMergeSizeMB=0.791015625)),segFN=segments_1,generation=1,filenames=[segments_1]
[junit4:junit4]   2> 5653 T435 oasc.SolrDeletionPolicy.updateCommits newest commit = 1
[junit4:junit4]   2> 5653 T435 oasc.SolrCore.initWriters created xml: solr.XMLResponseWriter
[junit4:junit4]   2> 5655 T435 oasup.UpdateRequestProcessorChain.init inserting DistributedUpdateProcessorFactory into updateRequestProcessorChain "dedupe"
[junit4:junit4]   2> 5655 T435 oasup.UpdateRequestProcessorChain.init inserting DistributedUpdateProcessorFactory into updateRequestProcessorChain "dedupe-allfields"
[junit4:junit4]   2> 5656 T435 oasup.UpdateRequestProcessorChain.init inserting DistributedUpdateProcessorFactory into updateRequestProcessorChain "stored_sig"
[junit4:junit4]   2> 5656 T435 oasup.UpdateRequestProcessorChain.init inserting DistributedUpdateProcessorFactory into updateRequestProcessorChain "uniq-fields"
[junit4:junit4]   2> 5657 T435 oasup.UpdateRequestProcessorChain.init inserting DistributedUpdateProcessorFactory into updateRequestProcessorChain "distrib-dup-test-chain-implicit"
[junit4:junit4]   2> 5658 T435 oasc.RequestHandlers.initHandlersFromConfig adding lazy requestHandler: solr.ReplicationHandler
[junit4:junit4]   2> 5659 T435 oasc.RequestHandlers.initHandlersFromConfig created /replication: solr.ReplicationHandler
[junit4:junit4]   2> 5659 T435 oasc.RequestHandlers.initHandlersFromConfig created standard: solr.StandardRequestHandler
[junit4:junit4]   2> 5660 T435 oasc.RequestHandlers.initHandlersFromConfig created /get: solr.RealTimeGetHandler
[junit4:junit4]   2> 5661 T435 oasc.RequestHandlers.initHandlersFromConfig created dismax: solr.SearchHandler
[junit4:junit4]   2> 5662 T435 oasc.RequestHandlers.initHandlersFromConfig created mock: org.apache.solr.core.MockQuerySenderListenerReqHandler
[junit4:junit4]   2> 5662 T435 oasc.RequestHandlers.initHandlersFromConfig created /admin/: org.apache.solr.handler.admin.AdminHandlers
[junit4:junit4]   2> 5663 T435 oasc.RequestHandlers.initHandlersFromConfig created defaults: solr.StandardRequestHandler
[junit4:junit4]   2> 5664 T435 oasc.RequestHandlers.initHandlersFromConfig adding lazy requestHandler: solr.StandardRequestHandler
[junit4:junit4]   2> 5665 T435 oasc.RequestHandlers.initHandlersFromConfig created lazy: solr.StandardRequestHandler
[junit4:junit4]   2> 5666 T435 oasc.RequestHandlers.initHandlersFromConfig created /update: solr.UpdateRequestHandler
[junit4:junit4]   2> 5666 T435 oasc.RequestHandlers.initHandlersFromConfig created /terms: org.apache.solr.handler.component.SearchHandler
[junit4:junit4]   2> 5667 T435 oasc.RequestHandlers.initHandlersFromConfig created spellCheckCompRH: org.apache.solr.handler.component.SearchHandler
[junit4:junit4]   2> 5668 T435 oasc.RequestHandlers.initHandlersFromConfig created spellCheckCompRH_Direct: org.apache.solr.handler.component.SearchHandler
[junit4:junit4]   2> 5669 T435 oasc.RequestHandlers.initHandlersFromConfig created spellCheckWithWordbreak: org.apache.solr.handler.component.SearchHandler
[junit4:junit4]   2> 5669 T435 oasc.RequestHandlers.initHandlersFromConfig created spellCheckWithWordbreak_Direct: org.apache.solr.handler.component.SearchHandler
[junit4:junit4]   2> 5670 T435 oasc.RequestHandlers.initHandlersFromConfig created spellCheckCompRH1: org.apache.solr.handler.component.SearchHandler
[junit4:junit4]   2> 5670 T435 oasc.RequestHandlers.initHandlersFromConfig created tvrh: org.apache.solr.handler.component.SearchHandler
[junit4:junit4]   2> 5671 T435 oasc.RequestHandlers.initHandlersFromConfig created /mlt: solr.MoreLikeThisHandler
[junit4:junit4]   2> 5671 T435 oasc.RequestHandlers.initHandlersFromConfig created /debug/dump: solr.DumpRequestHandler
[junit4:junit4]   2> 5673 T435 oashl.XMLLoader.init xsltCacheLifetimeSeconds=60
[junit4:junit4]   2> 5674 T435 oasc.SolrCore.initDeprecatedSupport WARNING solrconfig.xml uses deprecated <admin/gettableFiles>, Please update your config to use the ShowFileRequestHandler.
[junit4:junit4]   2> 5675 T435 oasc.SolrCore.initDeprecatedSupport WARNING adding ShowFileRequestHandler with hidden files: [BAD-SCHEMA-NOT-INDEXED-BUT-TF.XML, SCHEMA-REQUIRED-FIELDS.XML, SOLRCONFIG-MASTER1-KEEPONEBACKUP.XML, BAD-SCHEMA-NONTEXT-ANALYZER.XML, SOLRCONFIG-PROPINJECT.XML, SOLRCONFIG-PROPINJECT-INDEXDEFAULT.XML, STOP-2.TXT, SCHEMA11.XML, BAD-SCHEMA-UNIQUEKEY-USES-DEFAULT.XML, SCHEMA15.XML, SOLRCONFIG-NATIVELOCK.XML, SCHEMA-SIM.XML, CONDITIONAL.UPDATEPROCESSOR.JS, BAD-SOLRCONFIG-MISSING-SCRIPTFILE.XML, SOLRCONFIG-SCRIPT-UPDATEPROCESSOR.XML, SOLRCONFIG-REPEATER.XML, SOLRCONFIG-SPELLCHECKER.XML, SOLRCONFIG-NOCACHE.XML, SCHEMA-CHARFILTERS.XML, SOLRCONFIG-SOLCOREPROPERTIES.XML, SOLRCONFIG_CODEC.XML, BAD-SCHEMA-EXTERNAL-FILEFIELD.XML, HYPHENATION.DTD, TRIVIAL.UPDATEPROCESSOR1.JS, SCHEMA.XML, SOLRCONFIG-MERGEPOLICY.XML, SOLRCONFIG-PHRASESUGGEST.XML, SOLRCONFIG-SLAVE1.XML, SOLRCONFIG-BASIC.XML, SCHEMA-LMJELINEKMERCER.XML, BAD-MP-SOLRCONFIG.XML, BAD-SCHEMA-DUP-FIELD.XML, BAD-SCHEMA-UNIQUEKEY-MULTIVALUED.XML, SOLRCONFIG-MASTER.XML, SOLRCONFIG-HIGHLIGHT.XML, SCHEMA-TFIDF.XML, SCHEMA-REPLICATION1.XML, SYNONYMS.TXT, SOLRCONFIG-ELEVATE.XML, STOPWITHBOM.TXT, SOLRCONFIG-QUERYSENDER.XML, WDFTYPES.TXT, SOLRCONFIG-SNIPPET-PROCESSOR.XML, SOLRCONFIG-DELPOLICY1.XML, BAD_SOLRCONFIG.XML, HUNSPELL-TEST.DIC, SCHEMA-NUMERIC.XML, SCHEMA-LUCENEMATCHVERSION.XML, KEEP-2.TXT, SCHEMA-STOP-KEEP.XML, SCHEMA-IB.XML, STOP-SNOWBALL.TXT, SOLRCONFIG-INDEXCONFIG.XML, SOLRCONFIG-SLAVE.XML, BAD-SCHEMA-NOT-INDEXED-BUT-NORMS.XML, STOPWORDSWRONGENCODING.TXT, THROW.ERROR.ON.ADD.UPDATEPROCESSOR.JS, STOPTYPES-1.TXT, SOLRCONFIG-SPELLCHECKCOMPONENT.XML, SOLRCONFIG-TLOG.XML, COMPOUNDDICTIONARY.TXT, DA_COMPOUNDDICTIONARY.TXT, SOLRCONFIG-TERMINDEX.XML, BAD-SOLRCONFIG-INVALID-SCRIPTFILE.XML, SCHEMASURROUND.XML, OPEN-EXCHANGE-RATES.JSON, BAD-SCHEMA-DUP-FIELDTYPE.XML, PHRASESUGGEST.TXT, BAD-SCHEMA-CURRENCY-FT-MULTIVALUED.XML, SOLRCONFIG-MASTER2.XML, OLD_SYNONYMS.TXT, BAD-SCHEMA-UNIQUEKEY-IS-COPYFIELD-DEST.XML, SCHEMA-NOT-REQUIRED-UNIQUE-KEY.XML, BAD-SCHEMA-CODEC-GLOBAL-VS-FT-MISMATCH.XML, SCHEMA-LMDIRICHLET.XML, BAD-SCHEMA-NOT-INDEXED-BUT-POS.XML, SCHEMA-REVERSED.XML, BAD-SCHEMA-CURRENCY-MULTIVALUED.XML, SCHEMA-FOLDING.XML, SOLRCONFIG-CACHING.XML, MAPPING-ISOLATIN1ACCENT.TXT, ADDFIELDS.UPDATEPROCESSOR.JS, SCHEMA-BM25.XML, STOP-1.TXT, SOLRCONFIG-ENABLEPLUGIN.XML, MISSING.FUNCTIONS.UPDATEPROCESSOR.JS, SCHEMA12.XML, SOLRCONFIG-TRANSFORMERS.XML, SCHEMA-COPYFIELD-TEST.XML, BAD-SCHEMA-DUP-DYNAMICFIELD.XML, CURRENCY.XML, DA_UTF8.XML, MISSLEADING.EXTENSION.UPDATEPROCESSOR.JS.TXT, SOLRCONFIG-SOLR-749.XML, STOPWORDS.TXT, HUNSPELL-TEST.AFF, SOLRCONFIG_PERF.XML, SOLRCONFIG-SIMPLELOCK.XML, FRENCHARTICLES.TXT, SOLRCONFIG-LAZYWRITER.XML, SOLRCONFIG-RESPONSE-LOG-COMPONENT.XML, SCHEMA-REPLICATION2.XML, SCHEMA-SNIPPET-TYPE.XML, SCHEMA-SPATIAL.XML, SOLRCONFIG-XINCLUDE.XML, SCHEMA-SPELLCHECKER.XML, XSLT, SOLRCONFIG-DELPOLICY2.XML, TRIVIAL.UPDATEPROCESSOR0.JS, KEEP-1.TXT, BAD-SCHEMA-CURRENCY-DYNAMIC-MULTIVALUED.XML, SCHEMA-TRIE.XML, SCHEMA-BINARYFIELD.XML, BAD-SCHEMA-OMIT-TF-BUT-NOT-POS.XML, SCHEMA-MINIMAL.XML, STOPTYPES-2.TXT, SCHEMA_CODEC.XML, STEMDICT.TXT, ELEVATE.XML, SCHEMA-COLLATE.XML, PROTWORDS.TXT, SCHEMA-XINCLUDE.XML, SCHEMA-SNIPPET-FIELD.XML, SOLRCONFIG-REQHANDLER.INCL, SCHEMA-PHRASESUGGEST.XML, SCHEMA-DFR.XML, BAD-SCHEMA-ANALYZER-CLASS-AND-NESTED.XML, SOLRCONFIG-MASTER1.XML, SOLRCONFIG-FUNCTIONQUERY.XML, SOLRCONFIG-MASTER3.XML, SOLRCONFIG-UPDATE-PROCESSOR-CHAINS.XML, SOLRCONFIG-ALTDIRECTORY.XML, BAD-SCHEMA-SIM-GLOBAL-VS-FT-MISMATCH.XML, SOLRCONFIG-QUERYSENDER-NOQUERY.XML, BAD-SOLRCONFIG-BOGUS-SCRIPTENGINE-NAME.XML]
[junit4:junit4]   2> 5677 T435 oass.SolrIndexSearcher.<init> Opening Searcher@b4720cb7 main
[junit4:junit4]   2> 5678 T435 oass.SolrIndexSearcher.getIndexDir WARNING WARNING: Directory impl does not support setting indexDir: org.apache.lucene.store.MockDirectoryWrapper
[junit4:junit4]   2> 5678 T435 oasu.CommitTracker.<init> Hard AutoCommit: disabled
[junit4:junit4]   2> 5679 T435 oasu.CommitTracker.<init> Soft AutoCommit: disabled
[junit4:junit4]   2> 5680 T435 oashc.SpellCheckComponent.inform Initializing spell checkers
[junit4:junit4]   2> 5747 T435 oass.DirectSolrSpellChecker.init init: {name=direct,classname=DirectSolrSpellChecker,field=lowerfilt,minQueryLength=3}
[junit4:junit4]   2> 5769 T435 oashc.HttpShardHandlerFactory.getParameter Setting socketTimeout to: 0
[junit4:junit4]   2> 5770 T435 oashc.HttpShardHandlerFactory.getParameter Setting urlScheme to: http://
[junit4:junit4]   2> 5770 T435 oashc.HttpShardHandlerFactory.getParameter Setting connTimeout to: 0
[junit4:junit4]   2> 5771 T435 oashc.HttpShardHandlerFactory.getParameter Setting maxConnectionsPerHost to: 20
[junit4:junit4]   2> 5772 T435 oashc.HttpShardHandlerFactory.getParameter Setting corePoolSize to: 0
[junit4:junit4]   2> 5773 T435 oashc.HttpShardHandlerFactory.getParameter Setting maximumPoolSize to: 2147483647
[junit4:junit4]   2> 5773 T435 oashc.HttpShardHandlerFactory.getParameter Setting maxThreadIdleTime to: 5
[junit4:junit4]   2> 5774 T435 oashc.HttpShardHandlerFactory.getParameter Setting sizeOfQueue to: -1
[junit4:junit4]   2> 5775 T435 oashc.HttpShardHandlerFactory.getParameter Setting fairnessPolicy to: false
[junit4:junit4]   2> 5775 T435 oascsi.HttpClientUtil.createClient Creating new http client, config:maxConnectionsPerHost=20&maxConnections=10000&socketTimeout=0&connTimeout=0&retry=false
[junit4:junit4]   2> 5787 T438 oasc.SolrCore.registerSearcher [collection1] Registered new searcher Searcher@b4720cb7 main{StandardDirectoryReader(segments_1:1)}
[junit4:junit4]   2> 5794 T435 oasc.CoreContainer.register registering core: collection1
[junit4:junit4]   2> 5796 T435 oasu.AbstractSolrTestCase.setUp ####SETUP_END testMaxDocs
[junit4:junit4]   2> 5816 T435 oasc.SolrDeletionPolicy.onInit SolrDeletionPolicy.onInit: commits:num=1
[junit4:junit4]   2> 		commit{dir=MockDirWrapper(NRTCachingDirectory(org.apache.lucene.store.RAMDirectory@91fab41f lockFactory=org.apache.lucene.store.NativeFSLockFactory@87e501fe; maxCacheMB=0.5927734375 maxMergeSizeMB=0.791015625)),segFN=segments_1,generation=1,filenames=[segments_1]
[junit4:junit4]   2> 5817 T435 oasc.SolrDeletionPolicy.updateCommits newest commit = 1
[junit4:junit4]   2> 5819 T435 UPDATE [collection1] {add=[0]} 0 20
[junit4:junit4]   2> 5820 T435 UPDATE [collection1] {add=[1]} 0 20
[junit4:junit4]   2> 5821 T435 UPDATE [collection1] {add=[2]} 0 20
[junit4:junit4]   2> 5822 T435 UPDATE [collection1] {add=[3]} 0 20
[junit4:junit4]   2> 5823 T435 UPDATE [collection1] {add=[4]} 0 20
[junit4:junit4]   2> 5824 T435 UPDATE [collection1] {add=[5]} 0 20
[junit4:junit4]   2> 5825 T435 UPDATE [collection1] {add=[6]} 0 20
[junit4:junit4]   2> 5826 T435 UPDATE [collection1] {add=[7]} 0 20
[junit4:junit4]   2> 5827 T435 UPDATE [collection1] {add=[8]} 0 20
[junit4:junit4]   2> 5832 T435 UPDATE [collection1] {add=[9]} 0 20
[junit4:junit4]   2> 5834 T435 UPDATE [collection1] {add=[10]} 0 20
[junit4:junit4]   2> 5835 T435 UPDATE [collection1] {add=[11]} 0 20
[junit4:junit4]   2> 5836 T435 UPDATE [collection1] {add=[12]} 0 20
[junit4:junit4]   2> 5837 T435 UPDATE [collection1] {add=[13]} 0 20
[junit4:junit4]   2> ASYNC  NEW_CORE C27 name=collection1 org.apache.solr.core.SolrCore@a184248f
[junit4:junit4]   2> 5838 T435 C27 REQ [collection1] webapp=null path=null params={q=id:1&start=0&qt=standard&version=2.2&rows=20} hits=0 status=0 QTime=1 
[junit4:junit4]   2> 5856 T435 UPDATE [collection1] {add=[14]} 0 20
[junit4:junit4]   2> 5857 T439 oasu.DirectUpdateHandler2.commit start commit{flags=0,_version_=0,optimize=false,openSearcher=true,waitSearcher=true,expungeDeletes=false,softCommit=true}
[junit4:junit4]   2> 5921 T439 oass.SolrIndexSearcher.<init> Opening Searcher@9455840b main
[junit4:junit4]   2> 5921 T439 oass.SolrIndexSearcher.getIndexDir WARNING WARNING: Directory impl does not support setting indexDir: org.apache.lucene.store.MockDirectoryWrapper
[junit4:junit4]   2> 5922 T439 oasu.DirectUpdateHandler2.commit end_commit_flush
[junit4:junit4]   2> 5924 T438 oasc.SolrCore.registerSearcher [collection1] Registered new searcher Searcher@9455840b main{StandardDirectoryReader(segments_1:5:nrt _0(5.0):C10 _1(5.0):C5)}
[junit4:junit4]   2> 6108 T435 UPDATE [collection1] {add=[15]} 0 20
[junit4:junit4]   2> 6109 T435 C27 REQ [collection1] webapp=null path=null params={q=id:14&start=0&qt=standard&version=2.2&rows=20} hits=1 status=0 QTime=0 
[junit4:junit4]   2> 6112 T435 C27 REQ [collection1] webapp=null path=null params={q=id:15&start=0&qt=standard&version=2.2&rows=20} hits=0 status=0 QTime=0 
[junit4:junit4]   2> 6114 T435 oasu.AbstractSolrTestCase.tearDown ####TEARDOWN_START testMaxDocs
[junit4:junit4]   2> 6114 T435 oasc.CoreContainer.shutdown Shutting down CoreContainer instance=1110250453
[junit4:junit4]   2> 6115 T435 oasc.SolrCore.close [collection1]  CLOSING SolrCore org.apache.solr.core.SolrCore@a184248f
[junit4:junit4]   2> 6133 T435 oasu.DirectUpdateHandler2.close closing DirectUpdateHandler2{commits=1,autocommits=0,soft autocommit maxDocs=14,soft autocommits=1,optimizes=0,rollbacks=0,expungeDeletes=0,docsPending=16,adds=1,deletesById=0,deletesByQuery=0,errors=0,cumulative_adds=16,cumulative_deletesById=0,cumulative_deletesByQuery=0,cumulative_errors=0}
[junit4:junit4]   2> 6134 T435 oasc.SolrCore.decrefSolrCoreState Closing SolrCoreState
[junit4:junit4]   2> 6134 T435 oasu.DefaultSolrCoreState.closeIndexWriter SolrCoreState ref count has reached 0 - closing IndexWriter
[junit4:junit4]   2> 6135 T435 oasu.DefaultSolrCoreState.closeIndexWriter closing IndexWriter with IndexWriterCloser
[junit4:junit4]   2> 6140 T435 C27 oasc.SolrDeletionPolicy.onCommit SolrDeletionPolicy.onCommit: commits:num=2
[junit4:junit4]   2> 		commit{dir=MockDirWrapper(NRTCachingDirectory(org.apache.lucene.store.RAMDirectory@91fab41f lockFactory=org.apache.lucene.store.NativeFSLockFactory@87e501fe; maxCacheMB=0.5927734375 maxMergeSizeMB=0.791015625)),segFN=segments_1,generation=1,filenames=[segments_1]
[junit4:junit4]   2> 		commit{dir=MockDirWrapper(NRTCachingDirectory(org.apache.lucene.store.RAMDirectory@91fab41f lockFactory=org.apache.lucene.store.NativeFSLockFactory@87e501fe; maxCacheMB=0.5927734375 maxMergeSizeMB=0.791015625)),segFN=segments_2,generation=2,filenames=[_0_Lucene41WithOrds_0.doc, _1_MockRandom_0.pyl, _0_MockRandom_0.frq, _1_MockVariableIntBlock_0.pos, _1_MockRandom_0.tib, _0_MockVariableIntBlock_0.doc, _0_nrm.cfe, _1_nrm.cfe, _2_nrm.cfe, _1_Direct_0.tim, _1_MockRandom_0.tii, _0_Direct_0.doc, _1.si, _2_Lucene41WithOrds_0.tib, _1_Direct_0.tip, _1_MockRandom_0.skp, _2_MockVariableIntBlock_0.pyl, _0_MockRandom_0.doc, _2_Lucene41WithOrds_0.tii, _0_Lucene41WithOrds_0.pos, _0_nrm.cfs, _1_nrm.cfs, _2_nrm.cfs, _2_MockVariableIntBlock_0.tib, _1_MockRandom_0.frq, _2_MockVariableIntBlock_0.tii, _0_MockVariableIntBlock_0.pos, _2_MockVariableIntBlock_0.skp, _0_Direct_0.pos, _2_Direct_0.tim, _1_Direct_0.doc, _0_MockRandom_0.pos, _2_Direct_0.tip, _0.si, _0_MockRandom_0.sd, _2_MockRandom_0.tim, _1_Lucene41WithOrds_0.tib, _1_MockRandom_0.sd, _2_MockRandom_0.sd, _1_MockRandom_0.doc, _2_MockRandom_0.tip, _1_MockVariableIntBlock_0.pyl, _2_MockVariableIntBlock_0.frq, _0.fdt, _1.fdt, _2.fdt, _1_Lucene41WithOrds_0.tii, _0.fdx, _2_Lucene41WithOrds_0.doc, _1.fdx, _2.fdx, _1_MockVariableIntBlock_0.tib, _1_MockVariableIntBlock_0.tii, _2_MockVariableIntBlock_0.doc, _1_MockVariableIntBlock_0.skp, _1_Direct_0.pos, _2_Direct_0.doc, _1_MockRandom_0.pos, segments_2, _2_MockRandom_0.doc, _0_Lucene41WithOrds_0.tib, _0_MockVariableIntBlock_0.pyl, _1_MockVariableIntBlock_0.frq, _2_Lucene41WithOrds_0.pos, _0_Lucene41WithOrds_0.tii, _1_Lucene41WithOrds_0.doc, _0_MockRandom_0.pyl, _0_MockVariableIntBlock_0.tib, _2_MockVariableIntBlock_0.pos, _0.fnm, _0_MockVariableIntBlock_0.tii, _1.fnm, _2.fnm, _2_Direct_0.pos, _1_MockVariableIntBlock_0.doc, _0_MockVariableIntBlock_0.skp, _2_MockRandom_0.pos, _2.si, _0_Direct_0.tim, _0_Direct_0.tip, _0_MockRandom_0.skp, _0_MockRandom_0.tim, _0_MockRandom_0.tip, _0_MockVariableIntBlock_0.frq, _1_Lucene41WithOrds_0.pos]
[junit4:junit4]   2> 6141 T435 C27 oasc.SolrDeletionPolicy.updateCommits newest commit = 2
[junit4:junit4]   2> 6142 T435 oasc.SolrCore.closeSearcher [collection1] Closing main searcher on request.
[junit4:junit4]   2> 6172 T435 oasu.AbstractSolrTestCase.setUp ####SETUP_START testMaxTime
[junit4:junit4]   2> 6173 T435 oasc.SolrResourceLoader.<init> new SolrResourceLoader for directory: '/mnt/ssd/jenkins/workspace/Lucene-Solr-trunk-Linux/solr/build/solr-core/test-files/solr/collection1/'
[junit4:junit4]   2> 6175 T435 oasc.SolrResourceLoader.replaceClassLoader Adding 'file:/mnt/ssd/jenkins/workspace/Lucene-Solr-trunk-Linux/solr/build/solr-core/test-files/solr/collection1/lib/README' to classloader
[junit4:junit4]   2> 6176 T435 oasc.SolrResourceLoader.replaceClassLoader Adding 'file:/mnt/ssd/jenkins/workspace/Lucene-Solr-trunk-Linux/solr/build/solr-core/test-files/solr/collection1/lib/classes/' to classloader
[junit4:junit4]   2> 6215 T435 oasc.SolrConfig.<init> Using Lucene MatchVersion: LUCENE_50
[junit4:junit4]   2> 6272 T435 oasc.SolrConfig.<init> Loaded SolrConfig: solrconfig.xml
[junit4:junit4]   2> 6273 T435 oass.IndexSchema.readSchema Reading Solr Schema
[junit4:junit4]   2> 6280 T435 oass.IndexSchema.readSchema Schema name=test
[junit4:junit4]   2> 6607 T435 oass.OpenExchangeRatesOrgProvider.init Initialized with rates=open-exchange-rates.json, refreshInterval=1440.
[junit4:junit4]   2> 6613 T435 oass.IndexSchema.readSchema default search field in schema is text
[junit4:junit4]   2> 6615 T435 oass.IndexSchema.readSchema unique key field: id
[junit4:junit4]   2> 6621 T435 oass.FileExchangeRateProvider.reload Reloading exchange rates from file currency.xml
[junit4:junit4]   2> 6625 T435 oass.FileExchangeRateProvider.reload Reloading exchange rates from file currency.xml
[junit4:junit4]   2> 6628 T435 oass.OpenExchangeRatesOrgProvider.reload Reloading exchange rates from open-exchange-rates.json
[junit4:junit4]   2> 6629 T435 oass.OpenExchangeRatesOrgProvider.reload Reloading exchange rates from open-exchange-rates.json
[junit4:junit4]   2> 6629 T435 oasc.SolrResourceLoader.locateSolrHome JNDI not configured for solr (NoInitialContextEx)
[junit4:junit4]   2> 6630 T435 oasc.SolrResourceLoader.locateSolrHome using system property solr.solr.home: /mnt/ssd/jenkins/workspace/Lucene-Solr-trunk-Linux/solr/build/solr-core/test-files/solr
[junit4:junit4]   2> 6630 T435 oasc.SolrResourceLoader.<init> new SolrResourceLoader for directory: '/mnt/ssd/jenkins/workspace/Lucene-Solr-trunk-Linux/solr/build/solr-core/test-files/solr/'
[junit4:junit4]   2> 6638 T435 oasc.CoreContainer.<init> New CoreContainer 2128028774
[junit4:junit4]   2> 6639 T435 oasc.SolrCore.<init> [collection1] Opening new SolrCore at /mnt/ssd/jenkins/workspace/Lucene-Solr-trunk-Linux/solr/build/solr-core/test-files/solr/collection1/, dataDir=/mnt/ssd/jenkins/workspace/Lucene-Solr-trunk-Linux/solr/build/solr-core/test/J0/./org.apache.solr.update.AutoCommitTest-1350765710970/
[junit4:junit4]   2> 6640 T435 oasc.JmxMonitoredMap.<init> JMX monitoring is enabled. Adding Solr mbeans to JMX Server: com.sun.jmx.mbeanserver.JmxMBeanServer@ef976cc5
[junit4:junit4]   2> 6641 T435 oasc.SolrCore.getNewIndexDir New index directory detected: old=null new=/mnt/ssd/jenkins/workspace/Lucene-Solr-trunk-Linux/solr/build/solr-core/test/J0/./org.apache.solr.update.AutoCommitTest-1350765710970/index/
[junit4:junit4]   2> 6642 T435 oasc.SolrCore.initIndex WARNING [collection1] Solr index directory '/mnt/ssd/jenkins/workspace/Lucene-Solr-trunk-Linux/solr/build/solr-core/test/J0/./org.apache.solr.update.AutoCommitTest-1350765710970/index' doesn't exist. Creating new index...
[junit4:junit4]   2> 6643 T435 oasc.CachingDirectoryFactory.get return new directory for /mnt/ssd/jenkins/workspace/Lucene-Solr-trunk-Linux/solr/build/solr-core/test/J0/./org.apache.solr.update.AutoCommitTest-1350765710970/index forceNew:false
[junit4:junit4]   2> 6645 T435 oasc.SolrDeletionPolicy.onCommit SolrDeletionPolicy.onCommit: commits:num=1
[junit4:junit4]   2> 		commit{dir=BaseDirectoryWrapper(NRTCachingDirectory(org.apache.lucene.store.RAMDirectory@9363381f lockFactory=org.apache.lucene.store.NativeFSLockFactory@787ff1ff; maxCacheMB=0.9306640625 maxMergeSizeMB=0.82421875)),segFN=segments_1,generation=1,filenames=[segments_1]
[junit4:junit4]   2> 6646 T435 oasc.SolrDeletionPolicy.updateCommits newest commit = 1
[junit4:junit4]   2> 6647 T435 oasc.SolrCore.initWriters created xml: solr.XMLResponseWriter
[junit4:junit4]   2> 6649 T435 oasup.UpdateRequestProcessorChain.init inserting DistributedUpdateProcessorFactory into updateRequestProcessorChain "dedupe"
[junit4:junit4]   2> 6650 T435 oasup.UpdateRequestProcessorChain.init inserting DistributedUpdateProcessorFactory into updateRequestProcessorChain "dedupe-allfields"
[junit4:junit4]   2> 6651 T435 oasup.UpdateRequestProcessorChain.init inserting DistributedUpdateProcessorFactory into updateRequestProcessorChain "stored_sig"
[junit4:junit4]   2> 6652 T435 oasup.UpdateRequestProcessorChain.init inserting DistributedUpdateProcessorFactory into updateRequestProcessorChain "uniq-fields"
[junit4:junit4]   2> 6653 T435 oasup.UpdateRequestProcessorChain.init inserting DistributedUpdateProcessorFactory into updateRequestProcessorChain "distrib-dup-test-chain-implicit"
[junit4:junit4]   2> 6653 T435 oasc.RequestHandlers.initHandlersFromConfig adding lazy requestHandler: solr.ReplicationHandler
[junit4:junit4]   2> 6654 T435 oasc.RequestHandlers.initHandlersFromConfig created /replication: solr.ReplicationHandler
[junit4:junit4]   2> 6655 T435 oasc.RequestHandlers.initHandlersFromConfig created standard: solr.StandardRequestHandler
[junit4:junit4]   2> 6656 T435 oasc.RequestHandlers.initHandlersFromConfig created /get: solr.RealTimeGetHandler
[junit4:junit4]   2> 6657 T435 oasc.RequestHandlers.initHandlersFromConfig created dismax: solr.SearchHandler
[junit4:junit4]   2> 6658 T435 oasc.RequestHandlers.initHandlersFromConfig created mock: org.apache.solr.core.MockQuerySenderListenerReqHandler
[junit4:junit4]   2> 6659 T435 oasc.RequestHandlers.initHandlersFromConfig created /admin/: org.apache.solr.handler.admin.AdminHandlers
[junit4:junit4]   2> 6660 T435 oasc.RequestHandlers.initHandlersFromConfig created defaults: solr.StandardRequestHandler
[junit4:junit4]   2> 6660 T435 oasc.RequestHandlers.initHandlersFromConfig adding lazy requestHandler: solr.StandardRequestHandler
[junit4:junit4]   2> 6661 T435 oasc.RequestHandlers.initHandlersFromConfig created lazy: solr.StandardRequestHandler
[junit4:junit4]   2> 6662 T435 oasc.RequestHandlers.initHandlersFromConfig created /update: solr.UpdateRequestHandler
[junit4:junit4]   2> 6663 T435 oasc.RequestHandlers.initHandlersFromConfig created /terms: org.apache.solr.handler.component.SearchHandler
[junit4:junit4]   2> 6664 T435 oasc.RequestHandlers.initHandlersFromConfig created spellCheckCompRH: org.apache.solr.handler.component.SearchHandler
[junit4:junit4]   2> 6665 T435 oasc.RequestHandlers.initHandlersFromConfig created spellCheckCompRH_Direct: org.apache.solr.handler.component.SearchHandler
[junit4:junit4]   2> 6666 T435 oasc.RequestHandlers.initHandlersFromConfig created spellCheckWithWordbreak: org.apache.solr.handler.component.SearchHandler
[junit4:junit4]   2> 6667 T435 oasc.RequestHandlers.initHandlersFromConfig created spellCheckWithWordbreak_Direct: org.apache.solr.handler.component.SearchHandler
[junit4:junit4]   2> 6667 T435 oasc.RequestHandlers.initHandlersFromConfig created spellCheckCompRH1: org.apache.solr.handler.component.SearchHandler
[junit4:junit4]   2> 6668 T435 oasc.RequestHandlers.initHandlersFromConfig created tvrh: org.apache.solr.handler.component.SearchHandler
[junit4:junit4]   2> 6669 T435 oasc.RequestHandlers.initHandlersFromConfig created /mlt: solr.MoreLikeThisHandler
[junit4:junit4]   2> 6669 T435 oasc.RequestHandlers.initHandlersFromConfig created /debug/dump: solr.DumpRequestHandler
[junit4:junit4]   2> 6670 T435 oashl.XMLLoader.init xsltCacheLifetimeSeconds=60
[junit4:junit4]   2> 6672 T435 oasc.SolrCore.initDeprecatedSupport WARNING solrconfig.xml uses deprecated <admin/gettableFiles>, Please update your config to use the ShowFileRequestHandler.
[junit4:junit4]   2> 6673 T435 oasc.SolrCore.initDeprecatedSupport WARNING adding ShowFileRequestHandler with hidden files: [BAD-SCHEMA-NOT-INDEXED-BUT-TF.XML, SCHEMA-REQUIRED-FIELDS.XML, SOLRCONFIG-MASTER1-KEEPONEBACKUP.XML, BAD-SCHEMA-NONTEXT-ANALYZER.XML, SOLRCONFIG-PROPINJECT.XML, SOLRCONFIG-PROPINJECT-INDEXDEFAULT.XML, STOP-2.TXT, SCHEMA11.XML, BAD-SCHEMA-UNIQUEKEY-USES-DEFAULT.XML, SCHEMA15.XML, SOLRCONFIG-NATIVELOCK.XML, SCHEMA-SIM.XML, CONDITIONAL.UPDATEPROCESSOR.JS, BAD-SOLRCONFIG-MISSING-SCRIPTFILE.XML, SOLRCONFIG-SCRIPT-UPDATEPROCESSOR.XML, SOLRCONFIG-REPEATER.XML, SOLRCONFIG-SPELLCHECKER.XML, SOLRCONFIG-NOCACHE.XML, SCHEMA-CHARFILTERS.XML, SOLRCONFIG-SOLCOREPROPERTIES.XML, SOLRCONFIG_CODEC.XML, BAD-SCHEMA-EXTERNAL-FILEFIELD.XML, HYPHENATION.DTD, TRIVIAL.UPDATEPROCESSOR1.JS, SCHEMA.XML, SOLRCONFIG-MERGEPOLICY.XML, SOLRCONFIG-PHRASESUGGEST.XML, SOLRCONFIG-SLAVE1.XML, SOLRCONFIG-BASIC.XML, SCHEMA-LMJELINEKMERCER.XML, BAD-MP-SOLRCONFIG.XML, BAD-SCHEMA-DUP-FIELD.XML, BAD-SCHEMA-UNIQUEKEY-MULTIVALUED.XML, SOLRCONFIG-MASTER.XML, SOLRCONFIG-HIGHLIGHT.XML, SCHEMA-TFIDF.XML, SCHEMA-REPLICATION1.XML, SYNONYMS.TXT, SOLRCONFIG-ELEVATE.XML, STOPWITHBOM.TXT, SOLRCONFIG-QUERYSENDER.XML, WDFTYPES.TXT, SOLRCONFIG-SNIPPET-PROCESSOR.XML, SOLRCONFIG-DELPOLICY1.XML, BAD_SOLRCONFIG.XML, HUNSPELL-TEST.DIC, SCHEMA-NUMERIC.XML, SCHEMA-LUCENEMATCHVERSION.XML, KEEP-2.TXT, SCHEMA-STOP-KEEP.XML, SCHEMA-IB.XML, STOP-SNOWBALL.TXT, SOLRCONFIG-INDEXCONFIG.XML, SOLRCONFIG-SLAVE.XML, BAD-SCHEMA-NOT-INDEXED-BUT-NORMS.XML, STOPWORDSWRONGENCODING.TXT, THROW.ERROR.ON.ADD.UPDATEPROCESSOR.JS, STOPTYPES-1.TXT, SOLRCONFIG-SPELLCHECKCOMPONENT.XML, SOLRCONFIG-TLOG.XML, COMPOUNDDICTIONARY.TXT, DA_COMPOUNDDICTIONARY.TXT, SOLRCONFIG-TERMINDEX.XML, BAD-SOLRCONFIG-INVALID-SCRIPTFILE.XML, SCHEMASURROUND.XML, OPEN-EXCHANGE-RATES.JSON, BAD-SCHEMA-DUP-FIELDTYPE.XML, PHRASESUGGEST.TXT, BAD-SCHEMA-CURRENCY-FT-MULTIVALUED.XML, SOLRCONFIG-MASTER2.XML, OLD_SYNONYMS.TXT, BAD-SCHEMA-UNIQUEKEY-IS-COPYFIELD-DEST.XML, SCHEMA-NOT-REQUIRED-UNIQUE-KEY.XML, BAD-SCHEMA-CODEC-GLOBAL-VS-FT-MISMATCH.XML, SCHEMA-LMDIRICHLET.XML, BAD-SCHEMA-NOT-INDEXED-BUT-POS.XML, SCHEMA-REVERSED.XML, BAD-SCHEMA-CURRENCY-MULTIVALUED.XML, SCHEMA-FOLDING.XML, SOLRCONFIG-CACHING.XML, MAPPING-ISOLATIN1ACCENT.TXT, ADDFIELDS.UPDATEPROCESSOR.JS, SCHEMA-BM25.XML, STOP-1.TXT, SOLRCONFIG-ENABLEPLUGIN.XML, MISSING.FUNCTIONS.UPDATEPROCESSOR.JS, SCHEMA12.XML, SOLRCONFIG-TRANSFORMERS.XML, SCHEMA-COPYFIELD-TEST.XML, BAD-SCHEMA-DUP-DYNAMICFIELD.XML, CURRENCY.XML, DA_UTF8.XML, MISSLEADING.EXTENSION.UPDATEPROCESSOR.JS.TXT, SOLRCONFIG-SOLR-749.XML, STOPWORDS.TXT, HUNSPELL-TEST.AFF, SOLRCONFIG_PERF.XML, SOLRCONFIG-SIMPLELOCK.XML, FRENCHARTICLES.TXT, SOLRCONFIG-LAZYWRITER.XML, SOLRCONFIG-RESPONSE-LOG-COMPONENT.XML, SCHEMA-REPLICATION2.XML, SCHEMA-SNIPPET-TYPE.XML, SCHEMA-SPATIAL.XML, SOLRCONFIG-XINCLUDE.XML, SCHEMA-SPELLCHECKER.XML, XSLT, SOLRCONFIG-DELPOLICY2.XML, TRIVIAL.UPDATEPROCESSOR0.JS, KEEP-1.TXT, BAD-SCHEMA-CURRENCY-DYNAMIC-MULTIVALUED.XML, SCHEMA-TRIE.XML, SCHEMA-BINARYFIELD.XML, BAD-SCHEMA-OMIT-TF-BUT-NOT-POS.XML, SCHEMA-MINIMAL.XML, STOPTYPES-2.TXT, SCHEMA_CODEC.XML, STEMDICT.TXT, ELEVATE.XML, SCHEMA-COLLATE.XML, PROTWORDS.TXT, SCHEMA-XINCLUDE.XML, SCHEMA-SNIPPET-FIELD.XML, SOLRCONFIG-REQHANDLER.INCL, SCHEMA-PHRASESUGGEST.XML, SCHEMA-DFR.XML, BAD-SCHEMA-ANALYZER-CLASS-AND-NESTED.XML, SOLRCONFIG-MASTER1.XML, SOLRCONFIG-FUNCTIONQUERY.XML, SOLRCONFIG-MASTER3.XML, SOLRCONFIG-UPDATE-PROCESSOR-CHAINS.XML, SOLRCONFIG-ALTDIRECTORY.XML, BAD-SCHEMA-SIM-GLOBAL-VS-FT-MISMATCH.XML, SOLRCONFIG-QUERYSENDER-NOQUERY.XML, BAD-SOLRCONFIG-BOGUS-SCRIPTENGINE-NAME.XML]
[junit4:junit4]   2> 6675 T435 oass.SolrIndexSearcher.<init> Opening Searcher@c2190e57 main
[junit4:junit4]   2> 6675 T435 oass.SolrIndexSearcher.getIndexDir WARNING WARNING: Directory impl does not support setting indexDir: org.apache.lucene.store.BaseDirectoryWrapper
[junit4:junit4]   2> 6676 T435 oasu.CommitTracker.<init> Hard AutoCommit: disabled
[junit4:junit4]   2> 6676 T435 oasu.CommitTracker.<init> Soft AutoCommit: disabled
[junit4:junit4]   2> 6677 T435 oashc.SpellCheckComponent.inform Initializing spell checkers
[junit4:junit4]   2> 6682 T435 oass.DirectSolrSpellChecker.init init: {name=direct,classname=DirectSolrSpellChecker,field=lowerfilt,minQueryLength=3}
[junit4:junit4]   2> 6711 T435 oashc.HttpShardHandlerFactory.getParameter Setting socketTimeout to: 0
[junit4:junit4]   2> 6711 T435 oashc.HttpShardHandlerFactory.getParameter Setting urlScheme to: http://
[junit4:junit4]   2> 6712 T435 oashc.HttpShardHandlerFactory.getParameter Setting connTimeout to: 0
[junit4:junit4]   2> 6712 T435 oashc.HttpShardHandlerFactory.getParameter Setting maxConnectionsPerHost to: 20
[junit4:junit4]   2> 6712 T435 oashc.HttpShardHandlerFactory.getParameter Setting corePoolSize to: 0
[junit4:junit4]   2> 6713 T435 oashc.HttpShardHandlerFactory.getParameter Setting maximumPoolSize to: 2147483647
[junit4:junit4]   2> 6713 T435 oashc.HttpShardHandlerFactory.getParameter Setting maxThreadIdleTime to: 5
[junit4:junit4]   2> 6714 T435 oashc.HttpShardHandlerFactory.getParameter Setting sizeOfQueue to: -1
[junit4:junit4]   2> 6714 T435 oashc.HttpShardHandlerFactory.getParameter Setting fairnessPolicy to: false
[junit4:junit4]   2> 6715 T435 oascsi.HttpClientUtil.createClient Creating new http client, config:maxConnectionsPerHost=20&maxConnections=10000&socketTimeout=0&connTimeout=0&retry=false
[junit4:junit4]   2> 6725 T440 oasc.SolrCore.registerSearcher [collection1] Registered new searcher Searcher@c2190e57 main{StandardDirectoryReader(segments_1:1)}
[junit4:junit4]   2> 6731 T435 oasc.CoreContainer.register registering core: collection1
[junit4:junit4]   2> 6734 T435 oasu.AbstractSolrTestCase.setUp ####SETUP_END testMaxTime
[junit4:junit4]   2> 6738 T435 oasc.SolrDeletionPolicy.onInit SolrDeletionPolicy.onInit: commits:num=1
[junit4:junit4]   2> 		commit{dir=BaseDirectoryWrapper(NRTCachingDirectory(org.apache.lucene.store.RAMDirectory@9363381f lockFactory=org.apache.lucene.store.NativeFSLockFactory@787ff1ff; maxCacheMB=0.9306640625 maxMergeSizeMB=0.82421875)),segFN=segments_1,generation=1,filenames=[segments_1]
[junit4:junit4]   2> 6739 T435 oasc.SolrDeletionPolicy.updateCommits newest commit = 1
[junit4:junit4]   2> 6741 T435 UPDATE [collection1] {add=[529]} 0 5
[junit4:junit4]   2> ASYNC  NEW_CORE C28 name=collection1 org.apache.solr.core.SolrCore@ab2c26a7
[junit4:junit4]   2> 6741 T435 C28 REQ [collection1] webapp=null path=null params={q=id:529&start=0&qt=standard&version=2.2&rows=20} hits=0 status=0 QTime=0 
[junit4:junit4]   2> 7741 T441 oasu.DirectUpdateHandler2.commit start commit{flags=0,_version_=0,optimize=false,openSearcher=true,waitSearcher=true,expungeDeletes=false,softCommit=true}
[junit4:junit4]   2> 7744 T441 oass.SolrIndexSearcher.<init> Opening Searcher@1438ff39 main
[junit4:junit4]   2> 7744 T441 oass.SolrIndexSearcher.getIndexDir WARNING WARNING: Directory impl does not support setting indexDir: org.apache.lucene.store.BaseDirectoryWrapper
[junit4:junit4]   2> 7744 T441 oasu.DirectUpdateHandler2.commit end_commit_flush
[junit4:junit4]   2> 7746 T440 oasc.SolrCore.registerSearcher [collection1] Registered new searcher Searcher@1438ff39 main{StandardDirectoryReader(segments_1:3:nrt _0(5.0):C1)}
[junit4:junit4]   2> 7747 T435 UPDATE [collection1] {add=[530]} 0 5
[junit4:junit4]   2> 7748 T435 C28 REQ [collection1] webapp=null path=null params={q=id:529&start=0&qt=standard&version=2.2&rows=20} hits=1 status=0 QTime=0 
[junit4:junit4]   2> 7750 T435 C28 REQ [collection1] webapp=null path=null params={q=id:530&start=0&qt=standard&version=2.2&rows=20} hits=0 status=0 QTime=0 
[junit4:junit4]   2> 7756 T435 C28 UPDATE [collection1] webapp=null path=null params={} {delete=[529]} 0 0
[junit4:junit4]   2> 7758 T435 C28 REQ [collection1] webapp=null path=null params={q=id:529&start=0&qt=standard&version=2.2&rows=20} hits=1 status=0 QTime=0 
[junit4:junit4]   2> 8747 T441 oasu.DirectUpdateHandler2.commit start commit{flags=0,_version_=0,optimize=false,openSearcher=true,waitSearcher=true,expungeDeletes=false,softCommit=true}
[junit4:junit4]   2> 8752 T441 oass.SolrIndexSearcher.<init> Opening Searcher@c5eaf0ea main
[junit4:junit4]   2> 8753 T441 oass.SolrIndexSearcher.getIndexDir WARNING WARNING: Directory impl does not support setting indexDir: org.apache.lucene.store.BaseDirectoryWrapper
[junit4:junit4]   2> 8753 T441 oasu.DirectUpdateHandler2.commit end_commit_flush
[junit4:junit4]   2> 8756 T440 oasc.SolrCore.registerSearcher [collection1] Registered new searcher Searcher@c5eaf0ea main{StandardDirectoryReader(segments_1:7:nrt _1(5.0):C1)}
[junit4:junit4]   2> 8761 T435 UPDATE [collection1] {add=[550]} 0 5
[junit4:junit4]   2> 8761 T435 C28 REQ [collection1] webapp=null path=null params={q=id:529&start=0&qt=standard&version=2.2&rows=20} hits=0 status=0 QTime=0 
[junit4:junit4]   2> 8763 T435 UPDATE [collection1] {add=[500]} 0 5
[junit4:junit4]   2> 8764 T435 UPDATE [collection1] {add=[500]} 0 5
[junit4:junit4]   2> 8764 T435 UPDATE [collection1] {add=[500]} 0 5
[junit4:junit4]   2> 8765 T435 UPDATE [collection1] {add=[500]} 0 5
[junit4:junit4]   2> 8765 T435 UPDATE [collection1] {add=[500]} 0 5
[junit4:junit4]   2> 8766 T435 UPDATE [collection1] {add=[500]} 0 5
[junit4:junit4]   2> 8767 T435 UPDATE [collection1] {add=[500]} 0 5
[junit4:junit4]   2> 8767 T435 UPDATE [collection1] {add=[500]} 0 5
[junit4:junit4]   2> 8770 T435 UPDATE [collection1] {add=[500]} 0 5
[junit4:junit4]   2> 8771 T435 UPDATE [collection1] {add=[500]} 0 5
[junit4:junit4]   2> 8771 T435 C28 REQ [collection1] webapp=null path=null params={q=id:500&start=0&qt=standard&version=2.2&rows=20} hits=0 status=0 QTime=0 
[junit4:junit4]   2> 9761 T441 oasu.DirectUpdateHandler2.commit start commit{flags=0,_version_=0,optimize=false,openSearcher=true,waitSearcher=true,expungeDeletes=false,softCommit=true}
[junit4:junit4]   2> 9767 T441 oass.SolrIndexSearcher.<init> Opening Searcher@a0b815bb main
[junit4:junit4]   2> 9767 T441 oass.SolrIndexSearcher.getIndexDir WARNING WARNING: Directory impl does not support setting indexDir: org.apache.lucene.store.BaseDirectoryWrapper
[junit4:junit4]   2> 9768 T441 oasu.DirectUpdateHandler2.commit end_commit_flush
[junit4:junit4]   2> 9771 T440 oasc.SolrCore.registerSearcher [collection1] Registered new searcher Searcher@a0b815bb main{StandardDirectoryReader(segments_1:12:nrt _1(5.0):C1 _2(5.0):C10/9 _3(5.0):C1)}
[junit4:junit4]   2> 9774 T435 UPDATE [collection1] {add=[531]} 0 5
[junit4:junit4]   2> 9775 T435 C28 REQ [collection1] webapp=null path=null params={q=id:500&start=0&qt=standard&version=2.2&rows=20} hits=1 status=0 QTime=0 
[junit4:junit4]   2> 9778 T435 oasu.AbstractSolrTestCase.tearDown ####TEARDOWN_START testMaxTime
[junit4:junit4]   2> 9779 T435 oasc.CoreContainer.shutdown Shutting down CoreContainer instance=2128028774
[junit4:junit4]   2> 9780 T435 oasc.SolrCore.close [collection1]  CLOSING SolrCore org.apache.solr.core.SolrCore@ab2c26a7
[junit4:junit4]   2> 9790 T435 oasu.DirectUpdateHandler2.close closing DirectUpdateHandler2{commits=3,autocommits=0,soft autocommit maxTime=1000ms,soft autocommits=3,optimizes=0,rollbacks=0,expungeDeletes=0,docsPending=14,adds=1,deletesById=0,deletesByQuery=0,errors=0,cumulative_adds=14,cumulative_deletesById=1,cumulative_deletesByQuery=0,cumulative_errors=0}
[junit4:junit4]   2> 9791 T435 oasc.SolrCore.decrefSolrCoreState Closing SolrCoreState
[junit4:junit4]   2> 9791 T435 oasu.DefaultSolrCoreState.closeIndexWriter SolrCoreState ref count has reached 0 - closing IndexWriter
[junit4:junit4]   2> 9791 T435 oasu.DefaultSolrCoreState.closeIndexWriter closing IndexWriter with IndexWriterCloser
[junit4:junit4]   2> 9795 T435 C28 oasc.SolrDeletionPolicy.onCommit SolrDeletionPolicy.onCommit: commits:num=2
[junit4:junit4]   2> 		commit{dir=BaseDirectoryWrapper(NRTCachingDirectory(org.apache.lucene.store.RAMDirectory@9363381f lockFactory=org.apache.lucene.store.NativeFSLockFactory@787ff1ff; maxCacheMB=0.9306640625 maxMergeSizeMB=0.82421875)),segFN=segments_1,generation=1,filenames=[segments_1]
[junit4:junit4]   2> 		commit{dir=BaseDirectoryWrapper(NRTCachingDirectory(org.apache.lucene.store.RAMDirectory@9363381f lockFactory=org.apache.lucene.store.NativeFSLockFactory@787ff1ff; maxCacheMB=0.9306640625 maxMergeSizeMB=0.82421875)),segFN=segments_2,generation=2,filenames=[_1_MockRandom_0.tib, _4_Direct_0.doc, _3_MockRandom_0.pos, _1.si, _4_MockRandom_0.doc, _2_Lucene41WithOrds_0.tib, _2_MockVariableIntBlock_0.pyl, _2_Lucene41WithOrds_0.tii, _1_MockRandom_0.tiv, _2_MockRandom_0.pyl, _2_MockVariableIntBlock_0.tib, _2_MockVariableIntBlock_0.tii, _2_MockRandom_0.tib, _4_Direct_0.pos, _4_MockRandom_0.pos, _4.si, _2_MockRandom_0.tii, _2_Direct_0.tim, _1_Direct_0.doc, _2_Direct_0.tip, _1_MockRandom_0.sd, _1_Lucene41WithOrds_0.tib, _2_MockRandom_0.sd, _3_MockRandom_0.sd, _4_MockRandom_0.sd, _1.fdt, _1_Lucene41WithOrds_0.tii, _3.fdt, _1.fdx, _3_MockRandom_0.pyl, _3.fdx, _1_MockVariableIntBlock_0.skp, _1_Direct_0.pos, segments_2, _3_MockRandom_0.tim, _3_MockRandom_0.tip, _1_MockVariableIntBlock_0.frq, _4_MockRandom_0.pyl, _4_MockRandom_0.tib, _1.fnm, _4_MockVariableIntBlock_0.skp, _3.fnm, _1_MockVariableIntBlock_0.doc, _4_MockRandom_0.tii, _4_Direct_0.tim, _3_Direct_0.doc, _4_Direct_0.tip, _2.si, _4_MockVariableIntBlock_0.frq, _4_Lucene41WithOrds_0.doc, _1_MockVariableIntBlock_0.pos, _4_MockVariableIntBlock_0.doc, _3_Direct_0.pos, _1_nrm.cfe, _2_nrm.cfe, _1_Direct_0.tim, _3_nrm.cfe, _4_nrm.cfe, _1_Direct_0.tip, _4_Lucene41WithOrds_0.pos, _3_Lucene41WithOrds_0.doc, _1_nrm.cfs, _2_nrm.cfs, _3_nrm.cfs, _4_nrm.cfs, _4_MockVariableIntBlock_0.pos, _2_MockVariableIntBlock_0.skp, _2_MockRandom_0.skp, _1_MockRandom_0.doc, _1_MockVariableIntBlock_0.pyl, _2_MockVariableIntBlock_0.frq, _3_Lucene41WithOrds_0.pos, _2.fdt, _4.fdt, _2_Lucene41WithOrds_0.doc, _2.fdx, _2_MockRandom_0.frq, _1_MockVariableIntBlock_0.tib, _4.fdx, _2_2.del, _1_MockVariableIntBlock_0.tii, _2_MockVariableIntBlock_0.doc, _3_Direct_0.tim, _2_Direct_0.doc, _3.si, _1_MockRandom_0.pos, _4_Lucene41WithOrds_0.tib, _3_Direct_0.tip, _3_MockRandom_0.skp, _2_MockRandom_0.doc, _4_MockVariableIntBlock_0.pyl, _4_Lucene41WithOrds_0.tii, _2_Lucene41WithOrds_0.pos, _4_MockVariableIntBlock_0.tib, _1_Lucene41WithOrds_0.doc, _3_MockRandom_0.frq, _4_MockVariableIntBlock_0.tii, _2_MockVariableIntBlock_0.pos, _2.fnm, _2_Direct_0.pos, _4.fnm, _2_MockRandom_0.pos, _4_MockRandom_0.skp, _3_Lucene41WithOrds_0.tib, _3_MockRandom_0.doc, _3_Lucene41WithOrds_0.tii, _1_Lucene41WithOrds_0.pos, _4_MockRandom_0.frq]
[junit4:junit4]   2> 9795 T435 C28 oasc.SolrDeletionPolicy.updateCommits newest commit = 2
[junit4:junit4]   2> 9796 T435 oasc.SolrCore.closeSearcher [collection1] Closing main searcher on request.
[junit4:junit4]   2> NOTE: test params are: codec=Lucene41: {range_facet_si=PostingsFormat(name=MockRandom), range_facet_l=PostingsFormat(name=MockRandom), intDefault=PostingsFormat(name=Direct), range_facet_sl=PostingsFormat(name=Lucene41WithOrds), timestamp=PostingsFormat(name=MockRandom), multiDefault=PostingsFormat(name=MockRandom), id=PostingsFormat(name=Lucene41WithOrds), subject=PostingsFormat(name=MockRandom), text=MockVariableIntBlock(baseBlockSize=93), field_t=PostingsFormat(name=Lucene41WithOrds)}, sim=RandomSimilarityProvider(queryNorm=false,coord=crazy): {}, locale=ar_QA, timezone=America/Rankin_Inlet
[junit4:junit4]   2> NOTE: Linux 3.2.0-32-generic x86/IBM Corporation 1.7.0 (32-bit)/cpus=8,threads=1,free=57792952,total=99221504
[junit4:junit4]   2> NOTE: All tests run in this JVM: [TestSolr4Spatial, CopyFieldTest, TestWordDelimiterFilterFactory, DirectSolrConnectionTest, TestNumberUtils, DistributedSpellCheckComponentTest, TestGroupingSearch, TestPHPSerializedResponseWriter, TestStressReorder, SpellCheckCollatorTest, TestLuceneMatchVersion, BasicDistributedZk2Test, TestElisionMultitermQuery, AutoCommitTest]
[junit4:junit4] Completed on J0 in 9.48s, 3 tests, 1 failure <<< FAILURES!

[...truncated 601 lines...]
BUILD FAILED
/mnt/ssd/jenkins/workspace/Lucene-Solr-trunk-Linux/build.xml:348: The following error occurred while executing this line:
/mnt/ssd/jenkins/workspace/Lucene-Solr-trunk-Linux/build.xml:39: The following error occurred while executing this line:
/mnt/ssd/jenkins/workspace/Lucene-Solr-trunk-Linux/solr/build.xml:178: The following error occurred while executing this line:
/mnt/ssd/jenkins/workspace/Lucene-Solr-trunk-Linux/lucene/module-build.xml:61: The following error occurred while executing this line:
/mnt/ssd/jenkins/workspace/Lucene-Solr-trunk-Linux/lucene/common-build.xml:1170: The following error occurred while executing this line:
/mnt/ssd/jenkins/workspace/Lucene-Solr-trunk-Linux/lucene/common-build.xml:838: There were test failures: 231 suites, 958 tests, 1 failure, 7 ignored (2 assumptions)

Total time: 25 minutes 26 seconds
Build step 'Invoke Ant' marked build as failure
Archiving artifacts
Recording test results
Description set: Java: 32bit/ibm-j9-jdk7 -Xjit:exclude={org/apache/lucene/util/fst/FST.pack(IIF)Lorg/apache/lucene/util/fst/FST;}
Email was triggered for: Failure
Sending email for trigger: Failure



Mime
View raw message