lucene-dev mailing list archives

Site index · List index
Message view « Date » · « Thread »
Top « Date » · « Thread »
From Policeman Jenkins Server <jenk...@sd-datasolutions.de>
Subject [JENKINS] Lucene-Solr-trunk-Windows (32bit/jdk1.6.0_35) - Build # 1006 - Still Failing!
Date Mon, 01 Oct 2012 22:26:09 GMT
Build: http://jenkins.sd-datasolutions.de/job/Lucene-Solr-trunk-Windows/1006/
Java: 32bit/jdk1.6.0_35 -server -XX:+UseConcMarkSweepGC

1 tests failed.
REGRESSION:  org.apache.solr.spelling.suggest.SuggesterFSTTest.testRebuild

Error Message:
Exception during query

Stack Trace:
java.lang.RuntimeException: Exception during query
	at __randomizedtesting.SeedInfo.seed([7470E2D50E5F0FFD:2F5540963A5F7567]:0)
	at org.apache.solr.SolrTestCaseJ4.assertQ(SolrTestCaseJ4.java:512)
	at org.apache.solr.SolrTestCaseJ4.assertQ(SolrTestCaseJ4.java:479)
	at org.apache.solr.spelling.suggest.SuggesterTest.testRebuild(SuggesterTest.java:105)
	at sun.reflect.NativeMethodAccessorImpl.invoke0(Native Method)
	at sun.reflect.NativeMethodAccessorImpl.invoke(NativeMethodAccessorImpl.java:39)
	at sun.reflect.DelegatingMethodAccessorImpl.invoke(DelegatingMethodAccessorImpl.java:25)
	at java.lang.reflect.Method.invoke(Method.java:597)
	at com.carrotsearch.randomizedtesting.RandomizedRunner.invoke(RandomizedRunner.java:1559)
	at com.carrotsearch.randomizedtesting.RandomizedRunner.access$600(RandomizedRunner.java:79)
	at com.carrotsearch.randomizedtesting.RandomizedRunner$6.evaluate(RandomizedRunner.java:737)
	at com.carrotsearch.randomizedtesting.RandomizedRunner$7.evaluate(RandomizedRunner.java:773)
	at com.carrotsearch.randomizedtesting.RandomizedRunner$8.evaluate(RandomizedRunner.java:787)
	at com.carrotsearch.randomizedtesting.rules.SystemPropertiesRestoreRule$1.evaluate(SystemPropertiesRestoreRule.java:53)
	at org.apache.lucene.util.TestRuleSetupTeardownChained$1.evaluate(TestRuleSetupTeardownChained.java:50)
	at org.apache.lucene.util.TestRuleFieldCacheSanity$1.evaluate(TestRuleFieldCacheSanity.java:51)
	at org.apache.lucene.util.AbstractBeforeAfterRule$1.evaluate(AbstractBeforeAfterRule.java:45)
	at com.carrotsearch.randomizedtesting.rules.SystemPropertiesInvariantRule$1.evaluate(SystemPropertiesInvariantRule.java:55)
	at org.apache.lucene.util.TestRuleThreadAndTestName$1.evaluate(TestRuleThreadAndTestName.java:48)
	at org.apache.lucene.util.TestRuleIgnoreAfterMaxFailures$1.evaluate(TestRuleIgnoreAfterMaxFailures.java:70)
	at org.apache.lucene.util.TestRuleMarkFailure$1.evaluate(TestRuleMarkFailure.java:48)
	at com.carrotsearch.randomizedtesting.rules.StatementAdapter.evaluate(StatementAdapter.java:36)
	at com.carrotsearch.randomizedtesting.ThreadLeakControl$StatementRunner.run(ThreadLeakControl.java:358)
	at com.carrotsearch.randomizedtesting.ThreadLeakControl.forkTimeoutingTask(ThreadLeakControl.java:782)
	at com.carrotsearch.randomizedtesting.ThreadLeakControl$3.evaluate(ThreadLeakControl.java:442)
	at com.carrotsearch.randomizedtesting.RandomizedRunner.runSingleTest(RandomizedRunner.java:746)
	at com.carrotsearch.randomizedtesting.RandomizedRunner$3.evaluate(RandomizedRunner.java:648)
	at com.carrotsearch.randomizedtesting.RandomizedRunner$4.evaluate(RandomizedRunner.java:682)
	at com.carrotsearch.randomizedtesting.RandomizedRunner$5.evaluate(RandomizedRunner.java:693)
	at com.carrotsearch.randomizedtesting.rules.StatementAdapter.evaluate(StatementAdapter.java:36)
	at com.carrotsearch.randomizedtesting.rules.SystemPropertiesRestoreRule$1.evaluate(SystemPropertiesRestoreRule.java:53)
	at org.apache.lucene.util.AbstractBeforeAfterRule$1.evaluate(AbstractBeforeAfterRule.java:45)
	at org.apache.lucene.util.TestRuleStoreClassName$1.evaluate(TestRuleStoreClassName.java:42)
	at com.carrotsearch.randomizedtesting.rules.SystemPropertiesInvariantRule$1.evaluate(SystemPropertiesInvariantRule.java:55)
	at com.carrotsearch.randomizedtesting.rules.NoShadowingOrOverridesOnMethodsRule$1.evaluate(NoShadowingOrOverridesOnMethodsRule.java:39)
	at com.carrotsearch.randomizedtesting.rules.NoShadowingOrOverridesOnMethodsRule$1.evaluate(NoShadowingOrOverridesOnMethodsRule.java:39)
	at com.carrotsearch.randomizedtesting.rules.StatementAdapter.evaluate(StatementAdapter.java:36)
	at org.apache.lucene.util.TestRuleAssertionsRequired$1.evaluate(TestRuleAssertionsRequired.java:43)
	at org.apache.lucene.util.TestRuleMarkFailure$1.evaluate(TestRuleMarkFailure.java:48)
	at org.apache.lucene.util.TestRuleIgnoreAfterMaxFailures$1.evaluate(TestRuleIgnoreAfterMaxFailures.java:70)
	at org.apache.lucene.util.TestRuleIgnoreTestSuites$1.evaluate(TestRuleIgnoreTestSuites.java:55)
	at com.carrotsearch.randomizedtesting.rules.StatementAdapter.evaluate(StatementAdapter.java:36)
	at com.carrotsearch.randomizedtesting.ThreadLeakControl$StatementRunner.run(ThreadLeakControl.java:358)
	at java.lang.Thread.run(Thread.java:662)
Caused by: java.lang.NullPointerException
	at org.apache.lucene.search.suggest.fst.FSTCompletionLookup.lookup(FSTCompletionLookup.java:237)
	at org.apache.solr.spelling.suggest.Suggester.getSuggestions(Suggester.java:190)
	at org.apache.solr.handler.component.SpellCheckComponent.process(SpellCheckComponent.java:172)
	at org.apache.solr.handler.component.SearchHandler.handleRequestBody(SearchHandler.java:206)
	at org.apache.solr.handler.RequestHandlerBase.handleRequest(RequestHandlerBase.java:129)
	at org.apache.solr.core.SolrCore.execute(SolrCore.java:1750)
	at org.apache.solr.util.TestHarness.query(TestHarness.java:364)
	at org.apache.solr.util.TestHarness.query(TestHarness.java:346)
	at org.apache.solr.SolrTestCaseJ4.assertQ(SolrTestCaseJ4.java:486)
	... 42 more




Build Log:
[...truncated 8204 lines...]
[junit4:junit4] Suite: org.apache.solr.spelling.suggest.SuggesterFSTTest
[junit4:junit4]   2> 5 T3396 oas.SolrTestCaseJ4.initCore ####initCore
[junit4:junit4]   2> Creating dataDir: C:\Users\JenkinsSlave\workspace\Lucene-Solr-trunk-Windows\solr\build\solr-core\test\J0\.\solrtest-SuggesterFSTTest-1349130196968
[junit4:junit4]   2> 8 T3396 oasc.SolrResourceLoader.<init> new SolrResourceLoader for directory: 'C:\Users\JenkinsSlave\workspace\Lucene-Solr-trunk-Windows\solr\build\solr-core\test-files\solr\collection1\'
[junit4:junit4]   2> 12 T3396 oasc.SolrResourceLoader.replaceClassLoader Adding 'file:/C:/Users/JenkinsSlave/workspace/Lucene-Solr-trunk-Windows/solr/build/solr-core/test-files/solr/collection1/lib/classes/' to classloader
[junit4:junit4]   2> 15 T3396 oasc.SolrResourceLoader.replaceClassLoader Adding 'file:/C:/Users/JenkinsSlave/workspace/Lucene-Solr-trunk-Windows/solr/build/solr-core/test-files/solr/collection1/lib/README' to classloader
[junit4:junit4]   2> 132 T3396 oasc.SolrConfig.<init> Using Lucene MatchVersion: LUCENE_50
[junit4:junit4]   2> 241 T3396 oasc.SolrConfig.<init> Loaded SolrConfig: solrconfig-spellchecker.xml
[junit4:junit4]   2> 242 T3396 oass.IndexSchema.readSchema Reading Solr Schema
[junit4:junit4]   2> 249 T3396 oass.IndexSchema.readSchema Schema name=Solr SpellCheck Test
[junit4:junit4]   2> 326 T3396 oass.IndexSchema.readSchema default search field in schema is text
[junit4:junit4]   2> 330 T3396 oass.IndexSchema.readSchema query parser default operator is OR
[junit4:junit4]   2> 332 T3396 oass.IndexSchema.readSchema unique key field: id
[junit4:junit4]   2> 337 T3396 oasc.SolrResourceLoader.locateSolrHome JNDI not configured for solr (NoInitialContextEx)
[junit4:junit4]   2> 339 T3396 oasc.SolrResourceLoader.locateSolrHome using system property solr.solr.home: C:\Users\JenkinsSlave\workspace\Lucene-Solr-trunk-Windows\solr\build\solr-core\test-files\solr
[junit4:junit4]   2> 340 T3396 oasc.SolrResourceLoader.<init> new SolrResourceLoader for directory: 'C:\Users\JenkinsSlave\workspace\Lucene-Solr-trunk-Windows\solr\build\solr-core\test-files\solr\'
[junit4:junit4]   2> 359 T3396 oasc.CoreContainer.<init> New CoreContainer 28427585
[junit4:junit4]   2> 360 T3396 oasc.SolrCore.<init> [collection1] Opening new SolrCore at C:\Users\JenkinsSlave\workspace\Lucene-Solr-trunk-Windows\solr\build\solr-core\test-files\solr\collection1\, dataDir=C:\Users\JenkinsSlave\workspace\Lucene-Solr-trunk-Windows\solr\build\solr-core\test\J0\.\solrtest-SuggesterFSTTest-1349130196968\
[junit4:junit4]   2> 360 T3396 oasc.SolrCore.<init> JMX monitoring not detected for core: collection1
[junit4:junit4]   2> 361 T3396 oasc.SolrCore.getNewIndexDir New index directory detected: old=null new=C:\Users\JenkinsSlave\workspace\Lucene-Solr-trunk-Windows\solr\build\solr-core\test\J0\.\solrtest-SuggesterFSTTest-1349130196968\index/
[junit4:junit4]   2> 364 T3396 oasc.SolrCore.initIndex WARNING [collection1] Solr index directory 'C:\Users\JenkinsSlave\workspace\Lucene-Solr-trunk-Windows\solr\build\solr-core\test\J0\.\solrtest-SuggesterFSTTest-1349130196968\index' doesn't exist. Creating new index...
[junit4:junit4]   2> 366 T3396 oasc.CachingDirectoryFactory.get return new directory for C:\Users\JenkinsSlave\workspace\Lucene-Solr-trunk-Windows\solr\build\solr-core\test\J0\.\solrtest-SuggesterFSTTest-1349130196968\index forceNew:false
[junit4:junit4]   2> 375 T3396 oasc.SolrDeletionPolicy.onCommit SolrDeletionPolicy.onCommit: commits:num=1
[junit4:junit4]   2> 		commit{dir=MockDirWrapper(org.apache.lucene.store.MMapDirectory@C:\Users\JenkinsSlave\workspace\Lucene-Solr-trunk-Windows\solr\build\solr-core\test\J0\solrtest-SuggesterFSTTest-1349130196968\index lockFactory=org.apache.lucene.store.NativeFSLockFactory@e9bcb7),segFN=segments_1,generation=1,filenames=[segments_1]
[junit4:junit4]   2> 375 T3396 oasc.SolrDeletionPolicy.updateCommits newest commit = 1
[junit4:junit4]   2> 377 T3396 oasc.RequestHandlers.initHandlersFromConfig created standard: solr.StandardRequestHandler
[junit4:junit4]   2> 378 T3396 oasc.RequestHandlers.initHandlersFromConfig created /suggest: org.apache.solr.handler.component.SearchHandler
[junit4:junit4]   2> 378 T3396 oasc.RequestHandlers.initHandlersFromConfig created /suggest_tst: org.apache.solr.handler.component.SearchHandler
[junit4:junit4]   2> 378 T3396 oasc.RequestHandlers.initHandlersFromConfig created /suggest_fst: org.apache.solr.handler.component.SearchHandler
[junit4:junit4]   2> 378 T3396 oasc.RequestHandlers.initHandlersFromConfig created /suggest_wfst: org.apache.solr.handler.component.SearchHandler
[junit4:junit4]   2> 396 T3396 oass.SolrIndexSearcher.<init> Opening Searcher@12d49e1 main
[junit4:junit4]   2> 396 T3396 oass.SolrIndexSearcher.getIndexDir WARNING WARNING: Directory impl does not support setting indexDir: org.apache.lucene.store.MockDirectoryWrapper
[junit4:junit4]   2> 397 T3396 oasu.CommitTracker.<init> Hard AutoCommit: disabled
[junit4:junit4]   2> 397 T3396 oasu.CommitTracker.<init> Soft AutoCommit: disabled
[junit4:junit4]   2> 397 T3396 oashc.SpellCheckComponent.inform Initializing spell checkers
[junit4:junit4]   2> 398 T3396 oasss.Suggester.init init: {name=suggest,classname=org.apache.solr.spelling.suggest.Suggester,lookupImpl=org.apache.solr.spelling.suggest.jaspell.JaspellLookup,field=suggest,storeDir=suggest,buildOnCommit=true,threshold=0.0}
[junit4:junit4]   2> 399 T3396 oasssj.JaspellLookupFactory.create init: {name=suggest,classname=org.apache.solr.spelling.suggest.Suggester,lookupImpl=org.apache.solr.spelling.suggest.jaspell.JaspellLookup,field=suggest,storeDir=suggest,buildOnCommit=true,threshold=0.0}
[junit4:junit4]   2> 401 T3396 oashc.SpellCheckComponent.inform Registering newSearcher listener for spellchecker: suggest
[junit4:junit4]   2> 401 T3396 oashc.SpellCheckComponent.inform No queryConverter defined, using default converter
[junit4:junit4]   2> 403 T3396 oashc.SpellCheckComponent.inform Initializing spell checkers
[junit4:junit4]   2> 403 T3396 oasss.Suggester.init init: {name=suggest_tst,classname=org.apache.solr.spelling.suggest.Suggester,lookupImpl=org.apache.solr.spelling.suggest.tst.TSTLookup,field=suggest,storeDir=suggest_tst,buildOnCommit=true,threshold=0.0}
[junit4:junit4]   2> 405 T3396 oashc.SpellCheckComponent.inform Registering newSearcher listener for spellchecker: suggest_tst
[junit4:junit4]   2> 406 T3396 oashc.SpellCheckComponent.inform No queryConverter defined, using default converter
[junit4:junit4]   2> 406 T3396 oashc.SpellCheckComponent.inform Initializing spell checkers
[junit4:junit4]   2> 406 T3396 oasss.Suggester.init init: {name=suggest_fst,classname=org.apache.solr.spelling.suggest.Suggester,lookupImpl=org.apache.solr.spelling.suggest.fst.FSTLookup,field=suggest,storeDir=suggest_fst,buildOnCommit=true,weightBuckets=5,exactMatchFirst=true}
[junit4:junit4]   2> 409 T3396 oashc.SpellCheckComponent.inform Registering newSearcher listener for spellchecker: suggest_fst
[junit4:junit4]   2> 425 T3396 oashc.SpellCheckComponent.inform No queryConverter defined, using default converter
[junit4:junit4]   2> 425 T3396 oashc.SpellCheckComponent.inform Initializing spell checkers
[junit4:junit4]   2> 426 T3396 oasss.Suggester.init init: {name=suggest_wfst,classname=org.apache.solr.spelling.suggest.Suggester,lookupImpl=org.apache.solr.spelling.suggest.fst.WFSTLookupFactory,field=suggest,storeDir=suggest_wfst,buildOnCommit=true,exactMatchFirst=true}
[junit4:junit4]   2> 428 T3396 oashc.SpellCheckComponent.inform Registering newSearcher listener for spellchecker: suggest_wfst
[junit4:junit4]   2> 430 T3396 oashc.SpellCheckComponent.inform No queryConverter defined, using default converter
[junit4:junit4]   2> 430 T3396 oashc.HttpShardHandlerFactory.getParameter Setting socketTimeout to: 0
[junit4:junit4]   2> 430 T3396 oashc.HttpShardHandlerFactory.getParameter Setting urlScheme to: http://
[junit4:junit4]   2> 430 T3396 oashc.HttpShardHandlerFactory.getParameter Setting connTimeout to: 0
[junit4:junit4]   2> 431 T3396 oashc.HttpShardHandlerFactory.getParameter Setting maxConnectionsPerHost to: 20
[junit4:junit4]   2> 432 T3396 oashc.HttpShardHandlerFactory.getParameter Setting corePoolSize to: 0
[junit4:junit4]   2> 432 T3396 oashc.HttpShardHandlerFactory.getParameter Setting maximumPoolSize to: 2147483647
[junit4:junit4]   2> 432 T3396 oashc.HttpShardHandlerFactory.getParameter Setting maxThreadIdleTime to: 5
[junit4:junit4]   2> 433 T3396 oashc.HttpShardHandlerFactory.getParameter Setting sizeOfQueue to: -1
[junit4:junit4]   2> 433 T3396 oashc.HttpShardHandlerFactory.getParameter Setting fairnessPolicy to: false
[junit4:junit4]   2> 433 T3396 oascsi.HttpClientUtil.createClient Creating new http client, config:maxConnectionsPerHost=20&maxConnections=10000&socketTimeout=0&connTimeout=0&retry=false
[junit4:junit4]   2> 448 T3396 oasc.CoreContainer.register registering core: collection1
[junit4:junit4]   2> 461 T3396 oas.SolrTestCaseJ4.initCore ####initCore end
[junit4:junit4]   2> 467 T3396 oas.SolrTestCaseJ4.setUp ###Starting testRebuild
[junit4:junit4]   2> ASYNC  NEW_CORE C269 name=collection1 org.apache.solr.core.SolrCore@378ce6
[junit4:junit4]   2> 482 T3396 C269 oasc.SolrDeletionPolicy.onInit SolrDeletionPolicy.onInit: commits:num=1
[junit4:junit4]   2> 		commit{dir=MockDirWrapper(org.apache.lucene.store.MMapDirectory@C:\Users\JenkinsSlave\workspace\Lucene-Solr-trunk-Windows\solr\build\solr-core\test\J0\solrtest-SuggesterFSTTest-1349130196968\index lockFactory=org.apache.lucene.store.NativeFSLockFactory@e9bcb7),segFN=segments_1,generation=1,filenames=[segments_1]
[junit4:junit4]   2> 482 T3396 C269 oasc.SolrDeletionPolicy.updateCommits newest commit = 1
[junit4:junit4]   2> 487 T3396 C269 UPDATE [collection1] webapp=null path=null params={} {add=[1]} 0 11
[junit4:junit4]   2> 514 T3396 C269 UPDATE [collection1] webapp=null path=null params={} {add=[2]} 0 1
[junit4:junit4]   2> 525 T3396 C269 UPDATE [collection1] webapp=null path=null params={} {add=[3]} 0 1
[junit4:junit4]   2> 536 T3396 C269 oasu.DirectUpdateHandler2.commit start commit{flags=0,_version_=0,optimize=false,openSearcher=true,waitSearcher=true,expungeDeletes=false,softCommit=false}
[junit4:junit4]   2> 571 T3396 C269 oasc.SolrDeletionPolicy.onCommit SolrDeletionPolicy.onCommit: commits:num=2
[junit4:junit4]   2> 		commit{dir=MockDirWrapper(org.apache.lucene.store.MMapDirectory@C:\Users\JenkinsSlave\workspace\Lucene-Solr-trunk-Windows\solr\build\solr-core\test\J0\solrtest-SuggesterFSTTest-1349130196968\index lockFactory=org.apache.lucene.store.NativeFSLockFactory@e9bcb7),segFN=segments_1,generation=1,filenames=[segments_1]
[junit4:junit4]   2> 		commit{dir=MockDirWrapper(org.apache.lucene.store.MMapDirectory@C:\Users\JenkinsSlave\workspace\Lucene-Solr-trunk-Windows\solr\build\solr-core\test\J0\solrtest-SuggesterFSTTest-1349130196968\index lockFactory=org.apache.lucene.store.NativeFSLockFactory@e9bcb7),segFN=segments_2,generation=2,filenames=[_0_MockSep_0.pos, _0_MockVariableIntBlock_0.doc, _0_MockVariableIntBlock_0.skp, _0_MockVariableIntBlock_0.pyl, _0_MockVariableIntBlock_0.tib, _0_MockSep_0.skp, _0_MockVariableIntBlock_0.pos, _0.si, _0_MockSep_0.doc, _0_MockVariableIntBlock_0.tii, _0.fnm, _0_Memory_0.ram, _0_nrm.cfs, _0_MockRandom_0.skp, _0_MockSep_0.tib, _0_MockRandom_0.sd, _0_MockRandom_0.frq, _0_MockRandom_0.tip, _0_MockRandom_0.doc, _0_nrm.cfe, _0_MockVariableIntBlock_0.frq, _0_MockRandom_0.pos, segments_2, _0_MockSep_0.frq, _0.fdx, _0_MockSep_0.tii, _0_MockRandom_0.pyl, _0_MockSep_0.pyl, _0_MockRandom_0.tim, _0.fdt]
[junit4:junit4]   2> 572 T3396 C269 oasc.SolrDeletionPolicy.updateCommits newest commit = 2
[junit4:junit4]   2> 575 T3396 C269 oasc.SolrCore.getSearcher WARNING [collection1] PERFORMANCE WARNING: Overlapping onDeckSearchers=2
[junit4:junit4]   2> 608 T3396 C269 oass.SolrIndexSearcher.<init> Opening Searcher@c02297 main
[junit4:junit4]   2> 609 T3396 C269 oass.SolrIndexSearcher.getIndexDir WARNING WARNING: Directory impl does not support setting indexDir: org.apache.lucene.store.MockDirectoryWrapper
[junit4:junit4]   2> 611 T3396 C269 oasu.DirectUpdateHandler2.commit end_commit_flush
[junit4:junit4]   2> 612 T3397 oasc.SolrCore.registerSearcher [collection1] Registered new searcher Searcher@12d49e1 main{StandardDirectoryReader(segments_1:1)}
[junit4:junit4]   2> 612 T3397 oashc.SpellCheckComponent$SpellCheckerListener.newSearcher Loading spell index for spellchecker: suggest
[junit4:junit4]   2> 612 T3397 oasss.Suggester.reload reload()
[junit4:junit4]   2> 614 T3397 oashc.SpellCheckComponent$SpellCheckerListener.newSearcher SEVERE Exception in reloading spell check index for spellchecker: suggest java.io.FileNotFoundException: C:\Users\JenkinsSlave\workspace\Lucene-Solr-trunk-Windows\solr\build\solr-core\test\J0\.\solrtest-SuggesterFSTTest-1349130196968\suggest\jaspell.dat (The system cannot find the file specified)
[junit4:junit4]   2> 	at java.io.FileInputStream.open(Native Method)
[junit4:junit4]   2> 	at java.io.FileInputStream.<init>(FileInputStream.java:120)
[junit4:junit4]   2> 	at org.apache.solr.spelling.suggest.Suggester.reload(Suggester.java:161)
[junit4:junit4]   2> 	at org.apache.solr.handler.component.SpellCheckComponent$SpellCheckerListener.newSearcher(SpellCheckComponent.java:673)
[junit4:junit4]   2> 	at org.apache.solr.core.SolrCore$5.call(SolrCore.java:1530)
[junit4:junit4]   2> 	at java.util.concurrent.FutureTask$Sync.innerRun(FutureTask.java:303)
[junit4:junit4]   2> 	at java.util.concurrent.FutureTask.run(FutureTask.java:138)
[junit4:junit4]   2> 	at java.util.concurrent.ThreadPoolExecutor$Worker.runTask(ThreadPoolExecutor.java:886)
[junit4:junit4]   2> 	at java.util.concurrent.ThreadPoolExecutor$Worker.run(ThreadPoolExecutor.java:908)
[junit4:junit4]   2> 	at java.lang.Thread.run(Thread.java:662)
[junit4:junit4]   2> 
[junit4:junit4]   2> 615 T3397 oashc.SpellCheckComponent$SpellCheckerListener.newSearcher Loading spell index for spellchecker: suggest_tst
[junit4:junit4]   2> 615 T3397 oasss.Suggester.reload reload()
[junit4:junit4]   2> 617 T3397 oashc.SpellCheckComponent$SpellCheckerListener.newSearcher SEVERE Exception in reloading spell check index for spellchecker: suggest_tst java.io.FileNotFoundException: C:\Users\JenkinsSlave\workspace\Lucene-Solr-trunk-Windows\solr\build\solr-core\test\J0\.\solrtest-SuggesterFSTTest-1349130196968\suggest_tst\tst.dat (The system cannot find the file specified)
[junit4:junit4]   2> 	at java.io.FileInputStream.open(Native Method)
[junit4:junit4]   2> 	at java.io.FileInputStream.<init>(FileInputStream.java:120)
[junit4:junit4]   2> 	at org.apache.solr.spelling.suggest.Suggester.reload(Suggester.java:161)
[junit4:junit4]   2> 	at org.apache.solr.handler.component.SpellCheckComponent$SpellCheckerListener.newSearcher(SpellCheckComponent.java:673)
[junit4:junit4]   2> 	at org.apache.solr.core.SolrCore$5.call(SolrCore.java:1530)
[junit4:junit4]   2> 	at java.util.concurrent.FutureTask$Sync.innerRun(FutureTask.java:303)
[junit4:junit4]   2> 	at java.util.concurrent.FutureTask.run(FutureTask.java:138)
[junit4:junit4]   2> 	at java.util.concurrent.ThreadPoolExecutor$Worker.runTask(ThreadPoolExecutor.java:886)
[junit4:junit4]   2> 	at java.util.concurrent.ThreadPoolExecutor$Worker.run(ThreadPoolExecutor.java:908)
[junit4:junit4]   2> 	at java.lang.Thread.run(Thread.java:662)
[junit4:junit4]   2> 
[junit4:junit4]   2> 617 T3397 oashc.SpellCheckComponent$SpellCheckerListener.newSearcher Loading spell index for spellchecker: suggest_fst
[junit4:junit4]   2> 617 T3397 oasss.Suggester.reload reload()
[junit4:junit4]   2> 619 T3397 oashc.SpellCheckComponent$SpellCheckerListener.newSearcher SEVERE Exception in reloading spell check index for spellchecker: suggest_fst java.io.FileNotFoundException: C:\Users\JenkinsSlave\workspace\Lucene-Solr-trunk-Windows\solr\build\solr-core\test\J0\.\solrtest-SuggesterFSTTest-1349130196968\suggest_fst\fst.bin (The system cannot find the file specified)
[junit4:junit4]   2> 	at java.io.FileInputStream.open(Native Method)
[junit4:junit4]   2> 	at java.io.FileInputStream.<init>(FileInputStream.java:120)
[junit4:junit4]   2> 	at org.apache.solr.spelling.suggest.Suggester.reload(Suggester.java:161)
[junit4:junit4]   2> 	at org.apache.solr.handler.component.SpellCheckComponent$SpellCheckerListener.newSearcher(SpellCheckComponent.java:673)
[junit4:junit4]   2> 	at org.apache.solr.core.SolrCore$5.call(SolrCore.java:1530)
[junit4:junit4]   2> 	at java.util.concurrent.FutureTask$Sync.innerRun(FutureTask.java:303)
[junit4:junit4]   2> 	at java.util.concurrent.FutureTask.run(FutureTask.java:138)
[junit4:junit4]   2> 	at java.util.concurrent.ThreadPoolExecutor$Worker.runTask(ThreadPoolExecutor.java:886)
[junit4:junit4]   2> 	at java.util.concurrent.ThreadPoolExecutor$Worker.run(ThreadPoolExecutor.java:908)
[junit4:junit4]   2> 	at java.lang.Thread.run(Thread.java:662)
[junit4:junit4]   2> 
[junit4:junit4]   2> 621 T3397 oashc.SpellCheckComponent$SpellCheckerListener.newSearcher Loading spell index for spellchecker: suggest_wfst
[junit4:junit4]   2> 621 T3397 oasss.Suggester.reload reload()
[junit4:junit4]   2> 622 T3397 oashc.SpellCheckComponent$SpellCheckerListener.newSearcher SEVERE Exception in reloading spell check index for spellchecker: suggest_wfst java.io.FileNotFoundException: C:\Users\JenkinsSlave\workspace\Lucene-Solr-trunk-Windows\solr\build\solr-core\test\J0\.\solrtest-SuggesterFSTTest-1349130196968\suggest_wfst\wfst.bin (The system cannot find the file specified)
[junit4:junit4]   2> 	at java.io.FileInputStream.open(Native Method)
[junit4:junit4]   2> 	at java.io.FileInputStream.<init>(FileInputStream.java:120)
[junit4:junit4]   2> 	at org.apache.solr.spelling.suggest.Suggester.reload(Suggester.java:161)
[junit4:junit4]   2> 	at org.apache.solr.handler.component.SpellCheckComponent$SpellCheckerListener.newSearcher(SpellCheckComponent.java:673)
[junit4:junit4]   2> 	at org.apache.solr.core.SolrCore$5.call(SolrCore.java:1530)
[junit4:junit4]   2> 	at java.util.concurrent.FutureTask$Sync.innerRun(FutureTask.java:303)
[junit4:junit4]   2> 	at java.util.concurrent.FutureTask.run(FutureTask.java:138)
[junit4:junit4]   2> 	at java.util.concurrent.ThreadPoolExecutor$Worker.runTask(ThreadPoolExecutor.java:886)
[junit4:junit4]   2> 	at java.util.concurrent.ThreadPoolExecutor$Worker.run(ThreadPoolExecutor.java:908)
[junit4:junit4]   2> 	at java.lang.Thread.run(Thread.java:662)
[junit4:junit4]   2> 
[junit4:junit4]   2> 625 T3397 oasc.SolrCore.registerSearcher [collection1] Registered new searcher Searcher@c02297 main{StandardDirectoryReader(segments_2:3 _0(5.0):C3)}
[junit4:junit4]   2> 625 T3396 C269 UPDATE [collection1] webapp=null path=null params={} {commit=} 0 90
[junit4:junit4]   2> 635 T3396 C269 oasc.SolrException.log SEVERE java.lang.NullPointerException
[junit4:junit4]   2> 		at org.apache.lucene.search.suggest.fst.FSTCompletionLookup.lookup(FSTCompletionLookup.java:237)
[junit4:junit4]   2> 		at org.apache.solr.spelling.suggest.Suggester.getSuggestions(Suggester.java:190)
[junit4:junit4]   2> 		at org.apache.solr.handler.component.SpellCheckComponent.process(SpellCheckComponent.java:172)
[junit4:junit4]   2> 		at org.apache.solr.handler.component.SearchHandler.handleRequestBody(SearchHandler.java:206)
[junit4:junit4]   2> 		at org.apache.solr.handler.RequestHandlerBase.handleRequest(RequestHandlerBase.java:129)
[junit4:junit4]   2> 		at org.apache.solr.core.SolrCore.execute(SolrCore.java:1750)
[junit4:junit4]   2> 		at org.apache.solr.util.TestHarness.query(TestHarness.java:364)
[junit4:junit4]   2> 		at org.apache.solr.util.TestHarness.query(TestHarness.java:346)
[junit4:junit4]   2> 		at org.apache.solr.SolrTestCaseJ4.assertQ(SolrTestCaseJ4.java:486)
[junit4:junit4]   2> 		at org.apache.solr.SolrTestCaseJ4.assertQ(SolrTestCaseJ4.java:479)
[junit4:junit4]   2> 		at org.apache.solr.spelling.suggest.SuggesterTest.testRebuild(SuggesterTest.java:105)
[junit4:junit4]   2> 		at sun.reflect.NativeMethodAccessorImpl.invoke0(Native Method)
[junit4:junit4]   2> 		at sun.reflect.NativeMethodAccessorImpl.invoke(NativeMethodAccessorImpl.java:39)
[junit4:junit4]   2> 		at sun.reflect.DelegatingMethodAccessorImpl.invoke(DelegatingMethodAccessorImpl.java:25)
[junit4:junit4]   2> 		at java.lang.reflect.Method.invoke(Method.java:597)
[junit4:junit4]   2> 		at com.carrotsearch.randomizedtesting.RandomizedRunner.invoke(RandomizedRunner.java:1559)
[junit4:junit4]   2> 		at com.carrotsearch.randomizedtesting.RandomizedRunner.access$600(RandomizedRunner.java:79)
[junit4:junit4]   2> 		at com.carrotsearch.randomizedtesting.RandomizedRunner$6.evaluate(RandomizedRunner.java:737)
[junit4:junit4]   2> 		at com.carrotsearch.randomizedtesting.RandomizedRunner$7.evaluate(RandomizedRunner.java:773)
[junit4:junit4]   2> 		at com.carrotsearch.randomizedtesting.RandomizedRunner$8.evaluate(RandomizedRunner.java:787)
[junit4:junit4]   2> 		at com.carrotsearch.randomizedtesting.rules.SystemPropertiesRestoreRule$1.evaluate(SystemPropertiesRestoreRule.java:53)
[junit4:junit4]   2> 		at org.apache.lucene.util.TestRuleSetupTeardownChained$1.evaluate(TestRuleSetupTeardownChained.java:50)
[junit4:junit4]   2> 		at org.apache.lucene.util.TestRuleFieldCacheSanity$1.evaluate(TestRuleFieldCacheSanity.java:51)
[junit4:junit4]   2> 		at org.apache.lucene.util.AbstractBeforeAfterRule$1.evaluate(AbstractBeforeAfterRule.java:45)
[junit4:junit4]   2> 		at com.carrotsearch.randomizedtesting.rules.SystemPropertiesInvariantRule$1.evaluate(SystemPropertiesInvariantRule.java:55)
[junit4:junit4]   2> 		at org.apache.lucene.util.TestRuleThreadAndTestName$1.evaluate(TestRuleThreadAndTestName.java:48)
[junit4:junit4]   2> 		at org.apache.lucene.util.TestRuleIgnoreAfterMaxFailures$1.evaluate(TestRuleIgnoreAfterMaxFailures.java:70)
[junit4:junit4]   2> 		at org.apache.lucene.util.TestRuleMarkFailure$1.evaluate(TestRuleMarkFailure.java:48)
[junit4:junit4]   2> 		at com.carrotsearch.randomizedtesting.rules.StatementAdapter.evaluate(StatementAdapter.java:36)
[junit4:junit4]   2> 		at com.carrotsearch.randomizedtesting.ThreadLeakControl$StatementRunner.run(ThreadLeakControl.java:358)
[junit4:junit4]   2> 		at com.carrotsearch.randomizedtesting.ThreadLeakControl.forkTimeoutingTask(ThreadLeakControl.java:782)
[junit4:junit4]   2> 		at com.carrotsearch.randomizedtesting.ThreadLeakControl$3.evaluate(ThreadLeakControl.java:442)
[junit4:junit4]   2> 		at com.carrotsearch.randomizedtesting.RandomizedRunner.runSingleTest(RandomizedRunner.java:746)
[junit4:junit4]   2> 		at com.carrotsearch.randomizedtesting.RandomizedRunner$3.evaluate(RandomizedRunner.java:648)
[junit4:junit4]   2> 		at com.carrotsearch.randomizedtesting.RandomizedRunner$4.evaluate(RandomizedRunner.java:682)
[junit4:junit4]   2> 		at com.carrotsearch.randomizedtesting.RandomizedRunner$5.evaluate(RandomizedRunner.java:693)
[junit4:junit4]   2> 		at com.carrotsearch.randomizedtesting.rules.StatementAdapter.evaluate(StatementAdapter.java:36)
[junit4:junit4]   2> 		at com.carrotsearch.randomizedtesting.rules.SystemPropertiesRestoreRule$1.evaluate(SystemPropertiesRestoreRule.java:53)
[junit4:junit4]   2> 		at org.apache.lucene.util.AbstractBeforeAfterRule$1.evaluate(AbstractBeforeAfterRule.java:45)
[junit4:junit4]   2> 		at org.apache.lucene.util.TestRuleStoreClassName$1.evaluate(TestRuleStoreClassName.java:42)
[junit4:junit4]   2> 		at com.carrotsearch.randomizedtesting.rules.SystemPropertiesInvariantRule$1.evaluate(SystemPropertiesInvariantRule.java:55)
[junit4:junit4]   2> 		at com.carrotsearch.randomizedtesting.rules.NoShadowingOrOverridesOnMethodsRule$1.evaluate(NoShadowingOrOverridesOnMethodsRule.java:39)
[junit4:junit4]   2> 		at com.carrotsearch.randomizedtesting.rules.NoShadowingOrOverridesOnMethodsRule$1.evaluate(NoShadowingOrOverridesOnMethodsRule.java:39)
[junit4:junit4]   2> 		at com.carrotsearch.randomizedtesting.rules.StatementAdapter.evaluate(StatementAdapter.java:36)
[junit4:junit4]   2> 		at org.apache.lucene.util.TestRuleAssertionsRequired$1.evaluate(TestRuleAssertionsRequired.java:43)
[junit4:junit4]   2> 		at org.apache.lucene.util.TestRuleMarkFailure$1.evaluate(TestRuleMarkFailure.java:48)
[junit4:junit4]   2> 		at org.apache.lucene.util.TestRuleIgnoreAfterMaxFailures$1.evaluate(TestRuleIgnoreAfterMaxFailures.java:70)
[junit4:junit4]   2> 		at org.apache.lucene.util.TestRuleIgnoreTestSuites$1.evaluate(TestRuleIgnoreTestSuites.java:55)
[junit4:junit4]   2> 		at com.carrotsearch.randomizedtesting.rules.StatementAdapter.evaluate(StatementAdapter.java:36)
[junit4:junit4]   2> 		at com.carrotsearch.randomizedtesting.ThreadLeakControl$StatementRunner.run(ThreadLeakControl.java:358)
[junit4:junit4]   2> 		at java.lang.Thread.run(Thread.java:662)
[junit4:junit4]   2> 	
[junit4:junit4]   2> 637 T3396 C269 REQ [collection1] webapp=null path=null params={q=ac&spellcheck.count=2&qt=/suggest_fst&spellcheck.onlyMorePopular=true} status=500 QTime=2 
[junit4:junit4]   2> 639 T3396 oasc.SolrException.log SEVERE REQUEST FAILED: q=ac&spellcheck.count=2&qt=/suggest_fst&spellcheck.onlyMorePopular=true:java.lang.NullPointerException
[junit4:junit4]   2> 		at org.apache.lucene.search.suggest.fst.FSTCompletionLookup.lookup(FSTCompletionLookup.java:237)
[junit4:junit4]   2> 		at org.apache.solr.spelling.suggest.Suggester.getSuggestions(Suggester.java:190)
[junit4:junit4]   2> 		at org.apache.solr.handler.component.SpellCheckComponent.process(SpellCheckComponent.java:172)
[junit4:junit4]   2> 		at org.apache.solr.handler.component.SearchHandler.handleRequestBody(SearchHandler.java:206)
[junit4:junit4]   2> 		at org.apache.solr.handler.RequestHandlerBase.handleRequest(RequestHandlerBase.java:129)
[junit4:junit4]   2> 		at org.apache.solr.core.SolrCore.execute(SolrCore.java:1750)
[junit4:junit4]   2> 		at org.apache.solr.util.TestHarness.query(TestHarness.java:364)
[junit4:junit4]   2> 		at org.apache.solr.util.TestHarness.query(TestHarness.java:346)
[junit4:junit4]   2> 		at org.apache.solr.SolrTestCaseJ4.assertQ(SolrTestCaseJ4.java:486)
[junit4:junit4]   2> 		at org.apache.solr.SolrTestCaseJ4.assertQ(SolrTestCaseJ4.java:479)
[junit4:junit4]   2> 		at org.apache.solr.spelling.suggest.SuggesterTest.testRebuild(SuggesterTest.java:105)
[junit4:junit4]   2> 		at sun.reflect.NativeMethodAccessorImpl.invoke0(Native Method)
[junit4:junit4]   2> 		at sun.reflect.NativeMethodAccessorImpl.invoke(NativeMethodAccessorImpl.java:39)
[junit4:junit4]   2> 		at sun.reflect.DelegatingMethodAccessorImpl.invoke(DelegatingMethodAccessorImpl.java:25)
[junit4:junit4]   2> 		at java.lang.reflect.Method.invoke(Method.java:597)
[junit4:junit4]   2> 		at com.carrotsearch.randomizedtesting.RandomizedRunner.invoke(RandomizedRunner.java:1559)
[junit4:junit4]   2> 		at com.carrotsearch.randomizedtesting.RandomizedRunner.access$600(RandomizedRunner.java:79)
[junit4:junit4]   2> 		at com.carrotsearch.randomizedtesting.RandomizedRunner$6.evaluate(RandomizedRunner.java:737)
[junit4:junit4]   2> 		at com.carrotsearch.randomizedtesting.RandomizedRunner$7.evaluate(RandomizedRunner.java:773)
[junit4:junit4]   2> 		at com.carrotsearch.randomizedtesting.RandomizedRunner$8.evaluate(RandomizedRunner.java:787)
[junit4:junit4]   2> 		at com.carrotsearch.randomizedtesting.rules.SystemPropertiesRestoreRule$1.evaluate(SystemPropertiesRestoreRule.java:53)
[junit4:junit4]   2> 		at org.apache.lucene.util.TestRuleSetupTeardownChained$1.evaluate(TestRuleSetupTeardownChained.java:50)
[junit4:junit4]   2> 		at org.apache.lucene.util.TestRuleFieldCacheSanity$1.evaluate(TestRuleFieldCacheSanity.java:51)
[junit4:junit4]   2> 		at org.apache.lucene.util.AbstractBeforeAfterRule$1.evaluate(AbstractBeforeAfterRule.java:45)
[junit4:junit4]   2> 		at com.carrotsearch.randomizedtesting.rules.SystemPropertiesInvariantRule$1.evaluate(SystemPropertiesInvariantRule.java:55)
[junit4:junit4]   2> 		at org.apache.lucene.util.TestRuleThreadAndTestName$1.evaluate(TestRuleThreadAndTestName.java:48)
[junit4:junit4]   2> 		at org.apache.lucene.util.TestRuleIgnoreAfterMaxFailures$1.evaluate(TestRuleIgnoreAfterMaxFailures.java:70)
[junit4:junit4]   2> 		at org.apache.lucene.util.TestRuleMarkFailure$1.evaluate(TestRuleMarkFailure.java:48)
[junit4:junit4]   2> 		at com.carrotsearch.randomizedtesting.rules.StatementAdapter.evaluate(StatementAdapter.java:36)
[junit4:junit4]   2> 		at com.carrotsearch.randomizedtesting.ThreadLeakControl$StatementRunner.run(ThreadLeakControl.java:358)
[junit4:junit4]   2> 		at com.carrotsearch.randomizedtesting.ThreadLeakControl.forkTimeoutingTask(ThreadLeakControl.java:782)
[junit4:junit4]   2> 		at com.carrotsearch.randomizedtesting.ThreadLeakControl$3.evaluate(ThreadLeakControl.java:442)
[junit4:junit4]   2> 		at com.carrotsearch.randomizedtesting.RandomizedRunner.runSingleTest(RandomizedRunner.java:746)
[junit4:junit4]   2> 		at com.carrotsearch.randomizedtesting.RandomizedRunner$3.evaluate(RandomizedRunner.java:648)
[junit4:junit4]   2> 		at com.carrotsearch.randomizedtesting.RandomizedRunner$4.evaluate(RandomizedRunner.java:682)
[junit4:junit4]   2> 		at com.carrotsearch.randomizedtesting.RandomizedRunner$5.evaluate(RandomizedRunner.java:693)
[junit4:junit4]   2> 		at com.carrotsearch.randomizedtesting.rules.StatementAdapter.evaluate(StatementAdapter.java:36)
[junit4:junit4]   2> 		at com.carrotsearch.randomizedtesting.rules.SystemPropertiesRestoreRule$1.evaluate(SystemPropertiesRestoreRule.java:53)
[junit4:junit4]   2> 		at org.apache.lucene.util.AbstractBeforeAfterRule$1.evaluate(AbstractBeforeAfterRule.java:45)
[junit4:junit4]   2> 		at org.apache.lucene.util.TestRuleStoreClassName$1.evaluate(TestRuleStoreClassName.java:42)
[junit4:junit4]   2> 		at com.carrotsearch.randomizedtesting.rules.SystemPropertiesInvariantRule$1.evaluate(SystemPropertiesInvariantRule.java:55)
[junit4:junit4]   2> 		at com.carrotsearch.randomizedtesting.rules.NoShadowingOrOverridesOnMethodsRule$1.evaluate(NoShadowingOrOverridesOnMethodsRule.java:39)
[junit4:junit4]   2> 		at com.carrotsearch.randomizedtesting.rules.NoShadowingOrOverridesOnMethodsRule$1.evaluate(NoShadowingOrOverridesOnMethodsRule.java:39)
[junit4:junit4]   2> 		at com.carrotsearch.randomizedtesting.rules.StatementAdapter.evaluate(StatementAdapter.java:36)
[junit4:junit4]   2> 		at org.apache.lucene.util.TestRuleAssertionsRequired$1.evaluate(TestRuleAssertionsRequired.java:43)
[junit4:junit4]   2> 		at org.apache.lucene.util.TestRuleMarkFailure$1.evaluate(TestRuleMarkFailure.java:48)
[junit4:junit4]   2> 		at org.apache.lucene.util.TestRuleIgnoreAfterMaxFailures$1.evaluate(TestRuleIgnoreAfterMaxFailures.java:70)
[junit4:junit4]   2> 		at org.apache.lucene.util.TestRuleIgnoreTestSuites$1.evaluate(TestRuleIgnoreTestSuites.java:55)
[junit4:junit4]   2> 		at com.carrotsearch.randomizedtesting.rules.StatementAdapter.evaluate(StatementAdapter.java:36)
[junit4:junit4]   2> 		at com.carrotsearch.randomizedtesting.ThreadLeakControl$StatementRunner.run(ThreadLeakControl.java:358)
[junit4:junit4]   2> 		at java.lang.Thread.run(Thread.java:662)
[junit4:junit4]   2> 	
[junit4:junit4]   2> 640 T3396 oas.SolrTestCaseJ4.tearDown ###Ending testRebuild
[junit4:junit4]   2> NOTE: reproduce with: ant test  -Dtestcase=SuggesterFSTTest -Dtests.method=testRebuild -Dtests.seed=7470E2D50E5F0FFD -Dtests.slow=true -Dtests.locale=tr_TR -Dtests.timezone=Asia/Istanbul -Dtests.file.encoding=ISO-8859-1
[junit4:junit4] ERROR   0.24s | SuggesterFSTTest.testRebuild <<<
[junit4:junit4]    > Throwable #1: java.lang.RuntimeException: Exception during query
[junit4:junit4]    > 	at __randomizedtesting.SeedInfo.seed([7470E2D50E5F0FFD:2F5540963A5F7567]:0)
[junit4:junit4]    > 	at org.apache.solr.SolrTestCaseJ4.assertQ(SolrTestCaseJ4.java:512)
[junit4:junit4]    > 	at org.apache.solr.SolrTestCaseJ4.assertQ(SolrTestCaseJ4.java:479)
[junit4:junit4]    > 	at org.apache.solr.spelling.suggest.SuggesterTest.testRebuild(SuggesterTest.java:105)
[junit4:junit4]    > 	at sun.reflect.NativeMethodAccessorImpl.invoke0(Native Method)
[junit4:junit4]    > 	at sun.reflect.NativeMethodAccessorImpl.invoke(NativeMethodAccessorImpl.java:39)
[junit4:junit4]    > 	at sun.reflect.DelegatingMethodAccessorImpl.invoke(DelegatingMethodAccessorImpl.java:25)
[junit4:junit4]    > 	at java.lang.reflect.Method.invoke(Method.java:597)
[junit4:junit4]    > 	at com.carrotsearch.randomizedtesting.RandomizedRunner.invoke(RandomizedRunner.java:1559)
[junit4:junit4]    > 	at com.carrotsearch.randomizedtesting.RandomizedRunner.access$600(RandomizedRunner.java:79)
[junit4:junit4]    > 	at com.carrotsearch.randomizedtesting.RandomizedRunner$6.evaluate(RandomizedRunner.java:737)
[junit4:junit4]    > 	at com.carrotsearch.randomizedtesting.RandomizedRunner$7.evaluate(RandomizedRunner.java:773)
[junit4:junit4]    > 	at com.carrotsearch.randomizedtesting.RandomizedRunner$8.evaluate(RandomizedRunner.java:787)
[junit4:junit4]    > 	at com.carrotsearch.randomizedtesting.rules.SystemPropertiesRestoreRule$1.evaluate(SystemPropertiesRestoreRule.java:53)
[junit4:junit4]    > 	at org.apache.lucene.util.TestRuleSetupTeardownChained$1.evaluate(TestRuleSetupTeardownChained.java:50)
[junit4:junit4]    > 	at org.apache.lucene.util.TestRuleFieldCacheSanity$1.evaluate(TestRuleFieldCacheSanity.java:51)
[junit4:junit4]    > 	at org.apache.lucene.util.AbstractBeforeAfterRule$1.evaluate(AbstractBeforeAfterRule.java:45)
[junit4:junit4]    > 	at com.carrotsearch.randomizedtesting.rules.SystemPropertiesInvariantRule$1.evaluate(SystemPropertiesInvariantRule.java:55)
[junit4:junit4]    > 	at org.apache.lucene.util.TestRuleThreadAndTestName$1.evaluate(TestRuleThreadAndTestName.java:48)
[junit4:junit4]    > 	at org.apache.lucene.util.TestRuleIgnoreAfterMaxFailures$1.evaluate(TestRuleIgnoreAfterMaxFailures.java:70)
[junit4:junit4]    > 	at org.apache.lucene.util.TestRuleMarkFailure$1.evaluate(TestRuleMarkFailure.java:48)
[junit4:junit4]    > 	at com.carrotsearch.randomizedtesting.rules.StatementAdapter.evaluate(StatementAdapter.java:36)
[junit4:junit4]    > 	at com.carrotsearch.randomizedtesting.ThreadLeakControl$StatementRunner.run(ThreadLeakControl.java:358)
[junit4:junit4]    > 	at com.carrotsearch.randomizedtesting.ThreadLeakControl.forkTimeoutingTask(ThreadLeakControl.java:782)
[junit4:junit4]    > 	at com.carrotsearch.randomizedtesting.ThreadLeakControl$3.evaluate(ThreadLeakControl.java:442)
[junit4:junit4]    > 	at com.carrotsearch.randomizedtesting.RandomizedRunner.runSingleTest(RandomizedRunner.java:746)
[junit4:junit4]    > 	at com.carrotsearch.randomizedtesting.RandomizedRunner$3.evaluate(RandomizedRunner.java:648)
[junit4:junit4]    > 	at com.carrotsearch.randomizedtesting.RandomizedRunner$4.evaluate(RandomizedRunner.java:682)
[junit4:junit4]    > 	at com.carrotsearch.randomizedtesting.RandomizedRunner$5.evaluate(RandomizedRunner.java:693)
[junit4:junit4]    > 	at com.carrotsearch.randomizedtesting.rules.StatementAdapter.evaluate(StatementAdapter.java:36)
[junit4:junit4]    > 	at com.carrotsearch.randomizedtesting.rules.SystemPropertiesRestoreRule$1.evaluate(SystemPropertiesRestoreRule.java:53)
[junit4:junit4]    > 	at org.apache.lucene.util.AbstractBeforeAfterRule$1.evaluate(AbstractBeforeAfterRule.java:45)
[junit4:junit4]    > 	at org.apache.lucene.util.TestRuleStoreClassName$1.evaluate(TestRuleStoreClassName.java:42)
[junit4:junit4]    > 	at com.carrotsearch.randomizedtesting.rules.SystemPropertiesInvariantRule$1.evaluate(SystemPropertiesInvariantRule.java:55)
[junit4:junit4]    > 	at com.carrotsearch.randomizedtesting.rules.NoShadowingOrOverridesOnMethodsRule$1.evaluate(NoShadowingOrOverridesOnMethodsRule.java:39)
[junit4:junit4]    > 	at com.carrotsearch.randomizedtesting.rules.NoShadowingOrOverridesOnMethodsRule$1.evaluate(NoShadowingOrOverridesOnMethodsRule.java:39)
[junit4:junit4]    > 	at com.carrotsearch.randomizedtesting.rules.StatementAdapter.evaluate(StatementAdapter.java:36)
[junit4:junit4]    > 	at org.apache.lucene.util.TestRuleAssertionsRequired$1.evaluate(TestRuleAssertionsRequired.java:43)
[junit4:junit4]    > 	at org.apache.lucene.util.TestRuleMarkFailure$1.evaluate(TestRuleMarkFailure.java:48)
[junit4:junit4]    > 	at org.apache.lucene.util.TestRuleIgnoreAfterMaxFailures$1.evaluate(TestRuleIgnoreAfterMaxFailures.java:70)
[junit4:junit4]    > 	at org.apache.lucene.util.TestRuleIgnoreTestSuites$1.evaluate(TestRuleIgnoreTestSuites.java:55)
[junit4:junit4]    > 	at com.carrotsearch.randomizedtesting.rules.StatementAdapter.evaluate(StatementAdapter.java:36)
[junit4:junit4]    > 	at com.carrotsearch.randomizedtesting.ThreadLeakControl$StatementRunner.run(ThreadLeakControl.java:358)
[junit4:junit4]    > 	at java.lang.Thread.run(Thread.java:662)
[junit4:junit4]    > Caused by: java.lang.NullPointerException
[junit4:junit4]    > 	at org.apache.lucene.search.suggest.fst.FSTCompletionLookup.lookup(FSTCompletionLookup.java:237)
[junit4:junit4]    > 	at org.apache.solr.spelling.suggest.Suggester.getSuggestions(Suggester.java:190)
[junit4:junit4]    > 	at org.apache.solr.handler.component.SpellCheckComponent.process(SpellCheckComponent.java:172)
[junit4:junit4]    > 	at org.apache.solr.handler.component.SearchHandler.handleRequestBody(SearchHandler.java:206)
[junit4:junit4]    > 	at org.apache.solr.handler.RequestHandlerBase.handleRequest(RequestHandlerBase.java:129)
[junit4:junit4]    > 	at org.apache.solr.core.SolrCore.execute(SolrCore.java:1750)
[junit4:junit4]    > 	at org.apache.solr.util.TestHarness.query(TestHarness.java:364)
[junit4:junit4]    > 	at org.apache.solr.util.TestHarness.query(TestHarness.java:346)
[junit4:junit4]    > 	at org.apache.solr.SolrTestCaseJ4.assertQ(SolrTestCaseJ4.java:486)
[junit4:junit4]    > 	... 42 more
[junit4:junit4]   2> 707 T3396 oas.SolrTestCaseJ4.setUp ###Starting testSuggestions
[junit4:junit4]   2> 718 T3396 C269 UPDATE [collection1] webapp=null path=null params={} {add=[1]} 0 2
[junit4:junit4]   2> 731 T3396 C269 UPDATE [collection1] webapp=null path=null params={} {add=[2]} 0 1
[junit4:junit4]   2> 742 T3396 C269 UPDATE [collection1] webapp=null path=null params={} {add=[3]} 0 0
[junit4:junit4]   2> 754 T3396 C269 oasu.DirectUpdateHandler2.commit start commit{flags=0,_version_=0,optimize=false,openSearcher=true,waitSearcher=true,expungeDeletes=false,softCommit=false}
[junit4:junit4]   2> 822 T3396 C269 oasc.SolrDeletionPolicy.onCommit SolrDeletionPolicy.onCommit: commits:num=2
[junit4:junit4]   2> 		commit{dir=MockDirWrapper(org.apache.lucene.store.MMapDirectory@C:\Users\JenkinsSlave\workspace\Lucene-Solr-trunk-Windows\solr\build\solr-core\test\J0\solrtest-SuggesterFSTTest-1349130196968\index lockFactory=org.apache.lucene.store.NativeFSLockFactory@e9bcb7),segFN=segments_2,generation=2,filenames=[_0_MockSep_0.pos, _0_MockVariableIntBlock_0.doc, _0_MockVariableIntBlock_0.skp, _0_MockVariableIntBlock_0.pyl, _0_MockVariableIntBlock_0.tib, _0_MockSep_0.skp, _0_MockVariableIntBlock_0.pos, _0.si, _0_MockSep_0.doc, _0_MockVariableIntBlock_0.tii, _0.fnm, _0_Memory_0.ram, _0_nrm.cfs, _0_MockRandom_0.skp, _0_MockSep_0.tib, _0_MockRandom_0.sd, _0_MockRandom_0.frq, _0_MockRandom_0.tip, _0_MockRandom_0.doc, _0_nrm.cfe, _0_MockVariableIntBlock_0.frq, _0_MockRandom_0.pos, segments_2, _0_MockSep_0.frq, _0.fdx, _0_MockSep_0.tii, _0_MockRandom_0.pyl, _0_MockSep_0.pyl, _0_MockRandom_0.tim, _0.fdt]
[junit4:junit4]   2> 		commit{dir=MockDirWrapper(org.apache.lucene.store.MMapDirectory@C:\Users\JenkinsSlave\workspace\Lucene-Solr-trunk-Windows\solr\build\solr-core\test\J0\solrtest-SuggesterFSTTest-1349130196968\index lockFactory=org.apache.lucene.store.NativeFSLockFactory@e9bcb7),segFN=segments_3,generation=3,filenames=[_1_MockVariableIntBlock_0.skp, _1_MockSep_0.frq, _1_MockVariableIntBlock_0.pyl, _1_MockRandom_0.pos, _1.fnm, _1_Memory_0.ram, _1_MockVariableIntBlock_0.doc, _1_MockSep_0.doc, _1_MockSep_0.pyl, _1_MockRandom_0.tiv, _1_nrm.cfs, _1_MockSep_0.skp, _1_MockSep_0.pos, _1_MockSep_0.tib, _1_MockVariableIntBlock_0.tii, _1_MockVariableIntBlock_0.pos, _1_MockRandom_0.sd, _1_MockRandom_0.skp, _1_nrm.cfe, _1_MockSep_0.tii, _1_MockVariableIntBlock_0.tib, _1_MockVariableIntBlock_0.frq, _1.fdx, _1_MockRandom_0.tib, _1_MockRandom_0.pyl, _1.fdt, _1.si, _1_MockRandom_0.doc, _1_MockRandom_0.frq, segments_3]
[junit4:junit4]   2> 822 T3396 C269 oasc.SolrDeletionPolicy.updateCommits newest commit = 3
[junit4:junit4]   2> 881 T3396 C269 oass.SolrIndexSearcher.<init> Opening Searcher@14b0a35 main
[junit4:junit4]   2> 882 T3396 C269 oass.SolrIndexSearcher.getIndexDir WARNING WARNING: Directory impl does not support setting indexDir: org.apache.lucene.store.MockDirectoryWrapper
[junit4:junit4]   2> 884 T3397 oashc.SpellCheckComponent$SpellCheckerListener.buildSpellIndex Building spell index for spell checker: suggest
[junit4:junit4]   2> 884 T3397 oasss.Suggester.build build()
[junit4:junit4]   2> 890 T3397 oasss.Suggester.build Stored suggest data to: C:\Users\JenkinsSlave\workspace\Lucene-Solr-trunk-Windows\solr\build\solr-core\test\J0\.\solrtest-SuggesterFSTTest-1349130196968\suggest\jaspell.dat
[junit4:junit4]   2> 891 T3397 oashc.SpellCheckComponent$SpellCheckerListener.buildSpellIndex Building spell index for spell checker: suggest_tst
[junit4:junit4]   2> 891 T3397 oasss.Suggester.build build()
[junit4:junit4]   2> 913 T3397 oasss.Suggester.build Stored suggest data to: C:\Users\JenkinsSlave\workspace\Lucene-Solr-trunk-Windows\solr\build\solr-core\test\J0\.\solrtest-SuggesterFSTTest-1349130196968\suggest_tst\tst.dat
[junit4:junit4]   2> 914 T3397 oashc.SpellCheckComponent$SpellCheckerListener.buildSpellIndex Building spell index for spell checker: suggest_fst
[junit4:junit4]   2> 914 T3397 oasss.Suggester.build build()
[junit4:junit4]   2> 950 T3397 oasss.Suggester.build Stored suggest data to: C:\Users\JenkinsSlave\workspace\Lucene-Solr-trunk-Windows\solr\build\solr-core\test\J0\.\solrtest-SuggesterFSTTest-1349130196968\suggest_fst\fst.bin
[junit4:junit4]   2> 950 T3397 oashc.SpellCheckComponent$SpellCheckerListener.buildSpellIndex Building spell index for spell checker: suggest_wfst
[junit4:junit4]   2> 950 T3397 oasss.Suggester.build build()
[junit4:junit4]   2> 963 T3397 oasss.Suggester.build Stored suggest data to: C:\Users\JenkinsSlave\workspace\Lucene-Solr-trunk-Windows\solr\build\solr-core\test\J0\.\solrtest-SuggesterFSTTest-1349130196968\suggest_wfst\wfst.bin
[junit4:junit4]   2> 963 T3397 oasc.SolrCore.registerSearcher [collection1] Registered new searcher Searcher@14b0a35 main{StandardDirectoryReader(segments_3:7 _1(5.0):C3)}
[junit4:junit4]   2> 969 T3396 C269 oasu.DirectUpdateHandler2.commit end_commit_flush
[junit4:junit4]   2> 972 T3396 C269 UPDATE [collection1] webapp=null path=null params={} {commit=} 0 218
[junit4:junit4]   2> 982 T3396 C269 REQ [collection1] webapp=null path=null params={q=ac&spellcheck.count=2&qt=/suggest_fst&spellcheck.onlyMorePopular=true} status=0 QTime=4 
[junit4:junit4]   2> 998 T3396 oas.SolrTestCaseJ4.tearDown ###Ending testSuggestions
[junit4:junit4]   2> 1008 T3396 oas.SolrTestCaseJ4.setUp ###Starting testReload
[junit4:junit4]   2> 1017 T3396 C269 UPDATE [collection1] webapp=null path=null params={} {add=[1]} 0 2
[junit4:junit4]   2> 1025 T3396 C269 UPDATE [collection1] webapp=null path=null params={} {add=[2]} 0 0
[junit4:junit4]   2> 1033 T3396 C269 UPDATE [collection1] webapp=null path=null params={} {add=[3]} 0 1
[junit4:junit4]   2> 1040 T3396 C269 oasu.DirectUpdateHandler2.commit start commit{flags=0,_version_=0,optimize=false,openSearcher=true,waitSearcher=true,expungeDeletes=false,softCommit=false}
[junit4:junit4]   2> 1113 T3396 C269 oasc.SolrDeletionPolicy.onCommit SolrDeletionPolicy.onCommit: commits:num=2
[junit4:junit4]   2> 		commit{dir=MockDirWrapper(org.apache.lucene.store.MMapDirectory@C:\Users\JenkinsSlave\workspace\Lucene-Solr-trunk-Windows\solr\build\solr-core\test\J0\solrtest-SuggesterFSTTest-1349130196968\index lockFactory=org.apache.lucene.store.NativeFSLockFactory@e9bcb7),segFN=segments_3,generation=3,filenames=[_1_MockVariableIntBlock_0.skp, _1_MockSep_0.frq, _1_MockVariableIntBlock_0.pyl, _1_MockRandom_0.pos, _1.fnm, _1_Memory_0.ram, _1_MockVariableIntBlock_0.doc, _1_MockSep_0.doc, _1_MockSep_0.pyl, _1_MockRandom_0.tiv, _1_nrm.cfs, _1_MockSep_0.skp, _1_MockSep_0.pos, _1_MockSep_0.tib, _1_MockVariableIntBlock_0.tii, _1_MockVariableIntBlock_0.pos, _1_MockRandom_0.sd, _1_MockRandom_0.skp, _1_nrm.cfe, _1_MockSep_0.tii, _1_MockVariableIntBlock_0.tib, _1_MockVariableIntBlock_0.frq, _1.fdx, _1_MockRandom_0.tib, _1_MockRandom_0.pyl, _1.fdt, _1.si, _1_MockRandom_0.doc, _1_MockRandom_0.frq, segments_3]
[junit4:junit4]   2> 		commit{dir=MockDirWrapper(org.apache.lucene.store.MMapDirectory@C:\Users\JenkinsSlave\workspace\Lucene-Solr-trunk-Windows\solr\build\solr-core\test\J0\solrtest-SuggesterFSTTest-1349130196968\index lockFactory=org.apache.lucene.store.NativeFSLockFactory@e9bcb7),segFN=segments_4,generation=4,filenames=[_2.si, _2_MockRandom_0.tii, _2_MockVariableIntBlock_0.pyl, _2_MockSep_0.skp, _2_MockVariableIntBlock_0.frq, _2_MockSep_0.doc, _2_MockVariableIntBlock_0.doc, _2_nrm.cfe, _2_MockRandom_0.tib, _2_Memory_0.ram, _2_nrm.cfs, _2_MockVariableIntBlock_0.pos, _2_MockRandom_0.prx, _2_MockVariableIntBlock_0.tii, _2_MockVariableIntBlock_0.tib, _2_MockSep_0.frq, _2.fdt, _2_MockSep_0.tii, _2_MockSep_0.tib, _2.fdx, _2.fnm, _2_MockRandom_0.sd, _2_MockSep_0.pyl, _2_MockRandom_0.frq, _2_MockVariableIntBlock_0.skp, _2_MockSep_0.pos, segments_4]
[junit4:junit4]   2> 1114 T3396 C269 oasc.SolrDeletionPolicy.updateCommits newest commit = 4
[junit4:junit4]   2> 1152 T3396 C269 oass.SolrIndexSearcher.<init> Opening Searcher@19fd981 main
[junit4:junit4]   2> 1153 T3396 C269 oass.SolrIndexSearcher.getIndexDir WARNING WARNING: Directory impl does not support setting indexDir: org.apache.lucene.store.MockDirectoryWrapper
[junit4:junit4]   2> 1154 T3397 oashc.SpellCheckComponent$SpellCheckerListener.buildSpellIndex Building spell index for spell checker: suggest
[junit4:junit4]   2> 1154 T3397 oasss.Suggester.build build()
[junit4:junit4]   2> 1161 T3397 oasss.Suggester.build Stored suggest data to: C:\Users\JenkinsSlave\workspace\Lucene-Solr-trunk-Windows\solr\build\solr-core\test\J0\.\solrtest-SuggesterFSTTest-1349130196968\suggest\jaspell.dat
[junit4:junit4]   2> 1161 T3397 oashc.SpellCheckComponent$SpellCheckerListener.buildSpellIndex Building spell index for spell checker: suggest_tst
[junit4:junit4]   2> 1161 T3397 oasss.Suggester.build build()
[junit4:junit4]   2> 1181 T3397 oasss.Suggester.build Stored suggest data to: C:\Users\JenkinsSlave\workspace\Lucene-Solr-trunk-Windows\solr\build\solr-core\test\J0\.\solrtest-SuggesterFSTTest-1349130196968\suggest_tst\tst.dat
[junit4:junit4]   2> 1182 T3397 oashc.SpellCheckComponent$SpellCheckerListener.buildSpellIndex Building spell index for spell checker: suggest_fst
[junit4:junit4]   2> 1182 T3397 oasss.Suggester.build build()
[junit4:junit4]   2> 1218 T3397 oasss.Suggester.build Stored suggest data to: C:\Users\JenkinsSlave\workspace\Lucene-Solr-trunk-Windows\solr\build\solr-core\test\J0\.\solrtest-SuggesterFSTTest-1349130196968\suggest_fst\fst.bin
[junit4:junit4]   2> 1220 T3397 oashc.SpellCheckComponent$SpellCheckerListener.buildSpellIndex Building spell index for spell checker: suggest_wfst
[junit4:junit4]   2> 1220 T3397 oasss.Suggester.build build()
[junit4:junit4]   2> 1236 T3397 oasss.Suggester.build Stored suggest data to: C:\Users\JenkinsSlave\workspace\Lucene-Solr-trunk-Windows\solr\build\solr-core\test\J0\.\solrtest-SuggesterFSTTest-1349130196968\suggest_wfst\wfst.bin
[junit4:junit4]   2> 1236 T3397 oasc.SolrCore.registerSearcher [collection1] Registered new searcher Searcher@19fd981 main{StandardDirectoryReader(segments_4:11 _2(5.0):C3)}
[junit4:junit4]   2> 1239 T3396 C269 oasu.DirectUpdateHandler2.commit end_commit_flush
[junit4:junit4]   2> 1242 T3396 C269 UPDATE [collection1] webapp=null path=null params={} {commit=} 0 202
[junit4:junit4]   2> 1253 T3396 oas.SolrTestCaseJ4.deleteCore ###deleteCore
[junit4:junit4]   2> 1253 T3396 oasc.CoreContainer.shutdown Shutting down CoreContainer instance=28427585
[junit4:junit4]   2> 1253 T3396 oasc.SolrCore.close [collection1]  CLOSING SolrCore org.apache.solr.core.SolrCore@378ce6
[junit4:junit4]   2> 1254 T3396 oasu.DirectUpdateHandler2.close closing DirectUpdateHandler2{commits=3,autocommits=0,soft autocommits=0,optimizes=0,rollbacks=0,expungeDeletes=0,docsPending=0,adds=0,deletesById=0,deletesByQuery=0,errors=0,cumulative_adds=9,cumulative_deletesById=0,cumulative_deletesByQuery=0,cumulative_errors=0}
[junit4:junit4]   2> 1256 T3396 oasc.SolrCore.decrefSolrCoreState Closing SolrCoreState
[junit4:junit4]   2> 1256 T3396 oasu.DefaultSolrCoreState.closeIndexWriter SolrCoreState ref count has reached 0 - closing IndexWriter
[junit4:junit4]   2> 1257 T3396 oasu.DefaultSolrCoreState.closeIndexWriter closing IndexWriter with IndexWriterCloser
[junit4:junit4]   2> 1286 T3396 oasc.SolrCore.closeSearcher [collection1] Closing main searcher on request.
[junit4:junit4]   2> NOTE: per solr.test.leavedatadir, dataDir will not be removed: C:\Users\JenkinsSlave\workspace\Lucene-Solr-trunk-Windows\solr\build\solr-core\test\J0\.\solrtest-SuggesterFSTTest-1349130196968
[junit4:junit4]   2> 1334 T3396 oas.SolrTestCaseJ4.initCore ####initCore
[junit4:junit4]   2> 1334 T3396 oasc.SolrResourceLoader.<init> new SolrResourceLoader for directory: 'C:\Users\JenkinsSlave\workspace\Lucene-Solr-trunk-Windows\solr\build\solr-core\test-files\solr\collection1\'
[junit4:junit4]   2> 1339 T3396 oasc.SolrResourceLoader.replaceClassLoader Adding 'file:/C:/Users/JenkinsSlave/workspace/Lucene-Solr-trunk-Windows/solr/build/solr-core/test-files/solr/collection1/lib/classes/' to classloader
[junit4:junit4]   2> 1341 T3396 oasc.SolrResourceLoader.replaceClassLoader Adding 'file:/C:/Users/JenkinsSlave/workspace/Lucene-Solr-trunk-Windows/solr/build/solr-core/test-files/solr/collection1/lib/README' to classloader
[junit4:junit4]   2> 1461 T3396 oasc.SolrConfig.<init> Using Lucene MatchVersion: LUCENE_50
[junit4:junit4]   2> 1590 T3396 oasc.SolrConfig.<init> Loaded SolrConfig: solrconfig-spellchecker.xml
[junit4:junit4]   2> 1590 T3396 oass.IndexSchema.readSchema Reading Solr Schema
[junit4:junit4]   2> 1603 T3396 oass.IndexSchema.readSchema Schema name=test
[junit4:junit4]   2> 2933 T3396 oass.OpenExchangeRatesOrgProvider.init Initialized with rates=open-exchange-rates.json, refreshInterval=1440.
[junit4:junit4]   2> 2953 T3396 oass.IndexSchema.readSchema default search field in schema is text
[junit4:junit4]   2> 2961 T3396 oass.IndexSchema.readSchema unique key field: id
[junit4:junit4]   2> 2969 T3396 oass.FileExchangeRateProvider.reload Reloading exchange rates from file currency.xml
[junit4:junit4]   2> 2982 T3396 oass.FileExchangeRateProvider.reload Reloading exchange rates from file currency.xml
[junit4:junit4]   2> 2989 T3396 oass.OpenExchangeRatesOrgProvider.reload Reloading exchange rates from open-exchange-rates.json
[junit4:junit4]   2> 2990 T3396 oass.OpenExchangeRatesOrgProvider.reload Reloading exchange rates from open-exchange-rates.json
[junit4:junit4]   2> 2992 T3396 oasc.SolrResourceLoader.locateSolrHome JNDI not configured for solr (NoInitialContextEx)
[junit4:junit4]   2> 2992 T3396 oasc.SolrResourceLoader.locateSolrHome using system property solr.solr.home: C:\Users\JenkinsSlave\workspace\Lucene-Solr-trunk-Windows\solr\build\solr-core\test-files\solr
[junit4:junit4]   2> 2993 T3396 oasc.SolrResourceLoader.<init> new SolrResourceLoader for directory: 'C:\Users\JenkinsSlave\workspace\Lucene-Solr-trunk-Windows\solr\build\solr-core\test-files\solr\'
[junit4:junit4]   2> 3005 T3396 oasc.CoreContainer.<init> New CoreContainer 24658900
[junit4:junit4]   2> 3005 T3396 oasc.SolrCore.<init> [collection1] Opening new SolrCore at C:\Users\JenkinsSlave\workspace\Lucene-Solr-trunk-Windows\solr\build\solr-core\test-files\solr\collection1\, dataDir=C:\Users\JenkinsSlave\workspace\Lucene-Solr-trunk-Windows\solr\build\solr-core\test\J0\.\solrtest-SuggesterFSTTest-1349130196968\
[junit4:junit4]   2> 3006 T3396 oasc.SolrCore.<init> JMX monitoring not detected for core: collection1
[junit4:junit4]   2> 3007 T3396 oasc.SolrCore.getNewIndexDir New index directory detected: old=null new=C:\Users\JenkinsSlave\workspace\Lucene-Solr-trunk-Windows\solr\build\solr-core\test\J0\.\solrtest-SuggesterFSTTest-1349130196968\index/
[junit4:junit4]   2> 3008 T3396 oasc.RequestHandlers.initHandlersFromConfig created standard: solr.StandardRequestHandler
[junit4:junit4]   2> 3009 T3396 oasc.RequestHandlers.initHandlersFromConfig created /suggest: org.apache.solr.handler.component.SearchHandler
[junit4:junit4]   2> 3009 T3396 oasc.RequestHandlers.initHandlersFromConfig created /suggest_tst: org.apache.solr.handler.component.SearchHandler
[junit4:junit4]   2> 3010 T3396 oasc.RequestHandlers.initHandlersFromConfig created /suggest_fst: org.apache.solr.handler.component.SearchHandler
[junit4:junit4]   2> 3010 T3396 oasc.RequestHandlers.initHandlersFromConfig created /suggest_wfst: org.apache.solr.handler.component.SearchHandler
[junit4:junit4]   2> 3014 T3396 oasc.CachingDirectoryFactory.get return new directory for C:\Users\JenkinsSlave\workspace\Lucene-Solr-trunk-Windows\solr\build\solr-core\test\J0\.\solrtest-SuggesterFSTTest-1349130196968\index forceNew:false
[junit4:junit4]   2> 3026 T3396 oass.SolrIndexSearcher.<init> Opening Searcher@3a1830 main
[junit4:junit4]   2> 3026 T3396 oass.SolrIndexSearcher.getIndexDir WARNING WARNING: Directory impl does not support setting indexDir: org.apache.lucene.store.MockDirectoryWrapper
[junit4:junit4]   2> 3027 T3396 oasu.CommitTracker.<init> Hard AutoCommit: disabled
[junit4:junit4]   2> 3027 T3396 oasu.CommitTracker.<init> Soft AutoCommit: disabled
[junit4:junit4]   2> 3028 T3396 oashc.SpellCheckComponent.inform Initializing spell checkers
[junit4:junit4]   2> 3028 T3396 oasss.Suggester.init init: {name=suggest,classname=org.apache.solr.spelling.suggest.Suggester,lookupImpl=org.apache.solr.spelling.suggest.jaspell.JaspellLookup,field=suggest,storeDir=suggest,buildOnCommit=true,threshold=0.0}
[junit4:junit4]   2> 3029 T3396 oasssj.JaspellLookupFactory.create init: {name=suggest,classname=org.apache.solr.spelling.suggest.Suggester,lookupImpl=org.apache.solr.spelling.suggest.jaspell.JaspellLookup,field=suggest,storeDir=suggest,buildOnCommit=true,threshold=0.0}
[junit4:junit4]   2> 3031 T3396 oashc.SpellCheckComponent.inform Registering newSearcher listener for spellchecker: suggest
[junit4:junit4]   2> 3032 T3396 oashc.SpellCheckComponent.inform No queryConverter defined, using default converter
[junit4:junit4]   2> 3032 T3396 oashc.SpellCheckComponent.inform Initializing spell checkers
[junit4:junit4]   2> 3033 T3396 oasss.Suggester.init init: {name=suggest_tst,classname=org.apache.solr.spelling.suggest.Suggester,lookupImpl=org.apache.solr.spelling.suggest.tst.TSTLookup,field=suggest,storeDir=suggest_tst,buildOnCommit=true,threshold=0.0}
[junit4:junit4]   2> 3035 T3396 oashc.SpellCheckComponent.inform Registering newSearcher listener for spellchecker: suggest_tst
[junit4:junit4]   2> 3035 T3396 oashc.SpellCheckComponent.inform No queryConverter defined, using default converter
[junit4:junit4]   2> 3035 T3396 oashc.SpellCheckComponent.inform Initializing spell checkers
[junit4:junit4]   2> 3036 T3396 oasss.Suggester.init init: {name=suggest_fst,classname=org.apache.solr.spelling.suggest.Suggester,lookupImpl=org.apache.solr.spelling.suggest.fst.FSTLookup,field=suggest,storeDir=suggest_fst,buildOnCommit=true,weightBuckets=5,exactMatchFirst=true}
[junit4:junit4]   2> 3040 T3396 oashc.SpellCheckComponent.inform Registering newSearcher listener for spellchecker: suggest_fst
[junit4:junit4]   2> 3040 T3396 oashc.SpellCheckComponent.inform No queryConverter defined, using default converter
[junit4:junit4]   2> 3040 T3396 oashc.SpellCheckComponent.inform Initializing spell checkers
[junit4:junit4]   2> 3041 T3396 oasss.Suggester.init init: {name=suggest_wfst,classname=org.apache.solr.spelling.suggest.Suggester,lookupImpl=org.apache.solr.spelling.suggest.fst.WFSTLookupFactory,field=suggest,storeDir=suggest_wfst,buildOnCommit=true,exactMatchFirst=true}
[junit4:junit4]   2> 3042 T3396 oashc.SpellCheckComponent.inform Registering newSearcher listener for spellchecker: suggest_wfst
[junit4:junit4]   2> 3044 T3396 oashc.SpellCheckComponent.inform No queryConverter defined, using default converter
[junit4:junit4]   2> 3045 T3396 oashc.HttpShardHandlerFactory.getParameter Setting socketTimeout to: 0
[junit4:junit4]   2> 3045 T3396 oashc.HttpShardHandlerFactory.getParameter Setting urlScheme to: http://
[junit4:junit4]   2> 3046 T3396 oashc.HttpShardHandlerFactory.getParameter Setting connTimeout to: 0
[junit4:junit4]   2> 3046 T3396 oashc.HttpShardHandlerFactory.getParameter Setting maxConnectionsPerHost to: 20
[junit4:junit4]   2> 3046 T3396 oashc.HttpShardHandlerFactory.getParameter Setting corePoolSize to: 0
[junit4:junit4]   2> 3047 T3396 oashc.HttpShardHandlerFactory.getParameter Setting maximumPoolSize to: 2147483647
[junit4:junit4]   2> 3047 T3396 oashc.HttpShardHandlerFactory.getParameter Setting maxThreadIdleTime to: 5
[junit4:junit4]   2> 3048 T3396 oashc.HttpShardHandlerFactory.getParameter Setting sizeOfQueue to: -1
[junit4:junit4]   2> 3048 T3396 oashc.HttpShardHandlerFactory.getParameter Setting fairnessPolicy to: false
[junit4:junit4]   2> 3048 T3396 oascsi.HttpClientUtil.createClient Creating new http client, config:maxConnectionsPerHost=20&maxConnections=10000&socketTimeout=0&connTimeout=0&retry=false
[junit4:junit4]   2> 3056 T3396 oasc.CoreContainer.register registering core: collection1
[junit4:junit4]   2> 3063 T3396 oas.SolrTestCaseJ4.initCore ####initCore end
[junit4:junit4]   2> 3064 T3398 oasc.SolrCore.registerSearcher [collection1] Registered new searcher Searcher@3a1830 main{StandardDirectoryReader(segments_4:11 _2(5.0):C3)}
[junit4:junit4]   2> ASYNC  NEW_CORE C270 name=collection1 org.apache.solr.core.SolrCore@16256c2
[junit4:junit4]   2> 3064 T3396 C270 REQ [collection1] webapp=null path=null params={q=ac&spellcheck.count=2&qt=/suggest_fst&spellcheck.onlyMorePopular=true} status=0 QTime=1 
[junit4:junit4]   2> 3071 T3396 oas.SolrTestCaseJ4.tearDown ###Ending testReload
[junit4:junit4]   2> 3077 T3396 oas.SolrTestCaseJ4.setUp ###Starting testAnalyzer
[junit4:junit4]   2> 3077 T3396 oasss.Suggester.init init: {lookupImpl=org.apache.solr.spelling.suggest.tst.TSTLookupFactory}
[junit4:junit4]   2> 3077 T3396 oas.SolrTestCaseJ4.tearDown ###Ending testAnalyzer
[junit4:junit4]   2> 3078 T3396 oas.SolrTestCaseJ4.deleteCore ###deleteCore
[junit4:junit4]   2> 3079 T3396 oasc.CoreContainer.shutdown Shutting down CoreContainer instance=24658900
[junit4:junit4]   2> 3079 T3396 oasc.SolrCore.close [collection1]  CLOSING SolrCore org.apache.solr.core.SolrCore@16256c2
[junit4:junit4]   2> 3079 T3396 oasu.DirectUpdateHandler2.close closing DirectUpdateHandler2{commits=0,autocommits=0,soft autocommits=0,optimizes=0,rollbacks=0,expungeDeletes=0,docsPending=0,adds=0,deletesById=0,deletesByQuery=0,errors=0,cumulative_adds=0,cumulative_deletesById=0,cumulative_deletesByQuery=0,cumulative_errors=0}
[junit4:junit4]   2> 3080 T3396 oasc.SolrCore.decrefSolrCoreState Closing SolrCoreState
[junit4:junit4]   2> 3080 T3396 oasu.DefaultSolrCoreState.closeIndexWriter SolrCoreState ref count has reached 0 - closing IndexWriter
[junit4:junit4]   2> 3080 T3396 oasu.DefaultSolrCoreState.closeIndexWriter closing IndexWriter with IndexWriterCloser
[junit4:junit4]   2> 3082 T3396 oasc.SolrCore.closeSearcher [collection1] Closing main searcher on request.
[junit4:junit4]   2> NOTE: test params are: codec=Lucene40: {id=PostingsFormat(name=Memory doPackFST= true), text=PostingsFormat(name=MockRandom), suggest=MockVariableIntBlock(baseBlockSize=47), spell=PostingsFormat(name=MockSep)}, sim=RandomSimilarityProvider(queryNorm=false,coord=yes): {}, locale=tr_TR, timezone=Asia/Istanbul
[junit4:junit4]   2> NOTE: Windows 7 6.1 x86/Sun Microsystems Inc. 1.6.0_35 (32-bit)/cpus=2,threads=1,free=34661872,total=141516800
[junit4:junit4]   2> NOTE: All tests run in this JVM: [PrimUtilsTest, OpenExchangeRatesOrgProviderTest, TestIndexSearcher, FieldMutatingUpdateProcessorTest, TestSolrXMLSerializer, ResourceLoaderTest, TestMergePolicyConfig, TestConfig, MultiTermTest, CurrencyFieldTest, TestJoin, BadComponentTest, ResponseLogComponentTest, FieldAnalysisRequestHandlerTest, TestSuggestSpellingConverter, SolrInfoMBeanTest, ZkControllerTest, StatsComponentTest, TestPluginEnable, DirectSolrSpellCheckerTest, PeerSyncTest, DirectUpdateHandlerOptimizeTest, TestDocumentBuilder, CopyFieldTest, TermVectorComponentDistributedTest, XmlUpdateRequestHandlerTest, TestQuerySenderListener, TestSystemIdResolver, StatelessScriptUpdateProcessorFactoryTest, ReturnFieldsTest, LukeRequestHandlerTest, TestLRUCache, ZkCLITest, TestRecovery, SimplePostToolTest, TestPHPSerializedResponseWriter, TestCollationField, FileBasedSpellCheckerTest, UUIDFieldTest, TestRealTimeGet, BinaryUpdateRequestHandlerTest, FullSolrCloudDistribCmdsTest, TestReload, TestElisionMultitermQuery, ZkSolrClientTest, RequiredFieldsTest, CircularListTest, TestTrie, TestUtils, DebugComponentTest, DateFieldTest, TestArbitraryIndexDir, DistributedSpellCheckComponentTest, TestCSVLoader, TestFastWriter, TestFoldingMultitermQuery, IndexSchemaTest, MoreLikeThisHandlerTest, TestLFUCache, TestSearchPerf, BasicDistributedZk2Test, WordBreakSolrSpellCheckerTest, SpatialFilterTest, NoCacheHeaderTest, SortByFunctionTest, CoreAdminHandlerTest, TestSort, TestPerFieldSimilarity, OverseerTest, RequestHandlersTest, SimpleFacetsTest, UpdateParamsTest, StandardRequestHandlerTest, TestJmxIntegration, TestWriterPerf, TestWordDelimiterFilterFactory, CSVRequestHandlerTest, TestSolrDeletionPolicy1, TestSolrQueryParser, TestBadConfig, SearchHandlerTest, SpellPossibilityIteratorTest, TestSolrCoreProperties, IndexBasedSpellCheckerTest, TestJmxMonitoredMap, SolrRequestParserTest, DirectUpdateHandlerTest, BasicFunctionalityTest, QueryParsingTest, TestBinaryResponseWriter, TestCodecSupport, TestExtendedDismaxParser, SuggesterTSTTest, ZkNodePropsTest, TestFiltering, TestPropInject, DocumentBuilderTest, TestGroupingSearch, SolrCmdDistributorTest, QueryElevationComponentTest, BasicDistributedZkTest, TestQuerySenderNoQuery, CoreContainerCoreInitFailuresTest, ClusterStateTest, TestNumberUtils, BadIndexSchemaTest, TestOmitPositions, SolrIndexConfigTest, RecoveryZkTest, SpellCheckComponentTest, TestReplicationHandler, LeaderElectionIntegrationTest, LeaderElectionTest, TestDistributedGrouping, TestRandomFaceting, TestDistributedSearch, SpellCheckCollatorTest, SoftAutoCommitTest, AutoCommitTest, BasicZkTest, TestFaceting, TestHashPartitioner, DistributedTermsComponentTest, SolrCoreTest, TestRangeQuery, TestMultiCoreConfBootstrap, TestCoreContainer, ConvertedLegacyTest, SignatureUpdateProcessorFactoryTest, SampleTest, HighlighterTest, TestFunctionQuery, DirectSolrConnectionTest, TestRemoteStreaming, CacheHeaderTest, QueryEqualityTest, PolyFieldTest, TestCSVResponseWriter, MBeansHandlerTest, DistributedQueryElevationComponentTest, TestPseudoReturnFields, DisMaxRequestHandlerTest, TermsComponentTest, DistanceFunctionTest, XsltUpdateRequestHandlerTest, MinimalSchemaTest, TestQueryTypes, PingRequestHandlerTest, TermVectorComponentTest, SuggesterWFSTTest, JsonLoaderTest, TestSurroundQueryParser, DocumentAnalysisRequestHandlerTest, IndexSchemaRuntimeFieldTest, SolrPluginUtilsTest, TestValueSourceCache, FastVectorHighlighterTest, TestReversedWildcardFilterFactory, JSONWriterTest, SuggesterFSTTest]
[junit4:junit4] Completed in 3.21s, 4 tests, 1 error <<< FAILURES!

[...truncated 204 lines...]
BUILD FAILED
C:\Users\JenkinsSlave\workspace\Lucene-Solr-trunk-Windows\build.xml:38: The following error occurred while executing this line:
C:\Users\JenkinsSlave\workspace\Lucene-Solr-trunk-Windows\solr\build.xml:180: The following error occurred while executing this line:
C:\Users\JenkinsSlave\workspace\Lucene-Solr-trunk-Windows\lucene\module-build.xml:61: The following error occurred while executing this line:
C:\Users\JenkinsSlave\workspace\Lucene-Solr-trunk-Windows\lucene\common-build.xml:1143: The following error occurred while executing this line:
C:\Users\JenkinsSlave\workspace\Lucene-Solr-trunk-Windows\lucene\common-build.xml:816: There were test failures: 230 suites, 954 tests, 1 error, 12 ignored (7 assumptions)

Total time: 42 minutes 9 seconds
Build step 'Invoke Ant' marked build as failure
Recording test results
Description set: Java: 32bit/jdk1.6.0_35 -server -XX:+UseConcMarkSweepGC
Email was triggered for: Failure
Sending email for trigger: Failure



Mime
View raw message