lucene-dev mailing list archives

Site index · List index
Message view « Date » · « Thread »
Top « Date » · « Thread »
From Policeman Jenkins Server <jenk...@sd-datasolutions.de>
Subject [JENKINS] Lucene-Solr-trunk-Windows (32bit/jdk1.6.0_35) - Build # 1320 - Still Failing!
Date Sat, 27 Oct 2012 02:07:34 GMT
Build: http://jenkins.sd-datasolutions.de/job/Lucene-Solr-trunk-Windows/1320/
Java: 32bit/jdk1.6.0_35 -client -XX:+UseParallelGC

4 tests failed.
FAILED:  junit.framework.TestSuite.org.apache.solr.handler.TestReplicationHandler

Error Message:
Resource in scope SUITE failed to close. Resource was registered from thread Thread[id=1193, name=TEST-TestReplicationHandler.test-seed#[FEF5E47173CC2AC9], state=RUNNABLE, group=TGRP-TestReplicationHandler], registration stack trace below.

Stack Trace:
com.carrotsearch.randomizedtesting.ResourceDisposalError: Resource in scope SUITE failed to close. Resource was registered from thread Thread[id=1193, name=TEST-TestReplicationHandler.test-seed#[FEF5E47173CC2AC9], state=RUNNABLE, group=TGRP-TestReplicationHandler], registration stack trace below.
	at java.lang.Thread.getStackTrace(Thread.java:1479)
	at com.carrotsearch.randomizedtesting.RandomizedContext.closeAtEnd(RandomizedContext.java:150)
	at org.apache.lucene.util.LuceneTestCase.closeAfterSuite(LuceneTestCase.java:514)
	at org.apache.lucene.util.LuceneTestCase.wrapDirectory(LuceneTestCase.java:958)
	at org.apache.lucene.util.LuceneTestCase.newDirectory(LuceneTestCase.java:872)
	at org.apache.lucene.util.LuceneTestCase.newDirectory(LuceneTestCase.java:864)
	at org.apache.solr.core.MockDirectoryFactory.create(MockDirectoryFactory.java:33)
	at org.apache.solr.core.CachingDirectoryFactory.get(CachingDirectoryFactory.java:221)
	at org.apache.solr.update.SolrIndexWriter.create(SolrIndexWriter.java:60)
	at org.apache.solr.core.SolrCore.initIndex(SolrCore.java:502)
	at org.apache.solr.core.SolrCore.<init>(SolrCore.java:705)
	at org.apache.solr.core.SolrCore.<init>(SolrCore.java:618)
	at org.apache.solr.core.CoreContainer.create(CoreContainer.java:842)
	at org.apache.solr.core.CoreContainer.load(CoreContainer.java:529)
	at org.apache.solr.core.CoreContainer$Initializer.initialize(CoreContainer.java:306)
	at org.apache.solr.servlet.SolrDispatchFilter.init(SolrDispatchFilter.java:107)
	at org.eclipse.jetty.servlet.FilterHolder.doStart(FilterHolder.java:114)
	at org.eclipse.jetty.util.component.AbstractLifeCycle.start(AbstractLifeCycle.java:59)
	at org.eclipse.jetty.servlet.ServletHandler.initialize(ServletHandler.java:754)
	at org.eclipse.jetty.servlet.ServletHandler.updateMappings(ServletHandler.java:1227)
	at org.eclipse.jetty.servlet.ServletHandler.setFilterMappings(ServletHandler.java:1263)
	at org.eclipse.jetty.servlet.ServletHandler.addFilterWithMapping(ServletHandler.java:965)
	at org.eclipse.jetty.servlet.ServletHandler.addFilterWithMapping(ServletHandler.java:923)
	at org.eclipse.jetty.servlet.ServletContextHandler.addFilter(ServletContextHandler.java:333)
	at org.apache.solr.client.solrj.embedded.JettySolrRunner$1.lifeCycleStarted(JettySolrRunner.java:173)
	at org.eclipse.jetty.util.component.AbstractLifeCycle.setStarted(AbstractLifeCycle.java:169)
	at org.eclipse.jetty.util.component.AbstractLifeCycle.start(AbstractLifeCycle.java:60)
	at org.apache.solr.client.solrj.embedded.JettySolrRunner.start(JettySolrRunner.java:225)
	at org.apache.solr.client.solrj.embedded.JettySolrRunner.start(JettySolrRunner.java:205)
	at org.apache.solr.handler.TestReplicationHandler.createJetty(TestReplicationHandler.java:131)
	at org.apache.solr.handler.TestReplicationHandler.doTestIndexAndConfigReplication(TestReplicationHandler.java:410)
	at org.apache.solr.handler.TestReplicationHandler.test(TestReplicationHandler.java:254)
	at sun.reflect.NativeMethodAccessorImpl.invoke0(Native Method)
	at sun.reflect.NativeMethodAccessorImpl.invoke(NativeMethodAccessorImpl.java:39)
	at sun.reflect.DelegatingMethodAccessorImpl.invoke(DelegatingMethodAccessorImpl.java:25)
	at java.lang.reflect.Method.invoke(Method.java:597)
	at com.carrotsearch.randomizedtesting.RandomizedRunner.invoke(RandomizedRunner.java:1559)
	at com.carrotsearch.randomizedtesting.RandomizedRunner.access$600(RandomizedRunner.java:79)
	at com.carrotsearch.randomizedtesting.RandomizedRunner$6.evaluate(RandomizedRunner.java:737)
	at com.carrotsearch.randomizedtesting.RandomizedRunner$7.evaluate(RandomizedRunner.java:773)
	at com.carrotsearch.randomizedtesting.RandomizedRunner$8.evaluate(RandomizedRunner.java:787)
	at com.carrotsearch.randomizedtesting.rules.SystemPropertiesRestoreRule$1.evaluate(SystemPropertiesRestoreRule.java:53)
	at org.apache.lucene.util.TestRuleSetupTeardownChained$1.evaluate(TestRuleSetupTeardownChained.java:50)
	at org.apache.lucene.util.TestRuleFieldCacheSanity$1.evaluate(TestRuleFieldCacheSanity.java:51)
	at org.apache.lucene.util.AbstractBeforeAfterRule$1.evaluate(AbstractBeforeAfterRule.java:45)
	at com.carrotsearch.randomizedtesting.rules.SystemPropertiesInvariantRule$1.evaluate(SystemPropertiesInvariantRule.java:55)
	at org.apache.lucene.util.TestRuleThreadAndTestName$1.evaluate(TestRuleThreadAndTestName.java:48)
	at org.apache.lucene.util.TestRuleIgnoreAfterMaxFailures$1.evaluate(TestRuleIgnoreAfterMaxFailures.java:70)
	at org.apache.lucene.util.TestRuleMarkFailure$1.evaluate(TestRuleMarkFailure.java:48)
	at com.carrotsearch.randomizedtesting.rules.StatementAdapter.evaluate(StatementAdapter.java:36)
	at com.carrotsearch.randomizedtesting.ThreadLeakControl$StatementRunner.run(ThreadLeakControl.java:358)
	at com.carrotsearch.randomizedtesting.ThreadLeakControl.forkTimeoutingTask(ThreadLeakControl.java:782)
	at com.carrotsearch.randomizedtesting.ThreadLeakControl$3.evaluate(ThreadLeakControl.java:442)
	at com.carrotsearch.randomizedtesting.RandomizedRunner.runSingleTest(RandomizedRunner.java:746)
	at com.carrotsearch.randomizedtesting.RandomizedRunner$3.evaluate(RandomizedRunner.java:648)
	at com.carrotsearch.randomizedtesting.RandomizedRunner$4.evaluate(RandomizedRunner.java:682)
	at com.carrotsearch.randomizedtesting.RandomizedRunner$5.evaluate(RandomizedRunner.java:693)
	at com.carrotsearch.randomizedtesting.rules.StatementAdapter.evaluate(StatementAdapter.java:36)
	at com.carrotsearch.randomizedtesting.rules.SystemPropertiesRestoreRule$1.evaluate(SystemPropertiesRestoreRule.java:53)
	at org.apache.lucene.util.AbstractBeforeAfterRule$1.evaluate(AbstractBeforeAfterRule.java:45)
	at org.apache.lucene.util.TestRuleStoreClassName$1.evaluate(TestRuleStoreClassName.java:42)
	at com.carrotsearch.randomizedtesting.rules.SystemPropertiesInvariantRule$1.evaluate(SystemPropertiesInvariantRule.java:55)
	at com.carrotsearch.randomizedtesting.rules.NoShadowingOrOverridesOnMethodsRule$1.evaluate(NoShadowingOrOverridesOnMethodsRule.java:39)
	at com.carrotsearch.randomizedtesting.rules.NoShadowingOrOverridesOnMethodsRule$1.evaluate(NoShadowingOrOverridesOnMethodsRule.java:39)
	at com.carrotsearch.randomizedtesting.rules.StatementAdapter.evaluate(StatementAdapter.java:36)
	at org.apache.lucene.util.TestRuleAssertionsRequired$1.evaluate(TestRuleAssertionsRequired.java:43)
	at org.apache.lucene.util.TestRuleMarkFailure$1.evaluate(TestRuleMarkFailure.java:48)
	at org.apache.lucene.util.TestRuleIgnoreAfterMaxFailures$1.evaluate(TestRuleIgnoreAfterMaxFailures.java:70)
	at org.apache.lucene.util.TestRuleIgnoreTestSuites$1.evaluate(TestRuleIgnoreTestSuites.java:55)
	at com.carrotsearch.randomizedtesting.rules.StatementAdapter.evaluate(StatementAdapter.java:36)
	at com.carrotsearch.randomizedtesting.ThreadLeakControl$StatementRunner.run(ThreadLeakControl.java:358)
	at java.lang.Thread.run(Thread.java:662)
Caused by: java.lang.AssertionError: Directory not closed: MockDirWrapper(org.apache.lucene.store.RAMDirectory@e36e31 lockFactory=org.apache.lucene.store.SingleInstanceLockFactory@1907784)
	at org.junit.Assert.fail(Assert.java:93)
	at org.apache.lucene.util.CloseableDirectory.close(CloseableDirectory.java:47)
	at com.carrotsearch.randomizedtesting.RandomizedRunner$2$1.apply(RandomizedRunner.java:602)
	at com.carrotsearch.randomizedtesting.RandomizedRunner$2$1.apply(RandomizedRunner.java:599)
	at com.carrotsearch.randomizedtesting.RandomizedContext.closeResources(RandomizedContext.java:167)
	at com.carrotsearch.randomizedtesting.RandomizedRunner$2.afterAlways(RandomizedRunner.java:615)
	at com.carrotsearch.randomizedtesting.rules.StatementAdapter.evaluate(StatementAdapter.java:43)
	... 2 more


FAILED:  junit.framework.TestSuite.org.apache.solr.handler.TestReplicationHandler

Error Message:
Resource in scope SUITE failed to close. Resource was registered from thread Thread[id=1319, name=Thread-609, state=RUNNABLE, group=TGRP-TestReplicationHandler], registration stack trace below.

Stack Trace:
com.carrotsearch.randomizedtesting.ResourceDisposalError: Resource in scope SUITE failed to close. Resource was registered from thread Thread[id=1319, name=Thread-609, state=RUNNABLE, group=TGRP-TestReplicationHandler], registration stack trace below.
	at java.lang.Thread.getStackTrace(Thread.java:1479)
	at com.carrotsearch.randomizedtesting.RandomizedContext.closeAtEnd(RandomizedContext.java:150)
	at org.apache.lucene.util.LuceneTestCase.closeAfterSuite(LuceneTestCase.java:514)
	at org.apache.lucene.util.LuceneTestCase.wrapDirectory(LuceneTestCase.java:958)
	at org.apache.lucene.util.LuceneTestCase.newDirectory(LuceneTestCase.java:872)
	at org.apache.lucene.util.LuceneTestCase.newDirectory(LuceneTestCase.java:864)
	at org.apache.solr.core.MockDirectoryFactory.create(MockDirectoryFactory.java:33)
	at org.apache.solr.core.CachingDirectoryFactory.get(CachingDirectoryFactory.java:221)
	at org.apache.solr.core.CachingDirectoryFactory.get(CachingDirectoryFactory.java:181)
	at org.apache.solr.handler.SnapPuller.fetchLatestIndex(SnapPuller.java:373)
	at org.apache.solr.handler.ReplicationHandler.doFetch(ReplicationHandler.java:273)
	at org.apache.solr.handler.ReplicationHandler$1.run(ReplicationHandler.java:181)
Caused by: java.lang.AssertionError: Directory not closed: MockDirWrapper(org.apache.lucene.store.RAMDirectory@18e5d72 lockFactory=org.apache.lucene.store.SimpleFSLockFactory@1d9f748)
	at org.junit.Assert.fail(Assert.java:93)
	at org.apache.lucene.util.CloseableDirectory.close(CloseableDirectory.java:47)
	at com.carrotsearch.randomizedtesting.RandomizedRunner$2$1.apply(RandomizedRunner.java:602)
	at com.carrotsearch.randomizedtesting.RandomizedRunner$2$1.apply(RandomizedRunner.java:599)
	at com.carrotsearch.randomizedtesting.RandomizedContext.closeResources(RandomizedContext.java:167)
	at com.carrotsearch.randomizedtesting.RandomizedRunner$2.afterAlways(RandomizedRunner.java:615)
	at com.carrotsearch.randomizedtesting.rules.StatementAdapter.evaluate(StatementAdapter.java:43)
	at com.carrotsearch.randomizedtesting.ThreadLeakControl$StatementRunner.run(ThreadLeakControl.java:358)
	at java.lang.Thread.run(Thread.java:662)


FAILED:  org.apache.solr.cloud.BasicDistributedZk2Test.testDistribSearch

Error Message:
Shard still reported as live in zk - 0 jetty

Stack Trace:
java.lang.AssertionError: Shard still reported as live in zk - 0 jetty
	at __randomizedtesting.SeedInfo.seed([FEF5E47173CC2AC9:7F136A6904934AF5]:0)
	at org.junit.Assert.fail(Assert.java:93)
	at org.apache.solr.cloud.AbstractFullDistribZkTestBase.waitToSeeNotLive(AbstractFullDistribZkTestBase.java:1231)
	at org.apache.solr.cloud.BasicDistributedZk2Test.brindDownShardIndexSomeDocsAndRecover(BasicDistributedZk2Test.java:217)
	at org.apache.solr.cloud.BasicDistributedZk2Test.doTest(BasicDistributedZk2Test.java:92)
	at org.apache.solr.BaseDistributedSearchTestCase.testDistribSearch(BaseDistributedSearchTestCase.java:695)
	at sun.reflect.NativeMethodAccessorImpl.invoke0(Native Method)
	at sun.reflect.NativeMethodAccessorImpl.invoke(NativeMethodAccessorImpl.java:39)
	at sun.reflect.DelegatingMethodAccessorImpl.invoke(DelegatingMethodAccessorImpl.java:25)
	at java.lang.reflect.Method.invoke(Method.java:597)
	at com.carrotsearch.randomizedtesting.RandomizedRunner.invoke(RandomizedRunner.java:1559)
	at com.carrotsearch.randomizedtesting.RandomizedRunner.access$600(RandomizedRunner.java:79)
	at com.carrotsearch.randomizedtesting.RandomizedRunner$6.evaluate(RandomizedRunner.java:737)
	at com.carrotsearch.randomizedtesting.RandomizedRunner$7.evaluate(RandomizedRunner.java:773)
	at com.carrotsearch.randomizedtesting.RandomizedRunner$8.evaluate(RandomizedRunner.java:787)
	at com.carrotsearch.randomizedtesting.rules.SystemPropertiesRestoreRule$1.evaluate(SystemPropertiesRestoreRule.java:53)
	at org.apache.lucene.util.TestRuleSetupTeardownChained$1.evaluate(TestRuleSetupTeardownChained.java:50)
	at org.apache.lucene.util.TestRuleFieldCacheSanity$1.evaluate(TestRuleFieldCacheSanity.java:51)
	at org.apache.lucene.util.AbstractBeforeAfterRule$1.evaluate(AbstractBeforeAfterRule.java:45)
	at com.carrotsearch.randomizedtesting.rules.SystemPropertiesInvariantRule$1.evaluate(SystemPropertiesInvariantRule.java:55)
	at org.apache.lucene.util.TestRuleThreadAndTestName$1.evaluate(TestRuleThreadAndTestName.java:48)
	at org.apache.lucene.util.TestRuleIgnoreAfterMaxFailures$1.evaluate(TestRuleIgnoreAfterMaxFailures.java:70)
	at org.apache.lucene.util.TestRuleMarkFailure$1.evaluate(TestRuleMarkFailure.java:48)
	at com.carrotsearch.randomizedtesting.rules.StatementAdapter.evaluate(StatementAdapter.java:36)
	at com.carrotsearch.randomizedtesting.ThreadLeakControl$StatementRunner.run(ThreadLeakControl.java:358)
	at com.carrotsearch.randomizedtesting.ThreadLeakControl.forkTimeoutingTask(ThreadLeakControl.java:782)
	at com.carrotsearch.randomizedtesting.ThreadLeakControl$3.evaluate(ThreadLeakControl.java:442)
	at com.carrotsearch.randomizedtesting.RandomizedRunner.runSingleTest(RandomizedRunner.java:746)
	at com.carrotsearch.randomizedtesting.RandomizedRunner$3.evaluate(RandomizedRunner.java:648)
	at com.carrotsearch.randomizedtesting.RandomizedRunner$4.evaluate(RandomizedRunner.java:682)
	at com.carrotsearch.randomizedtesting.RandomizedRunner$5.evaluate(RandomizedRunner.java:693)
	at com.carrotsearch.randomizedtesting.rules.StatementAdapter.evaluate(StatementAdapter.java:36)
	at com.carrotsearch.randomizedtesting.rules.SystemPropertiesRestoreRule$1.evaluate(SystemPropertiesRestoreRule.java:53)
	at org.apache.lucene.util.AbstractBeforeAfterRule$1.evaluate(AbstractBeforeAfterRule.java:45)
	at org.apache.lucene.util.TestRuleStoreClassName$1.evaluate(TestRuleStoreClassName.java:42)
	at com.carrotsearch.randomizedtesting.rules.SystemPropertiesInvariantRule$1.evaluate(SystemPropertiesInvariantRule.java:55)
	at com.carrotsearch.randomizedtesting.rules.NoShadowingOrOverridesOnMethodsRule$1.evaluate(NoShadowingOrOverridesOnMethodsRule.java:39)
	at com.carrotsearch.randomizedtesting.rules.NoShadowingOrOverridesOnMethodsRule$1.evaluate(NoShadowingOrOverridesOnMethodsRule.java:39)
	at com.carrotsearch.randomizedtesting.rules.StatementAdapter.evaluate(StatementAdapter.java:36)
	at org.apache.lucene.util.TestRuleAssertionsRequired$1.evaluate(TestRuleAssertionsRequired.java:43)
	at org.apache.lucene.util.TestRuleMarkFailure$1.evaluate(TestRuleMarkFailure.java:48)
	at org.apache.lucene.util.TestRuleIgnoreAfterMaxFailures$1.evaluate(TestRuleIgnoreAfterMaxFailures.java:70)
	at org.apache.lucene.util.TestRuleIgnoreTestSuites$1.evaluate(TestRuleIgnoreTestSuites.java:55)
	at com.carrotsearch.randomizedtesting.rules.StatementAdapter.evaluate(StatementAdapter.java:36)
	at com.carrotsearch.randomizedtesting.ThreadLeakControl$StatementRunner.run(ThreadLeakControl.java:358)
	at java.lang.Thread.run(Thread.java:662)


FAILED:  org.apache.solr.cloud.SyncSliceTest.testDistribSearch

Error Message:
Shard still reported as live in zk - 0 jetty

Stack Trace:
java.lang.AssertionError: Shard still reported as live in zk - 0 jetty
	at __randomizedtesting.SeedInfo.seed([FEF5E47173CC2AC9:7F136A6904934AF5]:0)
	at org.junit.Assert.fail(Assert.java:93)
	at org.apache.solr.cloud.AbstractFullDistribZkTestBase.waitToSeeNotLive(AbstractFullDistribZkTestBase.java:1231)
	at org.apache.solr.cloud.AbstractFullDistribZkTestBase.waitToSeeNotLive(AbstractFullDistribZkTestBase.java:1216)
	at org.apache.solr.cloud.SyncSliceTest.waitToSeeDownInClusterState(SyncSliceTest.java:259)
	at org.apache.solr.cloud.SyncSliceTest.doTest(SyncSliceTest.java:163)
	at org.apache.solr.BaseDistributedSearchTestCase.testDistribSearch(BaseDistributedSearchTestCase.java:695)
	at sun.reflect.NativeMethodAccessorImpl.invoke0(Native Method)
	at sun.reflect.NativeMethodAccessorImpl.invoke(NativeMethodAccessorImpl.java:39)
	at sun.reflect.DelegatingMethodAccessorImpl.invoke(DelegatingMethodAccessorImpl.java:25)
	at java.lang.reflect.Method.invoke(Method.java:597)
	at com.carrotsearch.randomizedtesting.RandomizedRunner.invoke(RandomizedRunner.java:1559)
	at com.carrotsearch.randomizedtesting.RandomizedRunner.access$600(RandomizedRunner.java:79)
	at com.carrotsearch.randomizedtesting.RandomizedRunner$6.evaluate(RandomizedRunner.java:737)
	at com.carrotsearch.randomizedtesting.RandomizedRunner$7.evaluate(RandomizedRunner.java:773)
	at com.carrotsearch.randomizedtesting.RandomizedRunner$8.evaluate(RandomizedRunner.java:787)
	at com.carrotsearch.randomizedtesting.rules.SystemPropertiesRestoreRule$1.evaluate(SystemPropertiesRestoreRule.java:53)
	at org.apache.lucene.util.TestRuleSetupTeardownChained$1.evaluate(TestRuleSetupTeardownChained.java:50)
	at org.apache.lucene.util.TestRuleFieldCacheSanity$1.evaluate(TestRuleFieldCacheSanity.java:51)
	at org.apache.lucene.util.AbstractBeforeAfterRule$1.evaluate(AbstractBeforeAfterRule.java:45)
	at com.carrotsearch.randomizedtesting.rules.SystemPropertiesInvariantRule$1.evaluate(SystemPropertiesInvariantRule.java:55)
	at org.apache.lucene.util.TestRuleThreadAndTestName$1.evaluate(TestRuleThreadAndTestName.java:48)
	at org.apache.lucene.util.TestRuleIgnoreAfterMaxFailures$1.evaluate(TestRuleIgnoreAfterMaxFailures.java:70)
	at org.apache.lucene.util.TestRuleMarkFailure$1.evaluate(TestRuleMarkFailure.java:48)
	at com.carrotsearch.randomizedtesting.rules.StatementAdapter.evaluate(StatementAdapter.java:36)
	at com.carrotsearch.randomizedtesting.ThreadLeakControl$StatementRunner.run(ThreadLeakControl.java:358)
	at com.carrotsearch.randomizedtesting.ThreadLeakControl.forkTimeoutingTask(ThreadLeakControl.java:782)
	at com.carrotsearch.randomizedtesting.ThreadLeakControl$3.evaluate(ThreadLeakControl.java:442)
	at com.carrotsearch.randomizedtesting.RandomizedRunner.runSingleTest(RandomizedRunner.java:746)
	at com.carrotsearch.randomizedtesting.RandomizedRunner$3.evaluate(RandomizedRunner.java:648)
	at com.carrotsearch.randomizedtesting.RandomizedRunner$4.evaluate(RandomizedRunner.java:682)
	at com.carrotsearch.randomizedtesting.RandomizedRunner$5.evaluate(RandomizedRunner.java:693)
	at com.carrotsearch.randomizedtesting.rules.StatementAdapter.evaluate(StatementAdapter.java:36)
	at com.carrotsearch.randomizedtesting.rules.SystemPropertiesRestoreRule$1.evaluate(SystemPropertiesRestoreRule.java:53)
	at org.apache.lucene.util.AbstractBeforeAfterRule$1.evaluate(AbstractBeforeAfterRule.java:45)
	at org.apache.lucene.util.TestRuleStoreClassName$1.evaluate(TestRuleStoreClassName.java:42)
	at com.carrotsearch.randomizedtesting.rules.SystemPropertiesInvariantRule$1.evaluate(SystemPropertiesInvariantRule.java:55)
	at com.carrotsearch.randomizedtesting.rules.NoShadowingOrOverridesOnMethodsRule$1.evaluate(NoShadowingOrOverridesOnMethodsRule.java:39)
	at com.carrotsearch.randomizedtesting.rules.NoShadowingOrOverridesOnMethodsRule$1.evaluate(NoShadowingOrOverridesOnMethodsRule.java:39)
	at com.carrotsearch.randomizedtesting.rules.StatementAdapter.evaluate(StatementAdapter.java:36)
	at org.apache.lucene.util.TestRuleAssertionsRequired$1.evaluate(TestRuleAssertionsRequired.java:43)
	at org.apache.lucene.util.TestRuleMarkFailure$1.evaluate(TestRuleMarkFailure.java:48)
	at org.apache.lucene.util.TestRuleIgnoreAfterMaxFailures$1.evaluate(TestRuleIgnoreAfterMaxFailures.java:70)
	at org.apache.lucene.util.TestRuleIgnoreTestSuites$1.evaluate(TestRuleIgnoreTestSuites.java:55)
	at com.carrotsearch.randomizedtesting.rules.StatementAdapter.evaluate(StatementAdapter.java:36)
	at com.carrotsearch.randomizedtesting.ThreadLeakControl$StatementRunner.run(ThreadLeakControl.java:358)
	at java.lang.Thread.run(Thread.java:662)




Build Log:
[...truncated 7768 lines...]
[junit4:junit4] Suite: org.apache.solr.cloud.BasicDistributedZk2Test
[junit4:junit4]   2> 3 T139 oas.SolrTestCaseJ4.setUp ###Starting testDistribSearch
[junit4:junit4]   2> Creating dataDir: C:\Users\JenkinsSlave\workspace\Lucene-Solr-trunk-Windows\solr\build\solr-core\test\J0\.\solrtest-BasicDistributedZk2Test-1351302534123
[junit4:junit4]   2> 11 T139 oasc.ZkTestServer.run STARTING ZK TEST SERVER
[junit4:junit4]   2> 122 T140 oaz.Environment.logEnv Server environment:zookeeper.version=3.3.6-1366786, built on 07/29/2012 06:22 GMT
[junit4:junit4]   2> 122 T140 oaz.Environment.logEnv Server environment:host.name=JenkinsSlave-PC
[junit4:junit4]   2> 122 T140 oaz.Environment.logEnv Server environment:java.version=1.6.0_35
[junit4:junit4]   2> 122 T140 oaz.Environment.logEnv Server environment:java.vendor=Sun Microsystems Inc.
[junit4:junit4]   2> 124 T140 oaz.Environment.logEnv Server environment:java.home=C:\Users\JenkinsSlave\tools\java\32bit\jdk1.6.0_35\jre
[junit4:junit4]   2> 124 T140 oaz.Environment.logEnv Server environment:java.class.path=C:\Users\JenkinsSlave\workspace\Lucene-Solr-trunk-Windows\solr\build\solr-core\classes\test;C:\Users\JenkinsSlave\workspace\Lucene-Solr-trunk-Windows\solr\build\solr-test-framework\classes\java;C:\Users\JenkinsSlave\workspace\Lucene-Solr-trunk-Windows\solr\build\solr-core\test-files;C:\Users\JenkinsSlave\workspace\Lucene-Solr-trunk-Windows\lucene\build\test-framework\classes\java;C:\Users\JenkinsSlave\workspace\Lucene-Solr-trunk-Windows\lucene\build\codecs\classes\java;C:\Users\JenkinsSlave\workspace\Lucene-Solr-trunk-Windows\solr\build\solr-solrj\classes\java;C:\Users\JenkinsSlave\workspace\Lucene-Solr-trunk-Windows\solr\build\solr-core\classes\java;C:\Users\JenkinsSlave\workspace\Lucene-Solr-trunk-Windows\lucene\build\analysis\common\lucene-analyzers-common-5.0-SNAPSHOT.jar;C:\Users\JenkinsSlave\workspace\Lucene-Solr-trunk-Windows\lucene\build\analysis\kuromoji\lucene-analyzers-kuromoji-5.0-SNAPSHOT.jar;C:\Users\JenkinsSlave\workspace\Lucene-Solr-trunk-Windows\lucene\build\analysis\phonetic\lucene-analyzers-phonetic-5.0-SNAPSHOT.jar;C:\Users\JenkinsSlave\workspace\Lucene-Solr-trunk-Windows\lucene\build\highlighter\lucene-highlighter-5.0-SNAPSHOT.jar;C:\Users\JenkinsSlave\workspace\Lucene-Solr-trunk-Windows\lucene\build\memory\lucene-memory-5.0-SNAPSHOT.jar;C:\Users\JenkinsSlave\workspace\Lucene-Solr-trunk-Windows\lucene\build\misc\lucene-misc-5.0-SNAPSHOT.jar;C:\Users\JenkinsSlave\workspace\Lucene-Solr-trunk-Windows\lucene\build\spatial\lucene-spatial-5.0-SNAPSHOT.jar;C:\Users\JenkinsSlave\workspace\Lucene-Solr-trunk-Windows\lucene\build\suggest\lucene-suggest-5.0-SNAPSHOT.jar;C:\Users\JenkinsSlave\workspace\Lucene-Solr-trunk-Windows\lucene\build\grouping\lucene-grouping-5.0-SNAPSHOT.jar;C:\Users\JenkinsSlave\workspace\Lucene-Solr-trunk-Windows\lucene\build\queries\lucene-queries-5.0-SNAPSHOT.jar;C:\Users\JenkinsSlave\workspace\Lucene-Solr-trunk-Windows\lucene\build\queryparser\lucene-queryparser-5.0-SNAPSHOT.jar;C:\Users\JenkinsSlave\workspace\Lucene-Solr-trunk-Windows\solr\core\lib\commons-cli-1.2.jar;C:\Users\JenkinsSlave\workspace\Lucene-Solr-trunk-Windows\solr\core\lib\commons-codec-1.7.jar;C:\Users\JenkinsSlave\workspace\Lucene-Solr-trunk-Windows\solr\core\lib\commons-fileupload-1.2.1.jar;C:\Users\JenkinsSlave\workspace\Lucene-Solr-trunk-Windows\solr\core\lib\commons-lang-2.6.jar;C:\Users\JenkinsSlave\workspace\Lucene-Solr-trunk-Windows\solr\core\lib\easymock-2.2.jar;C:\Users\JenkinsSlave\workspace\Lucene-Solr-trunk-Windows\solr\core\lib\guava-r05.jar;C:\Users\JenkinsSlave\workspace\Lucene-Solr-trunk-Windows\solr\core\lib\javax.servlet-api-3.0.1.jar;C:\Users\JenkinsSlave\workspace\Lucene-Solr-trunk-Windows\solr\core\lib\spatial4j-0.3.jar;C:\Users\JenkinsSlave\workspace\Lucene-Solr-trunk-Windows\solr\solrj\lib\commons-io-2.1.jar;C:\Users\JenkinsSlave\workspace\Lucene-Solr-trunk-Windows\solr\solrj\lib\httpclient-4.1.3.jar;C:\Users\JenkinsSlave\workspace\Lucene-Solr-trunk-Windows\solr\solrj\lib\httpcore-4.1.4.jar;C:\Users\JenkinsSlave\workspace\Lucene-Solr-trunk-Windows\solr\solrj\lib\httpmime-4.1.3.jar;C:\Users\JenkinsSlave\workspace\Lucene-Solr-trunk-Windows\solr\solrj\lib\jcl-over-slf4j-1.6.4.jar;C:\Users\JenkinsSlave\workspace\Lucene-Solr-trunk-Windows\solr\solrj\lib\log4j-over-slf4j-1.6.4.jar;C:\Users\JenkinsSlave\workspace\Lucene-Solr-trunk-Windows\solr\solrj\lib\slf4j-api-1.6.4.jar;C:\Users\JenkinsSlave\workspace\Lucene-Solr-trunk-Windows\solr\solrj\lib\slf4j-jdk14-1.6.4.jar;C:\Users\JenkinsSlave\workspace\Lucene-Solr-trunk-Windows\solr\solrj\lib\wstx-asl-3.2.7.jar;C:\Users\JenkinsSlave\workspace\Lucene-Solr-trunk-Windows\solr\solrj\lib\zookeeper-3.3.6.jar;C:\Users\JenkinsSlave\workspace\Lucene-Solr-trunk-Windows\solr\example\lib\jetty-continuation-8.1.2.v20120308.jar;C:\Users\JenkinsSlave\workspace\Lucene-Solr-trunk-Windows\solr\example\lib\jetty-deploy-8.1.2.v20120308.jar;C:\Users\JenkinsSlave\workspace\Lucene-Solr-trunk-Windows\solr\example\lib\jetty-http-8.1.2.v20120308.jar;C:\Users\JenkinsSlave\workspace\Lucene-Solr-trunk-Windows\solr\example\lib\jetty-io-8.1.2.v20120308.jar;C:\Users\JenkinsSlave\workspace\Lucene-Solr-trunk-Windows\solr\example\lib\jetty-jmx-8.1.2.v20120308.jar;C:\Users\JenkinsSlave\workspace\Lucene-Solr-trunk-Windows\solr\example\lib\jetty-security-8.1.2.v20120308.jar;C:\Users\JenkinsSlave\workspace\Lucene-Solr-trunk-Windows\solr\example\lib\jetty-server-8.1.2.v20120308.jar;C:\Users\JenkinsSlave\workspace\Lucene-Solr-trunk-Windows\solr\example\lib\jetty-servlet-8.1.2.v20120308.jar;C:\Users\JenkinsSlave\workspace\Lucene-Solr-trunk-Windows\solr\example\lib\jetty-util-8.1.2.v20120308.jar;C:\Users\JenkinsSlave\workspace\Lucene-Solr-trunk-Windows\solr\example\lib\jetty-webapp-8.1.2.v20120308.jar;C:\Users\JenkinsSlave\workspace\Lucene-Solr-trunk-Windows\solr\example\lib\jetty-xml-8.1.2.v20120308.jar;C:\Users\JenkinsSlave\workspace\Lucene-Solr-trunk-Windows\solr\example\lib\servlet-api-3.0.jar;C:\Users\JenkinsSlave\workspace\Lucene-Solr-trunk-Windows\solr\example\example-DIH\solr\db\lib\hsqldb-1.8.0.10.jar;C:\Users\JenkinsSlave\workspace\Lucene-Solr-trunk-Windows\lucene\build\core\classes\java;C:\Users\JenkinsSlave\workspace\Lucene-Solr-trunk-Windows\lucene\test-framework\lib\junit-4.10.jar;C:\Users\JenkinsSlave\workspace\Lucene-Solr-trunk-Windows\lucene\test-framework\lib\randomizedtesting-runner-2.0.3.jar;C:\Users\JenkinsSlave\tools\Ant\ANT_1.8.2\lib\ant-launcher.jar;C:\Users\JenkinsSlave\.ant\lib\ivy-2.2.0.jar;C:\Users\JenkinsSlave\tools\Ant\ANT_1.8.2\lib\ant-antlr.jar;C:\Users\JenkinsSlave\tools\Ant\ANT_1.8.2\lib\ant-apache-bcel.jar;C:\Users\JenkinsSlave\tools\Ant\ANT_1.8.2\lib\ant-apache-bsf.jar;C:\Users\JenkinsSlave\tools\Ant\ANT_1.8.2\lib\ant-apache-log4j.jar;C:\Users\JenkinsSlave\tools\Ant\ANT_1.8.2\lib\ant-apache-oro.jar;C:\Users\JenkinsSlave\tools\Ant\ANT_1.8.2\lib\ant-apache-regexp.jar;C:\Users\JenkinsSlave\tools\Ant\ANT_1.8.2\lib\ant-apache-resolver.jar;C:\Users\JenkinsSlave\tools\Ant\ANT_1.8.2\lib\ant-apache-xalan2.jar;C:\Users\JenkinsSlave\tools\Ant\ANT_1.8.2\lib\ant-commons-logging.jar;C:\Users\JenkinsSlave\tools\Ant\ANT_1.8.2\lib\ant-commons-net.jar;C:\Users\JenkinsSlave\tools\Ant\ANT_1.8.2\lib\ant-jai.jar;C:\Users\JenkinsSlave\tools\Ant\ANT_1.8.2\lib\ant-javamail.jar;C:\Users\JenkinsSlave\tools\Ant\ANT_1.8.2\lib\ant-jdepend.jar;C:\Users\JenkinsSlave\tools\Ant\ANT_1.8.2\lib\ant-jmf.jar;C:\Users\JenkinsSlave\tools\Ant\ANT_1.8.2\lib\ant-jsch.jar;C:\Users\JenkinsSlave\tools\Ant\ANT_1.8.2\lib\ant-junit.jar;C:\Users\JenkinsSlave\tools\Ant\ANT_1.8.2\lib\ant-junit4.jar;C:\Users\JenkinsSlave\tools\Ant\ANT_1.8.2\lib\ant-netrexx.jar;C:\Users\JenkinsSlave\tools\Ant\ANT_1.8.2\lib\ant-swing.jar;C:\Users\JenkinsSlave\tools\Ant\ANT_1.8.2\lib\ant-testutil.jar;C:\Users\JenkinsSlave\tools\Ant\ANT_1.8.2\lib\ant.jar;C:\Users\JenkinsSlave\tools\java\32bit\jdk1.6.0_35\lib\tools.jar;C:\Users\JenkinsSlave\.ivy2\cache\com.carrotsearch.randomizedtesting\junit4-ant\jars\junit4-ant-2.0.3.jar
[junit4:junit4]   2> 131 T140 oaz.Environment.logEnv Server environment:java.library.path=C:\Users\JenkinsSlave\tools\java\32bit\jdk1.6.0_35\jre\bin;C:\Windows\Sun\Java\bin;C:\Windows\system32;C:\Windows;C:\Users\JenkinsSlave\tools\java\32bit\jdk1.6.0_35\bin;C:\Windows\system32;C:\Windows;C:\Windows\System32\Wbem;C:\Windows\System32\WindowsPowerShell\v1.0\;C:\Program Files (x86)\Subversion\bin;.
[junit4:junit4]   2> 133 T140 oaz.Environment.logEnv Server environment:java.io.tmpdir=.
[junit4:junit4]   2> 133 T140 oaz.Environment.logEnv Server environment:java.compiler=<NA>
[junit4:junit4]   2> 133 T140 oaz.Environment.logEnv Server environment:os.name=Windows 7
[junit4:junit4]   2> 133 T140 oaz.Environment.logEnv Server environment:os.arch=x86
[junit4:junit4]   2> 133 T140 oaz.Environment.logEnv Server environment:os.version=6.1
[junit4:junit4]   2> 133 T140 oaz.Environment.logEnv Server environment:user.name=JenkinsSlave
[junit4:junit4]   2> 133 T140 oaz.Environment.logEnv Server environment:user.home=C:\Users\JenkinsSlave
[junit4:junit4]   2> 133 T140 oaz.Environment.logEnv Server environment:user.dir=C:\Users\JenkinsSlave\workspace\Lucene-Solr-trunk-Windows\solr\build\solr-core\test\J0
[junit4:junit4]   2> 173 T140 oazs.ZooKeeperServer.setTickTime tickTime set to 1000
[junit4:junit4]   2> 204 T140 oazs.NIOServerCnxn$Factory.<init> binding to port 0.0.0.0/0.0.0.0:0
[junit4:junit4]   2> 257 T140 oazsp.FileTxnSnapLog.save Snapshotting: 0
[junit4:junit4]   2> 263 T139 oasc.ZkTestServer.run start zk server on port:59392
[junit4:junit4]   2> 394 T139 oaz.Environment.logEnv Client environment:zookeeper.version=3.3.6-1366786, built on 07/29/2012 06:22 GMT
[junit4:junit4]   2> 396 T139 oaz.Environment.logEnv Client environment:host.name=JenkinsSlave-PC
[junit4:junit4]   2> 396 T139 oaz.Environment.logEnv Client environment:java.version=1.6.0_35
[junit4:junit4]   2> 396 T139 oaz.Environment.logEnv Client environment:java.vendor=Sun Microsystems Inc.
[junit4:junit4]   2> 397 T139 oaz.Environment.logEnv Client environment:java.home=C:\Users\JenkinsSlave\tools\java\32bit\jdk1.6.0_35\jre
[junit4:junit4]   2> 397 T139 oaz.Environment.logEnv Client environment:java.class.path=C:\Users\JenkinsSlave\workspace\Lucene-Solr-trunk-Windows\solr\build\solr-core\classes\test;C:\Users\JenkinsSlave\workspace\Lucene-Solr-trunk-Windows\solr\build\solr-test-framework\classes\java;C:\Users\JenkinsSlave\workspace\Lucene-Solr-trunk-Windows\solr\build\solr-core\test-files;C:\Users\JenkinsSlave\workspace\Lucene-Solr-trunk-Windows\lucene\build\test-framework\classes\java;C:\Users\JenkinsSlave\workspace\Lucene-Solr-trunk-Windows\lucene\build\codecs\classes\java;C:\Users\JenkinsSlave\workspace\Lucene-Solr-trunk-Windows\solr\build\solr-solrj\classes\java;C:\Users\JenkinsSlave\workspace\Lucene-Solr-trunk-Windows\solr\build\solr-core\classes\java;C:\Users\JenkinsSlave\workspace\Lucene-Solr-trunk-Windows\lucene\build\analysis\common\lucene-analyzers-common-5.0-SNAPSHOT.jar;C:\Users\JenkinsSlave\workspace\Lucene-Solr-trunk-Windows\lucene\build\analysis\kuromoji\lucene-analyzers-kuromoji-5.0-SNAPSHOT.jar;C:\Users\JenkinsSlave\workspace\Lucene-Solr-trunk-Windows\lucene\build\analysis\phonetic\lucene-analyzers-phonetic-5.0-SNAPSHOT.jar;C:\Users\JenkinsSlave\workspace\Lucene-Solr-trunk-Windows\lucene\build\highlighter\lucene-highlighter-5.0-SNAPSHOT.jar;C:\Users\JenkinsSlave\workspace\Lucene-Solr-trunk-Windows\lucene\build\memory\lucene-memory-5.0-SNAPSHOT.jar;C:\Users\JenkinsSlave\workspace\Lucene-Solr-trunk-Windows\lucene\build\misc\lucene-misc-5.0-SNAPSHOT.jar;C:\Users\JenkinsSlave\workspace\Lucene-Solr-trunk-Windows\lucene\build\spatial\lucene-spatial-5.0-SNAPSHOT.jar;C:\Users\JenkinsSlave\workspace\Lucene-Solr-trunk-Windows\lucene\build\suggest\lucene-suggest-5.0-SNAPSHOT.jar;C:\Users\JenkinsSlave\workspace\Lucene-Solr-trunk-Windows\lucene\build\grouping\lucene-grouping-5.0-SNAPSHOT.jar;C:\Users\JenkinsSlave\workspace\Lucene-Solr-trunk-Windows\lucene\build\queries\lucene-queries-5.0-SNAPSHOT.jar;C:\Users\JenkinsSlave\workspace\Lucene-Solr-trunk-Windows\lucene\build\queryparser\lucene-queryparser-5.0-SNAPSHOT.jar;C:\Users\JenkinsSlave\workspace\Lucene-Solr-trunk-Windows\solr\core\lib\commons-cli-1.2.jar;C:\Users\JenkinsSlave\workspace\Lucene-Solr-trunk-Windows\solr\core\lib\commons-codec-1.7.jar;C:\Users\JenkinsSlave\workspace\Lucene-Solr-trunk-Windows\solr\core\lib\commons-fileupload-1.2.1.jar;C:\Users\JenkinsSlave\workspace\Lucene-Solr-trunk-Windows\solr\core\lib\commons-lang-2.6.jar;C:\Users\JenkinsSlave\workspace\Lucene-Solr-trunk-Windows\solr\core\lib\easymock-2.2.jar;C:\Users\JenkinsSlave\workspace\Lucene-Solr-trunk-Windows\solr\core\lib\guava-r05.jar;C:\Users\JenkinsSlave\workspace\Lucene-Solr-trunk-Windows\solr\core\lib\javax.servlet-api-3.0.1.jar;C:\Users\JenkinsSlave\workspace\Lucene-Solr-trunk-Windows\solr\core\lib\spatial4j-0.3.jar;C:\Users\JenkinsSlave\workspace\Lucene-Solr-trunk-Windows\solr\solrj\lib\commons-io-2.1.jar;C:\Users\JenkinsSlave\workspace\Lucene-Solr-trunk-Windows\solr\solrj\lib\httpclient-4.1.3.jar;C:\Users\JenkinsSlave\workspace\Lucene-Solr-trunk-Windows\solr\solrj\lib\httpcore-4.1.4.jar;C:\Users\JenkinsSlave\workspace\Lucene-Solr-trunk-Windows\solr\solrj\lib\httpmime-4.1.3.jar;C:\Users\JenkinsSlave\workspace\Lucene-Solr-trunk-Windows\solr\solrj\lib\jcl-over-slf4j-1.6.4.jar;C:\Users\JenkinsSlave\workspace\Lucene-Solr-trunk-Windows\solr\solrj\lib\log4j-over-slf4j-1.6.4.jar;C:\Users\JenkinsSlave\workspace\Lucene-Solr-trunk-Windows\solr\solrj\lib\slf4j-api-1.6.4.jar;C:\Users\JenkinsSlave\workspace\Lucene-Solr-trunk-Windows\solr\solrj\lib\slf4j-jdk14-1.6.4.jar;C:\Users\JenkinsSlave\workspace\Lucene-Solr-trunk-Windows\solr\solrj\lib\wstx-asl-3.2.7.jar;C:\Users\JenkinsSlave\workspace\Lucene-Solr-trunk-Windows\solr\solrj\lib\zookeeper-3.3.6.jar;C:\Users\JenkinsSlave\workspace\Lucene-Solr-trunk-Windows\solr\example\lib\jetty-continuation-8.1.2.v20120308.jar;C:\Users\JenkinsSlave\workspace\Lucene-Solr-trunk-Windows\solr\example\lib\jetty-deploy-8.1.2.v20120308.jar;C:\Users\JenkinsSlave\workspace\Lucene-Solr-trunk-Windows\solr\example\lib\jetty-http-8.1.2.v20120308.jar;C:\Users\JenkinsSlave\workspace\Lucene-Solr-trunk-Windows\solr\example\lib\jetty-io-8.1.2.v20120308.jar;C:\Users\JenkinsSlave\workspace\Lucene-Solr-trunk-Windows\solr\example\lib\jetty-jmx-8.1.2.v20120308.jar;C:\Users\JenkinsSlave\workspace\Lucene-Solr-trunk-Windows\solr\example\lib\jetty-security-8.1.2.v20120308.jar;C:\Users\JenkinsSlave\workspace\Lucene-Solr-trunk-Windows\solr\example\lib\jetty-server-8.1.2.v20120308.jar;C:\Users\JenkinsSlave\workspace\Lucene-Solr-trunk-Windows\solr\example\lib\jetty-servlet-8.1.2.v20120308.jar;C:\Users\JenkinsSlave\workspace\Lucene-Solr-trunk-Windows\solr\example\lib\jetty-util-8.1.2.v20120308.jar;C:\Users\JenkinsSlave\workspace\Lucene-Solr-trunk-Windows\solr\example\lib\jetty-webapp-8.1.2.v20120308.jar;C:\Users\JenkinsSlave\workspace\Lucene-Solr-trunk-Windows\solr\example\lib\jetty-xml-8.1.2.v20120308.jar;C:\Users\JenkinsSlave\workspace\Lucene-Solr-trunk-Windows\solr\example\lib\servlet-api-3.0.jar;C:\Users\JenkinsSlave\workspace\Lucene-Solr-trunk-Windows\solr\example\example-DIH\solr\db\lib\hsqldb-1.8.0.10.jar;C:\Users\JenkinsSlave\workspace\Lucene-Solr-trunk-Windows\lucene\build\core\classes\java;C:\Users\JenkinsSlave\workspace\Lucene-Solr-trunk-Windows\lucene\test-framework\lib\junit-4.10.jar;C:\Users\JenkinsSlave\workspace\Lucene-Solr-trunk-Windows\lucene\test-framework\lib\randomizedtesting-runner-2.0.3.jar;C:\Users\JenkinsSlave\tools\Ant\ANT_1.8.2\lib\ant-launcher.jar;C:\Users\JenkinsSlave\.ant\lib\ivy-2.2.0.jar;C:\Users\JenkinsSlave\tools\Ant\ANT_1.8.2\lib\ant-antlr.jar;C:\Users\JenkinsSlave\tools\Ant\ANT_1.8.2\lib\ant-apache-bcel.jar;C:\Users\JenkinsSlave\tools\Ant\ANT_1.8.2\lib\ant-apache-bsf.jar;C:\Users\JenkinsSlave\tools\Ant\ANT_1.8.2\lib\ant-apache-log4j.jar;C:\Users\JenkinsSlave\tools\Ant\ANT_1.8.2\lib\ant-apache-oro.jar;C:\Users\JenkinsSlave\tools\Ant\ANT_1.8.2\lib\ant-apache-regexp.jar;C:\Users\JenkinsSlave\tools\Ant\ANT_1.8.2\lib\ant-apache-resolver.jar;C:\Users\JenkinsSlave\tools\Ant\ANT_1.8.2\lib\ant-apache-xalan2.jar;C:\Users\JenkinsSlave\tools\Ant\ANT_1.8.2\lib\ant-commons-logging.jar;C:\Users\JenkinsSlave\tools\Ant\ANT_1.8.2\lib\ant-commons-net.jar;C:\Users\JenkinsSlave\tools\Ant\ANT_1.8.2\lib\ant-jai.jar;C:\Users\JenkinsSlave\tools\Ant\ANT_1.8.2\lib\ant-javamail.jar;C:\Users\JenkinsSlave\tools\Ant\ANT_1.8.2\lib\ant-jdepend.jar;C:\Users\JenkinsSlave\tools\Ant\ANT_1.8.2\lib\ant-jmf.jar;C:\Users\JenkinsSlave\tools\Ant\ANT_1.8.2\lib\ant-jsch.jar;C:\Users\JenkinsSlave\tools\Ant\ANT_1.8.2\lib\ant-junit.jar;C:\Users\JenkinsSlave\tools\Ant\ANT_1.8.2\lib\ant-junit4.jar;C:\Users\JenkinsSlave\tools\Ant\ANT_1.8.2\lib\ant-netrexx.jar;C:\Users\JenkinsSlave\tools\Ant\ANT_1.8.2\lib\ant-swing.jar;C:\Users\JenkinsSlave\tools\Ant\ANT_1.8.2\lib\ant-testutil.jar;C:\Users\JenkinsSlave\tools\Ant\ANT_1.8.2\lib\ant.jar;C:\Users\JenkinsSlave\tools\java\32bit\jdk1.6.0_35\lib\tools.jar;C:\Users\JenkinsSlave\.ivy2\cache\com.carrotsearch.randomizedtesting\junit4-ant\jars\junit4-ant-2.0.3.jar
[junit4:junit4]   2> 398 T139 oaz.Environment.logEnv Client environment:java.library.path=C:\Users\JenkinsSlave\tools\java\32bit\jdk1.6.0_35\jre\bin;C:\Windows\Sun\Java\bin;C:\Windows\system32;C:\Windows;C:\Users\JenkinsSlave\tools\java\32bit\jdk1.6.0_35\bin;C:\Windows\system32;C:\Windows;C:\Windows\System32\Wbem;C:\Windows\System32\WindowsPowerShell\v1.0\;C:\Program Files (x86)\Subversion\bin;.
[junit4:junit4]   2> 398 T139 oaz.Environment.logEnv Client environment:java.io.tmpdir=.
[junit4:junit4]   2> 398 T139 oaz.Environment.logEnv Client environment:java.compiler=<NA>
[junit4:junit4]   2> 398 T139 oaz.Environment.logEnv Client environment:os.name=Windows 7
[junit4:junit4]   2> 398 T139 oaz.Environment.logEnv Client environment:os.arch=x86
[junit4:junit4]   2> 400 T139 oaz.Environment.logEnv Client environment:os.version=6.1
[junit4:junit4]   2> 400 T139 oaz.Environment.logEnv Client environment:user.name=JenkinsSlave
[junit4:junit4]   2> 400 T139 oaz.Environment.logEnv Client environment:user.home=C:\Users\JenkinsSlave
[junit4:junit4]   2> 401 T139 oaz.Environment.logEnv Client environment:user.dir=C:\Users\JenkinsSlave\workspace\Lucene-Solr-trunk-Windows\solr\build\solr-core\test\J0
[junit4:junit4]   2> 409 T139 oaz.ZooKeeper.<init> Initiating client connection, connectString=127.0.0.1:59392 sessionTimeout=10000 watcher=org.apache.solr.common.cloud.ConnectionManager@7cf599
[junit4:junit4]   2> 512 T145 oaz.ClientCnxn$SendThread.startConnect Opening socket connection to server /127.0.0.1:59392
[junit4:junit4]   2> 512 T139 oascc.ConnectionManager.waitForConnected Waiting for client to connect to ZooKeeper
[junit4:junit4]   2> 516 T145 oaz.ClientCnxn$SendThread.primeConnection Socket connection established to 127.0.0.1/127.0.0.1:59392, initiating session
[junit4:junit4]   2> 516 T141 oazs.NIOServerCnxn$Factory.run Accepted socket connection from /127.0.0.1:59395
[junit4:junit4]   2> 531 T141 oazs.NIOServerCnxn.readConnectRequest Client attempting to establish new session at /127.0.0.1:59395
[junit4:junit4]   2> 543 T143 oazsp.FileTxnLog.append Creating new log file: log.1
[junit4:junit4]   2> 583 T143 oazs.NIOServerCnxn.finishSessionInit Established session 0x13a9fe855310000 with negotiated timeout 10000 for client /127.0.0.1:59395
[junit4:junit4]   2> 583 T145 oaz.ClientCnxn$SendThread.readConnectResult Session establishment complete on server 127.0.0.1/127.0.0.1:59392, sessionid = 0x13a9fe855310000, negotiated timeout = 10000
[junit4:junit4]   2> 593 T146 oascc.ConnectionManager.process Watcher org.apache.solr.common.cloud.ConnectionManager@7cf599 name:ZooKeeperConnection Watcher:127.0.0.1:59392 got event WatchedEvent state:SyncConnected type:None path:null path:null type:None
[junit4:junit4]   2> 594 T139 oascc.ConnectionManager.waitForConnected Client is connected to ZooKeeper
[junit4:junit4]   2> 599 T139 oascc.SolrZkClient.makePath makePath: /solr
[junit4:junit4]   2> 671 T144 oazs.PrepRequestProcessor.pRequest Processed session termination for sessionid: 0x13a9fe855310000
[junit4:junit4]   2> 673 T139 oaz.ZooKeeper.close Session: 0x13a9fe855310000 closed
[junit4:junit4]   2> 673 T141 oazs.NIOServerCnxn.doIO WARNING EndOfStreamException: Unable to read additional data from client sessionid 0x13a9fe855310000, likely client has closed socket
[junit4:junit4]   2> 673 T139 oaz.ZooKeeper.<init> Initiating client connection, connectString=127.0.0.1:59392/solr sessionTimeout=10000 watcher=org.apache.solr.common.cloud.ConnectionManager@2bbc83
[junit4:junit4]   2> 674 T146 oaz.ClientCnxn$EventThread.run EventThread shut down
[junit4:junit4]   2> 677 T141 oazs.NIOServerCnxn.closeSock Closed socket connection for client /127.0.0.1:59395 which had sessionid 0x13a9fe855310000
[junit4:junit4]   2> 677 T139 oascc.ConnectionManager.waitForConnected Waiting for client to connect to ZooKeeper
[junit4:junit4]   2> 677 T147 oaz.ClientCnxn$SendThread.startConnect Opening socket connection to server /127.0.0.1:59392
[junit4:junit4]   2> 679 T147 oaz.ClientCnxn$SendThread.primeConnection Socket connection established to 127.0.0.1/127.0.0.1:59392, initiating session
[junit4:junit4]   2> 679 T141 oazs.NIOServerCnxn$Factory.run Accepted socket connection from /127.0.0.1:59398
[junit4:junit4]   2> 679 T141 oazs.NIOServerCnxn.readConnectRequest Client attempting to establish new session at /127.0.0.1:59398
[junit4:junit4]   2> 681 T143 oazs.NIOServerCnxn.finishSessionInit Established session 0x13a9fe855310001 with negotiated timeout 10000 for client /127.0.0.1:59398
[junit4:junit4]   2> 681 T147 oaz.ClientCnxn$SendThread.readConnectResult Session establishment complete on server 127.0.0.1/127.0.0.1:59392, sessionid = 0x13a9fe855310001, negotiated timeout = 10000
[junit4:junit4]   2> 683 T148 oascc.ConnectionManager.process Watcher org.apache.solr.common.cloud.ConnectionManager@2bbc83 name:ZooKeeperConnection Watcher:127.0.0.1:59392/solr got event WatchedEvent state:SyncConnected type:None path:null path:null type:None
[junit4:junit4]   2> 683 T139 oascc.ConnectionManager.waitForConnected Client is connected to ZooKeeper
[junit4:junit4]   2> 687 T139 oascc.SolrZkClient.makePath makePath: /collections/collection1
[junit4:junit4]   2> 695 T139 oascc.SolrZkClient.makePath makePath: /collections/collection1/shards
[junit4:junit4]   2> 702 T139 oascc.SolrZkClient.makePath makePath: /collections/control_collection
[junit4:junit4]   2> 707 T139 oascc.SolrZkClient.makePath makePath: /collections/control_collection/shards
[junit4:junit4]   2> 714 T139 oasc.AbstractZkTestCase.putConfig put C:\Users\JenkinsSlave\workspace\Lucene-Solr-trunk-Windows\solr\build\solr-core\test-files\solr\collection1\conf\solrconfig.xml to /configs/conf1/solrconfig.xml
[junit4:junit4]   2> 717 T139 oascc.SolrZkClient.makePath makePath: /configs/conf1/solrconfig.xml
[junit4:junit4]   2> 735 T139 oasc.AbstractZkTestCase.putConfig put C:\Users\JenkinsSlave\workspace\Lucene-Solr-trunk-Windows\solr\build\solr-core\test-files\solr\collection1\conf\schema.xml to /configs/conf1/schema.xml
[junit4:junit4]   2> 738 T139 oascc.SolrZkClient.makePath makePath: /configs/conf1/schema.xml
[junit4:junit4]   2> 746 T139 oasc.AbstractZkTestCase.putConfig put C:\Users\JenkinsSlave\workspace\Lucene-Solr-trunk-Windows\solr\build\solr-core\test-files\solr\collection1\conf\solrconfig.xml to /configs/conf1/solrconfig.xml
[junit4:junit4]   2> 746 T139 oascc.SolrZkClient.makePath makePath: /configs/conf1/solrconfig.xml
[junit4:junit4]   2> 767 T139 oasc.AbstractZkTestCase.putConfig put C:\Users\JenkinsSlave\workspace\Lucene-Solr-trunk-Windows\solr\build\solr-core\test-files\solr\collection1\conf\stopwords.txt to /configs/conf1/stopwords.txt
[junit4:junit4]   2> 768 T139 oascc.SolrZkClient.makePath makePath: /configs/conf1/stopwords.txt
[junit4:junit4]   2> 775 T139 oasc.AbstractZkTestCase.putConfig put C:\Users\JenkinsSlave\workspace\Lucene-Solr-trunk-Windows\solr\build\solr-core\test-files\solr\collection1\conf\protwords.txt to /configs/conf1/protwords.txt
[junit4:junit4]   2> 775 T139 oascc.SolrZkClient.makePath makePath: /configs/conf1/protwords.txt
[junit4:junit4]   2> 782 T139 oasc.AbstractZkTestCase.putConfig put C:\Users\JenkinsSlave\workspace\Lucene-Solr-trunk-Windows\solr\build\solr-core\test-files\solr\collection1\conf\currency.xml to /configs/conf1/currency.xml
[junit4:junit4]   2> 783 T139 oascc.SolrZkClient.makePath makePath: /configs/conf1/currency.xml
[junit4:junit4]   2> 789 T139 oasc.AbstractZkTestCase.putConfig put C:\Users\JenkinsSlave\workspace\Lucene-Solr-trunk-Windows\solr\build\solr-core\test-files\solr\collection1\conf\open-exchange-rates.json to /configs/conf1/open-exchange-rates.json
[junit4:junit4]   2> 791 T139 oascc.SolrZkClient.makePath makePath: /configs/conf1/open-exchange-rates.json
[junit4:junit4]   2> 795 T139 oasc.AbstractZkTestCase.putConfig put C:\Users\JenkinsSlave\workspace\Lucene-Solr-trunk-Windows\solr\build\solr-core\test-files\solr\collection1\conf\mapping-ISOLatin1Accent.txt to /configs/conf1/mapping-ISOLatin1Accent.txt
[junit4:junit4]   2> 798 T139 oascc.SolrZkClient.makePath makePath: /configs/conf1/mapping-ISOLatin1Accent.txt
[junit4:junit4]   2> 805 T139 oasc.AbstractZkTestCase.putConfig put C:\Users\JenkinsSlave\workspace\Lucene-Solr-trunk-Windows\solr\build\solr-core\test-files\solr\collection1\conf\old_synonyms.txt to /configs/conf1/old_synonyms.txt
[junit4:junit4]   2> 806 T139 oascc.SolrZkClient.makePath makePath: /configs/conf1/old_synonyms.txt
[junit4:junit4]   2> 812 T139 oasc.AbstractZkTestCase.putConfig put C:\Users\JenkinsSlave\workspace\Lucene-Solr-trunk-Windows\solr\build\solr-core\test-files\solr\collection1\conf\synonyms.txt to /configs/conf1/synonyms.txt
[junit4:junit4]   2> 813 T139 oascc.SolrZkClient.makePath makePath: /configs/conf1/synonyms.txt
[junit4:junit4]   2> 819 T144 oazs.PrepRequestProcessor.pRequest Processed session termination for sessionid: 0x13a9fe855310001
[junit4:junit4]   2> 822 T139 oaz.ZooKeeper.close Session: 0x13a9fe855310001 closed
[junit4:junit4]   2> 822 T148 oaz.ClientCnxn$EventThread.run EventThread shut down
[junit4:junit4]   2> 822 T141 oazs.NIOServerCnxn.doIO WARNING EndOfStreamException: Unable to read additional data from client sessionid 0x13a9fe855310001, likely client has closed socket
[junit4:junit4]   2> 823 T141 oazs.NIOServerCnxn.closeSock Closed socket connection for client /127.0.0.1:59398 which had sessionid 0x13a9fe855310001
[junit4:junit4]   2> 1188 T139 oejs.Server.doStart jetty-8.1.2.v20120308
[junit4:junit4]   2> 1195 T139 oejs.AbstractConnector.doStart Started SelectChannelConnector@0.0.0.0:59399
[junit4:junit4]   2> 1195 T139 oasc.SolrResourceLoader.locateSolrHome JNDI not configured for solr (NoInitialContextEx)
[junit4:junit4]   2> 1196 T139 oasc.SolrResourceLoader.locateSolrHome using system property solr.solr.home: C:\Users\JenkinsSlave\workspace\Lucene-Solr-trunk-Windows\solr\build\solr-core\test\J0\.\org.apache.solr.cloud.BasicDistributedZk2Test-controljetty-1351302534941
[junit4:junit4]   2> 1196 T139 oasc.SolrResourceLoader.<init> new SolrResourceLoader for deduced Solr Home: 'C:\Users\JenkinsSlave\workspace\Lucene-Solr-trunk-Windows\solr\build\solr-core\test\J0\.\org.apache.solr.cloud.BasicDistributedZk2Test-controljetty-1351302534941\'
[junit4:junit4]   2> 1229 T139 oass.SolrDispatchFilter.init SolrDispatchFilter.init()
[junit4:junit4]   2> 1231 T139 oasc.SolrResourceLoader.locateSolrHome JNDI not configured for solr (NoInitialContextEx)
[junit4:junit4]   2> 1231 T139 oasc.SolrResourceLoader.locateSolrHome using system property solr.solr.home: C:\Users\JenkinsSlave\workspace\Lucene-Solr-trunk-Windows\solr\build\solr-core\test\J0\.\org.apache.solr.cloud.BasicDistributedZk2Test-controljetty-1351302534941
[junit4:junit4]   2> 1231 T139 oasc.CoreContainer$Initializer.initialize looking for solr.xml: C:\Users\JenkinsSlave\workspace\Lucene-Solr-trunk-Windows\solr\build\solr-core\test\J0\.\org.apache.solr.cloud.BasicDistributedZk2Test-controljetty-1351302534941\solr.xml
[junit4:junit4]   2> 1231 T139 oasc.CoreContainer.<init> New CoreContainer 27237422
[junit4:junit4]   2> 1232 T139 oasc.CoreContainer.load Loading CoreContainer using Solr Home: 'C:\Users\JenkinsSlave\workspace\Lucene-Solr-trunk-Windows\solr\build\solr-core\test\J0\.\org.apache.solr.cloud.BasicDistributedZk2Test-controljetty-1351302534941\'
[junit4:junit4]   2> 1232 T139 oasc.SolrResourceLoader.<init> new SolrResourceLoader for directory: 'C:\Users\JenkinsSlave\workspace\Lucene-Solr-trunk-Windows\solr\build\solr-core\test\J0\.\org.apache.solr.cloud.BasicDistributedZk2Test-controljetty-1351302534941\'
[junit4:junit4]   2> 1255 T139 oasc.CoreContainer.load Registering Log Listener
[junit4:junit4]   2> 1273 T139 oasc.CoreContainer.initZooKeeper Zookeeper client=127.0.0.1:59392/solr
[junit4:junit4]   2> 1297 T139 oaz.ZooKeeper.<init> Initiating client connection, connectString=127.0.0.1:59392/solr sessionTimeout=5000 watcher=org.apache.solr.common.cloud.ConnectionManager@12320ff
[junit4:junit4]   2> 1299 T158 oaz.ClientCnxn$SendThread.startConnect Opening socket connection to server /127.0.0.1:59392
[junit4:junit4]   2> 1299 T139 oascc.ConnectionManager.waitForConnected Waiting for client to connect to ZooKeeper
[junit4:junit4]   2> 1303 T158 oaz.ClientCnxn$SendThread.primeConnection Socket connection established to 127.0.0.1/127.0.0.1:59392, initiating session
[junit4:junit4]   2> 1303 T141 oazs.NIOServerCnxn$Factory.run Accepted socket connection from /127.0.0.1:59404
[junit4:junit4]   2> 1303 T141 oazs.NIOServerCnxn.readConnectRequest Client attempting to establish new session at /127.0.0.1:59404
[junit4:junit4]   2> 1317 T143 oazs.NIOServerCnxn.finishSessionInit Established session 0x13a9fe855310002 with negotiated timeout 5000 for client /127.0.0.1:59404
[junit4:junit4]   2> 1317 T158 oaz.ClientCnxn$SendThread.readConnectResult Session establishment complete on server 127.0.0.1/127.0.0.1:59392, sessionid = 0x13a9fe855310002, negotiated timeout = 5000
[junit4:junit4]   2> 1318 T159 oascc.ConnectionManager.process Watcher org.apache.solr.common.cloud.ConnectionManager@12320ff name:ZooKeeperConnection Watcher:127.0.0.1:59392/solr got event WatchedEvent state:SyncConnected type:None path:null path:null type:None
[junit4:junit4]   2> 1319 T139 oascc.ConnectionManager.waitForConnected Client is connected to ZooKeeper
[junit4:junit4]   2> 1343 T144 oazs.PrepRequestProcessor.pRequest Got user-level KeeperException when processing sessionid:0x13a9fe855310002 type:create cxid:0x2 zxid:0xfffffffffffffffe txntype:unknown reqpath:n/a Error Path:/solr/overseer Error:KeeperErrorCode = NodeExists for /solr/overseer
[junit4:junit4]   2> 1357 T139 oascc.SolrZkClient.makePath makePath: /live_nodes
[junit4:junit4]   2> 1361 T139 oasc.ZkController.createEphemeralLiveNode Register node as live in ZooKeeper:/live_nodes/127.0.0.1:59399_solr
[junit4:junit4]   2> 1365 T144 oazs.PrepRequestProcessor.pRequest Got user-level KeeperException when processing sessionid:0x13a9fe855310002 type:delete cxid:0x7 zxid:0xfffffffffffffffe txntype:unknown reqpath:n/a Error Path:/solr/live_nodes/127.0.0.1:59399_solr Error:KeeperErrorCode = NoNode for /solr/live_nodes/127.0.0.1:59399_solr
[junit4:junit4]   2> 1367 T139 oascc.SolrZkClient.makePath makePath: /live_nodes/127.0.0.1:59399_solr
[junit4:junit4]   2> 1373 T139 oashc.HttpShardHandlerFactory.getParameter Setting socketTimeout to: 0
[junit4:junit4]   2> 1375 T139 oashc.HttpShardHandlerFactory.getParameter Setting urlScheme to: http://
[junit4:junit4]   2> 1375 T139 oashc.HttpShardHandlerFactory.getParameter Setting connTimeout to: 0
[junit4:junit4]   2> 1375 T139 oashc.HttpShardHandlerFactory.getParameter Setting maxConnectionsPerHost to: 20
[junit4:junit4]   2> 1375 T139 oashc.HttpShardHandlerFactory.getParameter Setting corePoolSize to: 0
[junit4:junit4]   2> 1375 T139 oashc.HttpShardHandlerFactory.getParameter Setting maximumPoolSize to: 2147483647
[junit4:junit4]   2> 1377 T139 oashc.HttpShardHandlerFactory.getParameter Setting maxThreadIdleTime to: 5
[junit4:junit4]   2> 1377 T139 oashc.HttpShardHandlerFactory.getParameter Setting sizeOfQueue to: -1
[junit4:junit4]   2> 1377 T139 oashc.HttpShardHandlerFactory.getParameter Setting fairnessPolicy to: false
[junit4:junit4]   2> 1377 T139 oascsi.HttpClientUtil.createClient Creating new http client, config:maxConnectionsPerHost=20&maxConnections=10000&socketTimeout=0&connTimeout=0&retry=false
[junit4:junit4]   2> 1387 T139 oascc.SolrZkClient.makePath makePath: /overseer_elect/election
[junit4:junit4]   2> 1411 T144 oazs.PrepRequestProcessor.pRequest Got user-level KeeperException when processing sessionid:0x13a9fe855310002 type:delete cxid:0x15 zxid:0xfffffffffffffffe txntype:unknown reqpath:n/a Error Path:/solr/overseer_elect/leader Error:KeeperErrorCode = NoNode for /solr/overseer_elect/leader
[junit4:junit4]   2> 1413 T139 oascc.SolrZkClient.makePath makePath: /overseer_elect/leader
[junit4:junit4]   2> 1418 T139 oasc.Overseer.start Overseer (id=88558962897649666-127.0.0.1:59399_solr-n_0000000000) starting
[junit4:junit4]   2> 1419 T144 oazs.PrepRequestProcessor.pRequest Got user-level KeeperException when processing sessionid:0x13a9fe855310002 type:create cxid:0x1a zxid:0xfffffffffffffffe txntype:unknown reqpath:n/a Error Path:/solr/overseer Error:KeeperErrorCode = NodeExists for /solr/overseer
[junit4:junit4]   2> 1431 T144 oazs.PrepRequestProcessor.pRequest Got user-level KeeperException when processing sessionid:0x13a9fe855310002 type:create cxid:0x1b zxid:0xfffffffffffffffe txntype:unknown reqpath:n/a Error Path:/solr/overseer Error:KeeperErrorCode = NodeExists for /solr/overseer
[junit4:junit4]   2> 1435 T144 oazs.PrepRequestProcessor.pRequest Got user-level KeeperException when processing sessionid:0x13a9fe855310002 type:create cxid:0x1c zxid:0xfffffffffffffffe txntype:unknown reqpath:n/a Error Path:/solr/overseer Error:KeeperErrorCode = NodeExists for /solr/overseer
[junit4:junit4]   2> 1442 T144 oazs.PrepRequestProcessor.pRequest Got user-level KeeperException when processing sessionid:0x13a9fe855310002 type:create cxid:0x1d zxid:0xfffffffffffffffe txntype:unknown reqpath:n/a Error Path:/solr/overseer Error:KeeperErrorCode = NodeExists for /solr/overseer
[junit4:junit4]   2> 1444 T161 oasc.OverseerCollectionProcessor.run Process current queue of collection creations
[junit4:junit4]   2> 1445 T139 oascc.SolrZkClient.makePath makePath: /clusterstate.json
[junit4:junit4]   2> 1454 T139 oascc.ZkStateReader.createClusterStateWatchersAndUpdate Updating cluster state from ZooKeeper... 
[junit4:junit4]   2> 1483 T160 oasc.Overseer$ClusterStateUpdater.run Starting to work on the main queue
[junit4:junit4]   2> 1502 T139 oasc.CoreContainer.create Creating SolrCore 'collection1' using instanceDir: C:\Users\JenkinsSlave\workspace\Lucene-Solr-trunk-Windows\solr\build\solr-core\test\J0\.\org.apache.solr.cloud.BasicDistributedZk2Test-controljetty-1351302534941\collection1
[junit4:junit4]   2> 1503 T139 oasc.ZkController.createCollectionZkNode Check for collection zkNode:control_collection
[junit4:junit4]   2> 1504 T139 oasc.ZkController.createCollectionZkNode Collection zkNode exists
[junit4:junit4]   2> 1504 T139 oasc.ZkController.readConfigName Load collection config from:/collections/control_collection
[junit4:junit4]   2> 1508 T139 oasc.SolrResourceLoader.<init> new SolrResourceLoader for directory: 'C:\Users\JenkinsSlave\workspace\Lucene-Solr-trunk-Windows\solr\build\solr-core\test\J0\.\org.apache.solr.cloud.BasicDistributedZk2Test-controljetty-1351302534941\collection1\'
[junit4:junit4]   2> 1511 T139 oasc.SolrResourceLoader.replaceClassLoader Adding 'file:/C:/Users/JenkinsSlave/workspace/Lucene-Solr-trunk-Windows/solr/build/solr-core/test/J0/org.apache.solr.cloud.BasicDistributedZk2Test-controljetty-1351302534941/collection1/lib/classes/' to classloader
[junit4:junit4]   2> 1514 T139 oasc.SolrResourceLoader.replaceClassLoader Adding 'file:/C:/Users/JenkinsSlave/workspace/Lucene-Solr-trunk-Windows/solr/build/solr-core/test/J0/org.apache.solr.cloud.BasicDistributedZk2Test-controljetty-1351302534941/collection1/lib/README' to classloader
[junit4:junit4]   2> 1599 T139 oasc.SolrConfig.<init> Using Lucene MatchVersion: LUCENE_50
[junit4:junit4]   2> 1703 T139 oasc.SolrConfig.<init> Loaded SolrConfig: solrconfig.xml
[junit4:junit4]   2> 1704 T139 oass.IndexSchema.readSchema Reading Solr Schema
[junit4:junit4]   2> 1713 T139 oass.IndexSchema.readSchema Schema name=test
[junit4:junit4]   2> 2562 T139 oass.OpenExchangeRatesOrgProvider.init Initialized with rates=open-exchange-rates.json, refreshInterval=1440.
[junit4:junit4]   2> 2573 T139 oass.IndexSchema.readSchema default search field in schema is text
[junit4:junit4]   2> 2578 T139 oass.IndexSchema.readSchema unique key field: id
[junit4:junit4]   2> 2603 T139 oass.FileExchangeRateProvider.reload Reloading exchange rates from file currency.xml
[junit4:junit4]   2> 2610 T139 oass.FileExchangeRateProvider.reload Reloading exchange rates from file currency.xml
[junit4:junit4]   2> 2617 T139 oass.OpenExchangeRatesOrgProvider.reload Reloading exchange rates from open-exchange-rates.json
[junit4:junit4]   2> 2620 T139 oass.OpenExchangeRatesOrgProvider.reload Reloading exchange rates from open-exchange-rates.json
[junit4:junit4]   2> 2622 T139 oasc.SolrCore.<init> [collection1] Opening new SolrCore at C:\Users\JenkinsSlave\workspace\Lucene-Solr-trunk-Windows\solr\build\solr-core\test\J0\.\org.apache.solr.cloud.BasicDistributedZk2Test-controljetty-1351302534941\collection1\, dataDir=.\org.apache.solr.cloud.BasicDistributedZk2Test-1351302534121/control/data\
[junit4:junit4]   2> 2628 T139 oasc.JmxMonitoredMap.<init> JMX monitoring is enabled. Adding Solr mbeans to JMX Server: com.sun.jmx.mbeanserver.JmxMBeanServer@6a63d3
[junit4:junit4]   2> 2629 T139 oasc.SolrCore.initDirectoryFactory solr.NRTCachingDirectoryFactory
[junit4:junit4]   2> 2668 T139 oasc.CachingDirectoryFactory.injectLockFactory WARNING No lockType configured for NRTCachingDirectory(org.apache.lucene.store.SimpleFSDirectory@C:\Users\JenkinsSlave\workspace\Lucene-Solr-trunk-Windows\solr\build\solr-core\test\J0\org.apache.solr.cloud.BasicDistributedZk2Test-1351302534121\control\data lockFactory=org.apache.lucene.store.NativeFSLockFactory@854dc9; maxCacheMB=48.0 maxMergeSizeMB=4.0) assuming 'simple'
[junit4:junit4]   2> 2669 T139 oasc.CachingDirectoryFactory.get return new directory for C:\Users\JenkinsSlave\workspace\Lucene-Solr-trunk-Windows\solr\build\solr-core\test\J0\.\org.apache.solr.cloud.BasicDistributedZk2Test-1351302534121\control\data forceNew:false
[junit4:junit4]   2> 2669 T139 oasc.CachingDirectoryFactory.close Releasing directory:C:\Users\JenkinsSlave\workspace\Lucene-Solr-trunk-Windows\solr\build\solr-core\test\J0\.\org.apache.solr.cloud.BasicDistributedZk2Test-1351302534121\control\data
[junit4:junit4]   2> 2670 T139 oasc.SolrCore.getNewIndexDir New index directory detected: old=null new=.\org.apache.solr.cloud.BasicDistributedZk2Test-1351302534121/control/data\index/
[junit4:junit4]   2> 2671 T139 oasc.SolrCore.initIndex WARNING [collection1] Solr index directory '.\org.apache.solr.cloud.BasicDistributedZk2Test-1351302534121\control\data\index' doesn't exist. Creating new index...
[junit4:junit4]   2> 2672 T139 oasc.CachingDirectoryFactory.get return new directory for C:\Users\JenkinsSlave\workspace\Lucene-Solr-trunk-Windows\solr\build\solr-core\test\J0\.\org.apache.solr.cloud.BasicDistributedZk2Test-1351302534121\control\data\index forceNew:false
[junit4:junit4]   2> 2688 T139 oasc.SolrDeletionPolicy.onCommit SolrDeletionPolicy.onCommit: commits:num=1
[junit4:junit4]   2> 		commit{dir=NRTCachingDirectory(org.apache.lucene.store.SimpleFSDirectory@C:\Users\JenkinsSlave\workspace\Lucene-Solr-trunk-Windows\solr\build\solr-core\test\J0\org.apache.solr.cloud.BasicDistributedZk2Test-1351302534121\control\data\index lockFactory=org.apache.lucene.store.NativeFSLockFactory@38230; maxCacheMB=48.0 maxMergeSizeMB=4.0),segFN=segments_1,generation=1,filenames=[segments_1]
[junit4:junit4]   2> 2688 T139 oasc.SolrDeletionPolicy.updateCommits newest commit = 1[segments_1]
[junit4:junit4]   2> 2690 T139 oasc.CachingDirectoryFactory.close Releasing directory:C:\Users\JenkinsSlave\workspace\Lucene-Solr-trunk-Windows\solr\build\solr-core\test\J0\.\org.apache.solr.cloud.BasicDistributedZk2Test-1351302534121\control\data\index
[junit4:junit4]   2> 2692 T139 oasc.SolrCore.initWriters created xml: solr.XMLResponseWriter
[junit4:junit4]   2> 2693 T139 oasup.UpdateRequestProcessorChain.init inserting DistributedUpdateProcessorFactory into updateRequestProcessorChain "dedupe"
[junit4:junit4]   2> 2693 T139 oasup.UpdateRequestProcessorChain.init inserting DistributedUpdateProcessorFactory into updateRequestProcessorChain "dedupe-allfields"
[junit4:junit4]   2> 2693 T139 oasup.UpdateRequestProcessorChain.init inserting DistributedUpdateProcessorFactory into updateRequestProcessorChain "stored_sig"
[junit4:junit4]   2> 2693 T139 oasup.UpdateRequestProcessorChain.init inserting DistributedUpdateProcessorFactory into updateRequestProcessorChain "uniq-fields"
[junit4:junit4]   2> 2694 T139 oasup.UpdateRequestProcessorChain.init inserting DistributedUpdateProcessorFactory into updateRequestProcessorChain "distrib-dup-test-chain-implicit"
[junit4:junit4]   2> 2694 T139 oasc.RequestHandlers.initHandlersFromConfig adding lazy requestHandler: solr.ReplicationHandler
[junit4:junit4]   2> 2694 T139 oasc.RequestHandlers.initHandlersFromConfig created /replication: solr.ReplicationHandler
[junit4:junit4]   2> 2695 T139 oasc.RequestHandlers.initHandlersFromConfig created standard: solr.StandardRequestHandler
[junit4:junit4]   2> 2695 T139 oasc.RequestHandlers.initHandlersFromConfig created /get: solr.RealTimeGetHandler
[junit4:junit4]   2> 2696 T139 oasc.RequestHandlers.initHandlersFromConfig created dismax: solr.SearchHandler
[junit4:junit4]   2> 2696 T139 oasc.RequestHandlers.initHandlersFromConfig created mock: org.apache.solr.core.MockQuerySenderListenerReqHandler
[junit4:junit4]   2> 2696 T139 oasc.RequestHandlers.initHandlersFromConfig created /admin/: org.apache.solr.handler.admin.AdminHandlers
[junit4:junit4]   2> 2698 T139 oasc.RequestHandlers.initHandlersFromConfig created defaults: solr.StandardRequestHandler
[junit4:junit4]   2> 2698 T139 oasc.RequestHandlers.initHandlersFromConfig adding lazy requestHandler: solr.StandardRequestHandler
[junit4:junit4]   2> 2698 T139 oasc.RequestHandlers.initHandlersFromConfig created lazy: solr.StandardRequestHandler
[junit4:junit4]   2> 2698 T139 oasc.RequestHandlers.initHandlersFromConfig created /update: solr.UpdateRequestHandler
[junit4:junit4]   2> 2699 T139 oasc.RequestHandlers.initHandlersFromConfig created /terms: org.apache.solr.handler.component.SearchHandler
[junit4:junit4]   2> 2699 T139 oasc.RequestHandlers.initHandlersFromConfig created spellCheckCompRH: org.apache.solr.handler.component.SearchHandler
[junit4:junit4]   2> 2699 T139 oasc.RequestHandlers.initHandlersFromConfig created spellCheckCompRH_Direct: org.apache.solr.handler.component.SearchHandler
[junit4:junit4]   2> 2700 T139 oasc.RequestHandlers.initHandlersFromConfig created spellCheckWithWordbreak: org.apache.solr.handler.component.SearchHandler
[junit4:junit4]   2> 2700 T139 oasc.RequestHandlers.initHandlersFromConfig created spellCheckWithWordbreak_Direct: org.apache.solr.handler.component.SearchHandler
[junit4:junit4]   2> 2700 T139 oasc.RequestHandlers.initHandlersFromConfig created spellCheckCompRH1: org.apache.solr.handler.component.SearchHandler
[junit4:junit4]   2> 2701 T139 oasc.RequestHandlers.initHandlersFromConfig created tvrh: org.apache.solr.handler.component.SearchHandler
[junit4:junit4]   2> 2701 T139 oasc.RequestHandlers.initHandlersFromConfig created /mlt: solr.MoreLikeThisHandler
[junit4:junit4]   2> 2702 T139 oasc.RequestHandlers.initHandlersFromConfig created /debug/dump: solr.DumpRequestHandler
[junit4:junit4]   2> 2708 T139 oashl.XMLLoader.init xsltCacheLifetimeSeconds=60
[junit4:junit4]   2> 2714 T139 oasc.SolrCore.initDeprecatedSupport WARNING solrconfig.xml uses deprecated <admin/gettableFiles>, Please update your config to use the ShowFileRequestHandler.
[junit4:junit4]   2> 2718 T139 oasc.SolrCore.initDeprecatedSupport WARNING adding ShowFileRequestHandler with hidden files: [SCHEMA.XML, OLD_SYNONYMS.TXT, STOPWORDS.TXT, PROTWORDS.TXT, OPEN-EXCHANGE-RATES.JSON, SYNONYMS.TXT, CURRENCY.XML, MAPPING-ISOLATIN1ACCENT.TXT]
[junit4:junit4]   2> 2722 T139 oasc.CachingDirectoryFactory.close Releasing directory:C:\Users\JenkinsSlave\workspace\Lucene-Solr-trunk-Windows\solr\build\solr-core\test\J0\.\org.apache.solr.cloud.BasicDistributedZk2Test-1351302534121\control\data
[junit4:junit4]   2> 2724 T139 oass.SolrIndexSearcher.<init> Opening Searcher@9df61d main
[junit4:junit4]   2> 2752 T139 oasu.CommitTracker.<init> Hard AutoCommit: disabled
[junit4:junit4]   2> 2752 T139 oasu.CommitTracker.<init> Soft AutoCommit: disabled
[junit4:junit4]   2> 2753 T139 oashc.SpellCheckComponent.inform Initializing spell checkers
[junit4:junit4]   2> 2766 T139 oass.DirectSolrSpellChecker.init init: {name=direct,classname=DirectSolrSpellChecker,field=lowerfilt,minQueryLength=3}
[junit4:junit4]   2> 2832 T162 oasc.SolrCore.registerSearcher [collection1] Registered new searcher Searcher@9df61d main{StandardDirectoryReader(segments_1:1)}
[junit4:junit4]   2> 2837 T139 oasc.ZkController.publish numShards not found on descriptor - reading it from system property
[junit4:junit4]   2> 2839 T144 oazs.PrepRequestProcessor.pRequest Got user-level KeeperException when processing sessionid:0x13a9fe855310002 type:create cxid:0x56 zxid:0xfffffffffffffffe txntype:unknown reqpath:n/a Error Path:/solr/overseer/queue Error:KeeperErrorCode = NoNode for /solr/overseer/queue
[junit4:junit4]   2> 2846 T139 oasc.CoreContainer.register registering core: collection1
[junit4:junit4]   2> 2847 T139 oasc.ZkController.register Register shard - core:collection1 address:http://127.0.0.1:59399/solr shardId:control_shard
[junit4:junit4]   2> 2857 T139 oascsi.HttpClientUtil.createClient Creating new http client, config:maxConnections=10000&maxConnectionsPerHost=20&connTimeout=30000&socketTimeout=30000&retry=false
[junit4:junit4]   2> 2865 T139 oascc.SolrZkClient.makePath makePath: /collections/control_collection/leader_elect/control_shard/election
[junit4:junit4]   2> 2883 T144 oazs.PrepRequestProcessor.pRequest Got user-level KeeperException when processing sessionid:0x13a9fe855310002 type:delete cxid:0x65 zxid:0xfffffffffffffffe txntype:unknown reqpath:n/a Error Path:/solr/collections/control_collection/leaders Error:KeeperErrorCode = NoNode for /solr/collections/control_collection/leaders
[junit4:junit4]   2> 2886 T139 oasc.ShardLeaderElectionContext.runLeaderProcess Running the leader process.
[junit4:junit4]   2> 2887 T144 oazs.PrepRequestProcessor.pRequest Got user-level KeeperException when processing sessionid:0x13a9fe855310002 type:create cxid:0x66 zxid:0xfffffffffffffffe txntype:unknown reqpath:n/a Error Path:/solr/overseer Error:KeeperErrorCode = NodeExists for /solr/overseer
[junit4:junit4]   2> 3355 T160 oascc.ZkStateReader.updateClusterState Updating cloud state from ZooKeeper... 
[junit4:junit4]   2> 3356 T160 oasc.Overseer$ClusterStateUpdater.updateState Update state numShards=null message={
[junit4:junit4]   2> 	  "operation":"state",
[junit4:junit4]   2> 	  "numShards":null,
[junit4:junit4]   2> 	  "shard":"control_shard",
[junit4:junit4]   2> 	  "roles":null,
[junit4:junit4]   2> 	  "state":"down",
[junit4:junit4]   2> 	  "core":"collection1",
[junit4:junit4]   2> 	  "collection":"control_collection",
[junit4:junit4]   2> 	  "node_name":"127.0.0.1:59399_solr",
[junit4:junit4]   2> 	  "base_url":"http://127.0.0.1:59399/solr"}
[junit4:junit4]   2> 3369 T144 oazs.PrepRequestProcessor.pRequest Got user-level KeeperException when processing sessionid:0x13a9fe855310002 type:create cxid:0x6d zxid:0xfffffffffffffffe txntype:unknown reqpath:n/a Error Path:/solr/overseer/queue-work Error:KeeperErrorCode = NoNode for /solr/overseer/queue-work
[junit4:junit4]   2> 3410 T159 oascc.ZkStateReader$2.process A cluster state change has occurred - updating... (1)
[junit4:junit4]   2> 3507 T139 oasc.ShardLeaderElectionContext.waitForReplicasToComeUp Enough replicas found to continue.
[junit4:junit4]   2> 3507 T139 oasc.ShardLeaderElectionContext.runLeaderProcess I may be the new leader - try and sync
[junit4:junit4]   2> 3507 T139 oasc.SyncStrategy.sync Sync replicas to http://127.0.0.1:59399/solr/collection1/
[junit4:junit4]   2> 3510 T139 oasc.SyncStrategy.syncReplicas Sync Success - now sync replicas to me
[junit4:junit4]   2> 3510 T139 oasc.SyncStrategy.syncToMe http://127.0.0.1:59399/solr/collection1/ has no replicas
[junit4:junit4]   2> 3510 T139 oasc.ShardLeaderElectionContext.runLeaderProcess I am the new leader: http://127.0.0.1:59399/solr/collection1/
[junit4:junit4]   2> 3510 T139 oascc.SolrZkClient.makePath makePath: /collections/control_collection/leaders/control_shard
[junit4:junit4]   2> 3523 T144 oazs.PrepRequestProcessor.pRequest Got user-level KeeperException when processing sessionid:0x13a9fe855310002 type:create cxid:0x8c zxid:0xfffffffffffffffe txntype:unknown reqpath:n/a Error Path:/solr/overseer Error:KeeperErrorCode = NodeExists for /solr/overseer
[junit4:junit4]   2> 4037 T160 oascc.ZkStateReader.updateClusterState Updating cloud state from ZooKeeper... 
[junit4:junit4]   2> 4048 T159 oascc.ZkStateReader$2.process A cluster state change has occurred - updating... (1)
[junit4:junit4]   2> 4091 T139 oasc.ZkController.register We are http://127.0.0.1:59399/solr/collection1/ and leader is http://127.0.0.1:59399/solr/collection1/
[junit4:junit4]   2> 4095 T139 oasc.ZkController.register No LogReplay needed for core=collection1 baseURL=http://127.0.0.1:59399/solr
[junit4:junit4]   2> 4096 T139 oasc.ZkController.checkRecovery I am the leader, no recovery necessary
[junit4:junit4]   2> 4096 T139 oasc.ZkController.publish numShards not found on descriptor - reading it from system property
[junit4:junit4]   2> 4101 T139 oascc.ZkStateReader.updateClusterState Updating cloud state from ZooKeeper... 
[junit4:junit4]   2> 4101 T139 oass.SolrDispatchFilter.init user.dir=C:\Users\JenkinsSlave\workspace\Lucene-Solr-trunk-Windows\solr\build\solr-core\test\J0
[junit4:junit4]   2> 4102 T139 oass.SolrDispatchFilter.init SolrDispatchFilter.init() done
[junit4:junit4]   2> 4102 T139 oascsi.HttpClientUtil.createClient Creating new http client, config:maxConnections=128&maxConnectionsPerHost=32&followRedirects=false
[junit4:junit4]   2> 4108 T139 oascsi.HttpClientUtil.createClient Creating new http client, config:
[junit4:junit4]   2> 4118 T139 oaz.ZooKeeper.<init> Initiating client connection, connectString=127.0.0.1:59392/solr sessionTimeout=10000 watcher=org.apache.solr.common.cloud.ConnectionManager@f76647
[junit4:junit4]   2> 4119 T139 oascc.ConnectionManager.waitForConnected Waiting for client to connect to ZooKeeper
[junit4:junit4]   2> 4119 T163 oaz.ClientCnxn$SendThread.startConnect Opening socket connection to server /127.0.0.1:59392
[junit4:junit4]   2> 4122 T163 oaz.ClientCnxn$SendThread.primeConnection Socket connection established to 127.0.0.1/127.0.0.1:59392, initiating session
[junit4:junit4]   2> 4122 T141 oazs.NIOServerCnxn$Factory.run Accepted socket connection from /127.0.0.1:59407
[junit4:junit4]   2> 4124 T141 oazs.NIOServerCnxn.readConnectRequest Client attempting to establish new session at /127.0.0.1:59407
[junit4:junit4]   2> 4127 T163 oaz.ClientCnxn$SendThread.readConnectResult Session establishment complete on server 127.0.0.1/127.0.0.1:59392, sessionid = 0x13a9fe855310003, negotiated timeout = 10000
[junit4:junit4]   2> 4127 T143 oazs.NIOServerCnxn.finishSessionInit Established session 0x13a9fe855310003 with negotiated timeout 10000 for client /127.0.0.1:59407
[junit4:junit4]   2> 4127 T164 oascc.ConnectionManager.process Watcher org.apache.solr.common.cloud.ConnectionManager@f76647 name:ZooKeeperConnection Watcher:127.0.0.1:59392/solr got event WatchedEvent state:SyncConnected type:None path:null path:null type:None
[junit4:junit4]   2> 4128 T139 oascc.ConnectionManager.waitForConnected Client is connected to ZooKeeper
[junit4:junit4]   2> 4134 T139 oascc.ZkStateReader.createClusterStateWatchersAndUpdate Updating cluster state from ZooKeeper... 
[junit4:junit4]   2> 4139 T139 oasc.ChaosMonkey.monkeyLog monkey: init - expire sessions:true cause connection loss:true
[junit4:junit4]   2> 4547 T139 oejs.Server.doStart jetty-8.1.2.v20120308
[junit4:junit4]   2> 4551 T139 oejs.AbstractConnector.doStart Started SelectChannelConnector@0.0.0.0:59408
[junit4:junit4]   2> 4553 T139 oasc.SolrResourceLoader.locateSolrHome JNDI not configured for solr (NoInitialContextEx)
[junit4:junit4]   2> 4554 T139 oasc.SolrResourceLoader.locateSolrHome using system property solr.solr.home: C:\Users\JenkinsSlave\workspace\Lucene-Solr-trunk-Windows\solr\build\solr-core\test\J0\.\org.apache.solr.cloud.BasicDistributedZk2Test-jetty1-1351302538258
[junit4:junit4]   2> 4554 T139 oasc.SolrResourceLoader.<init> new SolrResourceLoader for deduced Solr Home: 'C:\Users\JenkinsSlave\workspace\Lucene-Solr-trunk-Windows\solr\build\solr-core\test\J0\.\org.apache.solr.cloud.BasicDistributedZk2Test-jetty1-1351302538258\'
[junit4:junit4]   2> 4611 T139 oass.SolrDispatchFilter.init SolrDispatchFilter.init()
[junit4:junit4]   2> 4612 T139 oasc.SolrResourceLoader.locateSolrHome JNDI not configured for solr (NoInitialContextEx)
[junit4:junit4]   2> 4613 T139 oasc.SolrResourceLoader.locateSolrHome using system property solr.solr.home: C:\Users\JenkinsSlave\workspace\Lucene-Solr-trunk-Windows\solr\build\solr-core\test\J0\.\org.apache.solr.cloud.BasicDistributedZk2Test-jetty1-1351302538258
[junit4:junit4]   2> 4613 T139 oasc.CoreContainer$Initializer.initialize looking for solr.xml: C:\Users\JenkinsSlave\workspace\Lucene-Solr-trunk-Windows\solr\build\solr-core\test\J0\.\org.apache.solr.cloud.BasicDistributedZk2Test-jetty1-1351302538258\solr.xml
[junit4:junit4]   2> 4614 T139 oasc.CoreContainer.<init> New CoreContainer 3968502
[junit4:junit4]   2> 4614 T139 oasc.CoreContainer.load Loading CoreContainer using Solr Home: 'C:\Users\JenkinsSlave\workspace\Lucene-Solr-trunk-Windows\solr\build\solr-core\test\J0\.\org.apache.solr.cloud.BasicDistributedZk2Test-jetty1-1351302538258\'
[junit4:junit4]   2> 4615 T139 oasc.SolrResourceLoader.<init> new SolrResourceLoader for directory: 'C:\Users\JenkinsSlave\workspace\Lucene-Solr-trunk-Windows\solr\build\solr-core\test\J0\.\org.apache.solr.cloud.BasicDistributedZk2Test-jetty1-1351302538258\'
[junit4:junit4]   2> 4651 T139 oasc.CoreContainer.load Registering Log Listener
[junit4:junit4]   2> 4671 T160 oascc.ZkStateReader.updateClusterState Updating cloud state from ZooKeeper... 
[junit4:junit4]   2> 4672 T160 oasc.Overseer$ClusterStateUpdater.updateState Update state numShards=null message={
[junit4:junit4]   2> 	  "operation":"state",
[junit4:junit4]   2> 	  "numShards":null,
[junit4:junit4]   2> 	  "shard":"control_shard",
[junit4:junit4]   2> 	  "roles":null,
[junit4:junit4]   2> 	  "state":"active",
[junit4:junit4]   2> 	  "core":"collection1",
[junit4:junit4]   2> 	  "collection":"control_collection",
[junit4:junit4]   2> 	  "node_name":"127.0.0.1:59399_solr",
[junit4:junit4]   2> 	  "base_url":"http://127.0.0.1:59399/solr"}
[junit4:junit4]   2> 4678 T139 oasc.CoreContainer.initZooKeeper Zookeeper client=127.0.0.1:59392/solr
[junit4:junit4]   2> 4679 T139 oaz.ZooKeeper.<init> Initiating client connection, connectString=127.0.0.1:59392/solr sessionTimeout=5000 watcher=org.apache.solr.common.cloud.ConnectionManager@fc824e
[junit4:junit4]   2> 4681 T174 oaz.ClientCnxn$SendThread.startConnect Opening socket connection to server /127.0.0.1:59392
[junit4:junit4]   2> 4681 T139 oascc.ConnectionManager.waitForConnected Waiting for client to connect to ZooKeeper
[junit4:junit4]   2> 4684 T141 oazs.NIOServerCnxn$Factory.run Accepted socket connection from /127.0.0.1:59413
[junit4:junit4]   2> 4684 T174 oaz.ClientCnxn$SendThread.primeConnection Socket connection established to 127.0.0.1/127.0.0.1:59392, initiating session
[junit4:junit4]   2> 4685 T141 oazs.NIOServerCnxn.readConnectRequest Client attempting to establish new session at /127.0.0.1:59413
[junit4:junit4]   2> 4691 T143 oazs.NIOServerCnxn.finishSessionInit Established session 0x13a9fe855310004 with negotiated timeout 5000 for client /127.0.0.1:59413
[junit4:junit4]   2> 4691 T174 oaz.ClientCnxn$SendThread.readConnectResult Session establishment complete on server 127.0.0.1/127.0.0.1:59392, sessionid = 0x13a9fe855310004, negotiated timeout = 5000
[junit4:junit4]   2> 4692 T175 oascc.ConnectionManager.process Watcher org.apache.solr.common.cloud.ConnectionManager@fc824e name:ZooKeeperConnection Watcher:127.0.0.1:59392/solr got event WatchedEvent state:SyncConnected type:None path:null path:null type:None
[junit4:junit4]   2> 4692 T139 oascc.ConnectionManager.waitForConnected Client is connected to ZooKeeper
[junit4:junit4]   2> 4696 T144 oazs.PrepRequestProcessor.pRequest Got user-level KeeperException when processing sessionid:0x13a9fe855310004 type:create cxid:0x1 zxid:0xfffffffffffffffe txntype:unknown reqpath:n/a Error Path:/solr/overseer Error:KeeperErrorCode = NodeExists for /solr/overseer
[junit4:junit4]   2> 4710 T144 oazs.PrepRequestProcessor.pRequest Got user-level KeeperException when processing sessionid:0x13a9fe855310004 type:create cxid:0x2 zxid:0xfffffffffffffffe txntype:unknown reqpath:n/a Error Path:/solr/overseer Error:KeeperErrorCode = NodeExists for /solr/overseer
[junit4:junit4]   2> 4719 T159 oascc.ZkStateReader$2.process A cluster state change has occurred - updating... (1)
[junit4:junit4]   2> 4720 T164 oascc.ZkStateReader$2.process A cluster state change has occurred - updating... (1)
[junit4:junit4]   2> 4721 T139 oasc.ZkController.createEphemeralLiveNode Register node as live in ZooKeeper:/live_nodes/127.0.0.1:59408_solr
[junit4:junit4]   2> 4722 T144 oazs.PrepRequestProcessor.pRequest Got user-level KeeperException when processing sessionid:0x13a9fe855310004 type:delete cxid:0x4 zxid:0xfffffffffffffffe txntype:unknown reqpath:n/a Error Path:/solr/live_nodes/127.0.0.1:59408_solr Error:KeeperErrorCode = NoNode for /solr/live_nodes/127.0.0.1:59408_solr
[junit4:junit4]   2> 4726 T139 oascc.SolrZkClient.makePath makePath: /live_nodes/127.0.0.1:59408_solr
[junit4:junit4]   2> 4731 T164 oascc.ZkStateReader$2.process A cluster state change has occurred - updating... (1)
[junit4:junit4]   2> 4733 T159 oascc.ZkStateReader$3.process Updating live nodes... (2)
[junit4:junit4]   2> 4733 T159 oascc.ZkStateReader$2.process A cluster state change has occurred - updating... (2)
[junit4:junit4]   2> 4734 T139 oashc.HttpShardHandlerFactory.getParameter Setting socketTimeout to: 0
[junit4:junit4]   2> 4735 T139 oashc.HttpShardHandlerFactory.getParameter Setting urlScheme to: http://
[junit4:junit4]   2> 4735 T139 oashc.HttpShardHandlerFactory.getParameter Setting connTimeout to: 0
[junit4:junit4]   2> 4737 T139 oashc.HttpShardHandlerFactory.getParameter Setting maxConnectionsPerHost to: 20
[junit4:junit4]   2> 4737 T139 oashc.HttpShardHandlerFactory.getParameter Setting corePoolSize to: 0
[junit4:junit4]   2> 4737 T139 oashc.HttpShardHandlerFactory.getParameter Setting maximumPoolSize to: 2147483647
[junit4:junit4]   2> 4738 T164 oascc.ZkStateReader$3.process Updating live nodes... (2)
[junit4:junit4]   2> 4738 T139 oashc.HttpShardHandlerFactory.getParameter Setting maxThreadIdleTime to: 5
[junit4:junit4]   2> 4738 T139 oashc.HttpShardHandlerFactory.getParameter Setting sizeOfQueue to: -1
[junit4:junit4]   2> 4739 T139 oashc.HttpShardHandlerFactory.getParameter Setting fairnessPolicy to: false
[junit4:junit4]   2> 4739 T139 oascsi.HttpClientUtil.createClient Creating new http client, config:maxConnectionsPerHost=20&maxConnections=10000&socketTimeout=0&connTimeout=0&retry=false
[junit4:junit4]   2> 4761 T139 oascc.ZkStateReader.createClusterStateWatchersAndUpdate Updating cluster state from ZooKeeper... 
[junit4:junit4]   2> 4770 T139 oasc.CoreContainer.create Creating SolrCore 'collection1' using instanceDir: C:\Users\JenkinsSlave\workspace\Lucene-Solr-trunk-Windows\solr\build\solr-core\test\J0\.\org.apache.solr.cloud.BasicDistributedZk2Test-jetty1-1351302538258\collection1
[junit4:junit4]   2> 4771 T139 oasc.ZkController.createCollectionZkNode Check for collection zkNode:collection1
[junit4:junit4]   2> 4773 T139 oasc.ZkController.createCollectionZkNode Collection zkNode exists
[junit4:junit4]   2> 4773 T139 oasc.ZkController.readConfigName Load collection config from:/collections/collection1
[junit4:junit4]   2> 4776 T139 oasc.SolrResourceLoader.<init> new SolrResourceLoader for directory: 'C:\Users\JenkinsSlave\workspace\Lucene-Solr-trunk-Windows\solr\build\solr-core\test\J0\.\org.apache.solr.cloud.BasicDistributedZk2Test-jetty1-1351302538258\collection1\'
[junit4:junit4]   2> 4779 T139 oasc.SolrResourceLoader.replaceClassLoader Adding 'file:/C:/Users/JenkinsSlave/workspace/Lucene-Solr-trunk-Windows/solr/build/solr-core/test/J0/org.apache.solr.cloud.BasicDistributedZk2Test-jetty1-1351302538258/collection1/lib/classes/' to classloader
[junit4:junit4]   2> 4780 T139 oasc.SolrResourceLoader.replaceClassLoader Adding 'file:/C:/Users/JenkinsSlave/workspace/Lucene-Solr-trunk-Windows/solr/build/solr-core/test/J0/org.apache.solr.cloud.BasicDistributedZk2Test-jetty1-1351302538258/collection1/lib/README' to classloader
[junit4:junit4]   2> 4846 T139 oasc.SolrConfig.<init> Using Lucene MatchVersion: LUCENE_50
[junit4:junit4]   2> 4938 T139 oasc.SolrConfig.<init> Loaded SolrConfig: solrconfig.xml
[junit4:junit4]   2> 4940 T139 oass.IndexSchema.readSchema Reading Solr Schema
[junit4:junit4]   2> 4945 T139 oass.IndexSchema.readSchema Schema name=test
[junit4:junit4]   2> 5668 T139 oass.OpenExchangeRatesOrgProvider.init Initialized with rates=open-exchange-rates.json, refreshInterval=1440.
[junit4:junit4]   2> 5680 T139 oass.IndexSchema.readSchema default search field in schema is text
[junit4:junit4]   2> 5684 T139 oass.IndexSchema.readSchema unique key field: id
[junit4:junit4]   2> 5707 T139 oass.FileExchangeRateProvider.reload Reloading exchange rates from file currency.xml
[junit4:junit4]   2> 5714 T139 oass.FileExchangeRateProvider.reload Reloading exchange rates from file currency.xml
[junit4:junit4]   2> 5721 T139 oass.OpenExchangeRatesOrgProvider.reload Reloading exchange rates from open-exchange-rates.json
[junit4:junit4]   2> 5724 T139 oass.OpenExchangeRatesOrgProvider.reload Reloading exchange rates from open-exchange-rates.json
[junit4:junit4]   2> 5726 T139 oasc.SolrCore.<init> [collection1] Opening new SolrCore at C:\Users\JenkinsSlave\workspace\Lucene-Solr-trunk-Windows\solr\build\solr-core\test\J0\.\org.apache.solr.cloud.BasicDistributedZk2Test-jetty1-1351302538258\collection1\, dataDir=.\org.apache.solr.cloud.BasicDistributedZk2Test-1351302534121/jetty1\
[junit4:junit4]   2> 5727 T139 oasc.JmxMonitoredMap.<init> JMX monitoring is enabled. Adding Solr mbeans to JMX Server: com.sun.jmx.mbeanserver.JmxMBeanServer@6a63d3
[junit4:junit4]   2> 5727 T139 oasc.SolrCore.initDirectoryFactory solr.NRTCachingDirectoryFactory
[junit4:junit4]   2> 5730 T139 oasc.CachingDirectoryFactory.injectLockFactory WARNING No lockType configured for NRTCachingDirectory(org.apache.lucene.store.SimpleFSDirectory@C:\Users\JenkinsSlave\workspace\Lucene-Solr-trunk-Windows\solr\build\solr-core\test\J0\org.apache.solr.cloud.BasicDistributedZk2Test-1351302534121\jetty1 lockFactory=org.apache.lucene.store.NativeFSLockFactory@192d8d4; maxCacheMB=48.0 maxMergeSizeMB=4.0) assuming 'simple'
[junit4:junit4]   2> 5730 T139 oasc.CachingDirectoryFactory.get return new directory for C:\Users\JenkinsSlave\workspace\Lucene-Solr-trunk-Windows\solr\build\solr-core\test\J0\.\org.apache.solr.cloud.BasicDistributedZk2Test-1351302534121\jetty1 forceNew:false
[junit4:junit4]   2> 5731 T139 oasc.CachingDirectoryFactory.close Releasing directory:C:\Users\JenkinsSlave\workspace\Lucene-Solr-trunk-Windows\solr\build\solr-core\test\J0\.\org.apache.solr.cloud.BasicDistributedZk2Test-1351302534121\jetty1
[junit4:junit4]   2> 5731 T139 oasc.SolrCore.getNewIndexDir New index directory detected: old=null new=.\org.apache.solr.cloud.BasicDistributedZk2Test-1351302534121/jetty1\index/
[junit4:junit4]   2> 5732 T139 oasc.SolrCore.initIndex WARNING [collection1] Solr index directory '.\org.apache.solr.cloud.BasicDistributedZk2Test-1351302534121\jetty1\index' doesn't exist. Creating new index...
[junit4:junit4]   2> 5733 T139 oasc.CachingDirectoryFactory.get return new directory for C:\Users\JenkinsSlave\workspace\Lucene-Solr-trunk-Windows\solr\build\solr-core\test\J0\.\org.apache.solr.cloud.BasicDistributedZk2Test-1351302534121\jetty1\index forceNew:false
[junit4:junit4]   2> 5746 T139 oasc.SolrDeletionPolicy.onCommit SolrDeletionPolicy.onCommit: commits:num=1
[junit4:junit4]   2> 		commit{dir=NRTCachingDirectory(org.apache.lucene.store.SimpleFSDirectory@C:\Users\JenkinsSlave\workspace\Lucene-Solr-trunk-Windows\solr\build\solr-core\test\J0\org.apache.solr.cloud.BasicDistributedZk2Test-1351302534121\jetty1\index lockFactory=org.apache.lucene.store.NativeFSLockFactory@17e2544; maxCacheMB=48.0 maxMergeSizeMB=4.0),segFN=segments_1,generation=1,filenames=[segments_1]
[junit4:junit4]   2> 5746 T139 oasc.SolrDeletionPolicy.updateCommits newest commit = 1[segments_1]
[junit4:junit4]   2> 5750 T139 oasc.CachingDirectoryFactory.close Releasing directory:C:\Users\JenkinsSlave\workspace\Lucene-Solr-trunk-Windows\solr\build\solr-core\test\J0\.\org.apache.solr.cloud.BasicDistributedZk2Test-1351302534121\jetty1\index
[junit4:junit4]   2> 5750 T139 oasc.SolrCore.initWriters created xml: solr.XMLResponseWriter
[junit4:junit4]   2> 5752 T139 oasup.UpdateRequestProcessorChain.init inserting DistributedUpdateProcessorFactory into updateRequestProcessorChain "dedupe"
[junit4:junit4]   2> 5752 T139 oasup.UpdateRequestProcessorChain.init inserting DistributedUpdateProcessorFactory into updateRequestProcessorChain "dedupe-allfields"
[junit4:junit4]   2> 5754 T139 oasup.UpdateRequestProcessorChain.init inserting DistributedUpdateProcessorFactory into updateRequestProcessorChain "stored_sig"
[junit4:junit4]   2> 5754 T139 oasup.UpdateRequestProcessorChain.init inserting DistributedUpdateProcessorFactory into updateRequestProcessorChain "uniq-fields"
[junit4:junit4]   2> 5755 T139 oasup.UpdateRequestProcessorChain.init inserting DistributedUpdateProcessorFactory into updateRequestProcessorChain "distrib-dup-test-chain-implicit"
[junit4:junit4]   2> 5755 T139 oasc.RequestHandlers.initHandlersFromConfig adding lazy requestHandler: solr.ReplicationHandler
[junit4:junit4]   2> 5756 T139 oasc.RequestHandlers.initHandlersFromConfig created /replication: solr.ReplicationHandler
[junit4:junit4]   2> 5756 T139 oasc.RequestHandlers.initHandlersFromConfig created standard: solr.StandardRequestHandler
[junit4:junit4]   2> 5757 T139 oasc.RequestHandlers.initHandlersFromConfig created /get: solr.RealTimeGetHandler
[junit4:junit4]   2> 5757 T139 oasc.RequestHandlers.initHandlersFromConfig created dismax: solr.SearchHandler
[junit4:junit4]   2> 5758 T139 oasc.RequestHandlers.initHandlersFromConfig created mock: org.apache.solr.core.MockQuerySenderListenerReqHandler
[junit4:junit4]   2> 5758 T139 oasc.RequestHandlers.initHandlersFromConfig created /admin/: org.apache.solr.handler.admin.AdminHandlers
[junit4:junit4]   2> 5760 T139 oasc.RequestHandlers.initHandlersFromConfig created defaults: solr.StandardRequestHandler
[junit4:junit4]   2> 5760 T139 oasc.RequestHandlers.initHandlersFromConfig adding lazy requestHandler: solr.StandardRequestHandler
[junit4:junit4]   2> 5761 T139 oasc.RequestHandlers.initHandlersFromConfig created lazy: solr.StandardRequestHandler
[junit4:junit4]   2> 5762 T139 oasc.RequestHandlers.initHandlersFromConfig created /update: solr.UpdateRequestHandler
[junit4:junit4]   2> 5762 T139 oasc.RequestHandlers.initHandlersFromConfig created /terms: org.apache.solr.handler.component.SearchHandler
[junit4:junit4]   2> 5763 T139 oasc.RequestHandlers.initHandlersFromConfig created spellCheckCompRH: org.apache.solr.handler.component.SearchHandler
[junit4:junit4]   2> 5763 T139 oasc.RequestHandlers.initHandlersFromConfig created spellCheckCompRH_Direct: org.apache.solr.handler.component.SearchHandler
[junit4:junit4]   2> 5764 T139 oasc.RequestHandlers.initHandlersFromConfig created spellCheckWithWordbreak: org.apache.solr.handler.component.SearchHandler
[junit4:junit4]   2> 5766 T139 oasc.RequestHandlers.initHandlersFromConfig created spellCheckWithWordbreak_Direct: org.apache.solr.handler.component.SearchHandler
[junit4:junit4]   2> 5766 T139 oasc.RequestHandlers.initHandlersFromConfig created spellCheckCompRH1: org.apache.solr.handler.component.SearchHandler
[junit4:junit4]   2> 5767 T139 oasc.RequestHandlers.initHandlersFromConfig created tvrh: org.apache.solr.handler.component.SearchHandler
[junit4:junit4]   2> 5767 T139 oasc.RequestHandlers.initHandlersFromConfig created /mlt: solr.MoreLikeThisHandler
[junit4:junit4]   2> 5768 T139 oasc.RequestHandlers.initHandlersFromConfig created /debug/dump: solr.DumpRequestHandler
[junit4:junit4]   2> 5779 T139 oashl.XMLLoader.init xsltCacheLifetimeSeconds=60
[junit4:junit4]   2> 5785 T139 oasc.SolrCore.initDeprecatedSupport WARNING solrconfig.xml uses deprecated <admin/gettableFiles>, Please update your config to use the ShowFileRequestHandler.
[junit4:junit4]   2> 5787 T139 oasc.SolrCore.initDeprecatedSupport WARNING adding ShowFileRequestHandler with hidden files: [SCHEMA.XML, OLD_SYNONYMS.TXT, STOPWORDS.TXT, PROTWORDS.TXT, OPEN-EXCHANGE-RATES.JSON, SYNONYMS.TXT, CURRENCY.XML, MAPPING-ISOLATIN1ACCENT.TXT]
[junit4:junit4]   2> 5791 T139 oasc.CachingDirectoryFactory.close Releasing directory:C:\Users\JenkinsSlave\workspace\Lucene-Solr-trunk-Windows\solr\build\solr-core\test\J0\.\org.apache.solr.cloud.BasicDistributedZk2Test-1351302534121\jetty1
[junit4:junit4]   2> 5793 T139 oass.SolrIndexSearcher.<init> Opening Searcher@5dc796 main
[junit4:junit4]   2> 5794 T139 oasu.CommitTracker.<init> Hard AutoCommit: disabled
[junit4:junit4]   2> 5794 T139 oasu.CommitTracker.<init> Soft AutoCommit: disabled
[junit4:junit4]   2> 5796 T139 oashc.SpellCheckComponent.inform Initializing spell checkers
[junit4:junit4]   2> 5809 T139 oass.DirectSolrSpellChecker.init init: {name=direct,classname=DirectSolrSpellChecker,field=lowerfilt,minQueryLength=3}
[junit4:junit4]   2> 5874 T176 oasc.SolrCore.registerSearcher [collection1] Registered new searcher Searcher@5dc796 main{StandardDirectoryReader(segments_1:1)}
[junit4:junit4]   2> 5877 T139 oasc.ZkController.publish numShards not found on descriptor - reading it from system property
[junit4:junit4]   2> 5961 T160 oascc.ZkStateReader.updateClusterState Updating cloud state from ZooKeeper... 
[junit4:junit4]   2> 5962 T160 oasc.Overseer$ClusterStateUpdater.updateState Update state numShards=2 message={
[junit4:junit4]   2> 	  "operation":"state",
[junit4:junit4]   2> 	  "numShards":"2",
[junit4:junit4]   2> 	  "shard":null,
[junit4:junit4]   2> 	  "roles":null,
[junit4:junit4]   2> 	  "state":"down",
[junit4:junit4]   2> 	  "core":"collection1",
[junit4:junit4]   2> 	  "collection":"collection1",
[junit4:junit4]   2> 	  "node_name":"127.0.0.1:59408_solr",
[junit4:junit4]   2> 	  "base_url":"http://127.0.0.1:59408/solr"}
[junit4:junit4]   2> 5962 T160 oasc.Overseer$ClusterStateUpdater.createCollection Create collection collection1 with numShards 2
[junit4:junit4]   2> 5988 T175 oascc.ZkStateReader$2.process A cluster state change has occurred - updating... (2)
[junit4:junit4]   2> 5988 T159 oascc.ZkStateReader$2.process A cluster state change has occurred - updating... (2)
[junit4:junit4]   2> 5989 T164 oascc.ZkStateReader$2.process A cluster state change has occurred - updating... (2)
[junit4:junit4]   2> 6495 T139 oasc.CoreContainer.register registering core: collection1
[junit4:junit4]   2> 6495 T139 oasc.ZkController.register Register shard - core:collection1 address:http://127.0.0.1:59408/solr shardId:shard1
[junit4:junit4]   2> 6496 T139 oascc.SolrZkClient.makePath makePath: /collections/collection1/leader_elect/shard1/election
[junit4:junit4]   2> 6514 T144 oazs.PrepRequestProcessor.pRequest Got user-level KeeperException when processing sessionid:0x13a9fe855310004 type:delete cxid:0x43 zxid:0xfffffffffffffffe txntype:unknown reqpath:n/a Error Path:/solr/collections/collection1/leaders Error:KeeperErrorCode = NoNode for /solr/collections/collection1/leaders
[junit4:junit4]   2> 6515 T139 oasc.ShardLeaderElectionContext.runLeaderProcess Running the leader process.
[junit4:junit4]   2> 6516 T144 oazs.PrepRequestProcessor.pRequest Got user-level KeeperException when processing sessionid:0x13a9fe855310004 type:create cxid:0x44 zxid:0xfffffffffffffffe txntype:unknown reqpath:n/a Error Path:/solr/overseer Error:KeeperErrorCode = NodeExists for /solr/overseer
[junit4:junit4]   2> 6521 T139 oasc.ShardLeaderElectionContext.waitForReplicasToComeUp Enough replicas found to continue.
[junit4:junit4]   2> 6521 T139 oasc.ShardLeaderElectionContext.runLeaderProcess I may be the new leader - try and sync
[junit4:junit4]   2> 6522 T139 oasc.SyncStrategy.sync Sync replicas to http://127.0.0.1:59408/solr/collection1/
[junit4:junit4]   2> 6522 T139 oasc.SyncStrategy.syncReplicas Sync Success - now sync replicas to me
[junit4:junit4]   2> 6522 T139 oasc.SyncStrategy.syncToMe http://127.0.0.1:59408/solr/collection1/ has no replicas
[junit4:junit4]   2> 6522 T139 oasc.ShardLeaderElectionContext.runLeaderProcess I am the new leader: http://127.0.0.1:59408/solr/collection1/
[junit4:junit4]   2> 6524 T139 oascc.SolrZkClient.makePath makePath: /collections/collection1/leaders/shard1
[junit4:junit4]   2> 6532 T144 oazs.PrepRequestProcessor.pRequest Got user-level KeeperException when processing sessionid:0x13a9fe855310004 type:create cxid:0x4e zxid:0xfffffffffffffffe txntype:unknown reqpath:n/a Error Path:/solr/overseer Error:KeeperErrorCode = NodeExists for /solr/overseer
[junit4:junit4]   2> 6615 T160 oascc.ZkStateReader.updateClusterState Updating cloud state from ZooKeeper... 
[junit4:junit4]   2> 6633 T175 oascc.ZkStateReader$2.process A cluster state change has occurred - updating... (2)
[junit4:junit4]   2> 6634 T159 oascc.ZkStateReader$2.process A cluster state change has occurred - updating... (2)
[junit4:junit4]   2> 6633 T164 oascc.ZkStateReader$2.process A cluster state change has occurred - updating... (2)
[junit4:junit4]   2> 6662 T139 oasc.ZkController.register We are http://127.0.0.1:59408/solr/collection1/ and leader is http://127.0.0.1:59408/solr/collection1/
[junit4:junit4]   2> 6662 T139 oasc.ZkController.register No LogReplay needed for core=collection1 baseURL=http://127.0.0.1:59408/solr
[junit4:junit4]   2> 6662 T139 oasc.ZkController.checkRecovery I am the leader, no recovery necessary
[junit4:junit4]   2> 6662 T139 oasc.ZkController.publish numShards not found on descriptor - reading it from system property
[junit4:junit4]   2> 6665 T139 oascc.ZkStateReader.updateClusterState Updating cloud state from ZooKeeper... 
[junit4:junit4]   2> 6668 T139 oass.SolrDispatchFilter.init user.dir=C:\Users\JenkinsSlave\workspace\Lucene-Solr-trunk-Windows\solr\build\solr-core\test\J0
[junit4:junit4]   2> 6669 T139 oass.SolrDispatchFilter.init SolrDispatchFilter.init() done
[junit4:junit4]   2> 6669 T139 oascsi.HttpClientUtil.createClient Creating new http client, config:maxConnections=128&maxConnectionsPerHost=32&followRedirects=false
[junit4:junit4]   2> 6994 T139 oejs.Server.doStart jetty-8.1.2.v20120308
[junit4:junit4]   2> 6998 T139 oejs.AbstractConnector.doStart Started SelectChannelConnector@0.0.0.0:59414
[junit4:junit4]   2> 6999 T139 oasc.SolrResourceLoader.locateSolrHome JNDI not configured for solr (NoInitialContextEx)
[junit4:junit4]   2> 7000 T139 oasc.SolrResourceLoader.locateSolrHome using system property solr.solr.home: C:\Users\JenkinsSlave\workspace\Lucene-Solr-trunk-Windows\solr\build\solr-core\test\J0\.\org.apache.solr.cloud.BasicDistributedZk2Test-jetty2-1351302540798
[junit4:junit4]   2> 7000 T139 oasc.SolrResourceLoader.<init> new SolrResourceLoader for deduced Solr Home: 'C:\Users\JenkinsSlave\workspace\Lucene-Solr-trunk-Windows\solr\build\solr-core\test\J0\.\org.apache.solr.cloud.BasicDistributedZk2Test-jetty2-1351302540798\'
[junit4:junit4]   2> 7031 T139 oass.SolrDispatchFilter.init SolrDispatchFilter.init()
[junit4:junit4]   2> 7031 T139 oasc.SolrResourceLoader.locateSolrHome JNDI not configured for solr (NoInitialContextEx)
[junit4:junit4]   2> 7032 T139 oasc.SolrResourceLoader.locateSolrHome using system property solr.solr.home: C:\Users\JenkinsSlave\workspace\Lucene-Solr-trunk-Windows\solr\build\solr-core\test\J0\.\org.apache.solr.cloud.BasicDistributedZk2Test-jetty2-1351302540798
[junit4:junit4]   2> 7032 T139 oasc.CoreContainer$Initializer.initialize looking for solr.xml: C:\Users\JenkinsSlave\workspace\Lucene-Solr-trunk-Windows\solr\build\solr-core\test\J0\.\org.apache.solr.cloud.BasicDistributedZk2Test-jetty2-1351302540798\solr.xml
[junit4:junit4]   2> 7032 T139 oasc.CoreContainer.<init> New CoreContainer 9723906
[junit4:junit4]   2> 7033 T139 oasc.CoreContainer.load Loading CoreContainer using Solr Home: 'C:\Users\JenkinsSlave\workspace\Lucene-Solr-trunk-Windows\solr\build\solr-core\test\J0\.\org.apache.solr.cloud.BasicDistributedZk2Test-jetty2-1351302540798\'
[junit4:junit4]   2> 7033 T139 oasc.SolrResourceLoader.<init> new SolrResourceLoader for directory: 'C:\Users\JenkinsSlave\workspace\Lucene-Solr-trunk-Windows\solr\build\solr-core\test\J0\.\org.apache.solr.cloud.BasicDistributedZk2Test-jetty2-1351302540798\'
[junit4:junit4]   2> 7065 T139 oasc.CoreContainer.load Registering Log Listener
[junit4:junit4]   2> 7080 T139 oasc.CoreContainer.initZooKeeper Zookeeper client=127.0.0.1:59392/solr
[junit4:junit4]   2> 7081 T139 oaz.ZooKeeper.<init> Initiating client connection, connectString=127.0.0.1:59392/solr sessionTimeout=5000 watcher=org.apache.solr.common.cloud.ConnectionManager@8c1400
[junit4:junit4]   2> 7082 T139 oascc.ConnectionManager.waitForConnected Waiting for client to connect to ZooKeeper
[junit4:junit4]   2> 7082 T186 oaz.ClientCnxn$SendThread.startConnect Opening socket connection to server /127.0.0.1:59392
[junit4:junit4]   2> 7086 T141 oazs.NIOServerCnxn$Factory.run Accepted socket connection from /127.0.0.1:59419
[junit4:junit4]   2> 7086 T186 oaz.ClientCnxn$SendThread.primeConnection Socket connection established to 127.0.0.1/127.0.0.1:59392, initiating session
[junit4:junit4]   2> 7086 T141 oazs.NIOServerCnxn.readConnectRequest Client attempting to establish new session at /127.0.0.1:59419
[junit4:junit4]   2> 7098 T143 oazs.NIOServerCnxn.finishSessionInit Established session 0x13a9fe855310005 with negotiated timeout 5000 for client /127.0.0.1:59419
[junit4:junit4]   2> 7100 T186 oaz.ClientCnxn$SendThread.readConnectResult Session establishment complete on server 127.0.0.1/127.0.0.1:59392, sessionid = 0x13a9fe855310005, negotiated timeout = 5000
[junit4:junit4]   2> 7100 T187 oascc.ConnectionManager.process Watcher org.apache.solr.common.cloud.ConnectionManager@8c1400 name:ZooKeeperConnection Watcher:127.0.0.1:59392/solr got event WatchedEvent state:SyncConnected type:None path:null path:null type:None
[junit4:junit4]   2> 7100 T139 oascc.ConnectionManager.waitForConnected Client is connected to ZooKeeper
[junit4:junit4]   2> 7101 T144 oazs.PrepRequestProcessor.pRequest Got user-level KeeperException when processing sessionid:0x13a9fe855310005 type:create cxid:0x1 zxid:0xfffffffffffffffe txntype:unknown reqpath:n/a Error Path:/solr/overseer Error:KeeperErrorCode = NodeExists for /solr/overseer
[junit4:junit4]   2> 7103 T144 oazs.PrepRequestProcessor.pRequest Got user-level KeeperException when processing sessionid:0x13a9fe855310005 type:create cxid:0x2 zxid:0xfffffffffffffffe txntype:unknown reqpath:n/a Error Path:/solr/overseer Error:KeeperErrorCode = NodeExists for /solr/overseer
[junit4:junit4]   2> 7107 T139 oasc.ZkController.createEphemeralLiveNode Register node as live in ZooKeeper:/live_nodes/127.0.0.1:59414_solr
[junit4:junit4]   2> 7108 T144 oazs.PrepRequestProcessor.pRequest Got user-level KeeperException when processing sessionid:0x13a9fe855310005 type:delete cxid:0x4 zxid:0xfffffffffffffffe txntype:unknown reqpath:n/a Error Path:/solr/live_nodes/127.0.0.1:59414_solr Error:KeeperErrorCode = NoNode for /solr/live_nodes/127.0.0.1:59414_solr
[junit4:junit4]   2> 7110 T139 oascc.SolrZkClient.makePath makePath: /live_nodes/127.0.0.1:59414_solr
[junit4:junit4]   2> 7113 T164 oascc.ZkStateReader$2.process A cluster state change has occurred - updating... (2)
[junit4:junit4]   2> 7114 T159 oascc.ZkStateReader$3.process Updating live nodes... (3)
[junit4:junit4]   2> 7114 T139 oashc.HttpShardHandlerFactory.getParameter Setting socketTimeout to: 0
[junit4:junit4]   2> 7114 T139 oashc.HttpShardHandlerFactory.getParameter Setting urlScheme to: http://
[junit4:junit4]   2> 7116 T139 oashc.HttpShardHandlerFactory.getParameter Setting connTimeout to: 0
[junit4:junit4]   2> 7116 T139 oashc.HttpShardHandlerFactory.getParameter Setting maxConnectionsPerHost to: 20
[junit4:junit4]   2> 7116 T139 oashc.HttpShardHandlerFactory.getParameter Setting corePoolSize to: 0
[junit4:junit4]   2> 7114 T175 oascc.ZkStateReader$3.process Updating live nodes... (3)
[junit4:junit4]   2> 7116 T164 oascc.ZkStateReader$3.process Updating live nodes... (3)
[junit4:junit4]   2> 7114 T159 oascc.ZkStateReader$2.process A cluster state change has occurred - updating... (3)
[junit4:junit4]   2> 7117 T175 oascc.ZkStateReader$2.process A cluster state change has occurred - updating... (3)
[junit4:junit4]   2> 7116 T139 oashc.HttpShardHandlerFactory.getParameter Setting maximumPoolSize to: 2147483647
[junit4:junit4]   2> 7117 T139 oashc.HttpShardHandlerFactory.getParameter Setting maxThreadIdleTime to: 5
[junit4:junit4]   2> 7119 T139 oashc.HttpShardHandlerFactory.getParameter Setting sizeOfQueue to: -1
[junit4:junit4]   2> 7119 T139 oashc.HttpShardHandlerFactory.getParameter Setting fairnessPolicy to: false
[junit4:junit4]   2> 7119 T139 oascsi.HttpClientUtil.createClient Creating new http client, config:maxConnectionsPerHost=20&maxConnections=10000&socketTimeout=0&connTimeout=0&retry=false
[junit4:junit4]   2> 7148 T139 oascc.ZkStateReader.createClusterStateWatchersAndUpdate Updating cluster state from ZooKeeper... 
[junit4:junit4]   2> 7155 T139 oasc.CoreContainer.create Creating SolrCore 'collection1' using instanceDir: C:\Users\JenkinsSlave\workspace\Lucene-Solr-trunk-Windows\solr\build\solr-core\test\J0\.\org.apache.solr.cloud.BasicDistributedZk2Test-jetty2-1351302540798\collection1
[junit4:junit4]   2> 7155 T139 oasc.ZkController.createCollectionZkNode Check for collection zkNode:collection1
[junit4:junit4]   2> 7157 T139 oasc.ZkController.createCollectionZkNode Collection zkNode exists
[junit4:junit4]   2> 7157 T139 oasc.ZkController.readConfigName Load collection config from:/collections/collection1
[junit4:junit4]   2> 7160 T139 oasc.SolrResourceLoader.<init> new SolrResourceLoader for directory: 'C:\Users\JenkinsSlave\workspace\Lucene-Solr-trunk-Windows\solr\build\solr-core\test\J0\.\org.apache.solr.cloud.BasicDistributedZk2Test-jetty2-1351302540798\collection1\'
[junit4:junit4]   2> 7162 T139 oasc.SolrResourceLoader.replaceClassLoader Adding 'file:/C:/Users/JenkinsSlave/workspace/Lucene-Solr-trunk-Windows/solr/build/solr-core/test/J0/org.apache.solr.cloud.BasicDistributedZk2Test-jetty2-1351302540798/collection1/lib/classes/' to classloader
[junit4:junit4]   2> 7163 T139 oasc.SolrResourceLoader.replaceClassLoader Adding 'file:/C:/Users/JenkinsSlave/workspace/Lucene-Solr-trunk-Windows/solr/build/solr-core/test/J0/org.apache.solr.cloud.BasicDistributedZk2Test-jetty2-1351302540798/collection1/lib/README' to classloader
[junit4:junit4]   2> 7210 T139 oasc.SolrConfig.<init> Using Lucene MatchVersion: LUCENE_50
[junit4:junit4]   2> 7215 T160 oascc.ZkStateReader.updateClusterState Updating cloud state from ZooKeeper... 
[junit4:junit4]   2> 7216 T160 oasc.Overseer$ClusterStateUpdater.updateState Update state numShards=2 message={
[junit4:junit4]   2> 	  "operation":"state",
[junit4:junit4]   2> 	  "numShards":"2",
[junit4:junit4]   2> 	  "shard":"shard1",
[junit4:junit4]   2> 	  "roles":null,
[junit4:junit4]   2> 	  "state":"active",
[junit4:junit4]   2> 	  "core":"collection1",
[junit4:junit4]   2> 	  "collection":"collection1",
[junit4:junit4]   2> 	  "node_name":"127.0.0.1:59408_solr",
[junit4:junit4]   2> 	  "base_url":"http://127.0.0.1:59408/solr"}
[junit4:junit4]   2> 7225 T164 oascc.ZkStateReader$2.process A cluster state change has occurred - updating... (3)
[junit4:junit4]   2> 7226 T187 oascc.ZkStateReader$2.process A cluster state change has occurred - updating... (3)
[junit4:junit4]   2> 7228 T159 oascc.ZkStateReader$2.process A cluster state change has occurred - updating... (3)
[junit4:junit4]   2> 7229 T175 oascc.ZkStateReader$2.process A cluster state change has occurred - updating... (3)
[junit4:junit4]   2> 7305 T139 oasc.SolrConfig.<init> Loaded SolrConfig: solrconfig.xml
[junit4:junit4]   2> 7307 T139 oass.IndexSchema.readSchema Reading Solr Schema
[junit4:junit4]   2> 7314 T139 oass.IndexSchema.readSchema Schema name=test
[junit4:junit4]   2> 8149 T139 oass.OpenExchangeRatesOrgProvider.init Initialized with rates=open-exchange-rates.json, refreshInterval=1440.
[junit4:junit4]   2> 8162 T139 oass.IndexSchema.readSchema default search field in schema is text
[junit4:junit4]   2> 8169 T139 oass.IndexSchema.readSchema unique key field: id
[junit4:junit4]   2> 8190 T139 oass.FileExchangeRateProvider.reload Reloading exchange rates from file currency.xml
[junit4:junit4]   2> 8198 T139 oass.FileExchangeRateProvider.reload Reloading exchange rates from file currency.xml
[junit4:junit4]   2> 8205 T139 oass.OpenExchangeRatesOrgProvider.reload Reloading exchange rates from open-exchange-rates.json
[junit4:junit4]   2> 8208 T139 oass.OpenExchangeRatesOrgProvider.reload Reloading exchange rates from open-exchange-rates.json
[junit4:junit4]   2> 8210 T139 oasc.SolrCore.<init> [collection1] Opening new SolrCore at C:\Users\JenkinsSlave\workspace\Lucene-Solr-trunk-Windows\solr\build\solr-core\test\J0\.\org.apache.solr.cloud.BasicDistributedZk2Test-jetty2-1351302540798\collection1\, dataDir=.\org.apache.solr.cloud.BasicDistributedZk2Test-1351302534121/jetty2\
[junit4:junit4]   2> 8210 T139 oasc.JmxMonitoredMap.<init> JMX monitoring is enabled. Adding Solr mbeans to JMX Server: com.sun.jmx.mbeanserver.JmxMBeanServer@6a63d3
[junit4:junit4]   2> 8211 T139 oasc.SolrCore.initDirectoryFactory solr.NRTCachingDirectoryFactory
[junit4:junit4]   2> 8212 T139 oasc.CachingDirectoryFactory.injectLockFactory WARNING No lockType configured for NRTCachingDirectory(org.apache.lucene.store.SimpleFSDirectory@C:\Users\JenkinsSlave\workspace\Lucene-Solr-trunk-Windows\solr\build\solr-core\test\J0\org.apache.solr.cloud.BasicDistributedZk2Test-1351302534121\jetty2 lockFactory=org.apache.lucene.store.NativeFSLockFactory@c540d0; maxCacheMB=48.0 maxMergeSizeMB=4.0) assuming 'simple'
[junit4:junit4]   2> 8212 T139 oasc.CachingDirectoryFactory.get return new directory for C:\Users\JenkinsSlave\workspace\Lucene-Solr-trunk-Windows\solr\build\solr-core\test\J0\.\org.apache.solr.cloud.BasicDistributedZk2Test-1351302534121\jetty2 forceNew:false
[junit4:junit4]   2> 8213 T139 oasc.CachingDirectoryFactory.close Releasing directory:C:\Users\JenkinsSlave\workspace\Lucene-Solr-trunk-Windows\solr\build\solr-core\test\J0\.\org.apache.solr.cloud.BasicDistributedZk2Test-1351302534121\jetty2
[junit4:junit4]   2> 8214 T139 oasc.SolrCore.getNewIndexDir New index directory detected: old=null new=.\org.apache.solr.cloud.BasicDistributedZk2Test-1351302534121/jetty2\index/
[junit4:junit4]   2> 8215 T139 oasc.SolrCore.initIndex WARNING [collection1] Solr index directory '.\org.apache.solr.cloud.BasicDistributedZk2Test-1351302534121\jetty2\index' doesn't exist. Creating new index...
[junit4:junit4]   2> 8215 T139 oasc.CachingDirectoryFactory.get return new directory for C:\Users\JenkinsSlave\workspace\Lucene-Solr-trunk-Windows\solr\build\solr-core\test\J0\.\org.apache.solr.cloud.BasicDistributedZk2Test-1351302534121\jetty2\index forceNew:false
[junit4:junit4]   2> 8228 T139 oasc.SolrDeletionPolicy.onCommit SolrDeletionPolicy.onCommit: commits:num=1
[junit4:junit4]   2> 		commit{dir=NRTCachingDirectory(org.apache.lucene.store.SimpleFSDirectory@C:\Users\JenkinsSlave\workspace\Lucene-Solr-trunk-Windows\solr\build\solr-core\test\J0\org.apache.solr.cloud.BasicDistributedZk2Test-1351302534121\jetty2\index lockFactory=org.apache.lucene.store.NativeFSLockFactory@104ee8; maxCacheMB=48.0 maxMergeSizeMB=4.0),segFN=segments_1,generation=1,filenames=[segments_1]
[junit4:junit4]   2> 8228 T139 oasc.SolrDeletionPolicy.updateCommits newest commit = 1[segments_1]
[junit4:junit4]   2> 8230 T139 oasc.CachingDirectoryFactory.close Releasing directory:C:\Users\JenkinsSlave\workspace\Lucene-Solr-trunk-Windows\solr\build\solr-core\test\J0\.\org.apache.solr.cloud.BasicDistributedZk2Test-1351302534121\jetty2\index
[junit4:junit4]   2> 8230 T139 oasc.SolrCore.initWriters created xml: solr.XMLResponseWriter
[junit4:junit4]   2> 8231 T139 oasup.UpdateRequestProcessorChain.init inserting DistributedUpdateProcessorFactory into updateRequestProcessorChain "dedupe"
[junit4:junit4]   2> 8231 T139 oasup.UpdateRequestProcessorChain.init inserting DistributedUpdateProcessorFactory into updateRequestProcessorChain "dedupe-allfields"
[junit4:junit4]   2> 8232 T139 oasup.UpdateRequestProcessorChain.init inserting DistributedUpdateProcessorFactory into updateRequestProcessorChain "stored_sig"
[junit4:junit4]   2> 8232 T139 oasup.UpdateRequestProcessorChain.init inserting DistributedUpdateProcessorFactory into updateRequestProcessorChain "uniq-fields"
[junit4:junit4]   2> 8232 T139 oasup.UpdateRequestProcessorChain.init inserting DistributedUpdateProcessorFactory into updateRequestProcessorChain "distrib-dup-test-chain-implicit"
[junit4:junit4]   2> 8232 T139 oasc.RequestHandlers.initHandlersFromConfig adding lazy requestHandler: solr.ReplicationHandler
[junit4:junit4]   2> 8234 T139 oasc.RequestHandlers.initHandlersFromConfig created /replication: solr.ReplicationHandler
[junit4:junit4]   2> 8234 T139 oasc.RequestHandlers.initHandlersFromConfig created standard: solr.StandardRequestHandler
[junit4:junit4]   2> 8234 T139 oasc.RequestHandlers.initHandlersFromConfig created /get: solr.RealTimeGetHandler
[junit4:junit4]   2> 8235 T139 oasc.RequestHandlers.initHandlersFromConfig created dismax: solr.SearchHandler
[junit4:junit4]   2> 8235 T139 oasc.RequestHandlers.initHandlersFromConfig created mock: org.apache.solr.core.MockQuerySenderListenerReqHandler
[junit4:junit4]   2> 8236 T139 oasc.RequestHandlers.initHandlersFromConfig created /admin/: org.apache.solr.handler.admin.AdminHandlers
[junit4:junit4]   2> 8236 T139 oasc.RequestHandlers.initHandlersFromConfig created defaults: solr.StandardRequestHandler
[junit4:junit4]   2> 8237 T139 oasc.RequestHandlers.initHandlersFromConfig adding lazy requestHandler: solr.StandardRequestHandler
[junit4:junit4]   2> 8237 T139 oasc.RequestHandlers.initHandlersFromConfig created lazy: solr.StandardRequestHandler
[junit4:junit4]   2> 8237 T139 oasc.RequestHandlers.initHandlersFromConfig created /update: solr.UpdateRequestHandler
[junit4:junit4]   2> 8237 T139 oasc.RequestHandlers.initHandlersFromConfig created /terms: org.apache.solr.handler.component.SearchHandler
[junit4:junit4]   2> 8239 T139 oasc.RequestHandlers.initHandlersFromConfig created spellCheckCompRH: org.apache.solr.handler.component.SearchHandler
[junit4:junit4]   2> 8239 T139 oasc.RequestHandlers.initHandlersFromConfig created spellCheckCompRH_Direct: org.apache.solr.handler.component.SearchHandler
[junit4:junit4]   2> 8240 T139 oasc.RequestHandlers.initHandlersFromConfig created spellCheckWithWordbreak: org.apache.solr.handler.component.SearchHandler
[junit4:junit4]   2> 8241 T139 oasc.RequestHandlers.initHandlersFromConfig created spellCheckWithWordbreak_Direct: org.apache.solr.handler.component.SearchHandler
[junit4:junit4]   2> 8241 T139 oasc.RequestHandlers.initHandlersFromConfig created spellCheckCompRH1: org.apache.solr.handler.component.SearchHandler
[junit4:junit4]   2> 8241 T139 oasc.RequestHandlers.initHandlersFromConfig created tvrh: org.apache.solr.handler.component.SearchHandler
[junit4:junit4]   2> 8243 T139 oasc.RequestHandlers.initHandlersFromConfig created /mlt: solr.MoreLikeThisHandler
[junit4:junit4]   2> 8243 T139 oasc.RequestHandlers.initHandlersFromConfig created /debug/dump: solr.DumpRequestHandler
[junit4:junit4]   2> 8251 T139 oashl.XMLLoader.init xsltCacheLifetimeSeconds=60
[junit4:junit4]   2> 8255 T139 oasc.SolrCore.initDeprecatedSupport WARNING solrconfig.xml uses deprecated <admin/gettableFiles>, Please update your config to use the ShowFileRequestHandler.
[junit4:junit4]   2> 8256 T139 oasc.SolrCore.initDeprecatedSupport WARNING adding ShowFileRequestHandler with hidden files: [SCHEMA.XML, OLD_SYNONYMS.TXT, STOPWORDS.TXT, PROTWORDS.TXT, OPEN-EXCHANGE-RATES.JSON, SYNONYMS.TXT, CURRENCY.XML, MAPPING-ISOLATIN1ACCENT.TXT]
[junit4:junit4]   2> 8259 T139 oasc.CachingDirectoryFactory.close Releasing directory:C:\Users\JenkinsSlave\workspace\Lucene-Solr-trunk-Windows\solr\build\solr-core\test\J0\.\org.apache.solr.cloud.BasicDistributedZk2Test-1351302534121\jetty2
[junit4:junit4]   2> 8261 T139 oass.SolrIndexSearcher.<init> Opening Searcher@1dbc064 main
[junit4:junit4]   2> 8263 T139 oasu.CommitTracker.<init> Hard AutoCommit: disabled
[junit4:junit4]   2> 8263 T139 oasu.CommitTracker.<init> Soft AutoCommit: disabled
[junit4:junit4]   2> 8263 T139 oashc.SpellCheckComponent.inform Initializing spell checkers
[junit4:junit4]   2> 8273 T139 oass.DirectSolrSpellChecker.init init: {name=direct,classname=DirectSolrSpellChecker,field=lowerfilt,minQueryLength=3}
[junit4:junit4]   2> 8335 T188 oasc.SolrCore.registerSearcher [collection1] Registered new searcher Searcher@1dbc064 main{StandardDirectoryReader(segments_1:1)}
[junit4:junit4]   2> 8339 T139 oasc.ZkController.publish numShards not found on descriptor - reading it from system property
[junit4:junit4]   2> 8345 T160 oascc.ZkStateReader.updateClusterState Updating cloud state from ZooKeeper... 
[junit4:junit4]   2> 8346 T160 oasc.Overseer$ClusterStateUpdater.updateState Update state numShards=2 message={
[junit4:junit4]   2> 	  "operation":"state",
[junit4:junit4]   2> 	  "numShards":"2",
[junit4:junit4]   2> 	  "shard":null,
[junit4:junit4]   2> 	  "roles":null,
[junit4:junit4]   2> 	  "state":"down",
[junit4:junit4]   2> 	  "core":"collection1",
[junit4:junit4]   2> 	  "collection":"collection1",
[junit4:junit4]   2> 	  "node_name":"127.0.0.1:59414_solr",
[junit4:junit4]   2> 	  "base_url":"http://127.0.0.1:59414/solr"}
[junit4:junit4]   2> 8353 T164 oascc.ZkStateReader$2.process A cluster state change has occurred - updating... (3)
[junit4:junit4]   2> 8354 T187 oascc.ZkStateReader$2.process A cluster state change has occurred - updating... (3)
[junit4:junit4]   2> 8354 T175 oascc.ZkStateReader$2.process A cluster state change has occurred - updating... (3)
[junit4:junit4]   2> 8354 T159 oascc.ZkStateReader$2.process A cluster state change has occurred - updating... (3)
[junit4:junit4]   2> 8895 T139 oasc.CoreContainer.register registering core: collection1
[junit4:junit4]   2> 8895 T139 oasc.ZkController.register Register shard - core:collection1 address:http://127.0.0.1:59414/solr shardId:shard2
[junit4:junit4]   2> 8896 T139 oascc.SolrZkClient.makePath makePath: /collections/collection1/leader_elect/shard2/election
[junit4:junit4]   2> 8914 T144 oazs.PrepRequestProcessor.pRequest Got user-level KeeperException when processing sessionid:0x13a9fe855310005 type:delete cxid:0x44 zxid:0xfffffffffffffffe txntype:unknown reqpath:n/a Error Path:/solr/collections/collection1/leaders/shard2 Error:KeeperErrorCode = NoNode for /solr/collections/collection1/leaders/shard2
[junit4:junit4]   2> 8915 T139 oasc.ShardLeaderElectionContext.runLeaderProcess Running the leader process.
[junit4:junit4]   2> 8916 T144 oazs.PrepRequestProcessor.pRequest Got user-level KeeperException when processing sessionid:0x13a9fe855310005 type:create cxid:0x45 zxid:0xfffffffffffffffe txntype:unknown reqpath:n/a Error Path:/solr/overseer Error:KeeperErrorCode = NodeExists for /solr/overseer
[junit4:junit4]   2> 8920 T139 oasc.ShardLeaderElectionContext.waitForReplicasToComeUp Enough replicas found to continue.
[junit4:junit4]   2> 8921 T139 oasc.ShardLeaderElectionContext.runLeaderProcess I may be the new leader - try and sync
[junit4:junit4]   2> 8921 T139 oasc.SyncStrategy.sync Sync replicas to http://127.0.0.1:59414/solr/collection1/
[junit4:junit4]   2> 8921 T139 oasc.SyncStrategy.syncReplicas Sync Success - now sync replicas to me
[junit4:junit4]   2> 8922 T139 oasc.SyncStrategy.syncToMe http://127.0.0.1:59414/solr/collection1/ has no replicas
[junit4:junit4]   2> 8922 T139 oasc.ShardLeaderElectionContext.runLeaderProcess I am the new leader: http://127.0.0.1:59414/solr/collection1/
[junit4:junit4]   2> 8922 T139 oascc.SolrZkClient.makePath makePath: /collections/collection1/leaders/shard2
[junit4:junit4]   2> 8929 T144 oazs.PrepRequestProcessor.pRequest Got user-level KeeperException when processing sessionid:0x13a9fe855310005 type:create cxid:0x4e zxid:0xfffffffffffffffe txntype:unknown reqpath:n/a Error Path:/solr/overseer Error:KeeperErrorCode = NodeExists for /solr/overseer
[junit4:junit4]   2> 9468 T160 oascc.ZkStateReader.updateClusterState Updating cloud state from ZooKeeper... 
[junit4:junit4]   2> 9489 T187 oascc.ZkStateReader$2.process A cluster state change has occurred - updating... (3)
[junit4:junit4]   2> 9489 T175 oascc.ZkStateReader$2.process A cluster state change has occurred - updating... (3)
[junit4:junit4]   2> 9490 T164 oascc.ZkStateReader$2.process A cluster state change has occurred - updating... (3)
[junit4:junit4]   2> 9490 T159 oascc.ZkStateReader$2.process A cluster state change has occurred - updating... (3)
[junit4:junit4]   2> 9493 T139 oasc.ZkController.register We are http://127.0.0.1:59414/solr/collection1/ and leader is http://127.0.0.1:59414/solr/collection1/
[junit4:junit4]   2> 9494 T139 oasc.ZkController.register No LogReplay needed for core=collection1 baseURL=http://127.0.0.1:59414/solr
[junit4:junit4]   2> 9494 T139 oasc.ZkController.checkRecovery I am the leader, no recovery necessary
[junit4:junit4]   2> 9495 T139 oasc.ZkController.publish numShards not found on descriptor - reading it from system property
[junit4:junit4]   2> 9500 T139 oascc.ZkStateReader.updateClusterState Updating cloud state from ZooKeeper... 
[junit4:junit4]   2> 9502 T139 oass.SolrDispatchFilter.init user.dir=C:\Users\JenkinsSlave\workspace\Lucene-Solr-trunk-Windows\solr\build\solr-core\test\J0
[junit4:junit4]   2> 9502 T139 oass.SolrDispatchFilter.init SolrDispatchFilter.init() done
[junit4:junit4]   2> 9503 T139 oascsi.HttpClientUtil.createClient Creating new http client, config:maxConnections=128&maxConnectionsPerHost=32&followRedirects=false
[junit4:junit4]   2> 9827 T139 oejs.Server.doStart jetty-8.1.2.v20120308
[junit4:junit4]   2> 9830 T139 oejs.AbstractConnector.doStart Started SelectChannelConnector@0.0.0.0:59420
[junit4:junit4]   2> 9830 T139 oasc.SolrResourceLoader.locateSolrHome JNDI not configured for solr (NoInitialContextEx)
[junit4:junit4]   2> 9830 T139 oasc.SolrResourceLoader.locateSolrHome using system property solr.solr.home: C:\Users\JenkinsSlave\workspace\Lucene-Solr-trunk-Windows\solr\build\solr-core\test\J0\.\org.apache.solr.cloud.BasicDistributedZk2Test-jetty3-1351302543631
[junit4:junit4]   2> 9831 T139 oasc.SolrResourceLoader.<init> new SolrResourceLoader for deduced Solr Home: 'C:\Users\JenkinsSlave\workspace\Lucene-Solr-trunk-Windows\solr\build\solr-core\test\J0\.\org.apache.solr.cloud.BasicDistributedZk2Test-jetty3-1351302543631\'
[junit4:junit4]   2> 9859 T139 oass.SolrDispatchFilter.init SolrDispatchFilter.init()
[junit4:junit4]   2> 9859 T139 oasc.SolrResourceLoader.locateSolrHome JNDI not configured for solr (NoInitialContextEx)
[junit4:junit4]   2> 9859 T139 oasc.SolrResourceLoader.locateSolrHome using system property solr.solr.home: C:\Users\JenkinsSlave\workspace\Lucene-Solr-trunk-Windows\solr\build\solr-core\test\J0\.\org.apache.solr.cloud.BasicDistributedZk2Test-jetty3-1351302543631
[junit4:junit4]   2> 9859 T139 oasc.CoreContainer$Initializer.initialize looking for solr.xml: C:\Users\JenkinsSlave\workspace\Lucene-Solr-trunk-Windows\solr\build\solr-core\test\J0\.\org.apache.solr.cloud.BasicDistributedZk2Test-jetty3-1351302543631\solr.xml
[junit4:junit4]   2> 9859 T139 oasc.CoreContainer.<init> New CoreContainer 7596085
[junit4:junit4]   2> 9860 T139 oasc.CoreContainer.load Loading CoreContainer using Solr Home: 'C:\Users\JenkinsSlave\workspace\Lucene-Solr-trunk-Windows\solr\build\solr-core\test\J0\.\org.apache.solr.cloud.BasicDistributedZk2Test-jetty3-1351302543631\'
[junit4:junit4]   2> 9860 T139 oasc.SolrResourceLoader.<init> new SolrResourceLoader for directory: 'C:\Users\JenkinsSlave\workspace\Lucene-Solr-trunk-Windows\solr\build\solr-core\test\J0\.\org.apache.solr.cloud.BasicDistributedZk2Test-jetty3-1351302543631\'
[junit4:junit4]   2> 9883 T139 oasc.CoreContainer.load Registering Log Listener
[junit4:junit4]   2> 9900 T139 oasc.CoreContainer.initZooKeeper Zookeeper client=127.0.0.1:59392/solr
[junit4:junit4]   2> 9900 T139 oaz.ZooKeeper.<init> Initiating client connection, connectString=127.0.0.1:59392/solr sessionTimeout=5000 watcher=org.apache.solr.common.cloud.ConnectionManager@18f5c10
[junit4:junit4]   2> 9902 T198 oaz.ClientCnxn$SendThread.startConnect Opening socket connection to server /127.0.0.1:59392
[junit4:junit4]   2> 9902 T139 oascc.ConnectionManager.waitForConnected Waiting for client to connect to ZooKeeper
[junit4:junit4]   2> 9904 T198 oaz.ClientCnxn$SendThread.primeConnection Socket connection established to 127.0.0.1/127.0.0.1:59392, initiating session
[junit4:junit4]   2> 9906 T141 oazs.NIOServerCnxn$Factory.run Accepted socket connection from /127.0.0.1:59425
[junit4:junit4]   2> 9906 T141 oazs.NIOServerCnxn.readConnectRequest Client attempting to establish new session at /127.0.0.1:59425
[junit4:junit4]   2> 9916 T143 oazs.NIOServerCnxn.finishSessionInit Established session 0x13a9fe855310006 with negotiated timeout 5000 for client /127.0.0.1:59425
[junit4:junit4]   2> 9916 T198 oaz.ClientCnxn$SendThread.readConnectResult Session establishment complete on server 127.0.0.1/127.0.0.1:59392, sessionid = 0x13a9fe855310006, negotiated timeout = 5000
[junit4:junit4]   2> 9918 T199 oascc.ConnectionManager.process Watcher org.apache.solr.common.cloud.ConnectionManager@18f5c10 name:ZooKeeperConnection Watcher:127.0.0.1:59392/solr got event WatchedEvent state:SyncConnected type:None path:null path:null type:None
[junit4:junit4]   2> 9918 T139 oascc.ConnectionManager.waitForConnected Client is connected to ZooKeeper
[junit4:junit4]   2> 9920 T144 oazs.PrepRequestProcessor.pRequest Got user-level KeeperException when processing sessionid:0x13a9fe855310006 type:create cxid:0x1 zxid:0xfffffffffffffffe txntype:unknown reqpath:n/a Error Path:/solr/overseer Error:KeeperErrorCode = NodeExists for /solr/overseer
[junit4:junit4]   2> 9922 T144 oazs.PrepRequestProcessor.pRequest Got user-level KeeperException when processing sessionid:0x13a9fe855310006 type:create cxid:0x2 zxid:0xfffffffffffffffe txntype:unknown reqpath:n/a Error Path:/solr/overseer Error:KeeperErrorCode = NodeExists for /solr/overseer
[junit4:junit4]   2> 9924 T139 oasc.ZkController.createEphemeralLiveNode Register node as live in ZooKeeper:/live_nodes/127.0.0.1:59420_solr
[junit4:junit4]   2> 9925 T144 oazs.PrepRequestProcessor.pRequest Got user-level KeeperException when processing sessionid:0x13a9fe855310006 type:delete cxid:0x4 zxid:0xfffffffffffffffe txntype:unknown reqpath:n/a Error Path:/solr/live_nodes/127.0.0.1:59420_solr Error:KeeperErrorCode = NoNode for /solr/live_nodes/127.0.0.1:59420_solr
[junit4:junit4]   2> 9926 T139 oascc.SolrZkClient.makePath makePath: /live_nodes/127.0.0.1:59420_solr
[junit4:junit4]   2> 9930 T164 oascc.ZkStateReader$2.process A cluster state change has occurred - updating... (3)
[junit4:junit4]   2> 9930 T187 oascc.ZkStateReader$3.process Updating live nodes... (4)
[junit4:junit4]   2> 9931 T187 oascc.ZkStateReader$2.process A cluster state change has occurred - updating... (4)
[junit4:junit4]   2> 9931 T175 oascc.ZkStateReader$3.process Updating live nodes... (4)
[junit4:junit4]   2> 9931 T159 oascc.ZkStateReader$3.process Updating live nodes... (4)
[junit4:junit4]   2> 9931 T159 oascc.ZkStateReader$2.process A cluster state change has occurred - updating... (4)
[junit4:junit4]   2> 9931 T175 oascc.ZkStateReader$2.process A cluster state change has occurred - updating... (4)
[junit4:junit4]   2> 9936 T139 oashc.HttpShardHandlerFactory.getParameter Setting socketTimeout to: 0
[junit4:junit4]   2> 9936 T139 oashc.HttpShardHandlerFactory.getParameter Setting urlScheme to: http://
[junit4:junit4]   2> 9937 T139 oashc.HttpShardHandlerFactory.getParameter Setting connTimeout to: 0
[junit4:junit4]   2> 9937 T164 oascc.ZkStateReader$3.process Updating live nodes... (4)
[junit4:junit4]   2> 9937 T139 oashc.HttpShardHandlerFactory.getParameter Setting maxConnectionsPerHost to: 20
[junit4:junit4]   2> 9938 T139 oashc.HttpShardHandlerFactory.getParameter Setting corePoolSize to: 0
[junit4:junit4]   2> 9938 T139 oashc.HttpShardHandlerFactory.getParameter Setting maximumPoolSize to: 2147483647
[junit4:junit4]   2> 9939 T139 oashc.HttpShardHandlerFactory.getParameter Setting maxThreadIdleTime to: 5
[junit4:junit4]   2> 9939 T139 oashc.HttpShardHandlerFactory.getParameter Setting sizeOfQueue to: -1
[junit4:junit4]   2> 9940 T139 oashc.HttpShardHandlerFactory.getParameter Setting fairnessPolicy to: false
[junit4:junit4]   2> 9940 T139 oascsi.HttpClientUtil.createClient Creating new http client, config:maxConnectionsPerHost=20&maxConnections=10000&socketTimeout=0&connTimeout=0&retry=false
[junit4:junit4]   2> 9954 T139 oascc.ZkStateReader.createClusterStateWatchersAndUpdate Updating cluster state from ZooKeeper... 
[junit4:junit4]   2> 9966 T139 oasc.CoreContainer.create Creating SolrCore 'collection1' using instanceDir: C:\Users\JenkinsSlave\workspace\Lucene-Solr-trunk-Windows\solr\build\solr-core\test\J0\.\org.apache.solr.cloud.BasicDistributedZk2Test-jetty3-1351302543631\collection1
[junit4:junit4]   2> 9967 T139 oasc.ZkController.createCollectionZkNode Check for collection zkNode:collection1
[junit4:junit4]   2> 9968 T139 oasc.ZkController.createCollectionZkNode Collection zkNode exists
[junit4:junit4]   2> 9968 T139 oasc.ZkController.readConfigName Load collection config from:/collections/collection1
[junit4:junit4]   2> 9971 T139 oasc.SolrResourceLoader.<init> new SolrResourceLoader for directory: 'C:\Users\JenkinsSlave\workspace\Lucene-Solr-trunk-Windows\solr\build\solr-core\test\J0\.\org.apache.solr.cloud.BasicDistributedZk2Test-jetty3-1351302543631\collection1\'
[junit4:junit4]   2> 9972 T139 oasc.SolrResourceLoader.replaceClassLoader Adding 'file:/C:/Users/JenkinsSlave/workspace/Lucene-Solr-trunk-Windows/solr/build/solr-core/test/J0/org.apache.solr.cloud.BasicDistributedZk2Test-jetty3-1351302543631/collection1/lib/classes/' to classloader
[junit4:junit4]   2> 9974 T139 oasc.SolrResourceLoader.replaceClassLoader Adding 'file:/C:/Users/JenkinsSlave/workspace/Lucene-Solr-trunk-Windows/solr/build/solr-core/test/J0/org.apache.solr.cloud.BasicDistributedZk2Test-jetty3-1351302543631/collection1/lib/README' to classloader
[junit4:junit4]   2> 10025 T139 oasc.SolrConfig.<init> Using Lucene MatchVersion: LUCENE_50
[junit4:junit4]   2> 10059 T160 oascc.ZkStateReader.updateClusterState Updating cloud state from ZooKeeper... 
[junit4:junit4]   2> 10061 T160 oasc.Overseer$ClusterStateUpdater.updateState Update state numShards=2 message={
[junit4:junit4]   2> 	  "operation":"state",
[junit4:junit4]   2> 	  "numShards":"2",
[junit4:junit4]   2> 	  "shard":"shard2",
[junit4:junit4]   2> 	  "roles":null,
[junit4:junit4]   2> 	  "state":"active",
[junit4:junit4]   2> 	  "core":"collection1",
[junit4:junit4]   2> 	  "collection":"collection1",
[junit4:junit4]   2> 	  "node_name":"127.0.0.1:59414_solr",
[junit4:junit4]   2> 	  "base_url":"http://127.0.0.1:59414/solr"}
[junit4:junit4]   2> 10076 T187 oascc.ZkStateReader$2.process A cluster state change has occurred - updating... (4)
[junit4:junit4]   2> 10076 T199 oascc.ZkStateReader$2.process A cluster state change has occurred - updating... (4)
[junit4:junit4]   2> 10077 T164 oascc.ZkStateReader$2.process A cluster state change has occurred - updating... (4)
[junit4:junit4]   2> 10077 T175 oascc.ZkStateReader$2.process A cluster state change has occurred - updating... (4)
[junit4:junit4]   2> 10077 T159 oascc.ZkStateReader$2.process A cluster state change has occurred - updating... (4)
[junit4:junit4]   2> 10126 T139 oasc.SolrConfig.<init> Loaded SolrConfig: solrconfig.xml
[junit4:junit4]   2> 10127 T139 oass.IndexSchema.readSchema Reading Solr Schema
[junit4:junit4]   2> 10134 T139 oass.IndexSchema.readSchema Schema name=test
[junit4:junit4]   2> 10930 T139 oass.OpenExchangeRatesOrgProvider.init Initialized with rates=open-exchange-rates.json, refreshInterval=1440.
[junit4:junit4]   2> 10949 T139 oass.IndexSchema.readSchema default search field in schema is text
[junit4:junit4]   2> 10959 T139 oass.IndexSchema.readSchema unique key field: id
[junit4:junit4]   2> 10983 T139 oass.FileExchangeRateProvider.reload Reloading exchange rates from file currency.xml
[junit4:junit4]   2> 10990 T139 oass.FileExchangeRateProvider.reload Reloading exchange rates from file currency.xml
[junit4:junit4]   2> 11000 T139 oass.OpenExchangeRatesOrgProvider.reload Reloading exchange rates from open-exchange-rates.json
[junit4:junit4]   2> 11002 T139 oass.OpenExchangeRatesOrgProvider.reload Reloading exchange rates from open-exchange-rates.json
[junit4:junit4]   2> 11004 T139 oasc.SolrCore.<init> [collection1] Opening new SolrCore at C:\Users\JenkinsSlave\workspace\Lucene-Solr-trunk-Windows\solr\build\solr-core\test\J0\.\org.apache.solr.cloud.BasicDistributedZk2Test-jetty3-1351302543631\collection1\, dataDir=.\org.apache.solr.cloud.BasicDistributedZk2Test-1351302534121/jetty3\
[junit4:junit4]   2> 11005 T139 oasc.JmxMonitoredMap.<init> JMX monitoring is enabled. Adding Solr mbeans to JMX Server: com.sun.jmx.mbeanserver.JmxMBeanServer@6a63d3
[junit4:junit4]   2> 11007 T139 oasc.SolrCore.initDirectoryFactory solr.NRTCachingDirectoryFactory
[junit4:junit4]   2> 11009 T139 oasc.CachingDirectoryFactory.injectLockFactory WARNING No lockType configured for NRTCachingDirectory(org.apache.lucene.store.SimpleFSDirectory@C:\Users\JenkinsSlave\workspace\Lucene-Solr-trunk-Windows\solr\build\solr-core\test\J0\org.apache.solr.cloud.BasicDistributedZk2Test-1351302534121\jetty3 lockFactory=org.apache.lucene.store.NativeFSLockFactory@8d4560; maxCacheMB=48.0 maxMergeSizeMB=4.0) assuming 'simple'
[junit4:junit4]   2> 11010 T139 oasc.CachingDirectoryFactory.get return new directory for C:\Users\JenkinsSlave\workspace\Lucene-Solr-trunk-Windows\solr\build\solr-core\test\J0\.\org.apache.solr.cloud.BasicDistributedZk2Test-1351302534121\jetty3 forceNew:false
[junit4:junit4]   2> 11011 T139 oasc.CachingDirectoryFactory.close Releasing directory:C:\Users\JenkinsSlave\workspace\Lucene-Solr-trunk-Windows\solr\build\solr-core\test\J0\.\org.apache.solr.cloud.BasicDistributedZk2Test-1351302534121\jetty3
[junit4:junit4]   2> 11012 T139 oasc.SolrCore.getNewIndexDir New index directory detected: old=null new=.\org.apache.solr.cloud.BasicDistributedZk2Test-1351302534121/jetty3\index/
[junit4:junit4]   2> 11013 T139 oasc.SolrCore.initIndex WARNING [collection1] Solr index directory '.\org.apache.solr.cloud.BasicDistributedZk2Test-1351302534121\jetty3\index' doesn't exist. Creating new index...
[junit4:junit4]   2> 11014 T139 oasc.CachingDirectoryFactory.get return new directory for C:\Users\JenkinsSlave\workspace\Lucene-Solr-trunk-Windows\solr\build\solr-core\test\J0\.\org.apache.solr.cloud.BasicDistributedZk2Test-1351302534121\jetty3\index forceNew:false
[junit4:junit4]   2> 11027 T139 oasc.SolrDeletionPolicy.onCommit SolrDeletionPolicy.onCommit: commits:num=1
[junit4:junit4]   2> 		commit{dir=NRTCachingDirectory(org.apache.lucene.store.SimpleFSDirectory@C:\Users\JenkinsSlave\workspace\Lucene-Solr-trunk-Windows\solr\build\solr-core\test\J0\org.apache.solr.cloud.BasicDistributedZk2Test-1351302534121\jetty3\index lockFactory=org.apache.lucene.store.NativeFSLockFactory@192c34b; maxCacheMB=48.0 maxMergeSizeMB=4.0),segFN=segments_1,generation=1,filenames=[segments_1]
[junit4:junit4]   2> 11027 T139 oasc.SolrDeletionPolicy.updateCommits newest commit = 1[segments_1]
[junit4:junit4]   2> 11030 T139 oasc.CachingDirectoryFactory.close Releasing directory:C:\Users\JenkinsSlave\workspace\Lucene-Solr-trunk-Windows\solr\build\solr-core\test\J0\.\org.apache.solr.cloud.BasicDistributedZk2Test-1351302534121\jetty3\index
[junit4:junit4]   2> 11030 T139 oasc.SolrCore.initWriters created xml: solr.XMLResponseWriter
[junit4:junit4]   2> 11034 T139 oasup.UpdateRequestProcessorChain.init inserting DistributedUpdateProcessorFactory into updateRequestProcessorChain "dedupe"
[junit4:junit4]   2> 11035 T139 oasup.UpdateRequestProcessorChain.init inserting DistributedUpdateProcessorFactory into updateRequestProcessorChain "dedupe-allfields"
[junit4:junit4]   2> 11035 T139 oasup.UpdateRequestProcessorChain.init inserting DistributedUpdateProcessorFactory into updateRequestProcessorChain "stored_sig"
[junit4:junit4]   2> 11036 T139 oasup.UpdateRequestProcessorChain.init inserting DistributedUpdateProcessorFactory into updateRequestProcessorChain "uniq-fields"
[junit4:junit4]   2> 11037 T139 oasup.UpdateRequestProcessorChain.init inserting DistributedUpdateProcessorFactory into updateRequestProcessorChain "distrib-dup-test-chain-implicit"
[junit4:junit4]   2> 11037 T139 oasc.RequestHandlers.initHandlersFromConfig adding lazy requestHandler: solr.ReplicationHandler
[junit4:junit4]   2> 11037 T139 oasc.RequestHandlers.initHandlersFromConfig created /replication: solr.ReplicationHandler
[junit4:junit4]   2> 11038 T139 oasc.RequestHandlers.initHandlersFromConfig created standard: solr.StandardRequestHandler
[junit4:junit4]   2> 11039 T139 oasc.RequestHandlers.initHandlersFromConfig created /get: solr.RealTimeGetHandler
[junit4:junit4]   2> 11039 T139 oasc.RequestHandlers.initHandlersFromConfig created dismax: solr.SearchHandler
[junit4:junit4]   2> 11040 T139 oasc.RequestHandlers.initHandlersFromConfig created mock: org.apache.solr.core.MockQuerySenderListenerReqHandler
[junit4:junit4]   2> 11040 T139 oasc.RequestHandlers.initHandlersFromConfig created /admin/: org.apache.solr.handler.admin.AdminHandlers
[junit4:junit4]   2> 11040 T139 oasc.RequestHandlers.initHandlersFromConfig created defaults: solr.StandardRequestHandler
[junit4:junit4]   2> 11040 T139 oasc.RequestHandlers.initHandlersFromConfig adding lazy requestHandler: solr.StandardRequestHandler
[junit4:junit4]   2> 11042 T139 oasc.RequestHandlers.initHandlersFromConfig created lazy: solr.StandardRequestHandler
[junit4:junit4]   2> 11042 T139 oasc.RequestHandlers.initHandlersFromConfig created /update: solr.UpdateRequestHandler
[junit4:junit4]   2> 11042 T139 oasc.RequestHandlers.initHandlersFromConfig created /terms: org.apache.solr.handler.component.SearchHandler
[junit4:junit4]   2> 11043 T139 oasc.RequestHandlers.initHandlersFromConfig created spellCheckCompRH: org.apache.solr.handler.component.SearchHandler
[junit4:junit4]   2> 11044 T139 oasc.RequestHandlers.initHandlersFromConfig created spellCheckCompRH_Direct: org.apache.solr.handler.component.SearchHandler
[junit4:junit4]   2> 11044 T139 oasc.RequestHandlers.initHandlersFromConfig created spellCheckWithWordbreak: org.apache.solr.handler.component.SearchHandler
[junit4:junit4]   2> 11044 T139 oasc.RequestHandlers.initHandlersFromConfig created spellCheckWithWordbreak_Direct: org.apache.solr.handler.component.SearchHandler
[junit4:junit4]   2> 11045 T139 oasc.RequestHandlers.initHandlersFromConfig created spellCheckCompRH1: org.apache.solr.handler.component.SearchHandler
[junit4:junit4]   2> 11045 T139 oasc.RequestHandlers.initHandlersFromConfig created tvrh: org.apache.solr.handler.component.SearchHandler
[junit4:junit4]   2> 11045 T139 oasc.RequestHandlers.initHandlersFromConfig created /mlt: solr.MoreLikeThisHandler
[junit4:junit4]   2> 11046 T139 oasc.RequestHandlers.initHandlersFromConfig created /debug/dump: solr.DumpRequestHandler
[junit4:junit4]   2> 11054 T139 oashl.XMLLoader.init xsltCacheLifetimeSeconds=60
[junit4:junit4]   2> 11058 T139 oasc.SolrCore.initDeprecatedSupport WARNING solrconfig.xml uses deprecated <admin/gettableFiles>, Please update your config to use the ShowFileRequestHandler.
[junit4:junit4]   2> 11061 T139 oasc.SolrCore.initDeprecatedSupport WARNING adding ShowFileRequestHandler with hidden files: [SCHEMA.XML, OLD_SYNONYMS.TXT, STOPWORDS.TXT, PROTWORDS.TXT, OPEN-EXCHANGE-RATES.JSON, SYNONYMS.TXT, CURRENCY.XML, MAPPING-ISOLATIN1ACCENT.TXT]
[junit4:junit4]   2> 11064 T139 oasc.CachingDirectoryFactory.close Releasing directory:C:\Users\JenkinsSlave\workspace\Lucene-Solr-trunk-Windows\solr\build\solr-core\test\J0\.\org.apache.solr.cloud.BasicDistributedZk2Test-1351302534121\jetty3
[junit4:junit4]   2> 11067 T139 oass.SolrIndexSearcher.<init> Opening Searcher@9a9631 main
[junit4:junit4]   2> 11068 T139 oasu.CommitTracker.<init> Hard AutoCommit: disabled
[junit4:junit4]   2> 11069 T139 oasu.CommitTracker.<init> Soft AutoCommit: disabled
[junit4:junit4]   2> 11069 T139 oashc.SpellCheckComponent.inform Initializing spell checkers
[junit4:junit4]   2> 11082 T139 oass.DirectSolrSpellChecker.init init: {name=direct,classname=DirectSolrSpellChecker,field=lowerfilt,minQueryLength=3}
[junit4:junit4]   2> 11233 T200 oasc.SolrCore.registerSearcher [collection1] Registered new searcher Searcher@9a9631 main{StandardDirectoryReader(segments_1:1)}
[junit4:junit4]   2> 11239 T139 oasc.ZkController.publish numShards not found on descriptor - reading it from system property
[junit4:junit4]   2> 11753 T160 oascc.ZkStateReader.updateClusterState Updating cloud state from ZooKeeper... 
[junit4:junit4]   2> 11755 T160 oasc.Overseer$ClusterStateUpdater.updateState Update state numShards=2 message={
[junit4:junit4]   2> 	  "operation":"state",
[junit4:junit4]   2> 	  "numShards":"2",
[junit4:junit4]   2> 	  "shard":null,
[junit4:junit4]   2> 	  "roles":null,
[junit4:junit4]   2> 	  "state":"down",
[junit4:junit4]   2> 	  "core":"collection1",
[junit4:junit4]   2> 	  "collection":"collection1",
[junit4:junit4]   2> 	  "node_name":"127.0.0.1:59420_solr",
[junit4:junit4]   2> 	  "base_url":"http://127.0.0.1:59420/solr"}
[junit4:junit4]   2> 11768 T187 oascc.ZkStateReader$2.process A cluster state change has occurred - updating... (4)
[junit4:junit4]   2> 11768 T199 oascc.ZkStateReader$2.process A cluster state change has occurred - updating... (4)
[junit4:junit4]   2> 11768 T175 oascc.ZkStateReader$2.process A cluster state change has occurred - updating... (4)
[junit4:junit4]   2> 11768 T164 oascc.ZkStateReader$2.process A cluster state change has occurred - updating... (4)
[junit4:junit4]   2> 11768 T159 oascc.ZkStateReader$2.process A cluster state change has occurred - updating... (4)
[junit4:junit4]   2> 11800 T139 oasc.CoreContainer.register registering core: collection1
[junit4:junit4]   2> 11800 T139 oasc.ZkController.register Register shard - core:collection1 address:http://127.0.0.1:59420/solr shardId:shard1
[junit4:junit4]   2> 11805 T139 oasc.ZkController.register We are http://127.0.0.1:59420/solr/collection1/ and leader is http://127.0.0.1:59408/solr/collection1/
[junit4:junit4]   2> 11805 T139 oasc.ZkController.register No LogReplay needed for core=collection1 baseURL=http://127.0.0.1:59420/solr
[junit4:junit4]   2> 11805 T139 oasc.ZkController.checkRecovery Core needs to recover:collection1
[junit4:junit4]   2> 11806 T139 oasu.DefaultSolrCoreState.doRecovery Running recovery - first canceling any ongoing recovery
[junit4:junit4]   2> ASYNC  NEW_CORE C19 name=collection1 org.apache.solr.core.SolrCore@ef659c url=http://127.0.0.1:59420/solr/collection1 node=127.0.0.1:59420_solr
[junit4:junit4]   2> 11814 T201 C19 P59420 oasc.RecoveryStrategy.run Starting recovery process.  core=collection1 recoveringAfterStartup=true
[junit4:junit4]   2> 11814 T139 oascc.ZkStateReader.updateClusterState Updating cloud state from ZooKeeper... 
[junit4:junit4]   2> 11815 T201 C19 P59420 oasc.RecoveryStrategy.doRecovery ###### startupVersions=[]
[junit4:junit4]   2> 11815 T201 C19 P59420 oasc.ZkController.publish numShards not found on descriptor - reading it from system property
[junit4:junit4]   2> 11816 T139 oass.SolrDispatchFilter.init user.dir=C:\Users\JenkinsSlave\workspace\Lucene-Solr-trunk-Windows\solr\build\solr-core\test\J0
[junit4:junit4]   2> 11817 T139 oass.SolrDispatchFilter.init SolrDispatchFilter.init() done
[junit4:junit4]   2> 11817 T139 oascsi.HttpClientUtil.createClient Creating new http client, config:maxConnections=128&maxConnectionsPerHost=32&followRedirects=false
[junit4:junit4]   2> 11818 T201 C19 P59420 oasc.RecoveryStrategy.doRecovery Attempting to PeerSync from http://127.0.0.1:59408/solr/collection1/ core=collection1 - recoveringAfterStartup=true
[junit4:junit4]   2> 11828 T201 C19 P59420 oascsi.HttpClientUtil.createClient Creating new http client, config:maxConnectionsPerHost=20&maxConnections=10000&connTimeout=30000&socketTimeout=30000&retry=false
[junit4:junit4]   2> 11840 T201 C19 P59420 oasu.PeerSync.sync PeerSync: core=collection1 url=http://127.0.0.1:59420/solr START replicas=[http://127.0.0.1:59408/solr/collection1/] nUpdates=100
[junit4:junit4]   2> 11841 T201 C19 P59420 oasu.PeerSync.sync WARNING no frame of reference to tell of we've missed updates
[junit4:junit4]   2> 11845 T201 C19 P59420 oasc.RecoveryStrategy.doRecovery PeerSync Recovery was not successful - trying replication. core=collection1
[junit4:junit4]   2> 11847 T201 C19 P59420 oasc.RecoveryStrategy.doRecovery Starting Replication Recovery. core=collection1
[junit4:junit4]   2> 11847 T201 C19 P59420 oascsi.HttpClientUtil.createClient Creating new http client, config:maxConnections=128&maxConnectionsPerHost=32&followRedirects=false
[junit4:junit4]   2> ASYNC  NEW_CORE C20 name=collection1 org.apache.solr.core.SolrCore@7b7bee url=http://127.0.0.1:59408/solr/collection1 node=127.0.0.1:59408_solr
[junit4:junit4]   2> 11882 T170 C20 P59408 REQ /get {distrib=false&qt=/get&wt=javabin&version=2&getVersions=100} status=0 QTime=1 
[junit4:junit4]   2> 12146 T139 oejs.Server.doStart jetty-8.1.2.v20120308
[junit4:junit4]   2> 12151 T139 oejs.AbstractConnector.doStart Started SelectChannelConnector@0.0.0.0:59428
[junit4:junit4]   2> 12151 T139 oasc.SolrResourceLoader.locateSolrHome JNDI not configured for solr (NoInitialContextEx)
[junit4:junit4]   2> 12151 T139 oasc.SolrResourceLoader.locateSolrHome using system property solr.solr.home: C:\Users\JenkinsSlave\workspace\Lucene-Solr-trunk-Windows\solr\build\solr-core\test\J0\.\org.apache.solr.cloud.BasicDistributedZk2Test-jetty4-1351302545946
[junit4:junit4]   2> 12152 T139 oasc.SolrResourceLoader.<init> new SolrResourceLoader for deduced Solr Home: 'C:\Users\JenkinsSlave\workspace\Lucene-Solr-trunk-Windows\solr\build\solr-core\test\J0\.\org.apache.solr.cloud.BasicDistributedZk2Test-jetty4-1351302545946\'
[junit4:junit4]   2> 12176 T139 oass.SolrDispatchFilter.init SolrDispatchFilter.init()
[junit4:junit4]   2> 12176 T139 oasc.SolrResourceLoader.locateSolrHome JNDI not configured for solr (NoInitialContextEx)
[junit4:junit4]   2> 12177 T139 oasc.SolrResourceLoader.locateSolrHome using system property solr.solr.home: C:\Users\JenkinsSlave\workspace\Lucene-Solr-trunk-Windows\solr\build\solr-core\test\J0\.\org.apache.solr.cloud.BasicDistributedZk2Test-jetty4-1351302545946
[junit4:junit4]   2> 12177 T139 oasc.CoreContainer$Initializer.initialize looking for solr.xml: C:\Users\JenkinsSlave\workspace\Lucene-Solr-trunk-Windows\solr\build\solr-core\test\J0\.\org.apache.solr.cloud.BasicDistributedZk2Test-jetty4-1351302545946\solr.xml
[junit4:junit4]   2> 12177 T139 oasc.CoreContainer.<init> New CoreContainer 9249785
[junit4:junit4]   2> 12178 T139 oasc.CoreContainer.load Loading CoreContainer using Solr Home: 'C:\Users\JenkinsSlave\workspace\Lucene-Solr-trunk-Windows\solr\build\solr-core\test\J0\.\org.apache.solr.cloud.BasicDistributedZk2Test-jetty4-1351302545946\'
[junit4:junit4]   2> 12179 T139 oasc.SolrResourceLoader.<init> new SolrResourceLoader for directory: 'C:\Users\JenkinsSlave\workspace\Lucene-Solr-trunk-Windows\solr\build\solr-core\test\J0\.\org.apache.solr.cloud.BasicDistributedZk2Test-jetty4-1351302545946\'
[junit4:junit4]   2> 12209 T139 oasc.CoreContainer.load Registering Log Listener
[junit4:junit4]   2> 12237 T139 oasc.CoreContainer.initZooKeeper Zookeeper client=127.0.0.1:59392/solr
[junit4:junit4]   2> 12238 T139 oaz.ZooKeeper.<init> Initiating client connection, connectString=127.0.0.1:59392/solr sessionTimeout=5000 watcher=org.apache.solr.common.cloud.ConnectionManager@7792fe
[junit4:junit4]   2> 12239 T139 oascc.ConnectionManager.waitForConnected Waiting for client to connect to ZooKeeper
[junit4:junit4]   2> 12239 T212 oaz.ClientCnxn$SendThread.startConnect Opening socket connection to server /127.0.0.1:59392
[junit4:junit4]   2> 12242 T212 oaz.ClientCnxn$SendThread.primeConnection Socket connection established to 127.0.0.1/127.0.0.1:59392, initiating session
[junit4:junit4]   2> 12242 T141 oazs.NIOServerCnxn$Factory.run Accepted socket connection from /127.0.0.1:59433
[junit4:junit4]   2> 12242 T141 oazs.NIOServerCnxn.readConnectRequest Client attempting to establish new session at /127.0.0.1:59433
[junit4:junit4]   2> 12253 T143 oazs.NIOServerCnxn.finishSessionInit Established session 0x13a9fe855310007 with negotiated timeout 5000 for client /127.0.0.1:59433
[junit4:junit4]   2> 12253 T212 oaz.ClientCnxn$SendThread.readConnectResult Session establishment complete on server 127.0.0.1/127.0.0.1:59392, sessionid = 0x13a9fe855310007, negotiated timeout = 5000
[junit4:junit4]   2> 12254 T213 oascc.ConnectionManager.process Watcher org.apache.solr.common.cloud.ConnectionManager@7792fe name:ZooKeeperConnection Watcher:127.0.0.1:59392/solr got event WatchedEvent state:SyncConnected type:None path:null path:null type:None
[junit4:junit4]   2> 12255 T139 oascc.ConnectionManager.waitForConnected Client is connected to ZooKeeper
[junit4:junit4]   2> 12256 T144 oazs.PrepRequestProcessor.pRequest Got user-level KeeperException when processing sessionid:0x13a9fe855310007 type:create cxid:0x1 zxid:0xfffffffffffffffe txntype:unknown reqpath:n/a Error Path:/solr/overseer Error:KeeperErrorCode = NodeExists for /solr/overseer
[junit4:junit4]   2> 12259 T144 oazs.PrepRequestProcessor.pRequest Got user-level KeeperException when processing sessionid:0x13a9fe855310007 type:create cxid:0x2 zxid:0xfffffffffffffffe txntype:unknown reqpath:n/a Error Path:/solr/overseer Error:KeeperErrorCode = NodeExists for /solr/overseer
[junit4:junit4]   2> 12261 T139 oasc.ZkController.createEphemeralLiveNode Register node as live in ZooKeeper:/live_nodes/127.0.0.1:59428_solr
[junit4:junit4]   2> 12262 T144 oazs.PrepRequestProcessor.pRequest Got user-level KeeperException when processing sessionid:0x13a9fe855310007 type:delete cxid:0x4 zxid:0xfffffffffffffffe txntype:unknown reqpath:n/a Error Path:/solr/live_nodes/127.0.0.1:59428_solr Error:KeeperErrorCode = NoNode for /solr/live_nodes/127.0.0.1:59428_solr
[junit4:junit4]   2> 12263 T139 oascc.SolrZkClient.makePath makePath: /live_nodes/127.0.0.1:59428_solr
[junit4:junit4]   2> 12266 T199 oascc.ZkStateReader$2.process A cluster state change has occurred - updating... (4)
[junit4:junit4]   2> 12266 T164 oascc.ZkStateReader$2.process A cluster state change has occurred - updating... (4)
[junit4:junit4]   2> 12268 T187 oascc.ZkStateReader$3.process Updating live nodes... (5)
[junit4:junit4]   2> 12269 T187 oascc.ZkStateReader$2.process A cluster state change has occurred - updating... (5)
[junit4:junit4]   2> 12269 T159 oascc.ZkStateReader$3.process Updating live nodes... (5)
[junit4:junit4]   2> 12269 T159 oascc.ZkStateReader$2.process A cluster state change has occurred - updating... (5)
[junit4:junit4]   2> 12271 T175 oascc.ZkStateReader$3.process Updating live nodes... (5)
[junit4:junit4]   2> 12271 T175 oascc.ZkStateReader$2.process A cluster state change has occurred - updating... (5)
[junit4:junit4]   2> 12272 T139 oashc.HttpShardHandlerFactory.getParameter Setting socketTimeout to: 0
[junit4:junit4]   2> 12272 T139 oashc.HttpShardHandlerFactory.getParameter Setting urlScheme to: http://
[junit4:junit4]   2> 12272 T139 oashc.HttpShardHandlerFactory.getParameter Setting connTimeout to: 0
[junit4:junit4]   2> 12272 T139 oashc.HttpShardHandlerFactory.getParameter Setting maxConnectionsPerHost to: 20
[junit4:junit4]   2> 12272 T139 oashc.HttpShardHandlerFactory.getParameter Setting corePoolSize to: 0
[junit4:junit4]   2> 12274 T139 oashc.HttpShardHandlerFactory.getParameter Setting maximumPoolSize to: 2147483647
[junit4:junit4]   2> 12274 T139 oashc.HttpShardHandlerFactory.getParameter Setting maxThreadIdleTime to: 5
[junit4:junit4]   2> 12274 T139 oashc.HttpShardHandlerFactory.getParameter Setting sizeOfQueue to: -1
[junit4:junit4]   2> 12274 T139 oashc.HttpShardHandlerFactory.getParameter Setting fairnessPolicy to: false
[junit4:junit4]   2> 12275 T164 oascc.ZkStateReader$3.process Updating live nodes... (5)
[junit4:junit4]   2> 12275 T139 oascsi.HttpClientUtil.createClient Creating new http client, config:maxConnectionsPerHost=20&maxConnections=10000&socketTimeout=0&connTimeout=0&retry=false
[junit4:junit4]   2> 12275 T199 oascc.ZkStateReader$3.process Updating live nodes... (5)
[junit4:junit4]   2> 12286 T139 oascc.ZkStateReader.createClusterStateWatchersAndUpdate Updating cluster state from ZooKeeper... 
[junit4:junit4]   2> 12294 T139 oasc.CoreContainer.create Creating SolrCore 'collection1' using instanceDir: C:\Users\JenkinsSlave\workspace\Lucene-Solr-trunk-Windows\solr\build\solr-core\test\J0\.\org.apache.solr.cloud.BasicDistributedZk2Test-jetty4-1351302545946\collection1
[junit4:junit4]   2> 12294 T139 oasc.ZkController.createCollectionZkNode Check for collection zkNode:collection1
[junit4:junit4]   2> 12295 T139 oasc.ZkController.createCollectionZkNode Collection zkNode exists
[junit4:junit4]   2> 12295 T139 oasc.ZkController.readConfigName Load collection config from:/collections/collection1
[junit4:junit4]   2> 12299 T139 oasc.SolrResourceLoader.<init> new SolrResourceLoader for directory: 'C:\Users\JenkinsSlave\workspace\Lucene-Solr-trunk-Windows\solr\build\solr-core\test\J0\.\org.apache.solr.cloud.BasicDistributedZk2Test-jetty4-1351302545946\collection1\'
[junit4:junit4]   2> 12300 T139 oasc.SolrResourceLoader.replaceClassLoader Adding 'file:/C:/Users/JenkinsSlave/workspace/Lucene-Solr-trunk-Windows/solr/build/solr-core/test/J0/org.apache.solr.cloud.BasicDistributedZk2Test-jetty4-1351302545946/collection1/lib/classes/' to classloader
[junit4:junit4]   2> 12301 T139 oasc.SolrResourceLoader.replaceClassLoader Adding 'file:/C:/Users/JenkinsSlave/workspace/Lucene-Solr-trunk-Windows/solr/build/solr-core/test/J0/org.apache.solr.cloud.BasicDistributedZk2Test-jetty4-1351302545946/collection1/lib/README' to classloader
[junit4:junit4]   2> 12328 T160 oascc.ZkStateReader.updateClusterState Updating cloud state from ZooKeeper... 
[junit4:junit4]   2> 12329 T160 oasc.Overseer$ClusterStateUpdater.updateState Update state numShards=2 message={
[junit4:junit4]   2> 	  "operation":"state",
[junit4:junit4]   2> 	  "numShards":"2",
[junit4:junit4]   2> 	  "shard":"shard1",
[junit4:junit4]   2> 	  "roles":null,
[junit4:junit4]   2> 	  "state":"recovering",
[junit4:junit4]   2> 	  "core":"collection1",
[junit4:junit4]   2> 	  "collection":"collection1",
[junit4:junit4]   2> 	  "node_name":"127.0.0.1:59420_solr",
[junit4:junit4]   2> 	  "base_url":"http://127.0.0.1:59420/solr"}
[junit4:junit4]   2> 12339 T187 oascc.ZkStateReader$2.process A cluster state change has occurred - updating... (5)
[junit4:junit4]   2> 12340 T213 oascc.ZkStateReader$2.process A cluster state change has occurred - updating... (5)
[junit4:junit4]   2> 12341 T159 oascc.ZkStateReader$2.process A cluster state change has occurred - updating... (5)
[junit4:junit4]   2> 12341 T175 oascc.ZkStateReader$2.process A cluster state change has occurred - updating... (5)
[junit4:junit4]   2> 12341 T199 oascc.ZkStateReader$2.process A cluster state change has occurred - updating... (5)
[junit4:junit4]   2> 12345 T164 oascc.ZkStateReader$2.process A cluster state change has occurred - updating... (5)
[junit4:junit4]   2> 12364 T139 oasc.SolrConfig.<init> Using Lucene MatchVersion: LUCENE_50
[junit4:junit4]   2> 12462 T139 oasc.SolrConfig.<init> Loaded SolrConfig: solrconfig.xml
[junit4:junit4]   2> 12464 T139 oass.IndexSchema.readSchema Reading Solr Schema
[junit4:junit4]   2> 12470 T139 oass.IndexSchema.readSchema Schema name=test
[junit4:junit4]   2> 13216 T139 oass.OpenExchangeRatesOrgProvider.init Initialized with rates=open-exchange-rates.json, refreshInterval=1440.
[junit4:junit4]   2> 13227 T139 oass.IndexSchema.readSchema default search field in schema is text
[junit4:junit4]   2> 13230 T139 oass.IndexSchema.readSchema unique key field: id
[junit4:junit4]   2> 13248 T139 oass.FileExchangeRateProvider.reload Reloading exchange rates from file currency.xml
[junit4:junit4]   2> 13253 T139 oass.FileExchangeRateProvider.reload Reloading exchange rates from file currency.xml
[junit4:junit4]   2> 13259 T139 oass.OpenExchangeRatesOrgProvider.reload Reloading exchange rates from open-exchange-rates.json
[junit4:junit4]   2> 13260 T139 oass.OpenExchangeRatesOrgProvider.reload Reloading exchange rates from open-exchange-rates.json
[junit4:junit4]   2> 13262 T139 oasc.SolrCore.<init> [collection1] Opening new SolrCore at C:\Users\JenkinsSlave\workspace\Lucene-Solr-trunk-Windows\solr\build\solr-core\test\J0\.\org.apache.solr.cloud.BasicDistributedZk2Test-jetty4-1351302545946\collection1\, dataDir=.\org.apache.solr.cloud.BasicDistributedZk2Test-1351302534121/jetty4\
[junit4:junit4]   2> 13262 T139 oasc.JmxMonitoredMap.<init> JMX monitoring is enabled. Adding Solr mbeans to JMX Server: com.sun.jmx.mbeanserver.JmxMBeanServer@6a63d3
[junit4:junit4]   2> 13264 T139 oasc.SolrCore.initDirectoryFactory solr.NRTCachingDirectoryFactory
[junit4:junit4]   2> 13265 T139 oasc.CachingDirectoryFactory.injectLockFactory WARNING No lockType configured for NRTCachingDirectory(org.apache.lucene.store.SimpleFSDirectory@C:\Users\JenkinsSlave\workspace\Lucene-Solr-trunk-Windows\solr\build\solr-core\test\J0\org.apache.solr.cloud.BasicDistributedZk2Test-1351302534121\jetty4 lockFactory=org.apache.lucene.store.NativeFSLockFactory@3b626c; maxCacheMB=48.0 maxMergeSizeMB=4.0) assuming 'simple'
[junit4:junit4]   2> 13266 T139 oasc.CachingDirectoryFactory.get return new directory for C:\Users\JenkinsSlave\workspace\Lucene-Solr-trunk-Windows\solr\build\solr-core\test\J0\.\org.apache.solr.cloud.BasicDistributedZk2Test-1351302534121\jetty4 forceNew:false
[junit4:junit4]   2> 13266 T139 oasc.CachingDirectoryFactory.close Releasing directory:C:\Users\JenkinsSlave\workspace\Lucene-Solr-trunk-Windows\solr\build\solr-core\test\J0\.\org.apache.solr.cloud.BasicDistributedZk2Test-1351302534121\jetty4
[junit4:junit4]   2> 13267 T139 oasc.SolrCore.getNewIndexDir New index directory detected: old=null new=.\org.apache.solr.cloud.BasicDistributedZk2Test-1351302534121/jetty4\index/
[junit4:junit4]   2> 13268 T139 oasc.SolrCore.initIndex WARNING [collection1] Solr index directory '.\org.apache.solr.cloud.BasicDistributedZk2Test-1351302534121\jetty4\index' doesn't exist. Creating new index...
[junit4:junit4]   2> 13269 T139 oasc.CachingDirectoryFactory.get return new directory for C:\Users\JenkinsSlave\workspace\Lucene-Solr-trunk-Windows\solr\build\solr-core\test\J0\.\org.apache.solr.cloud.BasicDistributedZk2Test-1351302534121\jetty4\index forceNew:false
[junit4:junit4]   2> 13279 T139 oasc.SolrDeletionPolicy.onCommit SolrDeletionPolicy.onCommit: commits:num=1
[junit4:junit4]   2> 		commit{dir=NRTCachingDirectory(org.apache.lucene.store.SimpleFSDirectory@C:\Users\JenkinsSlave\workspace\Lucene-Solr-trunk-Windows\solr\build\solr-core\test\J0\org.apache.solr.cloud.BasicDistributedZk2Test-1351302534121\jetty4\index lockFactory=org.apache.lucene.store.NativeFSLockFactory@b37b66; maxCacheMB=48.0 maxMergeSizeMB=4.0),segFN=segments_1,generation=1,filenames=[segments_1]
[junit4:junit4]   2> 13279 T139 oasc.SolrDeletionPolicy.updateCommits newest commit = 1[segments_1]
[junit4:junit4]   2> 13281 T139 oasc.CachingDirectoryFactory.close Releasing directory:C:\Users\JenkinsSlave\workspace\Lucene-Solr-trunk-Windows\solr\build\solr-core\test\J0\.\org.apache.solr.cloud.BasicDistributedZk2Test-1351302534121\jetty4\index
[junit4:junit4]   2> 13281 T139 oasc.SolrCore.initWriters created xml: solr.XMLResponseWriter
[junit4:junit4]   2> 13283 T139 oasup.UpdateRequestProcessorChain.init inserting DistributedUpdateProcessorFactory into updateRequestProcessorChain "dedupe"
[junit4:junit4]   2> 13284 T139 oasup.UpdateRequestProcessorChain.init inserting DistributedUpdateProcessorFactory into updateRequestProcessorChain "dedupe-allfields"
[junit4:junit4]   2> 13284 T139 oasup.UpdateRequestProcessorChain.init inserting DistributedUpdateProcessorFactory into updateRequestProcessorChain "stored_sig"
[junit4:junit4]   2> 13284 T139 oasup.UpdateRequestProcessorChain.init inserting DistributedUpdateProcessorFactory into updateRequestProcessorChain "uniq-fields"
[junit4:junit4]   2> 13284 T139 oasup.UpdateRequestProcessorChain.init inserting DistributedUpdateProcessorFactory into updateRequestProcessorChain "distrib-dup-test-chain-implicit"
[junit4:junit4]   2> 13286 T139 oasc.RequestHandlers.initHandlersFromConfig adding lazy requestHandler: solr.ReplicationHandler
[junit4:junit4]   2> 13286 T139 oasc.RequestHandlers.initHandlersFromConfig created /replication: solr.ReplicationHandler
[junit4:junit4]   2> 13286 T139 oasc.RequestHandlers.initHandlersFromConfig created standard: solr.StandardRequestHandler
[junit4:junit4]   2> 13287 T139 oasc.RequestHandlers.initHandlersFromConfig created /get: solr.RealTimeGetHandler
[junit4:junit4]   2> 13287 T139 oasc.RequestHandlers.initHandlersFromConfig created dismax: solr.SearchHandler
[junit4:junit4]   2> 13287 T139 oasc.RequestHandlers.initHandlersFromConfig created mock: org.apache.solr.core.MockQuerySenderListenerReqHandler
[junit4:junit4]   2> 13289 T139 oasc.RequestHandlers.initHandlersFromConfig created /admin/: org.apache.solr.handler.admin.AdminHandlers
[junit4:junit4]   2> 13289 T139 oasc.RequestHandlers.initHandlersFromConfig created defaults: solr.StandardRequestHandler
[junit4:junit4]   2> 13289 T139 oasc.RequestHandlers.initHandlersFromConfig adding lazy requestHandler: solr.StandardRequestHandler
[junit4:junit4]   2> 13291 T139 oasc.RequestHandlers.initHandlersFromConfig created lazy: solr.StandardRequestHandler
[junit4:junit4]   2> 13291 T139 oasc.RequestHandlers.initHandlersFromConfig created /update: solr.UpdateRequestHandler
[junit4:junit4]   2> 13292 T139 oasc.RequestHandlers.initHandlersFromConfig created /terms: org.apache.solr.handler.component.SearchHandler
[junit4:junit4]   2> 13292 T139 oasc.RequestHandlers.initHandlersFromConfig created spellCheckCompRH: org.apache.solr.handler.component.SearchHandler
[junit4:junit4]   2> 13292 T139 oasc.RequestHandlers.initHandlersFromConfig created spellCheckCompRH_Direct: org.apache.solr.handler.component.SearchHandler
[junit4:junit4]   2> 13293 T139 oasc.RequestHandlers.initHandlersFromConfig created spellCheckWithWordbreak: org.apache.solr.handler.component.SearchHandler
[junit4:junit4]   2> 13293 T139 oasc.RequestHandlers.initHandlersFromConfig created spellCheckWithWordbreak_Direct: org.apache.solr.handler.component.SearchHandler
[junit4:junit4]   2> 13294 T139 oasc.RequestHandlers.initHandlersFromConfig created spellCheckCompRH1: org.apache.solr.handler.component.SearchHandler
[junit4:junit4]   2> 13294 T139 oasc.RequestHandlers.initHandlersFromConfig created tvrh: org.apache.solr.handler.component.SearchHandler
[junit4:junit4]   2> 13294 T139 oasc.RequestHandlers.initHandlersFromConfig created /mlt: solr.MoreLikeThisHandler
[junit4:junit4]   2> 13295 T139 oasc.RequestHandlers.initHandlersFromConfig created /debug/dump: solr.DumpRequestHandler
[junit4:junit4]   2> 13301 T139 oashl.XMLLoader.init xsltCacheLifetimeSeconds=60
[junit4:junit4]   2> 13306 T139 oasc.SolrCore.initDeprecatedSupport WARNING solrconfig.xml uses deprecated <admin/gettableFiles>, Please update your config to use the ShowFileRequestHandler.
[junit4:junit4]   2> 13307 T139 oasc.SolrCore.initDeprecatedSupport WARNING adding ShowFileRequestHandler with hidden files: [SCHEMA.XML, OLD_SYNONYMS.TXT, STOPWORDS.TXT, PROTWORDS.TXT, OPEN-EXCHANGE-RATES.JSON, SYNONYMS.TXT, CURRENCY.XML, MAPPING-ISOLATIN1ACCENT.TXT]
[junit4:junit4]   2> 13310 T139 oasc.CachingDirectoryFactory.close Releasing directory:C:\Users\JenkinsSlave\workspace\Lucene-Solr-trunk-Windows\solr\build\solr-core\test\J0\.\org.apache.solr.cloud.BasicDistributedZk2Test-1351302534121\jetty4
[junit4:junit4]   2> 13312 T139 oass.SolrIndexSearcher.<init> Opening Searcher@cdd9ba main
[junit4:junit4]   2> 13314 T139 oasu.CommitTracker.<init> Hard AutoCommit: disabled
[junit4:junit4]   2> 13314 T139 oasu.CommitTracker.<init> Soft AutoCommit: disabled
[junit4:junit4]   2> 13314 T139 oashc.SpellCheckComponent.inform Initializing spell checkers
[junit4:junit4]   2> 13329 T139 oass.DirectSolrSpellChecker.init init: {name=direct,classname=DirectSolrSpellChecker,field=lowerfilt,minQueryLength=3}
[junit4:junit4]   2> 13389 T214 oasc.SolrCore.registerSearcher [collection1] Registered new searcher Searcher@cdd9ba main{StandardDirectoryReader(segments_1:1)}
[junit4:junit4]   2> 13393 T139 oasc.ZkController.publish numShards not found on descriptor - reading it from system property
[junit4:junit4]   2> 13461 T160 oascc.ZkStateReader.updateClusterState Updating cloud state from ZooKeeper... 
[junit4:junit4]   2> 13462 T160 oasc.Overseer$ClusterStateUpdater.updateState Update state numShards=2 message={
[junit4:junit4]   2> 	  "operation":"state",
[junit4:junit4]   2> 	  "numShards":"2",
[junit4:junit4]   2> 	  "shard":null,
[junit4:junit4]   2> 	  "roles":null,
[junit4:junit4]   2> 	  "state":"down",
[junit4:junit4]   2> 	  "core":"collection1",
[junit4:junit4]   2> 	  "collection":"collection1",
[junit4:junit4]   2> 	  "node_name":"127.0.0.1:59428_solr",
[junit4:junit4]   2> 	  "base_url":"http://127.0.0.1:59428/solr"}
[junit4:junit4]   2> 13470 T187 oascc.ZkStateReader$2.process A cluster state change has occurred - updating... (5)
[junit4:junit4]   2> 13470 T213 oascc.ZkStateReader$2.process A cluster state change has occurred - updating... (5)
[junit4:junit4]   2> 13471 T175 oascc.ZkStateReader$2.process A cluster state change has occurred - updating... (5)
[junit4:junit4]   2> 13471 T164 oascc.ZkStateReader$2.process A cluster state change has occurred - updating... (5)
[junit4:junit4]   2> 13471 T199 oascc.ZkStateReader$2.process A cluster state change has occurred - updating... (5)
[junit4:junit4]   2> 13471 T159 oascc.ZkStateReader$2.process A cluster state change has occurred - updating... (5)
[junit4:junit4]   2> 13949 T139 oasc.CoreContainer.register registering core: collection1
[junit4:junit4]   2> 13949 T139 oasc.ZkController.register Register shard - core:collection1 address:http://127.0.0.1:59428/solr shardId:shard2
[junit4:junit4]   2> 13962 T139 oasc.ZkController.register We are http://127.0.0.1:59428/solr/collection1/ and leader is http://127.0.0.1:59414/solr/collection1/
[junit4:junit4]   2> 13962 T139 oasc.ZkController.register No LogReplay needed for core=collection1 baseURL=http://127.0.0.1:59428/solr
[junit4:junit4]   2> 13962 T139 oasc.ZkController.checkRecovery Core needs to recover:collection1
[junit4:junit4]   2> 13963 T139 oasu.DefaultSolrCoreState.doRecovery Running recovery - first canceling any ongoing recovery
[junit4:junit4]   2> ASYNC  NEW_CORE C21 name=collection1 org.apache.solr.core.SolrCore@c3615b url=http://127.0.0.1:59428/solr/collection1 node=127.0.0.1:59428_solr
[junit4:junit4]   2> 13964 T215 C21 P59428 oasc.RecoveryStrategy.run Starting recovery process.  core=collection1 recoveringAfterStartup=true
[junit4:junit4]   2> 13965 T215 C21 P59428 oasc.RecoveryStrategy.doRecovery ###### startupVersions=[]
[junit4:junit4]   2> 13965 T215 C21 P59428 oasc.ZkController.publish numShards not found on descriptor - reading it from system property
[junit4:junit4]   2> 13966 T139 oascc.ZkStateReader.updateClusterState Updating cloud state from ZooKeeper... 
[junit4:junit4]   2> 13967 T215 C21 P59428 oasc.RecoveryStrategy.doRecovery Attempting to PeerSync from http://127.0.0.1:59414/solr/collection1/ core=collection1 - recoveringAfterStartup=true
[junit4:junit4]   2> 13967 T215 C21 P59428 oasu.PeerSync.sync PeerSync: core=collection1 url=http://127.0.0.1:59428/solr START replicas=[http://127.0.0.1:59414/solr/collection1/] nUpdates=100
[junit4:junit4]   2> 13967 T139 oass.SolrDispatchFilter.init user.dir=C:\Users\JenkinsSlave\workspace\Lucene-Solr-trunk-Windows\solr\build\solr-core\test\J0
[junit4:junit4]   2> 13968 T139 oass.SolrDispatchFilter.init SolrDispatchFilter.init() done
[junit4:junit4]   2> 13968 T139 oascsi.HttpClientUtil.createClient Creating new http client, config:maxConnections=128&maxConnectionsPerHost=32&followRedirects=false
[junit4:junit4]   2> 13968 T215 C21 P59428 oasu.PeerSync.sync WARNING no frame of reference to tell of we've missed updates
[junit4:junit4]   2> 13971 T215 C21 P59428 oasc.RecoveryStrategy.doRecovery PeerSync Recovery was not successful - trying replication. core=collection1
[junit4:junit4]   2> 13971 T215 C21 P59428 oasc.RecoveryStrategy.doRecovery Starting Replication Recovery. core=collection1
[junit4:junit4]   2> 13971 T215 C21 P59428 oascsi.HttpClientUtil.createClient Creating new http client, config:maxConnections=128&maxConnectionsPerHost=32&followRedirects=false
[junit4:junit4]   2> 13980 T139 oascc.ZkStateReader.updateClusterState Updating cloud state from ZooKeeper... 
[junit4:junit4]   2> ASYNC  NEW_CORE C22 name=collection1 org.apache.solr.core.SolrCore@b996d7 url=http://127.0.0.1:59414/solr/collection1 node=127.0.0.1:59414_solr
[junit4:junit4]   2> 13991 T185 C22 P59414 REQ /get {distrib=false&qt=/get&wt=javabin&version=2&getVersions=100} status=0 QTime=3 
[junit4:junit4]   2> ASYNC  NEW_CORE C23 name=collection1 org.apache.solr.core.SolrCore@9310d2 url=http://127.0.0.1:59399/solr/collection1 node=127.0.0.1:59399_solr
[junit4:junit4]   2> 14007 T155 C23 P59399 oascsi.HttpClientUtil.createClient Creating new http client, config:maxConnections=500&maxConnectionsPerHost=16
[junit4:junit4]   2> 14014 T155 C23 P59399 oasc.CachingDirectoryFactory.close Releasing directory:C:\Users\JenkinsSlave\workspace\Lucene-Solr-trunk-Windows\solr\build\solr-core\test\J0\.\org.apache.solr.cloud.BasicDistributedZk2Test-1351302534121\control\data
[junit4:junit4]   2> 14019 T155 C23 P59399 oasc.SolrDeletionPolicy.onInit SolrDeletionPolicy.onInit: commits:num=1
[junit4:junit4]   2> 		commit{dir=NRTCachingDirectory(org.apache.lucene.store.SimpleFSDirectory@C:\Users\JenkinsSlave\workspace\Lucene-Solr-trunk-Windows\solr\build\solr-core\test\J0\org.apache.solr.cloud.BasicDistributedZk2Test-1351302534121\control\data\index lockFactory=org.apache.lucene.store.NativeFSLockFactory@38230; maxCacheMB=48.0 maxMergeSizeMB=4.0),segFN=segments_1,generation=1,filenames=[segments_1]
[junit4:junit4]   2> 14020 T155 C23 P59399 oasc.SolrDeletionPolicy.updateCommits newest commit = 1[segments_1]
[junit4:junit4]   2> 14030 T160 oascc.ZkStateReader.updateClusterState Updating cloud state from ZooKeeper... 
[junit4:junit4]   2> 14034 T160 oasc.Overseer$ClusterStateUpdater.updateState Update state numShards=2 message={
[junit4:junit4]   2> 	  "operation":"state",
[junit4:junit4]   2> 	  "numShards":"2",
[junit4:junit4]   2> 	  "shard":"shard2",
[junit4:junit4]   2> 	  "roles":null,
[junit4:junit4]   2> 	  "state":"recovering",
[junit4:junit4]   2> 	  "core":"collection1",
[junit4:junit4]   2> 	  "collection":"collection1",
[junit4:junit4]   2> 	  "node_name":"127.0.0.1:59428_solr",
[junit4:junit4]   2> 	  "base_url":"http://127.0.0.1:59428/solr"}
[junit4:junit4]   2> 14044 T187 oascc.ZkStateReader$2.process A cluster state change has occurred - updating... (5)
[junit4:junit4]   2> 14044 T213 oascc.ZkStateReader$2.process A cluster state change has occurred - updating... (5)
[junit4:junit4]   2> 14046 T199 oascc.ZkStateReader$2.process A cluster state change has occurred - updating... (5)
[junit4:junit4]   2> 14046 T175 oascc.ZkStateReader$2.process A cluster state change has occurred - updating... (5)
[junit4:junit4]   2> 14046 T159 oascc.ZkStateReader$2.process A cluster state change has occurred - updating... (5)
[junit4:junit4]   2> 14046 T164 oascc.ZkStateReader$2.process A cluster state change has occurred - updating... (5)
[junit4:junit4]   2> 14050 T155 C23 P59399 /update {wt=javabin&version=2} {add=[1 (1416943420709011456)]} 0 55
[junit4:junit4]   2> 14062 T170 C20 P59408 oasc.CachingDirectoryFactory.close Releasing directory:C:\Users\JenkinsSlave\workspace\Lucene-Solr-trunk-Windows\solr\build\solr-core\test\J0\.\org.apache.solr.cloud.BasicDistributedZk2Test-1351302534121\jetty1
[junit4:junit4]   2> 14067 T170 C20 P59408 oasc.SolrDeletionPolicy.onInit SolrDeletionPolicy.onInit: commits:num=1
[junit4:junit4]   2> 		commit{dir=NRTCachingDirectory(org.apache.lucene.store.SimpleFSDirectory@C:\Users\JenkinsSlave\workspace\Lucene-Solr-trunk-Windows\solr\build\solr-core\test\J0\org.apache.solr.cloud.BasicDistributedZk2Test-1351302534121\jetty1\index lockFactory=org.apache.lucene.store.NativeFSLockFactory@17e2544; maxCacheMB=48.0 maxMergeSizeMB=4.0),segFN=segments_1,generation=1,filenames=[segments_1]
[junit4:junit4]   2> 14068 T170 C20 P59408 oasc.SolrDeletionPolicy.updateCommits newest commit = 1[segments_1]
[junit4:junit4]   2>  C19_STATE=coll:collection1 core:collection1 props:{shard=shard1, roles=null, state=recovering, core=collection1, collection=collection1, node_name=127.0.0.1:59420_solr, base_url=http://127.0.0.1:59420/solr}
[junit4:junit4]   2> 14107 T193 C19 P59420 oasc.CachingDirectoryFactory.close Releasing directory:C:\Users\JenkinsSlave\workspace\Lucene-Solr-trunk-Windows\solr\build\solr-core\test\J0\.\org.apache.solr.cloud.BasicDistributedZk2Test-1351302534121\jetty3
[junit4:junit4]   2> 14111 T193 C19 P59420 oasc.SolrDeletionPolicy.onInit SolrDeletionPolicy.onInit: commits:num=1
[junit4:junit4]   2> 		commit{dir=NRTCachingDirectory(org.apache.lucene.store.SimpleFSDirectory@C:\Users\JenkinsSlave\workspace\Lucene-Solr-trunk-Windows\solr\build\solr-core\test\J0\org.apache.solr.cloud.BasicDistributedZk2Test-1351302534121\jetty3\index lockFactory=org.apache.lucene.store.NativeFSLockFactory@192c34b; maxCacheMB=48.0 maxMergeSizeMB=4.0),segFN=segments_1,generation=1,filenames=[segments_1]
[junit4:junit4]   2> 14112 T193 C19 P59420 oasc.SolrDeletionPolicy.updateCommits newest commit = 1[segments_1]
[junit4:junit4]   2> 14116 T193 C19 P59420 REQ /update {distrib.from=http://127.0.0.1:59408/solr/collection1/&update.distrib=FROMLEADER&wt=javabin&version=2} status=0 QTime=12 
[junit4:junit4]   2> 14117 T170 C20 P59408 /update {wt=javabin&version=2} {add=[1 (1416943420759343104)]} 0 62
[junit4:junit4]   2> 14122 T156 C23 P59399 oasu.DirectUpdateHandler2.commit start commit{flags=0,_version_=0,optimize=false,openSearcher=true,waitSearcher=true,expungeDeletes=false,softCommit=false}
[junit4:junit4]   2> 14194 T156 C23 P59399 oasc.SolrDeletionPolicy.onCommit SolrDeletionPolicy.onCommit: commits:num=2
[junit4:junit4]   2> 		commit{dir=NRTCachingDirectory(org.apache.lucene.store.SimpleFSDirectory@C:\Users\JenkinsSlave\workspace\Lucene-Solr-trunk-Windows\solr\build\solr-core\test\J0\org.apache.solr.cloud.BasicDistributedZk2Test-1351302534121\control\data\index lockFactory=org.apache.lucene.store.NativeFSLockFactory@38230; maxCacheMB=48.0 maxMergeSizeMB=4.0),segFN=segments_1,generation=1,filenames=[segments_1]
[junit4:junit4]   2> 		commit{dir=NRTCachingDirectory(org.apache.lucene.store.SimpleFSDirectory@C:\Users\JenkinsSlave\workspace\Lucene-Solr-trunk-Windows\solr\build\solr-core\test\J0\org.apache.solr.cloud.BasicDistributedZk2Test-1351302534121\control\data\index lockFactory=org.apache.lucene.store.NativeFSLockFactory@38230; maxCacheMB=48.0 maxMergeSizeMB=4.0),segFN=segments_2,generation=2,filenames=[_0_Lucene41_0.pos, _0_MockFixedIntBlock_0.tib, _0_NestedPulsing_0.tip, _0_NestedPulsing_0.tim, _0_NestedPulsing_0.pos, _0_MockFixedIntBlock_0.skp, _0_MockFixedIntBlock_0.pyl, _0_MockFixedIntBlock_0.tii, _0.si, _0_Lucene41_0.tim, _0_Lucene41_0.tip, _0_NestedPulsing_0.doc, _0.fnm, _0_MockFixedIntBlock_0.pos, _0_nrm.cfs, _0_MockFixedIntBlock_0.frq, _0_Direct_0.doc, _0_Lucene41_0.doc, _0_MockFixedIntBlock_0.doc, _0_nrm.cfe, segments_2, _0_Direct_0.pos, _0_Direct_0.tip, _0.fdx, _0_Direct_0.tim, _0.fdt]
[junit4:junit4]   2> 14195 T156 C23 P59399 oasc.SolrDeletionPolicy.updateCommits newest commit = 2[_0_Lucene41_0.pos, _0_MockFixedIntBlock_0.tib, _0_NestedPulsing_0.tip, _0_NestedPulsing_0.tim, _0_NestedPulsing_0.pos, _0_MockFixedIntBlock_0.skp, _0_MockFixedIntBlock_0.pyl, _0_MockFixedIntBlock_0.tii, _0.si, _0_Lucene41_0.tim, _0_Lucene41_0.tip, _0_NestedPulsing_0.doc, _0.fnm, _0_MockFixedIntBlock_0.pos, _0_nrm.cfs, _0_MockFixedIntBlock_0.frq, _0_Direct_0.doc, _0_Lucene41_0.doc, _0_MockFixedIntBlock_0.doc, _0_nrm.cfe, segments_2, _0_Direct_0.pos, _0_Direct_0.tip, _0.fdx, _0_Direct_0.tim, _0.fdt]
[junit4:junit4]   2> 14197 T156 C23 P59399 oasc.CachingDirectoryFactory.close Releasing directory:C:\Users\JenkinsSlave\workspace\Lucene-Solr-trunk-Windows\solr\build\solr-core\test\J0\.\org.apache.solr.cloud.BasicDistributedZk2Test-1351302534121\control\data
[junit4:junit4]   2> 14210 T156 C23 P59399 oass.SolrIndexSearcher.<init> Opening Searcher@1f33ecb main
[junit4:junit4]   2> 14211 T156 C23 P59399 oasu.DirectUpdateHandler2.commit end_commit_flush
[junit4:junit4]   2> 14212 T162 oasc.SolrCore.registerSearcher [collection1] Registered new searcher Searcher@1f33ecb main{StandardDirectoryReader(segments_2:3 _0(5.0):C1)}
[junit4:junit4]   2> 14212 T162 oasc.CachingDirectoryFactory.close Releasing directory:C:\Users\JenkinsSlave\workspace\Lucene-Solr-trunk-Windows\solr\build\solr-core\test\J0\.\org.apache.solr.cloud.BasicDistributedZk2Test-1351302534121\control\data\index
[junit4:junit4]   2> 14213 T156 C23 P59399 /update {waitSearcher=true&wt=javabin&commit=true&softCommit=false&version=2} {commit=} 0 91
[junit4:junit4]   2> 14217 T169 C20 P59408 oasu.DirectUpdateHandler2.commit start commit{flags=0,_version_=0,optimize=false,openSearcher=true,waitSearcher=true,expungeDeletes=false,softCommit=false}
[junit4:junit4]   2> 14291 T169 C20 P59408 oasc.SolrDeletionPolicy.onCommit SolrDeletionPolicy.onCommit: commits:num=2
[junit4:junit4]   2> 		commit{dir=NRTCachingDirectory(org.apache.lucene.store.SimpleFSDirectory@C:\Users\JenkinsSlave\workspace\Lucene-Solr-trunk-Windows\solr\build\solr-core\test\J0\org.apache.solr.cloud.BasicDistributedZk2Test-1351302534121\jetty1\index lockFactory=org.apache.lucene.store.NativeFSLockFactory@17e2544; maxCacheMB=48.0 maxMergeSizeMB=4.0),segFN=segments_1,generation=1,filenames=[segments_1]
[junit4:junit4]   2> 		commit{dir=NRTCachingDirectory(org.apache.lucene.store.SimpleFSDirectory@C:\Users\JenkinsSlave\workspace\Lucene-Solr-trunk-Windows\solr\build\solr-core\test\J0\org.apache.solr.cloud.BasicDistributedZk2Test-1351302534121\jetty1\index lockFactory=org.apache.lucene.store.NativeFSLockFactory@17e2544; maxCacheMB=48.0 maxMergeSizeMB=4.0),segFN=segments_2,generation=2,filenames=[_0_Lucene41_0.pos, _0_MockFixedIntBlock_0.tib, _0_NestedPulsing_0.tip, _0_NestedPulsing_0.tim, _0_NestedPulsing_0.pos, _0_MockFixedIntBlock_0.skp, _0_MockFixedIntBlock_0.pyl, _0_MockFixedIntBlock_0.tii, _0.si, _0_Lucene41_0.tim, _0_Lucene41_0.tip, _0_NestedPulsing_0.doc, _0.fnm, _0_MockFixedIntBlock_0.pos, _0_nrm.cfs, _0_MockFixedIntBlock_0.frq, _0_Direct_0.doc, _0_Lucene41_0.doc, _0_MockFixedIntBlock_0.doc, _0_nrm.cfe, segments_2, _0_Direct_0.pos, _0_Direct_0.tip, _0.fdx, _0_Direct_0.tim, _0.fdt]
[junit4:junit4]   2> 14291 T169 C20 P59408 oasc.SolrDeletionPolicy.updateCommits newest commit = 2[_0_Lucene41_0.pos, _0_MockFixedIntBlock_0.tib, _0_NestedPulsing_0.tip, _0_NestedPulsing_0.tim, _0_NestedPulsing_0.pos, _0_MockFixedIntBlock_0.skp, _0_MockFixedIntBlock_0.pyl, _0_MockFixedIntBlock_0.tii, _0.si, _0_Lucene41_0.tim, _0_Lucene41_0.tip, _0_NestedPulsing_0.doc, _0.fnm, _0_MockFixedIntBlock_0.pos, _0_nrm.cfs, _0_MockFixedIntBlock_0.frq, _0_Direct_0.doc, _0_Lucene41_0.doc, _0_MockFixedIntBlock_0.doc, _0_nrm.cfe, segments_2, _0_Direct_0.pos, _0_Direct_0.tip, _0.fdx, _0_Direct_0.tim, _0.fdt]
[junit4:junit4]   2> 14294 T169 C20 P59408 oasc.CachingDirectoryFactory.close Releasing directory:C:\Users\JenkinsSlave\workspace\Lucene-Solr-trunk-Windows\solr\build\solr-core\test\J0\.\org.apache.solr.cloud.BasicDistributedZk2Test-1351302534121\jetty1
[junit4:junit4]   2> 14305 T169 C20 P59408 oass.SolrIndexSearcher.<init> Opening Searcher@13f948e main
[junit4:junit4]   2> 14307 T169 C20 P59408 oasu.DirectUpdateHandler2.commit end_commit_flush
[junit4:junit4]   2> 14308 T176 oasc.SolrCore.registerSearcher [collection1] Registered new searcher Searcher@13f948e main{StandardDirectoryReader(segments_2:3 _0(5.0):C1)}
[junit4:junit4]   2> 14308 T176 oasc.CachingDirectoryFactory.close Releasing directory:C:\Users\JenkinsSlave\workspace\Lucene-Solr-trunk-Windows\solr\build\solr-core\test\J0\.\org.apache.solr.cloud.BasicDistributedZk2Test-1351302534121\jetty1\index
[junit4:junit4]   2> 14308 T169 C20 P59408 oasu.SolrCmdDistributor.distribCommit Distrib commit to:[StdNode: http://127.0.0.1:59420/solr/collection1/, StdNode: http://127.0.0.1:59414/solr/collection1/, StdNode: http://127.0.0.1:59428/solr/collection1/] params:commit_end_point=true&commit=true&softCommit=false&waitSearcher=true&expungeDeletes=false
[junit4:junit4]   2> 14318 T195 C19 P59420 oasu.DirectUpdateHandler2.commit start commit{flags=0,_version_=0,optimize=false,openSearcher=true,waitSearcher=true,expungeDeletes=false,softCommit=false}
[junit4:junit4]   2> 14318 T181 C22 P59414 oasu.DirectUpdateHandler2.commit start commit{flags=0,_version_=0,optimize=false,openSearcher=true,waitSearcher=true,expungeDeletes=false,softCommit=false}
[junit4:junit4]   2> 14320 T181 C22 P59414 oasc.CachingDirectoryFactory.close Releasing directory:C:\Users\JenkinsSlave\workspace\Lucene-Solr-trunk-Windows\solr\build\solr-core\test\J0\.\org.apache.solr.cloud.BasicDistributedZk2Test-1351302534121\jetty2
[junit4:junit4]   2>  C21_STATE=coll:collection1 core:collection1 props:{shard=shard2, roles=null, state=recovering, core=collection1, collection=collection1, node_name=127.0.0.1:59428_solr, base_url=http://127.0.0.1:59428/solr}
[junit4:junit4]   2> 14354 T210 C21 P59428 oasu.DirectUpdateHandler2.commit start commit{flags=0,_version_=0,optimize=false,openSearcher=true,waitSearcher=true,expungeDeletes=false,softCommit=false}
[junit4:junit4]   2> 14356 T210 C21 P59428 oasc.CachingDirectoryFactory.close Releasing directory:C:\Users\JenkinsSlave\workspace\Lucene-Solr-trunk-Windows\solr\build\solr-core\test\J0\.\org.apache.solr.cloud.BasicDistributedZk2Test-1351302534121\jetty4
[junit4:junit4]   2> 14357 T181 C22 P59414 oasc.SolrDeletionPolicy.onInit SolrDeletionPolicy.onInit: commits:num=1
[junit4:junit4]   2> 		commit{dir=NRTCachingDirectory(org.apache.lucene.store.SimpleFSDirectory@C:\Users\JenkinsSlave\workspace\Lucene-Solr-trunk-Windows\solr\build\solr-core\test\J0\org.apache.solr.cloud.BasicDistributedZk2Test-1351302534121\jetty2\index lockFactory=org.apache.lucene.store.NativeFSLockFactory@104ee8; maxCacheMB=48.0 maxMergeSizeMB=4.0),segFN=segments_1,generation=1,filenames=[segments_1]
[junit4:junit4]   2> 14360 T181 C22 P59414 oasc.SolrDeletionPolicy.updateCommits newest commit = 1[segments_1]
[junit4:junit4]   2> 14360 T181 C22 P59414 oasc.CachingDirectoryFactory.close Releasing directory:C:\Users\JenkinsSlave\workspace\Lucene-Solr-trunk-Windows\solr\build\solr-core\test\J0\.\org.apache.solr.cloud.BasicDistributedZk2Test-1351302534121\jetty2
[junit4:junit4]   2> 14361 T210 C21 P59428 oasc.SolrDeletionPolicy.onInit SolrDeletionPolicy.onInit: commits:num=1
[junit4:junit4]   2> 		commit{dir=NRTCachingDirectory(org.apache.lucene.store.SimpleFSDirectory@C:\Users\JenkinsSlave\workspace\Lucene-Solr-trunk-Windows\solr\build\solr-core\test\J0\org.apache.solr.cloud.BasicDistributedZk2Test-1351302534121\jetty4\index lockFactory=org.apache.lucene.store.NativeFSLockFactory@b37b66; maxCacheMB=48.0 maxMergeSizeMB=4.0),segFN=segments_1,generation=1,filenames=[segments_1]
[junit4:junit4]   2> 14362 T210 C21 P59428 oasc.SolrDeletionPolicy.updateCommits newest commit = 1[segments_1]
[junit4:junit4]   2> 14362 T210 C21 P59428 oasc.CachingDirectoryFactory.close Releasing directory:C:\Users\JenkinsSlave\workspace\Lucene-Solr-trunk-Windows\solr\build\solr-core\test\J0\.\org.apache.solr.cloud.BasicDistributedZk2Test-1351302534121\jetty4
[junit4:junit4]   2> 14365 T210 C21 P59428 oass.SolrIndexSearcher.<init> Opening Searcher@377358 main
[junit4:junit4]   2> 14365 T210 C21 P59428 oasu.DirectUpdateHandler2.commit end_commit_flush
[junit4:junit4]   2> 14366 T181 C22 P59414 oass.SolrIndexSearcher.<init> Opening Searcher@8e4a47 main
[junit4:junit4]   2> 14366 T181 C22 P59414 oasu.DirectUpdateHandler2.commit end_commit_flush
[junit4:junit4]   2> 14366 T214 oasc.SolrCore.registerSearcher [collection1] Registered new searcher Searcher@377358 main{StandardDirectoryReader(segments_1:1)}
[junit4:junit4]   2> 14367 T214 oasc.CachingDirectoryFactory.close Releasing directory:C:\Users\JenkinsSlave\workspace\Lucene-Solr-trunk-Windows\solr\build\solr-core\test\J0\.\org.apache.solr.cloud.BasicDistributedZk2Test-1351302534121\jetty4\index
[junit4:junit4]   2> 14367 T210 C21 P59428 /update {waitSearcher=true&commit=true&commit_end_point=true&expungeDeletes=false&wt=javabin&softCommit=false&version=2} {commit=} 0 13
[junit4:junit4]   2> 14370 T188 oasc.SolrCore.registerSearcher [collection1] Registered new searcher Searcher@8e4a47 main{StandardDirectoryReader(segments_1:1)}
[junit4:junit4]   2> 14370 T188 oasc.CachingDirectoryFactory.close Releasing directory:C:\Users\JenkinsSlave\workspace\Lucene-Solr-trunk-Windows\solr\build\solr-core\test\J0\.\org.apache.solr.cloud.BasicDistributedZk2Test-1351302534121\jetty2\index
[junit4:junit4]   2> 14374 T181 C22 P59414 /update {waitSearcher=true&commit=true&commit_end_point=true&expungeDeletes=false&wt=javabin&softCommit=false&version=2} {commit=} 0 56
[junit4:junit4]   2> 14422 T195 C19 P59420 oasc.SolrDeletionPolicy.onCommit SolrDeletionPolicy.onCommit: commits:num=2
[junit4:junit4]   2> 		commit{dir=NRTCachingDirectory(org.apache.lucene.store.SimpleFSDirectory@C:\Users\JenkinsSlave\workspace\Lucene-Solr-trunk-Windows\solr\build\solr-core\test\J0\org.apache.solr.cloud.BasicDistributedZk2Test-1351302534121\jetty3\index lockFactory=org.apache.lucene.store.NativeFSLockFactory@192c34b; maxCacheMB=48.0 maxMergeSizeMB=4.0),segFN=segments_1,generation=1,filenames=[segments_1]
[junit4:junit4]   2> 		commit{dir=NRTCachingDirectory(org.apache.lucene.store.SimpleFSDirectory@C:\Users\JenkinsSlave\workspace\Lucene-Solr-trunk-Windows\solr\build\solr-core\test\J0\org.apache.solr.cloud.BasicDistributedZk2Test-1351302534121\jetty3\index lockFactory=org.apache.lucene.store.NativeFSLockFactory@192c34b; maxCacheMB=48.0 maxMergeSizeMB=4.0),segFN=segments_2,generation=2,filenames=[_0_Lucene41_0.pos, _0_MockFixedIntBlock_0.tib, _0_NestedPulsing_0.tip, _0_NestedPulsing_0.tim, _0_NestedPulsing_0.pos, _0_MockFixedIntBlock_0.skp, _0_MockFixedIntBlock_0.pyl, _0_MockFixedIntBlock_0.tii, _0.si, _0_Lucene41_0.tim, _0_Lucene41_0.tip, _0_NestedPulsing_0.doc, _0.fnm, _0_MockFixedIntBlock_0.pos, _0_nrm.cfs, _0_MockFixedIntBlock_0.frq, _0_Direct_0.doc, _0_Lucene41_0.doc, _0_MockFixedIntBlock_0.doc, _0_nrm.cfe, segments_2, _0_Direct_0.pos, _0_Direct_0.tip, _0.fdx, _0_Direct_0.tim, _0.fdt]
[junit4:junit4]   2> 14422 T195 C19 P59420 oasc.SolrDeletionPolicy.updateCommits newest commit = 2[_0_Lucene41_0.pos, _0_MockFixedIntBlock_0.tib, _0_NestedPulsing_0.tip, _0_NestedPulsing_0.tim, _0_NestedPulsing_0.pos, _0_MockFixedIntBlock_0.skp, _0_MockFixedIntBlock_0.pyl, _0_MockFixedIntBlock_0.tii, _0.si, _0_Lucene41_0.tim, _0_Lucene41_0.tip, _0_NestedPulsing_0.doc, _0.fnm, _0_MockFixedIntBlock_0.pos, _0_nrm.cfs, _0_MockFixedIntBlock_0.frq, _0_Direct_0.doc, _0_Lucene41_0.doc, _0_MockFixedIntBlock_0.doc, _0_nrm.cfe, segments_2, _0_Direct_0.pos, _0_Direct_0.tip, _0.fdx, _0_Direct_0.tim, _0.fdt]
[junit4:junit4]   2> 14425 T195 C19 P59420 oasc.CachingDirectoryFactory.close Releasing directory:C:\Users\JenkinsSlave\workspace\Lucene-Solr-trunk-Windows\solr\build\solr-core\test\J0\.\org.apache.solr.cloud.BasicDistributedZk2Test-1351302534121\jetty3
[junit4:junit4]   2> 14437 T195 C19 P59420 oass.SolrIndexSearcher.<init> Opening Searcher@7308ce main
[junit4:junit4]   2> 14438 T195 C19 P59420 oasu.DirectUpdateHandler2.commit end_commit_flush
[junit4:junit4]   2> 14440 T200 oasc.SolrCore.registerSearcher [collection1] Registered new searcher Searcher@7308ce main{StandardDirectoryReader(segments_2:3 _0(5.0):C1)}
[junit4:junit4]   2> 14440 T200 oasc.CachingDirectoryFactory.close Releasing directory:C:\Users\JenkinsSlave\workspace\Lucene-Solr-trunk-Windows\solr\build\solr-core\test\J0\.\org.apache.solr.cloud.BasicDistributedZk2Test-1351302534121\jetty3\index
[junit4:junit4]   2> 14441 T195 C19 P59420 /update {waitSearcher=true&commit=true&commit_end_point=true&expungeDeletes=false&wt=javabin&softCommit=false&version=2} {commit=} 0 123
[junit4:junit4]   2> 14442 T169 C20 P59408 /update {waitSearcher=true&wt=javabin&commit=true&softCommit=false&version=2} {commit=} 0 225
[junit4:junit4]   2> 14442 T139 oasc.AbstractDistribZkTestBase.waitForRecoveriesToFinish Wait for recoveries to finish - collection: collection1 failOnTimeout:true timeout (sec):600
[junit4:junit4]   2> 14444 T139 oascc.ZkStateReader.updateClusterState Updating cloud state from ZooKeeper... 
[junit4:junit4]   2> 15191 T201 C19 P59420 oasc.RecoveryStrategy.doRecovery Begin buffering updates. core=collection1
[junit4:junit4]   2> 15191 T201 C19 P59420 oasu.UpdateLog.bufferUpdates Starting to buffer updates. FSUpdateLog{state=ACTIVE, tlog=null}
[junit4:junit4]   2> 15191 T201 C19 P59420 oasc.RecoveryStrategy.replicate Attempting to replicate from http://127.0.0.1:59408/solr/collection1/. core=collection1
[junit4:junit4]   2> 15191 T201 C19 P59420 oascsi.HttpClientUtil.createClient Creating new http client, config:maxConnections=128&maxConnectionsPerHost=32&followRedirects=false
[junit4:junit4]   2> 15209 T168 C20 P59408 oasu.DirectUpdateHandler2.commit start commit{flags=0,_version_=0,optimize=false,openSearcher=false,waitSearcher=true,expungeDeletes=false,softCommit=false}
[junit4:junit4]   2> 15210 T168 C20 P59408 oasc.CachingDirectoryFactory.close Releasing directory:C:\Users\JenkinsSlave\workspace\Lucene-Solr-trunk-Windows\solr\build\solr-core\test\J0\.\org.apache.solr.cloud.BasicDistributedZk2Test-1351302534121\jetty1
[junit4:junit4]   2> 15216 T168 C20 P59408 oass.SolrIndexSearcher.<init> Opening Searcher@19acd13 realtime
[junit4:junit4]   2> 15216 T168 C20 P59408 oasu.DirectUpdateHandler2.commit end_commit_flush
[junit4:junit4]   2> 15216 T168 C20 P59408 /update {waitSearcher

[...truncated too long message...]

t org.apache.lucene.util.TestRuleMarkFailure$1.evaluate(TestRuleMarkFailure.java:48)
[junit4:junit4]    > 	at com.carrotsearch.randomizedtesting.rules.StatementAdapter.evaluate(StatementAdapter.java:36)
[junit4:junit4]    > 	at com.carrotsearch.randomizedtesting.ThreadLeakControl$StatementRunner.run(ThreadLeakControl.java:358)
[junit4:junit4]    > 	at com.carrotsearch.randomizedtesting.ThreadLeakControl.forkTimeoutingTask(ThreadLeakControl.java:782)
[junit4:junit4]    > 	at com.carrotsearch.randomizedtesting.ThreadLeakControl$3.evaluate(ThreadLeakControl.java:442)
[junit4:junit4]    > 	at com.carrotsearch.randomizedtesting.RandomizedRunner.runSingleTest(RandomizedRunner.java:746)
[junit4:junit4]    > 	at com.carrotsearch.randomizedtesting.RandomizedRunner$3.evaluate(RandomizedRunner.java:648)
[junit4:junit4]    > 	at com.carrotsearch.randomizedtesting.RandomizedRunner$4.evaluate(RandomizedRunner.java:682)
[junit4:junit4]    > 	at com.carrotsearch.randomizedtesting.RandomizedRunner$5.evaluate(RandomizedRunner.java:693)
[junit4:junit4]    > 	at com.carrotsearch.randomizedtesting.rules.StatementAdapter.evaluate(StatementAdapter.java:36)
[junit4:junit4]    > 	at com.carrotsearch.randomizedtesting.rules.SystemPropertiesRestoreRule$1.evaluate(SystemPropertiesRestoreRule.java:53)
[junit4:junit4]    > 	at org.apache.lucene.util.AbstractBeforeAfterRule$1.evaluate(AbstractBeforeAfterRule.java:45)
[junit4:junit4]    > 	at org.apache.lucene.util.TestRuleStoreClassName$1.evaluate(TestRuleStoreClassName.java:42)
[junit4:junit4]    > 	at com.carrotsearch.randomizedtesting.rules.SystemPropertiesInvariantRule$1.evaluate(SystemPropertiesInvariantRule.java:55)
[junit4:junit4]    > 	at com.carrotsearch.randomizedtesting.rules.NoShadowingOrOverridesOnMethodsRule$1.evaluate(NoShadowingOrOverridesOnMethodsRule.java:39)
[junit4:junit4]    > 	at com.carrotsearch.randomizedtesting.rules.NoShadowingOrOverridesOnMethodsRule$1.evaluate(NoShadowingOrOverridesOnMethodsRule.java:39)
[junit4:junit4]    > 	at com.carrotsearch.randomizedtesting.rules.StatementAdapter.evaluate(StatementAdapter.java:36)
[junit4:junit4]    > 	at org.apache.lucene.util.TestRuleAssertionsRequired$1.evaluate(TestRuleAssertionsRequired.java:43)
[junit4:junit4]    > 	at org.apache.lucene.util.TestRuleMarkFailure$1.evaluate(TestRuleMarkFailure.java:48)
[junit4:junit4]    > 	at org.apache.lucene.util.TestRuleIgnoreAfterMaxFailures$1.evaluate(TestRuleIgnoreAfterMaxFailures.java:70)
[junit4:junit4]    > 	at org.apache.lucene.util.TestRuleIgnoreTestSuites$1.evaluate(TestRuleIgnoreTestSuites.java:55)
[junit4:junit4]    > 	at com.carrotsearch.randomizedtesting.rules.StatementAdapter.evaluate(StatementAdapter.java:36)
[junit4:junit4]    > 	at com.carrotsearch.randomizedtesting.ThreadLeakControl$StatementRunner.run(ThreadLeakControl.java:358)
[junit4:junit4]    > 	at java.lang.Thread.run(Thread.java:662)
[junit4:junit4]   2> 35531 T3645 oas.SolrTestCaseJ4.deleteCore ###deleteCore
[junit4:junit4]   2> NOTE: test params are: codec=Lucene41: {range_facet_l=Pulsing41(freqCutoff=19 minBlockSize=9 maxBlockSize=66), text=PostingsFormat(name=TestBloomFilteredLucene41Postings), _version_=Pulsing41(freqCutoff=19 minBlockSize=9 maxBlockSize=66), rnd_b=PostingsFormat(name=Asserting), intDefault=Pulsing41(freqCutoff=19 minBlockSize=9 maxBlockSize=66), id=PostingsFormat(name=Asserting), timestamp=Pulsing41(freqCutoff=19 minBlockSize=9 maxBlockSize=66), a_t=Pulsing41(freqCutoff=19 minBlockSize=9 maxBlockSize=66), range_facet_sl=PostingsFormat(name=TestBloomFilteredLucene41Postings), range_facet_si=PostingsFormat(name=NestedPulsing), other_tl1=Pulsing41(freqCutoff=19 minBlockSize=9 maxBlockSize=66), multiDefault=PostingsFormat(name=NestedPulsing), a_si=PostingsFormat(name=NestedPulsing)}, sim=DefaultSimilarity, locale=es_PR, timezone=Etc/GMT-9
[junit4:junit4]   2> NOTE: Windows 7 6.1 x86/Sun Microsystems Inc. 1.6.0_35 (32-bit)/cpus=2,threads=1,free=130423896,total=289144832
[junit4:junit4]   2> NOTE: All tests run in this JVM: [PolyFieldTest, OutputWriterTest, AlternateDirectoryTest, ResourceLoaderTest, ScriptEngineTest, DistributedQueryElevationComponentTest, TestGroupingSearch, NumericFieldsTest, TestCollationField, TestReversedWildcardFilterFactory, TestElisionMultitermQuery, TestQuerySenderNoQuery, TermVectorComponentTest, SolrIndexConfigTest, TestSolrDeletionPolicy2, TestPropInjectDefaults, SortByFunctionTest, IndexBasedSpellCheckerTest, TestCodecSupport, SignatureUpdateProcessorFactoryTest, RequiredFieldsTest, BasicDistributedZk2Test, TestQueryTypes, TestStressReorder, TestIndexingPerformance, TestFiltering, SolrInfoMBeanTest, DebugComponentTest, DOMUtilTest, FieldAnalysisRequestHandlerTest, TestFaceting, MBeansHandlerTest, IndexSchemaTest, FileUtilsTest, ClusterStateUpdateTest, LukeRequestHandlerTest, TestSolrJ, TestDistributedSearch, TestDefaultSimilarityFactory, ResponseLogComponentTest, TestSystemIdResolver, UUIDFieldTest, TestCoreContainer, TermVectorComponentDistributedTest, StatelessScriptUpdateProcessorFactoryTest, NoCacheHeaderTest, TermsComponentTest, TestIndexSearcher, TestLMJelinekMercerSimilarityFactory, SoftAutoCommitTest, FullSolrCloudDistribCmdsTest, ReturnFieldsTest, SampleTest, QueryElevationComponentTest, DirectUpdateHandlerOptimizeTest, TestOmitPositions, JsonLoaderTest, UpdateRequestProcessorFactoryTest, TestSolrIndexConfig, TestSolrCoreProperties, QueryEqualityTest, CSVRequestHandlerTest, TestSolrXMLSerializer, SuggesterTSTTest, DistributedSpellCheckComponentTest, PreAnalyzedFieldTest, MultiTermTest, TestReload, TestArbitraryIndexDir, FileBasedSpellCheckerTest, TestCharFilters, SuggesterFSTTest, TestBM25SimilarityFactory, TestSolr4Spatial, FastVectorHighlighterTest, TestPseudoReturnFields, SpatialFilterTest, DateMathParserTest, TestWordDelimiterFilterFactory, TestPropInject, SpellCheckComponentTest, TestRecovery, BasicZkTest, TestFastOutputStream, HighlighterConfigTest, DocumentAnalysisRequestHandlerTest, UpdateParamsTest, TestDocumentBuilder, NotRequiredUniqueKeyTest, WordBreakSolrSpellCheckerTest, CurrencyFieldTest, TestFoldingMultitermQuery, TestMultiCoreConfBootstrap, TestMergePolicyConfig, PathHierarchyTokenizerFactoryTest, TestNumberUtils, TestStressLucene, TestBinaryResponseWriter, ShowFileRequestHandlerTest, SpellingQueryConverterTest, TestFastLRUCache, TestReplicationHandler, TestJmxMonitoredMap, TestAnalyzedSuggestions, SuggesterWFSTTest, TestUpdate, SolrPluginUtilsTest, BasicDistributedZkTest, OverseerTest, RecoveryZkTest, LeaderElectionIntegrationTest, LeaderElectionTest, TestRealTimeGet, ZkControllerTest, TestDistributedGrouping, TestRandomFaceting, SpellCheckCollatorTest, TestExtendedDismaxParser, AutoCommitTest, ZkSolrClientTest, TestHashPartitioner, DistributedTermsComponentTest, StatsComponentTest, TestJoin, SolrCoreTest, TestRangeQuery, DirectUpdateHandlerTest, SimpleFacetsTest, TestSort, DirectSolrSpellCheckerTest, ConvertedLegacyTest, PeerSyncTest, BasicFunctionalityTest, TestJmxIntegration, HighlighterTest, CoreAdminHandlerTest, TestFunctionQuery, TestTrie, SolrRequestParserTest, DirectSolrConnectionTest, TestRemoteStreaming, CacheHeaderTest, TestCSVLoader, TestCSVResponseWriter, MoreLikeThisHandlerTest, DocumentBuilderTest, DisMaxRequestHandlerTest, BinaryUpdateRequestHandlerTest, QueryParsingTest, DistanceFunctionTest, XsltUpdateRequestHandlerTest, MinimalSchemaTest, StandardRequestHandlerTest, TestPHPSerializedResponseWriter, XmlUpdateRequestHandlerTest, PingRequestHandlerTest, TestSurroundQueryParser, IndexSchemaRuntimeFieldTest, TestSolrQueryParser, TestValueSourceCache, JSONWriterTest, RequestHandlersTest, SearchHandlerTest, CopyFieldTest, TestQueryUtils, LoggingHandlerTest, SolrCmdDistributorTest, UniqFieldsUpdateProcessorFactoryTest, SuggesterTest, TestSearchPerf, BadIndexSchemaTest, SolrCoreCheckLockOnStartupTest, TestSolrDeletionPolicy1, TestLuceneMatchVersion, TestWriterPerf, PrimitiveFieldTypeTest, FieldMutatingUpdateProcessorTest, BadComponentTest, TestBinaryField, SOLR749Test, DefaultValueUpdateProcessorTest, TestXIncludeConfig, TestDocSet, TestLFUCache, TestQuerySenderListener, IndexReaderFactoryTest, TestConfig, EchoParamsTest, SpellPossibilityIteratorTest, TestPhraseSuggestions, TestLMDirichletSimilarityFactory, TestPerFieldSimilarity, TestPluginEnable, LegacyHTMLStripCharFilterTest, TestDFRSimilarityFactory, TestIBSimilarityFactory, TimeZoneUtilsTest, URLClassifyProcessorTest, PluginInfoTest, PrimUtilsTest, OpenExchangeRatesOrgProviderTest, DateFieldTest, TestSuggestSpellingConverter, TestBadConfig, TestLRUCache, RAMDirectoryFactoryTest, SystemInfoHandlerTest, TestUtils, ZkNodePropsTest, CircularListTest, AnalysisAfterCoreReloadTest, ClusterStateTest, SyncSliceTest]
[junit4:junit4] Completed in 35.56s, 1 test, 1 failure <<< FAILURES!

[...truncated 34 lines...]
BUILD FAILED
C:\Users\JenkinsSlave\workspace\Lucene-Solr-trunk-Windows\build.xml:335: The following error occurred while executing this line:
C:\Users\JenkinsSlave\workspace\Lucene-Solr-trunk-Windows\build.xml:39: The following error occurred while executing this line:
C:\Users\JenkinsSlave\workspace\Lucene-Solr-trunk-Windows\solr\build.xml:178: The following error occurred while executing this line:
C:\Users\JenkinsSlave\workspace\Lucene-Solr-trunk-Windows\lucene\module-build.xml:61: The following error occurred while executing this line:
C:\Users\JenkinsSlave\workspace\Lucene-Solr-trunk-Windows\lucene\common-build.xml:1159: The following error occurred while executing this line:
C:\Users\JenkinsSlave\workspace\Lucene-Solr-trunk-Windows\lucene\common-build.xml:827: There were test failures: 232 suites, 961 tests, 2 suite-level errors, 2 failures, 12 ignored (7 assumptions)

Total time: 36 minutes 36 seconds
Build step 'Invoke Ant' marked build as failure
Archiving artifacts
Recording test results
Description set: Java: 32bit/jdk1.6.0_35 -client -XX:+UseParallelGC
Email was triggered for: Failure
Sending email for trigger: Failure



Mime
View raw message