lucene-dev mailing list archives

Site index · List index
Message view « Date » · « Thread »
Top « Date » · « Thread »
From Apache Jenkins Server <jenk...@builds.apache.org>
Subject [JENKINS] Lucene-Solr-NightlyTests-4.x - Build # 81 - Still Failing
Date Wed, 31 Oct 2012 23:30:11 GMT
Build: https://builds.apache.org/job/Lucene-Solr-NightlyTests-4.x/81/

1 tests failed.
FAILED:  org.apache.lucene.codecs.compressing.TestCompressingStoredFieldsFormat.testBigDocuments

Error Message:
Java heap space

Stack Trace:
java.lang.OutOfMemoryError: Java heap space
	at java.util.Arrays.copyOf(Arrays.java:2746)
	at java.util.ArrayList.ensureCapacity(ArrayList.java:187)
	at java.util.ArrayList.add(ArrayList.java:378)
	at org.apache.lucene.document.Document.add(Document.java:64)
	at org.apache.lucene.document.DocumentStoredFieldVisitor.binaryField(DocumentStoredFieldVisitor.java:61)
	at org.apache.lucene.codecs.compressing.CompressingStoredFieldsReader.readField(CompressingStoredFieldsReader.java:140)
	at org.apache.lucene.codecs.compressing.CompressingStoredFieldsReader.visitDocument(CompressingStoredFieldsReader.java:226)
	at org.apache.lucene.index.SegmentReader.document(SegmentReader.java:142)
	at org.apache.lucene.index.BaseCompositeReader.document(BaseCompositeReader.java:116)
	at org.apache.lucene.index.IndexReader.document(IndexReader.java:436)
	at org.apache.lucene.codecs.compressing.TestCompressingStoredFieldsFormat.testBigDocuments(TestCompressingStoredFieldsFormat.java:343)
	at sun.reflect.NativeMethodAccessorImpl.invoke0(Native Method)
	at sun.reflect.NativeMethodAccessorImpl.invoke(NativeMethodAccessorImpl.java:57)
	at sun.reflect.DelegatingMethodAccessorImpl.invoke(DelegatingMethodAccessorImpl.java:43)
	at java.lang.reflect.Method.invoke(Method.java:616)
	at com.carrotsearch.randomizedtesting.RandomizedRunner.invoke(RandomizedRunner.java:1559)
	at com.carrotsearch.randomizedtesting.RandomizedRunner.access$600(RandomizedRunner.java:79)
	at com.carrotsearch.randomizedtesting.RandomizedRunner$6.evaluate(RandomizedRunner.java:737)
	at com.carrotsearch.randomizedtesting.RandomizedRunner$7.evaluate(RandomizedRunner.java:773)
	at com.carrotsearch.randomizedtesting.RandomizedRunner$8.evaluate(RandomizedRunner.java:787)
	at org.apache.lucene.util.TestRuleSetupTeardownChained$1.evaluate(TestRuleSetupTeardownChained.java:50)
	at org.apache.lucene.util.TestRuleFieldCacheSanity$1.evaluate(TestRuleFieldCacheSanity.java:51)
	at org.apache.lucene.util.AbstractBeforeAfterRule$1.evaluate(AbstractBeforeAfterRule.java:45)
	at com.carrotsearch.randomizedtesting.rules.SystemPropertiesInvariantRule$1.evaluate(SystemPropertiesInvariantRule.java:55)
	at org.apache.lucene.util.TestRuleThreadAndTestName$1.evaluate(TestRuleThreadAndTestName.java:48)
	at org.apache.lucene.util.TestRuleIgnoreAfterMaxFailures$1.evaluate(TestRuleIgnoreAfterMaxFailures.java:70)
	at org.apache.lucene.util.TestRuleMarkFailure$1.evaluate(TestRuleMarkFailure.java:48)
	at com.carrotsearch.randomizedtesting.rules.StatementAdapter.evaluate(StatementAdapter.java:36)
	at com.carrotsearch.randomizedtesting.ThreadLeakControl$StatementRunner.run(ThreadLeakControl.java:358)
	at com.carrotsearch.randomizedtesting.ThreadLeakControl.forkTimeoutingTask(ThreadLeakControl.java:782)
	at com.carrotsearch.randomizedtesting.ThreadLeakControl$3.evaluate(ThreadLeakControl.java:442)
	at com.carrotsearch.randomizedtesting.RandomizedRunner.runSingleTest(RandomizedRunner.java:746)




Build Log:
[...truncated 5479 lines...]
[junit4:junit4] Suite: org.apache.lucene.codecs.compressing.TestCompressingStoredFieldsFormat
[junit4:junit4]   2> NOTE: download the large Jenkins line-docs file by running 'ant get-jenkins-line-docs'
in the lucene directory.
[junit4:junit4]   2> NOTE: reproduce with: ant test  -Dtestcase=TestCompressingStoredFieldsFormat
-Dtests.method=testBigDocuments -Dtests.seed=37812FE503010D20 -Dtests.multiplier=3 -Dtests.nightly=true
-Dtests.slow=true -Dtests.linedocsfile=/home/hudson/lucene-data/enwiki.random.lines.txt -Dtests.locale=es_PR
-Dtests.timezone=America/Sitka -Dtests.file.encoding=ISO8859-1
[junit4:junit4] ERROR   52.5s J1 | TestCompressingStoredFieldsFormat.testBigDocuments <<<
[junit4:junit4]    > Throwable #1: java.lang.OutOfMemoryError: Java heap space
[junit4:junit4]    > 	at java.util.Arrays.copyOf(Arrays.java:2746)
[junit4:junit4]    > 	at java.util.ArrayList.ensureCapacity(ArrayList.java:187)
[junit4:junit4]    > 	at java.util.ArrayList.add(ArrayList.java:378)
[junit4:junit4]    > 	at org.apache.lucene.document.Document.add(Document.java:64)
[junit4:junit4]    > 	at org.apache.lucene.document.DocumentStoredFieldVisitor.binaryField(DocumentStoredFieldVisitor.java:61)
[junit4:junit4]    > 	at org.apache.lucene.codecs.compressing.CompressingStoredFieldsReader.readField(CompressingStoredFieldsReader.java:140)
[junit4:junit4]    > 	at org.apache.lucene.codecs.compressing.CompressingStoredFieldsReader.visitDocument(CompressingStoredFieldsReader.java:226)
[junit4:junit4]    > 	at org.apache.lucene.index.SegmentReader.document(SegmentReader.java:142)
[junit4:junit4]    > 	at org.apache.lucene.index.BaseCompositeReader.document(BaseCompositeReader.java:116)
[junit4:junit4]    > 	at org.apache.lucene.index.IndexReader.document(IndexReader.java:436)
[junit4:junit4]    > 	at org.apache.lucene.codecs.compressing.TestCompressingStoredFieldsFormat.testBigDocuments(TestCompressingStoredFieldsFormat.java:343)
[junit4:junit4]    > 	at sun.reflect.NativeMethodAccessorImpl.invoke0(Native Method)
[junit4:junit4]    > 	at sun.reflect.NativeMethodAccessorImpl.invoke(NativeMethodAccessorImpl.java:57)
[junit4:junit4]    > 	at sun.reflect.DelegatingMethodAccessorImpl.invoke(DelegatingMethodAccessorImpl.java:43)
[junit4:junit4]    > 	at java.lang.reflect.Method.invoke(Method.java:616)
[junit4:junit4]    > 	at com.carrotsearch.randomizedtesting.RandomizedRunner.invoke(RandomizedRunner.java:1559)
[junit4:junit4]    > 	at com.carrotsearch.randomizedtesting.RandomizedRunner.access$600(RandomizedRunner.java:79)
[junit4:junit4]    > 	at com.carrotsearch.randomizedtesting.RandomizedRunner$6.evaluate(RandomizedRunner.java:737)
[junit4:junit4]    > 	at com.carrotsearch.randomizedtesting.RandomizedRunner$7.evaluate(RandomizedRunner.java:773)
[junit4:junit4]    > 	at com.carrotsearch.randomizedtesting.RandomizedRunner$8.evaluate(RandomizedRunner.java:787)
[junit4:junit4]    > 	at org.apache.lucene.util.TestRuleSetupTeardownChained$1.evaluate(TestRuleSetupTeardownChained.java:50)
[junit4:junit4]    > 	at org.apache.lucene.util.TestRuleFieldCacheSanity$1.evaluate(TestRuleFieldCacheSanity.java:51)
[junit4:junit4]    > 	at org.apache.lucene.util.AbstractBeforeAfterRule$1.evaluate(AbstractBeforeAfterRule.java:45)
[junit4:junit4]    > 	at com.carrotsearch.randomizedtesting.rules.SystemPropertiesInvariantRule$1.evaluate(SystemPropertiesInvariantRule.java:55)
[junit4:junit4]    > 	at org.apache.lucene.util.TestRuleThreadAndTestName$1.evaluate(TestRuleThreadAndTestName.java:48)
[junit4:junit4]    > 	at org.apache.lucene.util.TestRuleIgnoreAfterMaxFailures$1.evaluate(TestRuleIgnoreAfterMaxFailures.java:70)
[junit4:junit4]    > 	at org.apache.lucene.util.TestRuleMarkFailure$1.evaluate(TestRuleMarkFailure.java:48)
[junit4:junit4]    > 	at com.carrotsearch.randomizedtesting.rules.StatementAdapter.evaluate(StatementAdapter.java:36)
[junit4:junit4]    > 	at com.carrotsearch.randomizedtesting.ThreadLeakControl$StatementRunner.run(ThreadLeakControl.java:358)
[junit4:junit4]    > 	at com.carrotsearch.randomizedtesting.ThreadLeakControl.forkTimeoutingTask(ThreadLeakControl.java:782)
[junit4:junit4]    > 	at com.carrotsearch.randomizedtesting.ThreadLeakControl$3.evaluate(ThreadLeakControl.java:442)
[junit4:junit4]    > 	at com.carrotsearch.randomizedtesting.RandomizedRunner.runSingleTest(RandomizedRunner.java:746)
[junit4:junit4]    > Throwable #2: java.lang.RuntimeException: MockDirectoryWrapper: cannot
close: there are still open files: {_1_Lucene41_0.doc=1, _2_Lucene41_0.tim=1, _1_Lucene41_0.tim=1,
_2.fdt=1, _0_dv.cfs=16, _2_Lucene41_0.doc=1, _2.fdx=1, _2_dv.cfs=13, _1.fdx=1, _0_Lucene41_0.doc=1,
_1.fdt=1, _1_dv.cfs=18, _0.fdx=1, _0_Lucene41_0.tim=1, _0.fdt=1}
[junit4:junit4]    > 	at org.apache.lucene.store.MockDirectoryWrapper.close(MockDirectoryWrapper.java:590)
[junit4:junit4]    > 	at org.apache.lucene.util.IOUtils.close(IOUtils.java:146)
[junit4:junit4]    > 	at org.apache.lucene.codecs.compressing.TestCompressingStoredFieldsFormat.tearDown(TestCompressingStoredFieldsFormat.java:76)
[junit4:junit4]    > 	at sun.reflect.GeneratedMethodAccessor4.invoke(Unknown Source)
[junit4:junit4]    > 	at sun.reflect.DelegatingMethodAccessorImpl.invoke(DelegatingMethodAccessorImpl.java:43)
[junit4:junit4]    > 	at java.lang.reflect.Method.invoke(Method.java:616)
[junit4:junit4]    > 	at com.carrotsearch.randomizedtesting.RandomizedRunner.invoke(RandomizedRunner.java:1559)
[junit4:junit4]    > 	at com.carrotsearch.randomizedtesting.RandomizedRunner.access$600(RandomizedRunner.java:79)
[junit4:junit4]    > 	at com.carrotsearch.randomizedtesting.RandomizedRunner$8.evaluate(RandomizedRunner.java:795)
[junit4:junit4]    > 	at org.apache.lucene.util.TestRuleSetupTeardownChained$1.evaluate(TestRuleSetupTeardownChained.java:50)
[junit4:junit4]    > 	at org.apache.lucene.util.TestRuleFieldCacheSanity$1.evaluate(TestRuleFieldCacheSanity.java:51)
[junit4:junit4]    > 	at org.apache.lucene.util.AbstractBeforeAfterRule$1.evaluate(AbstractBeforeAfterRule.java:45)
[junit4:junit4]    > 	at com.carrotsearch.randomizedtesting.rules.SystemPropertiesInvariantRule$1.evaluate(SystemPropertiesInvariantRule.java:55)
[junit4:junit4]    > 	at org.apache.lucene.util.TestRuleThreadAndTestName$1.evaluate(TestRuleThreadAndTestName.java:48)
[junit4:junit4]    > 	at org.apache.lucene.util.TestRuleIgnoreAfterMaxFailures$1.evaluate(TestRuleIgnoreAfterMaxFailures.java:70)
[junit4:junit4]    > 	at org.apache.lucene.util.TestRuleMarkFailure$1.evaluate(TestRuleMarkFailure.java:48)
[junit4:junit4]    > 	at com.carrotsearch.randomizedtesting.rules.StatementAdapter.evaluate(StatementAdapter.java:36)
[junit4:junit4]    > 	at com.carrotsearch.randomizedtesting.ThreadLeakControl$StatementRunner.run(ThreadLeakControl.java:358)
[junit4:junit4]    > 	at com.carrotsearch.randomizedtesting.ThreadLeakControl.forkTimeoutingTask(ThreadLeakControl.java:782)
[junit4:junit4]    > 	at com.carrotsearch.randomizedtesting.ThreadLeakControl$3.evaluate(ThreadLeakControl.java:442)
[junit4:junit4]    > 	at com.carrotsearch.randomizedtesting.RandomizedRunner.runSingleTest(RandomizedRunner.java:746)
[junit4:junit4]    > 	at com.carrotsearch.randomizedtesting.RandomizedRunner$3.evaluate(RandomizedRunner.java:648)
[junit4:junit4]    > 	at com.carrotsearch.randomizedtesting.RandomizedRunner$4.evaluate(RandomizedRunner.java:682)
[junit4:junit4]    > 	at com.carrotsearch.randomizedtesting.RandomizedRunner$5.evaluate(RandomizedRunner.java:693)
[junit4:junit4]    > 	at org.apache.lucene.util.AbstractBeforeAfterRule$1.evaluate(AbstractBeforeAfterRule.java:45)
[junit4:junit4]    > 	at org.apache.lucene.util.TestRuleStoreClassName$1.evaluate(TestRuleStoreClassName.java:42)
[junit4:junit4]    > 	at com.carrotsearch.randomizedtesting.rules.SystemPropertiesInvariantRule$1.evaluate(SystemPropertiesInvariantRule.java:55)
[junit4:junit4]    > 	at com.carrotsearch.randomizedtesting.rules.NoShadowingOrOverridesOnMethodsRule$1.evaluate(NoShadowingOrOverridesOnMethodsRule.java:39)
[junit4:junit4]    > 	at com.carrotsearch.randomizedtesting.rules.NoShadowingOrOverridesOnMethodsRule$1.evaluate(NoShadowingOrOverridesOnMethodsRule.java:39)
[junit4:junit4]    > 	at com.carrotsearch.randomizedtesting.rules.StatementAdapter.evaluate(StatementAdapter.java:36)
[junit4:junit4]    > 	at org.apache.lucene.util.TestRuleAssertionsRequired$1.evaluate(TestRuleAssertionsRequired.java:43)
[junit4:junit4]    > 	at org.apache.lucene.util.TestRuleMarkFailure$1.evaluate(TestRuleMarkFailure.java:48)
[junit4:junit4]    > 	at org.apache.lucene.util.TestRuleIgnoreAfterMaxFailures$1.evaluate(TestRuleIgnoreAfterMaxFailures.java:70)
[junit4:junit4]    > 	at org.apache.lucene.util.TestRuleIgnoreTestSuites$1.evaluate(TestRuleIgnoreTestSuites.java:55)
[junit4:junit4]    > 	at com.carrotsearch.randomizedtesting.rules.StatementAdapter.evaluate(StatementAdapter.java:36)
[junit4:junit4]    > 	at com.carrotsearch.randomizedtesting.ThreadLeakControl$StatementRunner.run(ThreadLeakControl.java:358)
[junit4:junit4]    > 	at java.lang.Thread.run(Thread.java:679)
[junit4:junit4]    > Caused by: java.lang.RuntimeException: unclosed IndexInput: _2_dv.cfs
[junit4:junit4]    > 	at org.apache.lucene.store.MockDirectoryWrapper.addFileHandle(MockDirectoryWrapper.java:481)
[junit4:junit4]    > 	at org.apache.lucene.store.MockDirectoryWrapper$1.openSlice(MockDirectoryWrapper.java:895)
[junit4:junit4]    > 	at org.apache.lucene.store.CompoundFileDirectory.openInput(CompoundFileDirectory.java:271)
[junit4:junit4]    > 	at org.apache.lucene.codecs.lucene40.values.Bytes$BytesReaderBase.<init>(Bytes.java:329)
[junit4:junit4]    > 	at org.apache.lucene.codecs.lucene40.values.FixedSortedBytesImpl$Reader.<init>(FixedSortedBytesImpl.java:131)
[junit4:junit4]    > 	at org.apache.lucene.codecs.lucene40.values.Bytes.getValues(Bytes.java:192)
[junit4:junit4]    > 	at org.apache.lucene.codecs.lucene40.Lucene40DocValuesProducer.loadDocValues(Lucene40DocValuesProducer.java:102)
[junit4:junit4]    > 	at org.apache.lucene.codecs.PerDocProducerBase.load(PerDocProducerBase.java:80)
[junit4:junit4]    > 	at org.apache.lucene.codecs.lucene40.Lucene40DocValuesProducer.<init>(Lucene40DocValuesProducer.java:60)
[junit4:junit4]    > 	at org.apache.lucene.codecs.lucene40.Lucene40DocValuesFormat.docsProducer(Lucene40DocValuesFormat.java:144)
[junit4:junit4]    > 	at org.apache.lucene.index.SegmentCoreReaders.<init>(SegmentCoreReaders.java:113)
[junit4:junit4]    > 	at org.apache.lucene.index.SegmentReader.<init>(SegmentReader.java:57)
[junit4:junit4]    > 	at org.apache.lucene.index.StandardDirectoryReader$1.doBody(StandardDirectoryReader.java:62)
[junit4:junit4]    > 	at org.apache.lucene.index.SegmentInfos$FindSegmentsFile.run(SegmentInfos.java:783)
[junit4:junit4]    > 	at org.apache.lucene.index.StandardDirectoryReader.open(StandardDirectoryReader.java:52)
[junit4:junit4]    > 	at org.apache.lucene.index.DirectoryReader.open(DirectoryReader.java:65)
[junit4:junit4]    > 	at org.apache.lucene.codecs.compressing.TestCompressingStoredFieldsFormat.testBigDocuments(TestCompressingStoredFieldsFormat.java:337)
[junit4:junit4]    > 	at sun.reflect.NativeMethodAccessorImpl.invoke0(Native Method)
[junit4:junit4]    > 	at sun.reflect.NativeMethodAccessorImpl.invoke(NativeMethodAccessorImpl.java:57)
[junit4:junit4]    > 	at sun.reflect.DelegatingMethodAccessorImpl.invoke(DelegatingMethodAccessorImpl.java:43)
[junit4:junit4]    > 	at java.lang.reflect.Method.invoke(Method.java:616)
[junit4:junit4]    > 	at com.carrotsearch.randomizedtesting.RandomizedRunner.invoke(RandomizedRunner.java:1559)
[junit4:junit4]    > 	at com.carrotsearch.randomizedtesting.RandomizedRunner.access$600(RandomizedRunner.java:79)
[junit4:junit4]    > 	at com.carrotsearch.randomizedtesting.RandomizedRunner$6.evaluate(RandomizedRunner.java:737)
[junit4:junit4]    > 	at com.carrotsearch.randomizedtesting.RandomizedRunner$7.evaluate(RandomizedRunner.java:773)
[junit4:junit4]    > 	at com.carrotsearch.randomizedtesting.RandomizedRunner$8.evaluate(RandomizedRunner.java:787)
[junit4:junit4]    > 	... 28 more
[junit4:junit4]   2> NOTE: test params are: codec=Lucene3x, sim=RandomSimilarityProvider(queryNorm=false,coord=yes):
{}, locale=es_PR, timezone=America/Sitka
[junit4:junit4]   2> NOTE: FreeBSD 9.0-RELEASE amd64/Sun Microsystems Inc. 1.6.0_32 (64-bit)/cpus=16,threads=1,free=367026840,total=433192960
[junit4:junit4]   2> NOTE: All tests run in this JVM: [TestBloomPostingsFormat, TestFastDecompressionMode,
TestFixedGapPostingsFormat, Test10KPulsings, TestPulsingReuse, TestIntBlockCodec, TestCompressingStoredFieldsFormat]
[junit4:junit4] Completed on J1 in 84.76s, 5 tests, 1 error <<< FAILURES!

[...truncated 19 lines...]
BUILD FAILED
/usr/home/hudson/hudson-slave/workspace/Lucene-Solr-NightlyTests-4.x/build.xml:335: The following
error occurred while executing this line:
/usr/home/hudson/hudson-slave/workspace/Lucene-Solr-NightlyTests-4.x/build.xml:39: The following
error occurred while executing this line:
/usr/home/hudson/hudson-slave/workspace/Lucene-Solr-NightlyTests-4.x/lucene/build.xml:519:
The following error occurred while executing this line:
/usr/home/hudson/hudson-slave/workspace/Lucene-Solr-NightlyTests-4.x/lucene/common-build.xml:1691:
The following error occurred while executing this line:
/usr/home/hudson/hudson-slave/workspace/Lucene-Solr-NightlyTests-4.x/lucene/module-build.xml:61:
The following error occurred while executing this line:
/usr/home/hudson/hudson-slave/workspace/Lucene-Solr-NightlyTests-4.x/lucene/common-build.xml:1163:
The following error occurred while executing this line:
/usr/home/hudson/hudson-slave/workspace/Lucene-Solr-NightlyTests-4.x/lucene/common-build.xml:827:
There were test failures: 16 suites, 98 tests, 1 error

Total time: 66 minutes 53 seconds
Build step 'Invoke Ant' marked build as failure
Archiving artifacts
Recording test results
Email was triggered for: Failure
Sending email for trigger: Failure



Mime
View raw message