lucene-dev mailing list archives

Site index · List index
Message view « Date » · « Thread »
Top « Date » · « Thread »
From "Uwe Schindler" <...@thetaphi.de>
Subject RE: [JENKINS] Lucene-Solr-trunk-Linux (32bit/ibm-j9-jdk7) - Build # 1896 - Still Failing!
Date Sun, 21 Oct 2012 10:31:39 GMT
I am now installing the updates for J9 (there is already update 2 available for Java 7 and
update 11 for Java 6, both one more than currently installed), maybe the FST.pack() failure
is gone.

I will also install https://www14.software.ibm.com/webapp/iwm/web/preLogin.do?source=jcesdk
for all 4 installations of IBM J9.

-----
Uwe Schindler
H.-H.-Meier-Allee 63, D-28213 Bremen
http://www.thetaphi.de
eMail: uwe@thetaphi.de


> -----Original Message-----
> From: Uwe Schindler [mailto:uwe@thetaphi.de]
> Sent: Sunday, October 21, 2012 12:13 PM
> To: dev@lucene.apache.org
> Subject: RE: [JENKINS] Lucene-Solr-trunk-Linux (32bit/ibm-j9-jdk7) - Build #
> 1896 - Still Failing!
> 
> See: http://stackoverflow.com/questions/6481627/java-security-illegal-key-
> size-or-default-parameters
> 
> It seems that this IBM JDK does not have unlimited strength... I'll dig.
> This error did not happen before, because I did not build docs on J9, no I
> *only* don't lint it, but still build it.
> 
> Uwe
> 
> -----
> Uwe Schindler
> H.-H.-Meier-Allee 63, D-28213 Bremen
> http://www.thetaphi.de
> eMail: uwe@thetaphi.de
> 
> > -----Original Message-----
> > From: Robert Muir [mailto:rmuir@apache.org]
> > Sent: Sunday, October 21, 2012 5:35 AM
> > To: dev@lucene.apache.org
> > Subject: Re: [JENKINS] Lucene-Solr-trunk-Linux (32bit/ibm-j9-jdk7) -
> > Build #
> > 1896 - Still Failing!
> >
> > Does anyone know what is causing these SSL failures when retrieving
> > the JIRA stuff for changes-to-html?
> >
> > I tried the obvious workaround (changing it to just use http) but it
> > forwards to https anyway.
> > And it doesnt fail on my machine in any case
> >
> > changes-to-html:
> >       [get] Getting: http://issues.apache.org/jira/rest/api/2/project/LUCENE
> >       [get] To:
> > /home/rmuir/workspace/lucene-
> > trunk/lucene/build/docs/changes/jiraVersionList.json
> >       [get] http://issues.apache.org/jira/rest/api/2/project/LUCENE
> > moved to https://issues.apache.org/jira/rest/api/2/project/LUCENE
> >    [delete] Deleting:
> > /home/rmuir/workspace/lucene-
> > trunk/lucene/build/docs/changes/jiraVersionList.json
> >
> > BUILD SUCCESSFUL
> > Total time: 3 seconds
> >
> >
> > On Sat, Oct 20, 2012 at 11:27 PM, Policeman Jenkins Server
> > <jenkins@sd- datasolutions.de> wrote:
> > > Build:
> > > http://jenkins.sd-datasolutions.de/job/Lucene-Solr-trunk-Linux/1896/
> > > Java: 32bit/ibm-j9-jdk7
> > > -Xjit:exclude={org/apache/lucene/util/fst/FST.pack(IIF)Lorg/apache/l
> > > uc
> > > ene/util/fst/FST;}
> > >
> > > All tests passed
> > >
> > > Build Log:
> > > [...truncated 24172 lines...]
> > > BUILD FAILED
> > > /mnt/ssd/jenkins/workspace/Lucene-Solr-trunk-Linux/build.xml:60: The
> > following error occurred while executing this line:
> > > /mnt/ssd/jenkins/workspace/Lucene-Solr-trunk-
> > Linux/lucene/build.xml:517: The following error occurred while
> > executing this
> > line:
> > > /mnt/ssd/jenkins/workspace/Lucene-Solr-trunk-Linux/lucene/common-
> > build.xml:1937: javax.net.ssl.SSLKeyException: RSA premaster secret
> > error
> > >         at com.ibm.jsse2.z.<init>(z.java:32)
> > >         at com.ibm.jsse2.bb.a(bb.java:233)
> > >         at com.ibm.jsse2.bb.a(bb.java:113)
> > >         at com.ibm.jsse2.ab.r(ab.java:75)
> > >         at com.ibm.jsse2.ab.a(ab.java:532)
> > >         at com.ibm.jsse2.qc.a(qc.java:158)
> > >         at com.ibm.jsse2.qc.h(qc.java:272)
> > >         at com.ibm.jsse2.qc.a(qc.java:234)
> > >         at com.ibm.jsse2.qc.startHandshake(qc.java:8)
> > >         at com.ibm.net.ssl.www2.protocol.https.c.afterConnect(c.java:111)
> > >         at com.ibm.net.ssl.www2.protocol.https.d.connect(d.java:18)
> > >         at com.ibm.net.ssl.www2.protocol.https.b.connect(b.java:28)
> > >         at
> >
> org.apache.tools.ant.taskdefs.Get$GetThread.openConnection(Get.java:66
> > 0
> > )
> > >         at org.apache.tools.ant.taskdefs.Get$GetThread.get(Get.java:579)
> > >         at
> > > org.apache.tools.ant.taskdefs.Get$GetThread.run(Get.java:569)
> > > Caused by: java.security.InvalidKeyException: Illegal key size or
> > > default
> > parameters
> > >         at javax.crypto.Cipher.a(Unknown Source)
> > >         at javax.crypto.Cipher.a(Unknown Source)
> > >         at javax.crypto.Cipher.a(Unknown Source)
> > >         at javax.crypto.Cipher.init(Unknown Source)
> > >         at com.ibm.jsse2.z.<init>(z.java:12)
> > >         ... 14 more
> > >
> > > Total time: 29 minutes 58 seconds
> > > Build step 'Invoke Ant' marked build as failure Archiving artifacts
> > > Recording test results Description set: Java: 32bit/ibm-j9-jdk7
> > > -Xjit:exclude={org/apache/lucene/util/fst/FST.pack(IIF)Lorg/apache/l
> > > uc
> > > ene/util/fst/FST;}
> > > Email was triggered for: Failure
> > > Sending email for trigger: Failure
> > >
> >
> > ---------------------------------------------------------------------
> > To unsubscribe, e-mail: dev-unsubscribe@lucene.apache.org For
> > additional commands, e-mail: dev-help@lucene.apache.org
> 
> 
> ---------------------------------------------------------------------
> To unsubscribe, e-mail: dev-unsubscribe@lucene.apache.org For additional
> commands, e-mail: dev-help@lucene.apache.org


---------------------------------------------------------------------
To unsubscribe, e-mail: dev-unsubscribe@lucene.apache.org
For additional commands, e-mail: dev-help@lucene.apache.org


Mime
View raw message