lucene-dev mailing list archives

Site index · List index
Message view « Date » · « Thread »
Top « Date » · « Thread »
From Robert Muir <rcm...@gmail.com>
Subject Re: [JENKINS] Lucene-Solr-trunk-Windows (64bit/jdk1.7.0_07) - Build # 673 - Failure!
Date Sat, 08 Sep 2012 12:01:49 GMT
i think i beat you to it.... i added missing .close()'s to the new
tests (though the other missing ones were just on clones)

On Sat, Sep 8, 2012 at 7:53 AM, Uwe Schindler <uwe@thetaphi.de> wrote:
> Ah, slicer is not closed! I'll fix!
>
> -----
> Uwe Schindler
> H.-H.-Meier-Allee 63, D-28213 Bremen
> http://www.thetaphi.de
> eMail: uwe@thetaphi.de
>
>
>> -----Original Message-----
>> From: Uwe Schindler [mailto:uwe@thetaphi.de]
>> Sent: Saturday, September 08, 2012 1:52 PM
>> To: dev@lucene.apache.org
>> Subject: RE: [JENKINS] Lucene-Solr-trunk-Windows (64bit/jdk1.7.0_07) - Build #
>> 673 - Failure!
>>
>> I can reproduce this in Windows with this seed every time, but not with other
>> seeds. Also on Java 6. I don’t understand the stack trace, so I have no idea. Test
>> looks OK.
>>
>> -----
>> Uwe Schindler
>> H.-H.-Meier-Allee 63, D-28213 Bremen
>> http://www.thetaphi.de
>> eMail: uwe@thetaphi.de
>>
>> > -----Original Message-----
>> > From: Policeman Jenkins Server [mailto:jenkins@sd-datasolutions.de]
>> > Sent: Saturday, September 08, 2012 12:22 PM
>> > To: dev@lucene.apache.org
>> > Subject: [JENKINS] Lucene-Solr-trunk-Windows (64bit/jdk1.7.0_07) - Build #
>> 673
>> > - Failure!
>> >
>> > Build: http://jenkins.sd-datasolutions.de/job/Lucene-Solr-trunk-Windows/673/
>> > Java: 64bit/jdk1.7.0_07 -XX:+UseParallelGC
>> >
>> > 17 tests failed.
>> > FAILED:  junit.framework.TestSuite.org.apache.lucene.store.TestMultiMMap
>> >
>> > Error Message:
>> > Resource in scope SUITE failed to close. Resource was registered from thread
>> > Thread[id=695, name=TEST-TestMultiMMap.testSeekSliceEnd-
>> > seed#[AA4F04524D760878], state=RUNNABLE, group=TGRP-
>> TestMultiMMap],
>> > registration stack trace below.
>> >
>> > Stack Trace:
>> > com.carrotsearch.randomizedtesting.ResourceDisposalError: Resource in
>> scope
>> > SUITE failed to close. Resource was registered from thread Thread[id=695,
>> > name=TEST-TestMultiMMap.testSeekSliceEnd-seed#[AA4F04524D760878],
>> > state=RUNNABLE, group=TGRP-TestMultiMMap], registration stack trace
>> > below.
>> >     at java.lang.Thread.getStackTrace(Thread.java:1567)
>> >     at
>> >
>> com.carrotsearch.randomizedtesting.RandomizedContext.closeAtEnd(Randomiz
>> > edContext.java:150)
>> >     at
>> >
>> org.apache.lucene.util.LuceneTestCase.closeAfterSuite(LuceneTestCase.java:48
>> > 5)
>> >     at org.apache.lucene.util._TestUtil.getTempDir(_TestUtil.java:97)
>> >     at
>> >
>> org.apache.lucene.store.TestMultiMMap.testSeekSliceEnd(TestMultiMMap.jav
>> > a:164)
>> >     at sun.reflect.NativeMethodAccessorImpl.invoke0(Native Method)
>> >     at
>> >
>> sun.reflect.NativeMethodAccessorImpl.invoke(NativeMethodAccessorImpl.java:
>> > 57)
>> >     at
>> >
>> sun.reflect.DelegatingMethodAccessorImpl.invoke(DelegatingMethodAccessorI
>> > mpl.java:43)
>> >     at java.lang.reflect.Method.invoke(Method.java:601)
>> >     at
>> >
>> com.carrotsearch.randomizedtesting.RandomizedRunner.invoke(RandomizedRu
>> > nner.java:1559)
>> >     at
>> >
>> com.carrotsearch.randomizedtesting.RandomizedRunner.access$600(Randomiz
>> > edRunner.java:79)
>> >     at
>> >
>> com.carrotsearch.randomizedtesting.RandomizedRunner$6.evaluate(Randomiz
>> > edRunner.java:737)
>> >     at
>> >
>> com.carrotsearch.randomizedtesting.RandomizedRunner$7.evaluate(Randomiz
>> > edRunner.java:773)
>> >     at
>> >
>> com.carrotsearch.randomizedtesting.RandomizedRunner$8.evaluate(Randomiz
>> > edRunner.java:787)
>> >     at
>> >
>> org.apache.lucene.util.TestRuleSetupTeardownChained$1.evaluate(TestRuleSet
>> > upTeardownChained.java:50)
>> >     at
>> >
>> org.apache.lucene.util.TestRuleFieldCacheSanity$1.evaluate(TestRuleFieldCach
>> > eSanity.java:51)
>> >     at
>> >
>> org.apache.lucene.util.AbstractBeforeAfterRule$1.evaluate(AbstractBeforeAfte
>> > rRule.java:45)
>> >     at
>> >
>> com.carrotsearch.randomizedtesting.rules.SystemPropertiesInvariantRule$1.ev
>> > aluate(SystemPropertiesInvariantRule.java:55)
>> >     at
>> >
>> org.apache.lucene.util.TestRuleThreadAndTestName$1.evaluate(TestRuleThrea
>> > dAndTestName.java:48)
>> >     at
>> >
>> org.apache.lucene.util.TestRuleIgnoreAfterMaxFailures$1.evaluate(TestRuleIgn
>> > oreAfterMaxFailures.java:70)
>> >     at
>> >
>> org.apache.lucene.util.TestRuleMarkFailure$1.evaluate(TestRuleMarkFailure.ja
>> > va:48)
>> >     at
>> >
>> com.carrotsearch.randomizedtesting.rules.StatementAdapter.evaluate(Stateme
>> > ntAdapter.java:36)
>> >     at
>> >
>> com.carrotsearch.randomizedtesting.ThreadLeakControl$StatementRunner.run
>> > (ThreadLeakControl.java:358)
>> >     at
>> >
>> com.carrotsearch.randomizedtesting.ThreadLeakControl.forkTimeoutingTask(T
>> > hreadLeakControl.java:782)
>> >     at
>> >
>> com.carrotsearch.randomizedtesting.ThreadLeakControl$3.evaluate(ThreadLea
>> > kControl.java:442)
>> >     at
>> >
>> com.carrotsearch.randomizedtesting.RandomizedRunner.runSingleTest(Rando
>> > mizedRunner.java:746)
>> >     at
>> >
>> com.carrotsearch.randomizedtesting.RandomizedRunner$3.evaluate(Randomiz
>> > edRunner.java:648)
>> >     at
>> >
>> com.carrotsearch.randomizedtesting.RandomizedRunner$4.evaluate(Randomiz
>> > edRunner.java:682)
>> >     at
>> >
>> com.carrotsearch.randomizedtesting.RandomizedRunner$5.evaluate(Randomiz
>> > edRunner.java:693)
>> >     at
>> >
>> org.apache.lucene.util.AbstractBeforeAfterRule$1.evaluate(AbstractBeforeAfte
>> > rRule.java:45)
>> >     at
>> >
>> org.apache.lucene.util.TestRuleStoreClassName$1.evaluate(TestRuleStoreClass
>> > Name.java:42)
>> >     at
>> >
>> com.carrotsearch.randomizedtesting.rules.SystemPropertiesInvariantRule$1.ev
>> > aluate(SystemPropertiesInvariantRule.java:55)
>> >     at
>> >
>> com.carrotsearch.randomizedtesting.rules.NoShadowingOrOverridesOnMethod
>> > sRule$1.evaluate(NoShadowingOrOverridesOnMethodsRule.java:39)
>> >     at
>> >
>> com.carrotsearch.randomizedtesting.rules.NoShadowingOrOverridesOnMethod
>> > sRule$1.evaluate(NoShadowingOrOverridesOnMethodsRule.java:39)
>> >     at
>> >
>> org.apache.lucene.util.TestRuleAssertionsRequired$1.evaluate(TestRuleAssertio
>> > nsRequired.java:40)
>> >     at
>> >
>> org.apache.lucene.util.TestRuleMarkFailure$1.evaluate(TestRuleMarkFailure.ja
>> > va:48)
>> >     at
>> >
>> org.apache.lucene.util.TestRuleIgnoreAfterMaxFailures$1.evaluate(TestRuleIgn
>> > oreAfterMaxFailures.java:70)
>> >     at
>> >
>> org.apache.lucene.util.TestRuleIgnoreTestSuites$1.evaluate(TestRuleIgnoreTest
>> > Suites.java:55)
>> >     at
>> >
>> com.carrotsearch.randomizedtesting.rules.StatementAdapter.evaluate(Stateme
>> > ntAdapter.java:36)
>> >     at
>> >
>> com.carrotsearch.randomizedtesting.ThreadLeakControl$StatementRunner.run
>> > (ThreadLeakControl.java:358)
>> >     at java.lang.Thread.run(Thread.java:722)
>> > Caused by: java.io.IOException: Could not remove:
>> > C:\Jenkins\workspace\Lucene-Solr-trunk-
>> > Windows\lucene\build\core\test\J0\.\testSeekSliceEnd4659546750tmp
>> >     at org.apache.lucene.util.CloseableFile.close(CloseableFile.java:47)
>> >     at
>> >
>> com.carrotsearch.randomizedtesting.RandomizedRunner$2$1.apply(Randomize
>> > dRunner.java:602)
>> >     at
>> >
>> com.carrotsearch.randomizedtesting.RandomizedRunner$2$1.apply(Randomize
>> > dRunner.java:599)
>> >     at
>> >
>> com.carrotsearch.randomizedtesting.RandomizedContext.closeResources(Rand
>> > omizedContext.java:167)
>> >     at
>> >
>> com.carrotsearch.randomizedtesting.RandomizedRunner$2.afterAlways(Rando
>> > mizedRunner.java:615)
>> >     at
>> >
>> com.carrotsearch.randomizedtesting.rules.StatementAdapter.evaluate(Stateme
>> > ntAdapter.java:43)
>> >     ... 2 more
>> >
>> >
>> > FAILED:  junit.framework.TestSuite.org.apache.lucene.store.TestMultiMMap
>> >
>> > Error Message:
>> > Resource in scope SUITE failed to close. Resource was registered from thread
>> > Thread[id=695, name=TEST-TestMultiMMap.testSeekSliceEnd-
>> > seed#[AA4F04524D760878], state=RUNNABLE, group=TGRP-
>> TestMultiMMap],
>> > registration stack trace below.
>> >
>> > Stack Trace:
>> > com.carrotsearch.randomizedtesting.ResourceDisposalError: Resource in
>> scope
>> > SUITE failed to close. Resource was registered from thread Thread[id=695,
>> > name=TEST-TestMultiMMap.testSeekSliceEnd-seed#[AA4F04524D760878],
>> > state=RUNNABLE, group=TGRP-TestMultiMMap], registration stack trace
>> > below.
>> >     at java.lang.Thread.getStackTrace(Thread.java:1567)
>> >     at
>> >
>> com.carrotsearch.randomizedtesting.RandomizedContext.closeAtEnd(Randomiz
>> > edContext.java:150)
>> >     at
>> >
>> org.apache.lucene.util.LuceneTestCase.closeAfterSuite(LuceneTestCase.java:48
>> > 5)
>> >     at org.apache.lucene.util._TestUtil.getTempDir(_TestUtil.java:97)
>> >     at
>> >
>> org.apache.lucene.store.TestMultiMMap.testSeekSliceEnd(TestMultiMMap.jav
>> > a:164)
>> >     at sun.reflect.NativeMethodAccessorImpl.invoke0(Native Method)
>> >     at
>> >
>> sun.reflect.NativeMethodAccessorImpl.invoke(NativeMethodAccessorImpl.java:
>> > 57)
>> >     at
>> >
>> sun.reflect.DelegatingMethodAccessorImpl.invoke(DelegatingMethodAccessorI
>> > mpl.java:43)
>> >     at java.lang.reflect.Method.invoke(Method.java:601)
>> >     at
>> >
>> com.carrotsearch.randomizedtesting.RandomizedRunner.invoke(RandomizedRu
>> > nner.java:1559)
>> >     at
>> >
>> com.carrotsearch.randomizedtesting.RandomizedRunner.access$600(Randomiz
>> > edRunner.java:79)
>> >     at
>> >
>> com.carrotsearch.randomizedtesting.RandomizedRunner$6.evaluate(Randomiz
>> > edRunner.java:737)
>> >     at
>> >
>> com.carrotsearch.randomizedtesting.RandomizedRunner$7.evaluate(Randomiz
>> > edRunner.java:773)
>> >     at
>> >
>> com.carrotsearch.randomizedtesting.RandomizedRunner$8.evaluate(Randomiz
>> > edRunner.java:787)
>> >     at
>> >
>> org.apache.lucene.util.TestRuleSetupTeardownChained$1.evaluate(TestRuleSet
>> > upTeardownChained.java:50)
>> >     at
>> >
>> org.apache.lucene.util.TestRuleFieldCacheSanity$1.evaluate(TestRuleFieldCach
>> > eSanity.java:51)
>> >     at
>> >
>> org.apache.lucene.util.AbstractBeforeAfterRule$1.evaluate(AbstractBeforeAfte
>> > rRule.java:45)
>> >     at
>> >
>> com.carrotsearch.randomizedtesting.rules.SystemPropertiesInvariantRule$1.ev
>> > aluate(SystemPropertiesInvariantRule.java:55)
>> >     at
>> >
>> org.apache.lucene.util.TestRuleThreadAndTestName$1.evaluate(TestRuleThrea
>> > dAndTestName.java:48)
>> >     at
>> >
>> org.apache.lucene.util.TestRuleIgnoreAfterMaxFailures$1.evaluate(TestRuleIgn
>> > oreAfterMaxFailures.java:70)
>> >     at
>> >
>> org.apache.lucene.util.TestRuleMarkFailure$1.evaluate(TestRuleMarkFailure.ja
>> > va:48)
>> >     at
>> >
>> com.carrotsearch.randomizedtesting.rules.StatementAdapter.evaluate(Stateme
>> > ntAdapter.java:36)
>> >     at
>> >
>> com.carrotsearch.randomizedtesting.ThreadLeakControl$StatementRunner.run
>> > (ThreadLeakControl.java:358)
>> >     at
>> >
>> com.carrotsearch.randomizedtesting.ThreadLeakControl.forkTimeoutingTask(T
>> > hreadLeakControl.java:782)
>> >     at
>> >
>> com.carrotsearch.randomizedtesting.ThreadLeakControl$3.evaluate(ThreadLea
>> > kControl.java:442)
>> >     at
>> >
>> com.carrotsearch.randomizedtesting.RandomizedRunner.runSingleTest(Rando
>> > mizedRunner.java:746)
>> >     at
>> >
>> com.carrotsearch.randomizedtesting.RandomizedRunner$3.evaluate(Randomiz
>> > edRunner.java:648)
>> >     at
>> >
>> com.carrotsearch.randomizedtesting.RandomizedRunner$4.evaluate(Randomiz
>> > edRunner.java:682)
>> >     at
>> >
>> com.carrotsearch.randomizedtesting.RandomizedRunner$5.evaluate(Randomiz
>> > edRunner.java:693)
>> >     at
>> >
>> org.apache.lucene.util.AbstractBeforeAfterRule$1.evaluate(AbstractBeforeAfte
>> > rRule.java:45)
>> >     at
>> >
>> org.apache.lucene.util.TestRuleStoreClassName$1.evaluate(TestRuleStoreClass
>> > Name.java:42)
>> >     at
>> >
>> com.carrotsearch.randomizedtesting.rules.SystemPropertiesInvariantRule$1.ev
>> > aluate(SystemPropertiesInvariantRule.java:55)
>> >     at
>> >
>> com.carrotsearch.randomizedtesting.rules.NoShadowingOrOverridesOnMethod
>> > sRule$1.evaluate(NoShadowingOrOverridesOnMethodsRule.java:39)
>> >     at
>> >
>> com.carrotsearch.randomizedtesting.rules.NoShadowingOrOverridesOnMethod
>> > sRule$1.evaluate(NoShadowingOrOverridesOnMethodsRule.java:39)
>> >     at
>> >
>> org.apache.lucene.util.TestRuleAssertionsRequired$1.evaluate(TestRuleAssertio
>> > nsRequired.java:40)
>> >     at
>> >
>> org.apache.lucene.util.TestRuleMarkFailure$1.evaluate(TestRuleMarkFailure.ja
>> > va:48)
>> >     at
>> >
>> org.apache.lucene.util.TestRuleIgnoreAfterMaxFailures$1.evaluate(TestRuleIgn
>> > oreAfterMaxFailures.java:70)
>> >     at
>> >
>> org.apache.lucene.util.TestRuleIgnoreTestSuites$1.evaluate(TestRuleIgnoreTest
>> > Suites.java:55)
>> >     at
>> >
>> com.carrotsearch.randomizedtesting.rules.StatementAdapter.evaluate(Stateme
>> > ntAdapter.java:36)
>> >     at
>> >
>> com.carrotsearch.randomizedtesting.ThreadLeakControl$StatementRunner.run
>> > (ThreadLeakControl.java:358)
>> >     at java.lang.Thread.run(Thread.java:722)
>> > Caused by: java.io.IOException: Could not remove:
>> > C:\Jenkins\workspace\Lucene-Solr-trunk-
>> > Windows\lucene\build\core\test\J0\.\testSeekSliceEnd4659546751tmp
>> >     at org.apache.lucene.util.CloseableFile.close(CloseableFile.java:47)
>> >     at
>> >
>> com.carrotsearch.randomizedtesting.RandomizedRunner$2$1.apply(Randomize
>> > dRunner.java:602)
>> >     at
>> >
>> com.carrotsearch.randomizedtesting.RandomizedRunner$2$1.apply(Randomize
>> > dRunner.java:599)
>> >     at
>> >
>> com.carrotsearch.randomizedtesting.RandomizedContext.closeResources(Rand
>> > omizedContext.java:167)
>> >     at
>> >
>> com.carrotsearch.randomizedtesting.RandomizedRunner$2.afterAlways(Rando
>> > mizedRunner.java:615)
>> >     at
>> >
>> com.carrotsearch.randomizedtesting.rules.StatementAdapter.evaluate(Stateme
>> > ntAdapter.java:43)
>> >     ... 2 more
>> >
>> >
>> > FAILED:  junit.framework.TestSuite.org.apache.lucene.store.TestMultiMMap
>> >
>> > Error Message:
>> > Resource in scope SUITE failed to close. Resource was registered from thread
>> > Thread[id=695, name=TEST-TestMultiMMap.testSeekSliceEnd-
>> > seed#[AA4F04524D760878], state=RUNNABLE, group=TGRP-
>> TestMultiMMap],
>> > registration stack trace below.
>> >
>> > Stack Trace:
>> > com.carrotsearch.randomizedtesting.ResourceDisposalError: Resource in
>> scope
>> > SUITE failed to close. Resource was registered from thread Thread[id=695,
>> > name=TEST-TestMultiMMap.testSeekSliceEnd-seed#[AA4F04524D760878],
>> > state=RUNNABLE, group=TGRP-TestMultiMMap], registration stack trace
>> > below.
>> >     at java.lang.Thread.getStackTrace(Thread.java:1567)
>> >     at
>> >
>> com.carrotsearch.randomizedtesting.RandomizedContext.closeAtEnd(Randomiz
>> > edContext.java:150)
>> >     at
>> >
>> org.apache.lucene.util.LuceneTestCase.closeAfterSuite(LuceneTestCase.java:48
>> > 5)
>> >     at org.apache.lucene.util._TestUtil.getTempDir(_TestUtil.java:97)
>> >     at
>> >
>> org.apache.lucene.store.TestMultiMMap.testSeekSliceEnd(TestMultiMMap.jav
>> > a:164)
>> >     at sun.reflect.NativeMethodAccessorImpl.invoke0(Native Method)
>> >     at
>> >
>> sun.reflect.NativeMethodAccessorImpl.invoke(NativeMethodAccessorImpl.java:
>> > 57)
>> >     at
>> >
>> sun.reflect.DelegatingMethodAccessorImpl.invoke(DelegatingMethodAccessorI
>> > mpl.java:43)
>> >     at java.lang.reflect.Method.invoke(Method.java:601)
>> >     at
>> >
>> com.carrotsearch.randomizedtesting.RandomizedRunner.invoke(RandomizedRu
>> > nner.java:1559)
>> >     at
>> >
>> com.carrotsearch.randomizedtesting.RandomizedRunner.access$600(Randomiz
>> > edRunner.java:79)
>> >     at
>> >
>> com.carrotsearch.randomizedtesting.RandomizedRunner$6.evaluate(Randomiz
>> > edRunner.java:737)
>> >     at
>> >
>> com.carrotsearch.randomizedtesting.RandomizedRunner$7.evaluate(Randomiz
>> > edRunner.java:773)
>> >     at
>> >
>> com.carrotsearch.randomizedtesting.RandomizedRunner$8.evaluate(Randomiz
>> > edRunner.java:787)
>> >     at
>> >
>> org.apache.lucene.util.TestRuleSetupTeardownChained$1.evaluate(TestRuleSet
>> > upTeardownChained.java:50)
>> >     at
>> >
>> org.apache.lucene.util.TestRuleFieldCacheSanity$1.evaluate(TestRuleFieldCach
>> > eSanity.java:51)
>> >     at
>> >
>> org.apache.lucene.util.AbstractBeforeAfterRule$1.evaluate(AbstractBeforeAfte
>> > rRule.java:45)
>> >     at
>> >
>> com.carrotsearch.randomizedtesting.rules.SystemPropertiesInvariantRule$1.ev
>> > aluate(SystemPropertiesInvariantRule.java:55)
>> >     at
>> >
>> org.apache.lucene.util.TestRuleThreadAndTestName$1.evaluate(TestRuleThrea
>> > dAndTestName.java:48)
>> >     at
>> >
>> org.apache.lucene.util.TestRuleIgnoreAfterMaxFailures$1.evaluate(TestRuleIgn
>> > oreAfterMaxFailures.java:70)
>> >     at
>> >
>> org.apache.lucene.util.TestRuleMarkFailure$1.evaluate(TestRuleMarkFailure.ja
>> > va:48)
>> >     at
>> >
>> com.carrotsearch.randomizedtesting.rules.StatementAdapter.evaluate(Stateme
>> > ntAdapter.java:36)
>> >     at
>> >
>> com.carrotsearch.randomizedtesting.ThreadLeakControl$StatementRunner.run
>> > (ThreadLeakControl.java:358)
>> >     at
>> >
>> com.carrotsearch.randomizedtesting.ThreadLeakControl.forkTimeoutingTask(T
>> > hreadLeakControl.java:782)
>> >     at
>> >
>> com.carrotsearch.randomizedtesting.ThreadLeakControl$3.evaluate(ThreadLea
>> > kControl.java:442)
>> >     at
>> >
>> com.carrotsearch.randomizedtesting.RandomizedRunner.runSingleTest(Rando
>> > mizedRunner.java:746)
>> >     at
>> >
>> com.carrotsearch.randomizedtesting.RandomizedRunner$3.evaluate(Randomiz
>> > edRunner.java:648)
>> >     at
>> >
>> com.carrotsearch.randomizedtesting.RandomizedRunner$4.evaluate(Randomiz
>> > edRunner.java:682)
>> >     at
>> >
>> com.carrotsearch.randomizedtesting.RandomizedRunner$5.evaluate(Randomiz
>> > edRunner.java:693)
>> >     at
>> >
>> org.apache.lucene.util.AbstractBeforeAfterRule$1.evaluate(AbstractBeforeAfte
>> > rRule.java:45)
>> >     at
>> >
>> org.apache.lucene.util.TestRuleStoreClassName$1.evaluate(TestRuleStoreClass
>> > Name.java:42)
>> >     at
>> >
>> com.carrotsearch.randomizedtesting.rules.SystemPropertiesInvariantRule$1.ev
>> > aluate(SystemPropertiesInvariantRule.java:55)
>> >     at
>> >
>> com.carrotsearch.randomizedtesting.rules.NoShadowingOrOverridesOnMethod
>> > sRule$1.evaluate(NoShadowingOrOverridesOnMethodsRule.java:39)
>> >     at
>> >
>> com.carrotsearch.randomizedtesting.rules.NoShadowingOrOverridesOnMethod
>> > sRule$1.evaluate(NoShadowingOrOverridesOnMethodsRule.java:39)
>> >     at
>> >
>> org.apache.lucene.util.TestRuleAssertionsRequired$1.evaluate(TestRuleAssertio
>> > nsRequired.java:40)
>> >     at
>> >
>> org.apache.lucene.util.TestRuleMarkFailure$1.evaluate(TestRuleMarkFailure.ja
>> > va:48)
>> >     at
>> >
>> org.apache.lucene.util.TestRuleIgnoreAfterMaxFailures$1.evaluate(TestRuleIgn
>> > oreAfterMaxFailures.java:70)
>> >     at
>> >
>> org.apache.lucene.util.TestRuleIgnoreTestSuites$1.evaluate(TestRuleIgnoreTest
>> > Suites.java:55)
>> >     at
>> >
>> com.carrotsearch.randomizedtesting.rules.StatementAdapter.evaluate(Stateme
>> > ntAdapter.java:36)
>> >     at
>> >
>> com.carrotsearch.randomizedtesting.ThreadLeakControl$StatementRunner.run
>> > (ThreadLeakControl.java:358)
>> >     at java.lang.Thread.run(Thread.java:722)
>> > Caused by: java.io.IOException: Could not remove:
>> > C:\Jenkins\workspace\Lucene-Solr-trunk-
>> > Windows\lucene\build\core\test\J0\.\testSeekSliceEnd4659546752tmp
>> >     at org.apache.lucene.util.CloseableFile.close(CloseableFile.java:47)
>> >     at
>> >
>> com.carrotsearch.randomizedtesting.RandomizedRunner$2$1.apply(Randomize
>> > dRunner.java:602)
>> >     at
>> >
>> com.carrotsearch.randomizedtesting.RandomizedRunner$2$1.apply(Randomize
>> > dRunner.java:599)
>> >     at
>> >
>> com.carrotsearch.randomizedtesting.RandomizedContext.closeResources(Rand
>> > omizedContext.java:167)
>> >     at
>> >
>> com.carrotsearch.randomizedtesting.RandomizedRunner$2.afterAlways(Rando
>> > mizedRunner.java:615)
>> >     at
>> >
>> com.carrotsearch.randomizedtesting.rules.StatementAdapter.evaluate(Stateme
>> > ntAdapter.java:43)
>> >     ... 2 more
>> >
>> >
>> > FAILED:  junit.framework.TestSuite.org.apache.lucene.store.TestMultiMMap
>> >
>> > Error Message:
>> > Resource in scope SUITE failed to close. Resource was registered from thread
>> > Thread[id=695, name=TEST-TestMultiMMap.testSeekSliceEnd-
>> > seed#[AA4F04524D760878], state=RUNNABLE, group=TGRP-
>> TestMultiMMap],
>> > registration stack trace below.
>> >
>> > Stack Trace:
>> > com.carrotsearch.randomizedtesting.ResourceDisposalError: Resource in
>> scope
>> > SUITE failed to close. Resource was registered from thread Thread[id=695,
>> > name=TEST-TestMultiMMap.testSeekSliceEnd-seed#[AA4F04524D760878],
>> > state=RUNNABLE, group=TGRP-TestMultiMMap], registration stack trace
>> > below.
>> >     at java.lang.Thread.getStackTrace(Thread.java:1567)
>> >     at
>> >
>> com.carrotsearch.randomizedtesting.RandomizedContext.closeAtEnd(Randomiz
>> > edContext.java:150)
>> >     at
>> >
>> org.apache.lucene.util.LuceneTestCase.closeAfterSuite(LuceneTestCase.java:48
>> > 5)
>> >     at org.apache.lucene.util._TestUtil.getTempDir(_TestUtil.java:97)
>> >     at
>> >
>> org.apache.lucene.store.TestMultiMMap.testSeekSliceEnd(TestMultiMMap.jav
>> > a:164)
>> >     at sun.reflect.NativeMethodAccessorImpl.invoke0(Native Method)
>> >     at
>> >
>> sun.reflect.NativeMethodAccessorImpl.invoke(NativeMethodAccessorImpl.java:
>> > 57)
>> >     at
>> >
>> sun.reflect.DelegatingMethodAccessorImpl.invoke(DelegatingMethodAccessorI
>> > mpl.java:43)
>> >     at java.lang.reflect.Method.invoke(Method.java:601)
>> >     at
>> >
>> com.carrotsearch.randomizedtesting.RandomizedRunner.invoke(RandomizedRu
>> > nner.java:1559)
>> >     at
>> >
>> com.carrotsearch.randomizedtesting.RandomizedRunner.access$600(Randomiz
>> > edRunner.java:79)
>> >     at
>> >
>> com.carrotsearch.randomizedtesting.RandomizedRunner$6.evaluate(Randomiz
>> > edRunner.java:737)
>> >     at
>> >
>> com.carrotsearch.randomizedtesting.RandomizedRunner$7.evaluate(Randomiz
>> > edRunner.java:773)
>> >     at
>> >
>> com.carrotsearch.randomizedtesting.RandomizedRunner$8.evaluate(Randomiz
>> > edRunner.java:787)
>> >     at
>> >
>> org.apache.lucene.util.TestRuleSetupTeardownChained$1.evaluate(TestRuleSet
>> > upTeardownChained.java:50)
>> >     at
>> >
>> org.apache.lucene.util.TestRuleFieldCacheSanity$1.evaluate(TestRuleFieldCach
>> > eSanity.java:51)
>> >     at
>> >
>> org.apache.lucene.util.AbstractBeforeAfterRule$1.evaluate(AbstractBeforeAfte
>> > rRule.java:45)
>> >     at
>> >
>> com.carrotsearch.randomizedtesting.rules.SystemPropertiesInvariantRule$1.ev
>> > aluate(SystemPropertiesInvariantRule.java:55)
>> >     at
>> >
>> org.apache.lucene.util.TestRuleThreadAndTestName$1.evaluate(TestRuleThrea
>> > dAndTestName.java:48)
>> >     at
>> >
>> org.apache.lucene.util.TestRuleIgnoreAfterMaxFailures$1.evaluate(TestRuleIgn
>> > oreAfterMaxFailures.java:70)
>> >     at
>> >
>> org.apache.lucene.util.TestRuleMarkFailure$1.evaluate(TestRuleMarkFailure.ja
>> > va:48)
>> >     at
>> >
>> com.carrotsearch.randomizedtesting.rules.StatementAdapter.evaluate(Stateme
>> > ntAdapter.java:36)
>> >     at
>> >
>> com.carrotsearch.randomizedtesting.ThreadLeakControl$StatementRunner.run
>> > (ThreadLeakControl.java:358)
>> >     at
>> >
>> com.carrotsearch.randomizedtesting.ThreadLeakControl.forkTimeoutingTask(T
>> > hreadLeakControl.java:782)
>> >     at
>> >
>> com.carrotsearch.randomizedtesting.ThreadLeakControl$3.evaluate(ThreadLea
>> > kControl.java:442)
>> >     at
>> >
>> com.carrotsearch.randomizedtesting.RandomizedRunner.runSingleTest(Rando
>> > mizedRunner.java:746)
>> >     at
>> >
>> com.carrotsearch.randomizedtesting.RandomizedRunner$3.evaluate(Randomiz
>> > edRunner.java:648)
>> >     at
>> >
>> com.carrotsearch.randomizedtesting.RandomizedRunner$4.evaluate(Randomiz
>> > edRunner.java:682)
>> >     at
>> >
>> com.carrotsearch.randomizedtesting.RandomizedRunner$5.evaluate(Randomiz
>> > edRunner.java:693)
>> >     at
>> >
>> org.apache.lucene.util.AbstractBeforeAfterRule$1.evaluate(AbstractBeforeAfte
>> > rRule.java:45)
>> >     at
>> >
>> org.apache.lucene.util.TestRuleStoreClassName$1.evaluate(TestRuleStoreClass
>> > Name.java:42)
>> >     at
>> >
>> com.carrotsearch.randomizedtesting.rules.SystemPropertiesInvariantRule$1.ev
>> > aluate(SystemPropertiesInvariantRule.java:55)
>> >     at
>> >
>> com.carrotsearch.randomizedtesting.rules.NoShadowingOrOverridesOnMethod
>> > sRule$1.evaluate(NoShadowingOrOverridesOnMethodsRule.java:39)
>> >     at
>> >
>> com.carrotsearch.randomizedtesting.rules.NoShadowingOrOverridesOnMethod
>> > sRule$1.evaluate(NoShadowingOrOverridesOnMethodsRule.java:39)
>> >     at
>> >
>> org.apache.lucene.util.TestRuleAssertionsRequired$1.evaluate(TestRuleAssertio
>> > nsRequired.java:40)
>> >     at
>> >
>> org.apache.lucene.util.TestRuleMarkFailure$1.evaluate(TestRuleMarkFailure.ja
>> > va:48)
>> >     at
>> >
>> org.apache.lucene.util.TestRuleIgnoreAfterMaxFailures$1.evaluate(TestRuleIgn
>> > oreAfterMaxFailures.java:70)
>> >     at
>> >
>> org.apache.lucene.util.TestRuleIgnoreTestSuites$1.evaluate(TestRuleIgnoreTest
>> > Suites.java:55)
>> >     at
>> >
>> com.carrotsearch.randomizedtesting.rules.StatementAdapter.evaluate(Stateme
>> > ntAdapter.java:36)
>> >     at
>> >
>> com.carrotsearch.randomizedtesting.ThreadLeakControl$StatementRunner.run
>> > (ThreadLeakControl.java:358)
>> >     at java.lang.Thread.run(Thread.java:722)
>> > Caused by: java.io.IOException: Could not remove:
>> > C:\Jenkins\workspace\Lucene-Solr-trunk-
>> > Windows\lucene\build\core\test\J0\.\testSeekSliceEnd4659546753tmp
>> >     at org.apache.lucene.util.CloseableFile.close(CloseableFile.java:47)
>> >     at
>> >
>> com.carrotsearch.randomizedtesting.RandomizedRunner$2$1.apply(Randomize
>> > dRunner.java:602)
>> >     at
>> >
>> com.carrotsearch.randomizedtesting.RandomizedRunner$2$1.apply(Randomize
>> > dRunner.java:599)
>> >     at
>> >
>> com.carrotsearch.randomizedtesting.RandomizedContext.closeResources(Rand
>> > omizedContext.java:167)
>> >     at
>> >
>> com.carrotsearch.randomizedtesting.RandomizedRunner$2.afterAlways(Rando
>> > mizedRunner.java:615)
>> >     at
>> >
>> com.carrotsearch.randomizedtesting.rules.StatementAdapter.evaluate(Stateme
>> > ntAdapter.java:43)
>> >     ... 2 more
>> >
>> >
>> > FAILED:  junit.framework.TestSuite.org.apache.lucene.store.TestMultiMMap
>> >
>> > Error Message:
>> > Resource in scope SUITE failed to close. Resource was registered from thread
>> > Thread[id=695, name=TEST-TestMultiMMap.testSeekSliceEnd-
>> > seed#[AA4F04524D760878], state=RUNNABLE, group=TGRP-
>> TestMultiMMap],
>> > registration stack trace below.
>> >
>> > Stack Trace:
>> > com.carrotsearch.randomizedtesting.ResourceDisposalError: Resource in
>> scope
>> > SUITE failed to close. Resource was registered from thread Thread[id=695,
>> > name=TEST-TestMultiMMap.testSeekSliceEnd-seed#[AA4F04524D760878],
>> > state=RUNNABLE, group=TGRP-TestMultiMMap], registration stack trace
>> > below.
>> >     at java.lang.Thread.getStackTrace(Thread.java:1567)
>> >     at
>> >
>> com.carrotsearch.randomizedtesting.RandomizedContext.closeAtEnd(Randomiz
>> > edContext.java:150)
>> >     at
>> >
>> org.apache.lucene.util.LuceneTestCase.closeAfterSuite(LuceneTestCase.java:48
>> > 5)
>> >     at org.apache.lucene.util._TestUtil.getTempDir(_TestUtil.java:97)
>> >     at
>> >
>> org.apache.lucene.store.TestMultiMMap.testSeekSliceEnd(TestMultiMMap.jav
>> > a:164)
>> >     at sun.reflect.NativeMethodAccessorImpl.invoke0(Native Method)
>> >     at
>> >
>> sun.reflect.NativeMethodAccessorImpl.invoke(NativeMethodAccessorImpl.java:
>> > 57)
>> >     at
>> >
>> sun.reflect.DelegatingMethodAccessorImpl.invoke(DelegatingMethodAccessorI
>> > mpl.java:43)
>> >     at java.lang.reflect.Method.invoke(Method.java:601)
>> >     at
>> >
>> com.carrotsearch.randomizedtesting.RandomizedRunner.invoke(RandomizedRu
>> > nner.java:1559)
>> >     at
>> >
>> com.carrotsearch.randomizedtesting.RandomizedRunner.access$600(Randomiz
>> > edRunner.java:79)
>> >     at
>> >
>> com.carrotsearch.randomizedtesting.RandomizedRunner$6.evaluate(Randomiz
>> > edRunner.java:737)
>> >     at
>> >
>> com.carrotsearch.randomizedtesting.RandomizedRunner$7.evaluate(Randomiz
>> > edRunner.java:773)
>> >     at
>> >
>> com.carrotsearch.randomizedtesting.RandomizedRunner$8.evaluate(Randomiz
>> > edRunner.java:787)
>> >     at
>> >
>> org.apache.lucene.util.TestRuleSetupTeardownChained$1.evaluate(TestRuleSet
>> > upTeardownChained.java:50)
>> >     at
>> >
>> org.apache.lucene.util.TestRuleFieldCacheSanity$1.evaluate(TestRuleFieldCach
>> > eSanity.java:51)
>> >     at
>> >
>> org.apache.lucene.util.AbstractBeforeAfterRule$1.evaluate(AbstractBeforeAfte
>> > rRule.java:45)
>> >     at
>> >
>> com.carrotsearch.randomizedtesting.rules.SystemPropertiesInvariantRule$1.ev
>> > aluate(SystemPropertiesInvariantRule.java:55)
>> >     at
>> >
>> org.apache.lucene.util.TestRuleThreadAndTestName$1.evaluate(TestRuleThrea
>> > dAndTestName.java:48)
>> >     at
>> >
>> org.apache.lucene.util.TestRuleIgnoreAfterMaxFailures$1.evaluate(TestRuleIgn
>> > oreAfterMaxFailures.java:70)
>> >     at
>> >
>> org.apache.lucene.util.TestRuleMarkFailure$1.evaluate(TestRuleMarkFailure.ja
>> > va:48)
>> >     at
>> >
>> com.carrotsearch.randomizedtesting.rules.StatementAdapter.evaluate(Stateme
>> > ntAdapter.java:36)
>> >     at
>> >
>> com.carrotsearch.randomizedtesting.ThreadLeakControl$StatementRunner.run
>> > (ThreadLeakControl.java:358)
>> >     at
>> >
>> com.carrotsearch.randomizedtesting.ThreadLeakControl.forkTimeoutingTask(T
>> > hreadLeakControl.java:782)
>> >     at
>> >
>> com.carrotsearch.randomizedtesting.ThreadLeakControl$3.evaluate(ThreadLea
>> > kControl.java:442)
>> >     at
>> >
>> com.carrotsearch.randomizedtesting.RandomizedRunner.runSingleTest(Rando
>> > mizedRunner.java:746)
>> >     at
>> >
>> com.carrotsearch.randomizedtesting.RandomizedRunner$3.evaluate(Randomiz
>> > edRunner.java:648)
>> >     at
>> >
>> com.carrotsearch.randomizedtesting.RandomizedRunner$4.evaluate(Randomiz
>> > edRunner.java:682)
>> >     at
>> >
>> com.carrotsearch.randomizedtesting.RandomizedRunner$5.evaluate(Randomiz
>> > edRunner.java:693)
>> >     at
>> >
>> org.apache.lucene.util.AbstractBeforeAfterRule$1.evaluate(AbstractBeforeAfte
>> > rRule.java:45)
>> >     at
>> >
>> org.apache.lucene.util.TestRuleStoreClassName$1.evaluate(TestRuleStoreClass
>> > Name.java:42)
>> >     at
>> >
>> com.carrotsearch.randomizedtesting.rules.SystemPropertiesInvariantRule$1.ev
>> > aluate(SystemPropertiesInvariantRule.java:55)
>> >     at
>> >
>> com.carrotsearch.randomizedtesting.rules.NoShadowingOrOverridesOnMethod
>> > sRule$1.evaluate(NoShadowingOrOverridesOnMethodsRule.java:39)
>> >     at
>> >
>> com.carrotsearch.randomizedtesting.rules.NoShadowingOrOverridesOnMethod
>> > sRule$1.evaluate(NoShadowingOrOverridesOnMethodsRule.java:39)
>> >     at
>> >
>> org.apache.lucene.util.TestRuleAssertionsRequired$1.evaluate(TestRuleAssertio
>> > nsRequired.java:40)
>> >     at
>> >
>> org.apache.lucene.util.TestRuleMarkFailure$1.evaluate(TestRuleMarkFailure.ja
>> > va:48)
>> >     at
>> >
>> org.apache.lucene.util.TestRuleIgnoreAfterMaxFailures$1.evaluate(TestRuleIgn
>> > oreAfterMaxFailures.java:70)
>> >     at
>> >
>> org.apache.lucene.util.TestRuleIgnoreTestSuites$1.evaluate(TestRuleIgnoreTest
>> > Suites.java:55)
>> >     at
>> >
>> com.carrotsearch.randomizedtesting.rules.StatementAdapter.evaluate(Stateme
>> > ntAdapter.java:36)
>> >     at
>> >
>> com.carrotsearch.randomizedtesting.ThreadLeakControl$StatementRunner.run
>> > (ThreadLeakControl.java:358)
>> >     at java.lang.Thread.run(Thread.java:722)
>> > Caused by: java.io.IOException: Could not remove:
>> > C:\Jenkins\workspace\Lucene-Solr-trunk-
>> > Windows\lucene\build\core\test\J0\.\testSeekSliceEnd4659546754tmp
>> >     at org.apache.lucene.util.CloseableFile.close(CloseableFile.java:47)
>> >     at
>> >
>> com.carrotsearch.randomizedtesting.RandomizedRunner$2$1.apply(Randomize
>> > dRunner.java:602)
>> >     at
>> >
>> com.carrotsearch.randomizedtesting.RandomizedRunner$2$1.apply(Randomize
>> > dRunner.java:599)
>> >     at
>> >
>> com.carrotsearch.randomizedtesting.RandomizedContext.closeResources(Rand
>> > omizedContext.java:167)
>> >     at
>> >
>> com.carrotsearch.randomizedtesting.RandomizedRunner$2.afterAlways(Rando
>> > mizedRunner.java:615)
>> >     at
>> >
>> com.carrotsearch.randomizedtesting.rules.StatementAdapter.evaluate(Stateme
>> > ntAdapter.java:43)
>> >     ... 2 more
>> >
>> >
>> > FAILED:  junit.framework.TestSuite.org.apache.lucene.store.TestMultiMMap
>> >
>> > Error Message:
>> > Resource in scope SUITE failed to close. Resource was registered from thread
>> > Thread[id=695, name=TEST-TestMultiMMap.testSeekSliceEnd-
>> > seed#[AA4F04524D760878], state=RUNNABLE, group=TGRP-
>> TestMultiMMap],
>> > registration stack trace below.
>> >
>> > Stack Trace:
>> > com.carrotsearch.randomizedtesting.ResourceDisposalError: Resource in
>> scope
>> > SUITE failed to close. Resource was registered from thread Thread[id=695,
>> > name=TEST-TestMultiMMap.testSeekSliceEnd-seed#[AA4F04524D760878],
>> > state=RUNNABLE, group=TGRP-TestMultiMMap], registration stack trace
>> > below.
>> >     at java.lang.Thread.getStackTrace(Thread.java:1567)
>> >     at
>> >
>> com.carrotsearch.randomizedtesting.RandomizedContext.closeAtEnd(Randomiz
>> > edContext.java:150)
>> >     at
>> >
>> org.apache.lucene.util.LuceneTestCase.closeAfterSuite(LuceneTestCase.java:48
>> > 5)
>> >     at org.apache.lucene.util._TestUtil.getTempDir(_TestUtil.java:97)
>> >     at
>> >
>> org.apache.lucene.store.TestMultiMMap.testSeekSliceEnd(TestMultiMMap.jav
>> > a:164)
>> >     at sun.reflect.NativeMethodAccessorImpl.invoke0(Native Method)
>> >     at
>> >
>> sun.reflect.NativeMethodAccessorImpl.invoke(NativeMethodAccessorImpl.java:
>> > 57)
>> >     at
>> >
>> sun.reflect.DelegatingMethodAccessorImpl.invoke(DelegatingMethodAccessorI
>> > mpl.java:43)
>> >     at java.lang.reflect.Method.invoke(Method.java:601)
>> >     at
>> >
>> com.carrotsearch.randomizedtesting.RandomizedRunner.invoke(RandomizedRu
>> > nner.java:1559)
>> >     at
>> >
>> com.carrotsearch.randomizedtesting.RandomizedRunner.access$600(Randomiz
>> > edRunner.java:79)
>> >     at
>> >
>> com.carrotsearch.randomizedtesting.RandomizedRunner$6.evaluate(Randomiz
>> > edRunner.java:737)
>> >     at
>> >
>> com.carrotsearch.randomizedtesting.RandomizedRunner$7.evaluate(Randomiz
>> > edRunner.java:773)
>> >     at
>> >
>> com.carrotsearch.randomizedtesting.RandomizedRunner$8.evaluate(Randomiz
>> > edRunner.java:787)
>> >     at
>> >
>> org.apache.lucene.util.TestRuleSetupTeardownChained$1.evaluate(TestRuleSet
>> > upTeardownChained.java:50)
>> >     at
>> >
>> org.apache.lucene.util.TestRuleFieldCacheSanity$1.evaluate(TestRuleFieldCach
>> > eSanity.java:51)
>> >     at
>> >
>> org.apache.lucene.util.AbstractBeforeAfterRule$1.evaluate(AbstractBeforeAfte
>> > rRule.java:45)
>> >     at
>> >
>> com.carrotsearch.randomizedtesting.rules.SystemPropertiesInvariantRule$1.ev
>> > aluate(SystemPropertiesInvariantRule.java:55)
>> >     at
>> >
>> org.apache.lucene.util.TestRuleThreadAndTestName$1.evaluate(TestRuleThrea
>> > dAndTestName.java:48)
>> >     at
>> >
>> org.apache.lucene.util.TestRuleIgnoreAfterMaxFailures$1.evaluate(TestRuleIgn
>> > oreAfterMaxFailures.java:70)
>> >     at
>> >
>> org.apache.lucene.util.TestRuleMarkFailure$1.evaluate(TestRuleMarkFailure.ja
>> > va:48)
>> >     at
>> >
>> com.carrotsearch.randomizedtesting.rules.StatementAdapter.evaluate(Stateme
>> > ntAdapter.java:36)
>> >     at
>> >
>> com.carrotsearch.randomizedtesting.ThreadLeakControl$StatementRunner.run
>> > (ThreadLeakControl.java:358)
>> >     at
>> >
>> com.carrotsearch.randomizedtesting.ThreadLeakControl.forkTimeoutingTask(T
>> > hreadLeakControl.java:782)
>> >     at
>> >
>> com.carrotsearch.randomizedtesting.ThreadLeakControl$3.evaluate(ThreadLea
>> > kControl.java:442)
>> >     at
>> >
>> com.carrotsearch.randomizedtesting.RandomizedRunner.runSingleTest(Rando
>> > mizedRunner.java:746)
>> >     at
>> >
>> com.carrotsearch.randomizedtesting.RandomizedRunner$3.evaluate(Randomiz
>> > edRunner.java:648)
>> >     at
>> >
>> com.carrotsearch.randomizedtesting.RandomizedRunner$4.evaluate(Randomiz
>> > edRunner.java:682)
>> >     at
>> >
>> com.carrotsearch.randomizedtesting.RandomizedRunner$5.evaluate(Randomiz
>> > edRunner.java:693)
>> >     at
>> >
>> org.apache.lucene.util.AbstractBeforeAfterRule$1.evaluate(AbstractBeforeAfte
>> > rRule.java:45)
>> >     at
>> >
>> org.apache.lucene.util.TestRuleStoreClassName$1.evaluate(TestRuleStoreClass
>> > Name.java:42)
>> >     at
>> >
>> com.carrotsearch.randomizedtesting.rules.SystemPropertiesInvariantRule$1.ev
>> > aluate(SystemPropertiesInvariantRule.java:55)
>> >     at
>> >
>> com.carrotsearch.randomizedtesting.rules.NoShadowingOrOverridesOnMethod
>> > sRule$1.evaluate(NoShadowingOrOverridesOnMethodsRule.java:39)
>> >     at
>> >
>> com.carrotsearch.randomizedtesting.rules.NoShadowingOrOverridesOnMethod
>> > sRule$1.evaluate(NoShadowingOrOverridesOnMethodsRule.java:39)
>> >     at
>> >
>> org.apache.lucene.util.TestRuleAssertionsRequired$1.evaluate(TestRuleAssertio
>> > nsRequired.java:40)
>> >     at
>> >
>> org.apache.lucene.util.TestRuleMarkFailure$1.evaluate(TestRuleMarkFailure.ja
>> > va:48)
>> >     at
>> >
>> org.apache.lucene.util.TestRuleIgnoreAfterMaxFailures$1.evaluate(TestRuleIgn
>> > oreAfterMaxFailures.java:70)
>> >     at
>> >
>> org.apache.lucene.util.TestRuleIgnoreTestSuites$1.evaluate(TestRuleIgnoreTest
>> > Suites.java:55)
>> >     at
>> >
>> com.carrotsearch.randomizedtesting.rules.StatementAdapter.evaluate(Stateme
>> > ntAdapter.java:36)
>> >     at
>> >
>> com.carrotsearch.randomizedtesting.ThreadLeakControl$StatementRunner.run
>> > (ThreadLeakControl.java:358)
>> >     at java.lang.Thread.run(Thread.java:722)
>> > Caused by: java.io.IOException: Could not remove:
>> > C:\Jenkins\workspace\Lucene-Solr-trunk-
>> > Windows\lucene\build\core\test\J0\.\testSeekSliceEnd4659546755tmp
>> >     at org.apache.lucene.util.CloseableFile.close(CloseableFile.java:47)
>> >     at
>> >
>> com.carrotsearch.randomizedtesting.RandomizedRunner$2$1.apply(Randomize
>> > dRunner.java:602)
>> >     at
>> >
>> com.carrotsearch.randomizedtesting.RandomizedRunner$2$1.apply(Randomize
>> > dRunner.java:599)
>> >     at
>> >
>> com.carrotsearch.randomizedtesting.RandomizedContext.closeResources(Rand
>> > omizedContext.java:167)
>> >     at
>> >
>> com.carrotsearch.randomizedtesting.RandomizedRunner$2.afterAlways(Rando
>> > mizedRunner.java:615)
>> >     at
>> >
>> com.carrotsearch.randomizedtesting.rules.StatementAdapter.evaluate(Stateme
>> > ntAdapter.java:43)
>> >     ... 2 more
>> >
>> >
>> > FAILED:  junit.framework.TestSuite.org.apache.lucene.store.TestMultiMMap
>> >
>> > Error Message:
>> > Resource in scope SUITE failed to close. Resource was registered from thread
>> > Thread[id=695, name=TEST-TestMultiMMap.testSeekSliceEnd-
>> > seed#[AA4F04524D760878], state=RUNNABLE, group=TGRP-
>> TestMultiMMap],
>> > registration stack trace below.
>> >
>> > Stack Trace:
>> > com.carrotsearch.randomizedtesting.ResourceDisposalError: Resource in
>> scope
>> > SUITE failed to close. Resource was registered from thread Thread[id=695,
>> > name=TEST-TestMultiMMap.testSeekSliceEnd-seed#[AA4F04524D760878],
>> > state=RUNNABLE, group=TGRP-TestMultiMMap], registration stack trace
>> > below.
>> >     at java.lang.Thread.getStackTrace(Thread.java:1567)
>> >     at
>> >
>> com.carrotsearch.randomizedtesting.RandomizedContext.closeAtEnd(Randomiz
>> > edContext.java:150)
>> >     at
>> >
>> org.apache.lucene.util.LuceneTestCase.closeAfterSuite(LuceneTestCase.java:48
>> > 5)
>> >     at org.apache.lucene.util._TestUtil.getTempDir(_TestUtil.java:97)
>> >     at
>> >
>> org.apache.lucene.store.TestMultiMMap.testSeekSliceEnd(TestMultiMMap.jav
>> > a:164)
>> >     at sun.reflect.NativeMethodAccessorImpl.invoke0(Native Method)
>> >     at
>> >
>> sun.reflect.NativeMethodAccessorImpl.invoke(NativeMethodAccessorImpl.java:
>> > 57)
>> >     at
>> >
>> sun.reflect.DelegatingMethodAccessorImpl.invoke(DelegatingMethodAccessorI
>> > mpl.java:43)
>> >     at java.lang.reflect.Method.invoke(Method.java:601)
>> >     at
>> >
>> com.carrotsearch.randomizedtesting.RandomizedRunner.invoke(RandomizedRu
>> > nner.java:1559)
>> >     at
>> >
>> com.carrotsearch.randomizedtesting.RandomizedRunner.access$600(Randomiz
>> > edRunner.java:79)
>> >     at
>> >
>> com.carrotsearch.randomizedtesting.RandomizedRunner$6.evaluate(Randomiz
>> > edRunner.java:737)
>> >     at
>> >
>> com.carrotsearch.randomizedtesting.RandomizedRunner$7.evaluate(Randomiz
>> > edRunner.java:773)
>> >     at
>> >
>> com.carrotsearch.randomizedtesting.RandomizedRunner$8.evaluate(Randomiz
>> > edRunner.java:787)
>> >     at
>> >
>> org.apache.lucene.util.TestRuleSetupTeardownChained$1.evaluate(TestRuleSet
>> > upTeardownChained.java:50)
>> >     at
>> >
>> org.apache.lucene.util.TestRuleFieldCacheSanity$1.evaluate(TestRuleFieldCach
>> > eSanity.java:51)
>> >     at
>> >
>> org.apache.lucene.util.AbstractBeforeAfterRule$1.evaluate(AbstractBeforeAfte
>> > rRule.java:45)
>> >     at
>> >
>> com.carrotsearch.randomizedtesting.rules.SystemPropertiesInvariantRule$1.ev
>> > aluate(SystemPropertiesInvariantRule.java:55)
>> >     at
>> >
>> org.apache.lucene.util.TestRuleThreadAndTestName$1.evaluate(TestRuleThrea
>> > dAndTestName.java:48)
>> >     at
>> >
>> org.apache.lucene.util.TestRuleIgnoreAfterMaxFailures$1.evaluate(TestRuleIgn
>> > oreAfterMaxFailures.java:70)
>> >     at
>> >
>> org.apache.lucene.util.TestRuleMarkFailure$1.evaluate(TestRuleMarkFailure.ja
>> > va:48)
>> >     at
>> >
>> com.carrotsearch.randomizedtesting.rules.StatementAdapter.evaluate(Stateme
>> > ntAdapter.java:36)
>> >     at
>> >
>> com.carrotsearch.randomizedtesting.ThreadLeakControl$StatementRunner.run
>> > (ThreadLeakControl.java:358)
>> >     at
>> >
>> com.carrotsearch.randomizedtesting.ThreadLeakControl.forkTimeoutingTask(T
>> > hreadLeakControl.java:782)
>> >     at
>> >
>> com.carrotsearch.randomizedtesting.ThreadLeakControl$3.evaluate(ThreadLea
>> > kControl.java:442)
>> >     at
>> >
>> com.carrotsearch.randomizedtesting.RandomizedRunner.runSingleTest(Rando
>> > mizedRunner.java:746)
>> >     at
>> >
>> com.carrotsearch.randomizedtesting.RandomizedRunner$3.evaluate(Randomiz
>> > edRunner.java:648)
>> >     at
>> >
>> com.carrotsearch.randomizedtesting.RandomizedRunner$4.evaluate(Randomiz
>> > edRunner.java:682)
>> >     at
>> >
>> com.carrotsearch.randomizedtesting.RandomizedRunner$5.evaluate(Randomiz
>> > edRunner.java:693)
>> >     at
>> >
>> org.apache.lucene.util.AbstractBeforeAfterRule$1.evaluate(AbstractBeforeAfte
>> > rRule.java:45)
>> >     at
>> >
>> org.apache.lucene.util.TestRuleStoreClassName$1.evaluate(TestRuleStoreClass
>> > Name.java:42)
>> >     at
>> >
>> com.carrotsearch.randomizedtesting.rules.SystemPropertiesInvariantRule$1.ev
>> > aluate(SystemPropertiesInvariantRule.java:55)
>> >     at
>> >
>> com.carrotsearch.randomizedtesting.rules.NoShadowingOrOverridesOnMethod
>> > sRule$1.evaluate(NoShadowingOrOverridesOnMethodsRule.java:39)
>> >     at
>> >
>> com.carrotsearch.randomizedtesting.rules.NoShadowingOrOverridesOnMethod
>> > sRule$1.evaluate(NoShadowingOrOverridesOnMethodsRule.java:39)
>> >     at
>> >
>> org.apache.lucene.util.TestRuleAssertionsRequired$1.evaluate(TestRuleAssertio
>> > nsRequired.java:40)
>> >     at
>> >
>> org.apache.lucene.util.TestRuleMarkFailure$1.evaluate(TestRuleMarkFailure.ja
>> > va:48)
>> >     at
>> >
>> org.apache.lucene.util.TestRuleIgnoreAfterMaxFailures$1.evaluate(TestRuleIgn
>> > oreAfterMaxFailures.java:70)
>> >     at
>> >
>> org.apache.lucene.util.TestRuleIgnoreTestSuites$1.evaluate(TestRuleIgnoreTest
>> > Suites.java:55)
>> >     at
>> >
>> com.carrotsearch.randomizedtesting.rules.StatementAdapter.evaluate(Stateme
>> > ntAdapter.java:36)
>> >     at
>> >
>> com.carrotsearch.randomizedtesting.ThreadLeakControl$StatementRunner.run
>> > (ThreadLeakControl.java:358)
>> >     at java.lang.Thread.run(Thread.java:722)
>> > Caused by: java.io.IOException: Could not remove:
>> > C:\Jenkins\workspace\Lucene-Solr-trunk-
>> > Windows\lucene\build\core\test\J0\.\testSeekSliceEnd4659546756tmp
>> >     at org.apache.lucene.util.CloseableFile.close(CloseableFile.java:47)
>> >     at
>> >
>> com.carrotsearch.randomizedtesting.RandomizedRunner$2$1.apply(Randomize
>> > dRunner.java:602)
>> >     at
>> >
>> com.carrotsearch.randomizedtesting.RandomizedRunner$2$1.apply(Randomize
>> > dRunner.java:599)
>> >     at
>> >
>> com.carrotsearch.randomizedtesting.RandomizedContext.closeResources(Rand
>> > omizedContext.java:167)
>> >     at
>> >
>> com.carrotsearch.randomizedtesting.RandomizedRunner$2.afterAlways(Rando
>> > mizedRunner.java:615)
>> >     at
>> >
>> com.carrotsearch.randomizedtesting.rules.StatementAdapter.evaluate(Stateme
>> > ntAdapter.java:43)
>> >     ... 2 more
>> >
>> >
>> > FAILED:  junit.framework.TestSuite.org.apache.lucene.store.TestMultiMMap
>> >
>> > Error Message:
>> > Resource in scope SUITE failed to close. Resource was registered from thread
>> > Thread[id=695, name=TEST-TestMultiMMap.testSeekSliceEnd-
>> > seed#[AA4F04524D760878], state=RUNNABLE, group=TGRP-
>> TestMultiMMap],
>> > registration stack trace below.
>> >
>> > Stack Trace:
>> > com.carrotsearch.randomizedtesting.ResourceDisposalError: Resource in
>> scope
>> > SUITE failed to close. Resource was registered from thread Thread[id=695,
>> > name=TEST-TestMultiMMap.testSeekSliceEnd-seed#[AA4F04524D760878],
>> > state=RUNNABLE, group=TGRP-TestMultiMMap], registration stack trace
>> > below.
>> >     at java.lang.Thread.getStackTrace(Thread.java:1567)
>> >     at
>> >
>> com.carrotsearch.randomizedtesting.RandomizedContext.closeAtEnd(Randomiz
>> > edContext.java:150)
>> >     at
>> >
>> org.apache.lucene.util.LuceneTestCase.closeAfterSuite(LuceneTestCase.java:48
>> > 5)
>> >     at org.apache.lucene.util._TestUtil.getTempDir(_TestUtil.java:97)
>> >     at
>> >
>> org.apache.lucene.store.TestMultiMMap.testSeekSliceEnd(TestMultiMMap.jav
>> > a:164)
>> >     at sun.reflect.NativeMethodAccessorImpl.invoke0(Native Method)
>> >     at
>> >
>> sun.reflect.NativeMethodAccessorImpl.invoke(NativeMethodAccessorImpl.java:
>> > 57)
>> >     at
>> >
>> sun.reflect.DelegatingMethodAccessorImpl.invoke(DelegatingMethodAccessorI
>> > mpl.java:43)
>> >     at java.lang.reflect.Method.invoke(Method.java:601)
>> >     at
>> >
>> com.carrotsearch.randomizedtesting.RandomizedRunner.invoke(RandomizedRu
>> > nner.java:1559)
>> >     at
>> >
>> com.carrotsearch.randomizedtesting.RandomizedRunner.access$600(Randomiz
>> > edRunner.java:79)
>> >     at
>> >
>> com.carrotsearch.randomizedtesting.RandomizedRunner$6.evaluate(Randomiz
>> > edRunner.java:737)
>> >     at
>> >
>> com.carrotsearch.randomizedtesting.RandomizedRunner$7.evaluate(Randomiz
>> > edRunner.java:773)
>> >     at
>> >
>> com.carrotsearch.randomizedtesting.RandomizedRunner$8.evaluate(Randomiz
>> > edRunner.java:787)
>> >     at
>> >
>> org.apache.lucene.util.TestRuleSetupTeardownChained$1.evaluate(TestRuleSet
>> > upTeardownChained.java:50)
>> >     at
>> >
>> org.apache.lucene.util.TestRuleFieldCacheSanity$1.evaluate(TestRuleFieldCach
>> > eSanity.java:51)
>> >     at
>> >
>> org.apache.lucene.util.AbstractBeforeAfterRule$1.evaluate(AbstractBeforeAfte
>> > rRule.java:45)
>> >     at
>> >
>> com.carrotsearch.randomizedtesting.rules.SystemPropertiesInvariantRule$1.ev
>> > aluate(SystemPropertiesInvariantRule.java:55)
>> >     at
>> >
>> org.apache.lucene.util.TestRuleThreadAndTestName$1.evaluate(TestRuleThrea
>> > dAndTestName.java:48)
>> >     at
>> >
>> org.apache.lucene.util.TestRuleIgnoreAfterMaxFailures$1.evaluate(TestRuleIgn
>> > oreAfterMaxFailures.java:70)
>> >     at
>> >
>> org.apache.lucene.util.TestRuleMarkFailure$1.evaluate(TestRuleMarkFailure.ja
>> > va:48)
>> >     at
>> >
>> com.carrotsearch.randomizedtesting.rules.StatementAdapter.evaluate(Stateme
>> > ntAdapter.java:36)
>> >     at
>> >
>> com.carrotsearch.randomizedtesting.ThreadLeakControl$StatementRunner.run
>> > (ThreadLeakControl.java:358)
>> >     at
>> >
>> com.carrotsearch.randomizedtesting.ThreadLeakControl.forkTimeoutingTask(T
>> > hreadLeakControl.java:782)
>> >     at
>> >
>> com.carrotsearch.randomizedtesting.ThreadLeakControl$3.evaluate(ThreadLea
>> > kControl.java:442)
>> >     at
>> >
>> com.carrotsearch.randomizedtesting.RandomizedRunner.runSingleTest(Rando
>> > mizedRunner.java:746)
>> >     at
>> >
>> com.carrotsearch.randomizedtesting.RandomizedRunner$3.evaluate(Randomiz
>> > edRunner.java:648)
>> >     at
>> >
>> com.carrotsearch.randomizedtesting.RandomizedRunner$4.evaluate(Randomiz
>> > edRunner.java:682)
>> >     at
>> >
>> com.carrotsearch.randomizedtesting.RandomizedRunner$5.evaluate(Randomiz
>> > edRunner.java:693)
>> >     at
>> >
>> org.apache.lucene.util.AbstractBeforeAfterRule$1.evaluate(AbstractBeforeAfte
>> > rRule.java:45)
>> >     at
>> >
>> org.apache.lucene.util.TestRuleStoreClassName$1.evaluate(TestRuleStoreClass
>> > Name.java:42)
>> >     at
>> >
>> com.carrotsearch.randomizedtesting.rules.SystemPropertiesInvariantRule$1.ev
>> > aluate(SystemPropertiesInvariantRule.java:55)
>> >     at
>> >
>> com.carrotsearch.randomizedtesting.rules.NoShadowingOrOverridesOnMethod
>> > sRule$1.evaluate(NoShadowingOrOverridesOnMethodsRule.java:39)
>> >     at
>> >
>> com.carrotsearch.randomizedtesting.rules.NoShadowingOrOverridesOnMethod
>> > sRule$1.evaluate(NoShadowingOrOverridesOnMethodsRule.java:39)
>> >     at
>> >
>> org.apache.lucene.util.TestRuleAssertionsRequired$1.evaluate(TestRuleAssertio
>> > nsRequired.java:40)
>> >     at
>> >
>> org.apache.lucene.util.TestRuleMarkFailure$1.evaluate(TestRuleMarkFailure.ja
>> > va:48)
>> >     at
>> >
>> org.apache.lucene.util.TestRuleIgnoreAfterMaxFailures$1.evaluate(TestRuleIgn
>> > oreAfterMaxFailures.java:70)
>> >     at
>> >
>> org.apache.lucene.util.TestRuleIgnoreTestSuites$1.evaluate(TestRuleIgnoreTest
>> > Suites.java:55)
>> >     at
>> >
>> com.carrotsearch.randomizedtesting.rules.StatementAdapter.evaluate(Stateme
>> > ntAdapter.java:36)
>> >     at
>> >
>> com.carrotsearch.randomizedtesting.ThreadLeakControl$StatementRunner.run
>> > (ThreadLeakControl.java:358)
>> >     at java.lang.Thread.run(Thread.java:722)
>> > Caused by: java.io.IOException: Could not remove:
>> > C:\Jenkins\workspace\Lucene-Solr-trunk-
>> > Windows\lucene\build\core\test\J0\.\testSeekSliceEnd4659546757tmp
>> >     at org.apache.lucene.util.CloseableFile.close(CloseableFile.java:47)
>> >     at
>> >
>> com.carrotsearch.randomizedtesting.RandomizedRunner$2$1.apply(Randomize
>> > dRunner.java:602)
>> >     at
>> >
>> com.carrotsearch.randomizedtesting.RandomizedRunner$2$1.apply(Randomize
>> > dRunner.java:599)
>> >     at
>> >
>> com.carrotsearch.randomizedtesting.RandomizedContext.closeResources(Rand
>> > omizedContext.java:167)
>> >     at
>> >
>> com.carrotsearch.randomizedtesting.RandomizedRunner$2.afterAlways(Rando
>> > mizedRunner.java:615)
>> >     at
>> >
>> com.carrotsearch.randomizedtesting.rules.StatementAdapter.evaluate(Stateme
>> > ntAdapter.java:43)
>> >     ... 2 more
>> >
>> >
>> > FAILED:  junit.framework.TestSuite.org.apache.lucene.store.TestMultiMMap
>> >
>> > Error Message:
>> > Resource in scope SUITE failed to close. Resource was registered from thread
>> > Thread[id=695, name=TEST-TestMultiMMap.testSeekSliceEnd-
>> > seed#[AA4F04524D760878], state=RUNNABLE, group=TGRP-
>> TestMultiMMap],
>> > registration stack trace below.
>> >
>> > Stack Trace:
>> > com.carrotsearch.randomizedtesting.ResourceDisposalError: Resource in
>> scope
>> > SUITE failed to close. Resource was registered from thread Thread[id=695,
>> > name=TEST-TestMultiMMap.testSeekSliceEnd-seed#[AA4F04524D760878],
>> > state=RUNNABLE, group=TGRP-TestMultiMMap], registration stack trace
>> > below.
>> >     at java.lang.Thread.getStackTrace(Thread.java:1567)
>> >     at
>> >
>> com.carrotsearch.randomizedtesting.RandomizedContext.closeAtEnd(Randomiz
>> > edContext.java:150)
>> >     at
>> >
>> org.apache.lucene.util.LuceneTestCase.closeAfterSuite(LuceneTestCase.java:48
>> > 5)
>> >     at org.apache.lucene.util._TestUtil.getTempDir(_TestUtil.java:97)
>> >     at
>> >
>> org.apache.lucene.store.TestMultiMMap.testSeekSliceEnd(TestMultiMMap.jav
>> > a:164)
>> >     at sun.reflect.NativeMethodAccessorImpl.invoke0(Native Method)
>> >     at
>> >
>> sun.reflect.NativeMethodAccessorImpl.invoke(NativeMethodAccessorImpl.java:
>> > 57)
>> >     at
>> >
>> sun.reflect.DelegatingMethodAccessorImpl.invoke(DelegatingMethodAccessorI
>> > mpl.java:43)
>> >     at java.lang.reflect.Method.invoke(Method.java:601)
>> >     at
>> >
>> com.carrotsearch.randomizedtesting.RandomizedRunner.invoke(RandomizedRu
>> > nner.java:1559)
>> >     at
>> >
>> com.carrotsearch.randomizedtesting.RandomizedRunner.access$600(Randomiz
>> > edRunner.java:79)
>> >     at
>> >
>> com.carrotsearch.randomizedtesting.RandomizedRunner$6.evaluate(Randomiz
>> > edRunner.java:737)
>> >     at
>> >
>> com.carrotsearch.randomizedtesting.RandomizedRunner$7.evaluate(Randomiz
>> > edRunner.java:773)
>> >     at
>> >
>> com.carrotsearch.randomizedtesting.RandomizedRunner$8.evaluate(Randomiz
>> > edRunner.java:787)
>> >     at
>> >
>> org.apache.lucene.util.TestRuleSetupTeardownChained$1.evaluate(TestRuleSet
>> > upTeardownChained.java:50)
>> >     at
>> >
>> org.apache.lucene.util.TestRuleFieldCacheSanity$1.evaluate(TestRuleFieldCach
>> > eSanity.java:51)
>> >     at
>> >
>> org.apache.lucene.util.AbstractBeforeAfterRule$1.evaluate(AbstractBeforeAfte
>> > rRule.java:45)
>> >     at
>> >
>> com.carrotsearch.randomizedtesting.rules.SystemPropertiesInvariantRule$1.ev
>> > aluate(SystemPropertiesInvariantRule.java:55)
>> >     at
>> >
>> org.apache.lucene.util.TestRuleThreadAndTestName$1.evaluate(TestRuleThrea
>> > dAndTestName.java:48)
>> >     at
>> >
>> org.apache.lucene.util.TestRuleIgnoreAfterMaxFailures$1.evaluate(TestRuleIgn
>> > oreAfterMaxFailures.java:70)
>> >     at
>> >
>> org.apache.lucene.util.TestRuleMarkFailure$1.evaluate(TestRuleMarkFailure.ja
>> > va:48)
>> >     at
>> >
>> com.carrotsearch.randomizedtesting.rules.StatementAdapter.evaluate(Stateme
>> > ntAdapter.java:36)
>> >     at
>> >
>> com.carrotsearch.randomizedtesting.ThreadLeakControl$StatementRunner.run
>> > (ThreadLeakControl.java:358)
>> >     at
>> >
>> com.carrotsearch.randomizedtesting.ThreadLeakControl.forkTimeoutingTask(T
>> > hreadLeakControl.java:782)
>> >     at
>> >
>> com.carrotsearch.randomizedtesting.ThreadLeakControl$3.evaluate(ThreadLea
>> > kControl.java:442)
>> >     at
>> >
>> com.carrotsearch.randomizedtesting.RandomizedRunner.runSingleTest(Rando
>> > mizedRunner.java:746)
>> >     at
>> >
>> com.carrotsearch.randomizedtesting.RandomizedRunner$3.evaluate(Randomiz
>> > edRunner.java:648)
>> >     at
>> >
>> com.carrotsearch.randomizedtesting.RandomizedRunner$4.evaluate(Randomiz
>> > edRunner.java:682)
>> >     at
>> >
>> com.carrotsearch.randomizedtesting.RandomizedRunner$5.evaluate(Randomiz
>> > edRunner.java:693)
>> >     at
>> >
>> org.apache.lucene.util.AbstractBeforeAfterRule$1.evaluate(AbstractBeforeAfte
>> > rRule.java:45)
>> >     at
>> >
>> org.apache.lucene.util.TestRuleStoreClassName$1.evaluate(TestRuleStoreClass
>> > Name.java:42)
>> >     at
>> >
>> com.carrotsearch.randomizedtesting.rules.SystemPropertiesInvariantRule$1.ev
>> > aluate(SystemPropertiesInvariantRule.java:55)
>> >     at
>> >
>> com.carrotsearch.randomizedtesting.rules.NoShadowingOrOverridesOnMethod
>> > sRule$1.evaluate(NoShadowingOrOverridesOnMethodsRule.java:39)
>> >     at
>> >
>> com.carrotsearch.randomizedtesting.rules.NoShadowingOrOverridesOnMethod
>> > sRule$1.evaluate(NoShadowingOrOverridesOnMethodsRule.java:39)
>> >     at
>> >
>> org.apache.lucene.util.TestRuleAssertionsRequired$1.evaluate(TestRuleAssertio
>> > nsRequired.java:40)
>> >     at
>> >
>> org.apache.lucene.util.TestRuleMarkFailure$1.evaluate(TestRuleMarkFailure.ja
>> > va:48)
>> >     at
>> >
>> org.apache.lucene.util.TestRuleIgnoreAfterMaxFailures$1.evaluate(TestRuleIgn
>> > oreAfterMaxFailures.java:70)
>> >     at
>> >
>> org.apache.lucene.util.TestRuleIgnoreTestSuites$1.evaluate(TestRuleIgnoreTest
>> > Suites.java:55)
>> >     at
>> >
>> com.carrotsearch.randomizedtesting.rules.StatementAdapter.evaluate(Stateme
>> > ntAdapter.java:36)
>> >     at
>> >
>> com.carrotsearch.randomizedtesting.ThreadLeakControl$StatementRunner.run
>> > (ThreadLeakControl.java:358)
>> >     at java.lang.Thread.run(Thread.java:722)
>> > Caused by: java.io.IOException: Could not remove:
>> > C:\Jenkins\workspace\Lucene-Solr-trunk-
>> > Windows\lucene\build\core\test\J0\.\testSeekSliceEnd4659546758tmp
>> >     at org.apache.lucene.util.CloseableFile.close(CloseableFile.java:47)
>> >     at
>> >
>> com.carrotsearch.randomizedtesting.RandomizedRunner$2$1.apply(Randomize
>> > dRunner.java:602)
>> >     at
>> >
>> com.carrotsearch.randomizedtesting.RandomizedRunner$2$1.apply(Randomize
>> > dRunner.java:599)
>> >     at
>> >
>> com.carrotsearch.randomizedtesting.RandomizedContext.closeResources(Rand
>> > omizedContext.java:167)
>> >     at
>> >
>> com.carrotsearch.randomizedtesting.RandomizedRunner$2.afterAlways(Rando
>> > mizedRunner.java:615)
>> >     at
>> >
>> com.carrotsearch.randomizedtesting.rules.StatementAdapter.evaluate(Stateme
>> > ntAdapter.java:43)
>> >     ... 2 more
>> >
>> >
>> > FAILED:  junit.framework.TestSuite.org.apache.lucene.store.TestMultiMMap
>> >
>> > Error Message:
>> > Resource in scope SUITE failed to close. Resource was registered from thread
>> > Thread[id=695, name=TEST-TestMultiMMap.testSeekSliceEnd-
>> > seed#[AA4F04524D760878], state=RUNNABLE, group=TGRP-
>> TestMultiMMap],
>> > registration stack trace below.
>> >
>> > Stack Trace:
>> > com.carrotsearch.randomizedtesting.ResourceDisposalError: Resource in
>> scope
>> > SUITE failed to close. Resource was registered from thread Thread[id=695,
>> > name=TEST-TestMultiMMap.testSeekSliceEnd-seed#[AA4F04524D760878],
>> > state=RUNNABLE, group=TGRP-TestMultiMMap], registration stack trace
>> > below.
>> >     at java.lang.Thread.getStackTrace(Thread.java:1567)
>> >     at
>> >
>> com.carrotsearch.randomizedtesting.RandomizedContext.closeAtEnd(Randomiz
>> > edContext.java:150)
>> >     at
>> >
>> org.apache.lucene.util.LuceneTestCase.closeAfterSuite(LuceneTestCase.java:48
>> > 5)
>> >     at org.apache.lucene.util._TestUtil.getTempDir(_TestUtil.java:97)
>> >     at
>> >
>> org.apache.lucene.store.TestMultiMMap.testSeekSliceEnd(TestMultiMMap.jav
>> > a:164)
>> >     at sun.reflect.NativeMethodAccessorImpl.invoke0(Native Method)
>> >     at
>> >
>> sun.reflect.NativeMethodAccessorImpl.invoke(NativeMethodAccessorImpl.java:
>> > 57)
>> >     at
>> >
>> sun.reflect.DelegatingMethodAccessorImpl.invoke(DelegatingMethodAccessorI
>> > mpl.java:43)
>> >     at java.lang.reflect.Method.invoke(Method.java:601)
>> >     at
>> >
>> com.carrotsearch.randomizedtesting.RandomizedRunner.invoke(RandomizedRu
>> > nner.java:1559)
>> >     at
>> >
>> com.carrotsearch.randomizedtesting.RandomizedRunner.access$600(Randomiz
>> > edRunner.java:79)
>> >     at
>> >
>> com.carrotsearch.randomizedtesting.RandomizedRunner$6.evaluate(Randomiz
>> > edRunner.java:737)
>> >     at
>> >
>> com.carrotsearch.randomizedtesting.RandomizedRunner$7.evaluate(Randomiz
>> > edRunner.java:773)
>> >     at
>> >
>> com.carrotsearch.randomizedtesting.RandomizedRunner$8.evaluate(Randomiz
>> > edRunner.java:787)
>> >     at
>> >
>> org.apache.lucene.util.TestRuleSetupTeardownChained$1.evaluate(TestRuleSet
>> > upTeardownChained.java:50)
>> >     at
>> >
>> org.apache.lucene.util.TestRuleFieldCacheSanity$1.evaluate(TestRuleFieldCach
>> > eSanity.java:51)
>> >     at
>> >
>> org.apache.lucene.util.AbstractBeforeAfterRule$1.evaluate(AbstractBeforeAfte
>> > rRule.java:45)
>> >     at
>> >
>> com.carrotsearch.randomizedtesting.rules.SystemPropertiesInvariantRule$1.ev
>> > aluate(SystemPropertiesInvariantRule.java:55)
>> >     at
>> >
>> org.apache.lucene.util.TestRuleThreadAndTestName$1.evaluate(TestRuleThrea
>> > dAndTestName.java:48)
>> >     at
>> >
>> org.apache.lucene.util.TestRuleIgnoreAfterMaxFailures$1.evaluate(TestRuleIgn
>> > oreAfterMaxFailures.java:70)
>> >     at
>> >
>> org.apache.lucene.util.TestRuleMarkFailure$1.evaluate(TestRuleMarkFailure.ja
>> > va:48)
>> >     at
>> >
>> com.carrotsearch.randomizedtesting.rules.StatementAdapter.evaluate(Stateme
>> > ntAdapter.java:36)
>> >     at
>> >
>> com.carrotsearch.randomizedtesting.ThreadLeakControl$StatementRunner.run
>> > (ThreadLeakControl.java:358)
>> >     at
>> >
>> com.carrotsearch.randomizedtesting.ThreadLeakControl.forkTimeoutingTask(T
>> > hreadLeakControl.java:782)
>> >     at
>> >
>> com.carrotsearch.randomizedtesting.ThreadLeakControl$3.evaluate(ThreadLea
>> > kControl.java:442)
>> >     at
>> >
>> com.carrotsearch.randomizedtesting.RandomizedRunner.runSingleTest(Rando
>> > mizedRunner.java:746)
>> >     at
>> >
>> com.carrotsearch.randomizedtesting.RandomizedRunner$3.evaluate(Randomiz
>> > edRunner.java:648)
>> >     at
>> >
>> com.carrotsearch.randomizedtesting.RandomizedRunner$4.evaluate(Randomiz
>> > edRunner.java:682)
>> >     at
>> >
>> com.carrotsearch.randomizedtesting.RandomizedRunner$5.evaluate(Randomiz
>> > edRunner.java:693)
>> >     at
>> >
>> org.apache.lucene.util.AbstractBeforeAfterRule$1.evaluate(AbstractBeforeAfte
>> > rRule.java:45)
>> >     at
>> >
>> org.apache.lucene.util.TestRuleStoreClassName$1.evaluate(TestRuleStoreClass
>> > Name.java:42)
>> >     at
>> >
>> com.carrotsearch.randomizedtesting.rules.SystemPropertiesInvariantRule$1.ev
>> > aluate(SystemPropertiesInvariantRule.java:55)
>> >     at
>> >
>> com.carrotsearch.randomizedtesting.rules.NoShadowingOrOverridesOnMethod
>> > sRule$1.evaluate(NoShadowingOrOverridesOnMethodsRule.java:39)
>> >     at
>> >
>> com.carrotsearch.randomizedtesting.rules.NoShadowingOrOverridesOnMethod
>> > sRule$1.evaluate(NoShadowingOrOverridesOnMethodsRule.java:39)
>> >     at
>> >
>> org.apache.lucene.util.TestRuleAssertionsRequired$1.evaluate(TestRuleAssertio
>> > nsRequired.java:40)
>> >     at
>> >
>> org.apache.lucene.util.TestRuleMarkFailure$1.evaluate(TestRuleMarkFailure.ja
>> > va:48)
>> >     at
>> >
>> org.apache.lucene.util.TestRuleIgnoreAfterMaxFailures$1.evaluate(TestRuleIgn
>> > oreAfterMaxFailures.java:70)
>> >     at
>> >
>> org.apache.lucene.util.TestRuleIgnoreTestSuites$1.evaluate(TestRuleIgnoreTest
>> > Suites.java:55)
>> >     at
>> >
>> com.carrotsearch.randomizedtesting.rules.StatementAdapter.evaluate(Stateme
>> > ntAdapter.java:36)
>> >     at
>> >
>> com.carrotsearch.randomizedtesting.ThreadLeakControl$StatementRunner.run
>> > (ThreadLeakControl.java:358)
>> >     at java.lang.Thread.run(Thread.java:722)
>> > Caused by: java.io.IOException: Could not remove:
>> > C:\Jenkins\workspace\Lucene-Solr-trunk-
>> > Windows\lucene\build\core\test\J0\.\testSeekSliceEnd4659546759tmp
>> >     at org.apache.lucene.util.CloseableFile.close(CloseableFile.java:47)
>> >     at
>> >
>> com.carrotsearch.randomizedtesting.RandomizedRunner$2$1.apply(Randomize
>> > dRunner.java:602)
>> >     at
>> >
>> com.carrotsearch.randomizedtesting.RandomizedRunner$2$1.apply(Randomize
>> > dRunner.java:599)
>> >     at
>> >
>> com.carrotsearch.randomizedtesting.RandomizedContext.closeResources(Rand
>> > omizedContext.java:167)
>> >     at
>> >
>> com.carrotsearch.randomizedtesting.RandomizedRunner$2.afterAlways(Rando
>> > mizedRunner.java:615)
>> >     at
>> >
>> com.carrotsearch.randomizedtesting.rules.StatementAdapter.evaluate(Stateme
>> > ntAdapter.java:43)
>> >     ... 2 more
>> >
>> >
>> > FAILED:  junit.framework.TestSuite.org.apache.lucene.store.TestMultiMMap
>> >
>> > Error Message:
>> > Resource in scope SUITE failed to close. Resource was registered from thread
>> > Thread[id=695, name=TEST-TestMultiMMap.testSeekSliceEnd-
>> > seed#[AA4F04524D760878], state=RUNNABLE, group=TGRP-
>> TestMultiMMap],
>> > registration stack trace below.
>> >
>> > Stack Trace:
>> > com.carrotsearch.randomizedtesting.ResourceDisposalError: Resource in
>> scope
>> > SUITE failed to close. Resource was registered from thread Thread[id=695,
>> > name=TEST-TestMultiMMap.testSeekSliceEnd-seed#[AA4F04524D760878],
>> > state=RUNNABLE, group=TGRP-TestMultiMMap], registration stack trace
>> > below.
>> >     at java.lang.Thread.getStackTrace(Thread.java:1567)
>> >     at
>> >
>> com.carrotsearch.randomizedtesting.RandomizedContext.closeAtEnd(Randomiz
>> > edContext.java:150)
>> >     at
>> >
>> org.apache.lucene.util.LuceneTestCase.closeAfterSuite(LuceneTestCase.java:48
>> > 5)
>> >     at org.apache.lucene.util._TestUtil.getTempDir(_TestUtil.java:97)
>> >     at
>> >
>> org.apache.lucene.store.TestMultiMMap.testSeekSliceEnd(TestMultiMMap.jav
>> > a:164)
>> >     at sun.reflect.NativeMethodAccessorImpl.invoke0(Native Method)
>> >     at
>> >
>> sun.reflect.NativeMethodAccessorImpl.invoke(NativeMethodAccessorImpl.java:
>> > 57)
>> >     at
>> >
>> sun.reflect.DelegatingMethodAccessorImpl.invoke(DelegatingMethodAccessorI
>> > mpl.java:43)
>> >     at java.lang.reflect.Method.invoke(Method.java:601)
>> >     at
>> >
>> com.carrotsearch.randomizedtesting.RandomizedRunner.invoke(RandomizedRu
>> > nner.java:1559)
>> >     at
>> >
>> com.carrotsearch.randomizedtesting.RandomizedRunner.access$600(Randomiz
>> > edRunner.java:79)
>> >     at
>> >
>> com.carrotsearch.randomizedtesting.RandomizedRunner$6.evaluate(Randomiz
>> > edRunner.java:737)
>> >     at
>> >
>> com.carrotsearch.randomizedtesting.RandomizedRunner$7.evaluate(Randomiz
>> > edRunner.java:773)
>> >     at
>> >
>> com.carrotsearch.randomizedtesting.RandomizedRunner$8.evaluate(Randomiz
>> > edRunner.java:787)
>> >     at
>> >
>> org.apache.lucene.util.TestRuleSetupTeardownChained$1.evaluate(TestRuleSet
>> > upTeardownChained.java:50)
>> >     at
>> >
>> org.apache.lucene.util.TestRuleFieldCacheSanity$1.evaluate(TestRuleFieldCach
>> > eSanity.java:51)
>> >     at
>> >
>> org.apache.lucene.util.AbstractBeforeAfterRule$1.evaluate(AbstractBeforeAfte
>> > rRule.java:45)
>> >     at
>> >
>> com.carrotsearch.randomizedtesting.rules.SystemPropertiesInvariantRule$1.ev
>> > aluate(SystemPropertiesInvariantRule.java:55)
>> >     at
>> >
>> org.apache.lucene.util.TestRuleThreadAndTestName$1.evaluate(TestRuleThrea
>> > dAndTestName.java:48)
>> >     at
>> >
>> org.apache.lucene.util.TestRuleIgnoreAfterMaxFailures$1.evaluate(TestRuleIgn
>> > oreAfterMaxFailures.java:70)
>> >     at
>> >
>> org.apache.lucene.util.TestRuleMarkFailure$1.evaluate(TestRuleMarkFailure.ja
>> > va:48)
>> >     at
>> >
>> com.carrotsearch.randomizedtesting.rules.StatementAdapter.evaluate(Stateme
>> > ntAdapter.java:36)
>> >     at
>> >
>> com.carrotsearch.randomizedtesting.ThreadLeakControl$StatementRunner.run
>> > (ThreadLeakControl.java:358)
>> >     at
>> >
>> com.carrotsearch.randomizedtesting.ThreadLeakControl.forkTimeoutingTask(T
>> > hreadLeakControl.java:782)
>> >     at
>> >
>> com.carrotsearch.randomizedtesting.ThreadLeakControl$3.evaluate(ThreadLea
>> > kControl.java:442)
>> >     at
>> >
>> com.carrotsearch.randomizedtesting.RandomizedRunner.runSingleTest(Rando
>> > mizedRunner.java:746)
>> >     at
>> >
>> com.carrotsearch.randomizedtesting.RandomizedRunner$3.evaluate(Randomiz
>> > edRunner.java:648)
>> >     at
>> >
>> com.carrotsearch.randomizedtesting.RandomizedRunner$4.evaluate(Randomiz
>> > edRunner.java:682)
>> >     at
>> >
>> com.carrotsearch.randomizedtesting.RandomizedRunner$5.evaluate(Randomiz
>> > edRunner.java:693)
>> >     at
>> >
>> org.apache.lucene.util.AbstractBeforeAfterRule$1.evaluate(AbstractBeforeAfte
>> > rRule.java:45)
>> >     at
>> >
>> org.apache.lucene.util.TestRuleStoreClassName$1.evaluate(TestRuleStoreClass
>> > Name.java:42)
>> >     at
>> >
>> com.carrotsearch.randomizedtesting.rules.SystemPropertiesInvariantRule$1.ev
>> > aluate(SystemPropertiesInvariantRule.java:55)
>> >     at
>> >
>> com.carrotsearch.randomizedtesting.rules.NoShadowingOrOverridesOnMethod
>> > sRule$1.evaluate(NoShadowingOrOverridesOnMethodsRule.java:39)
>> >     at
>> >
>> com.carrotsearch.randomizedtesting.rules.NoShadowingOrOverridesOnMethod
>> > sRule$1.evaluate(NoShadowingOrOverridesOnMethodsRule.java:39)
>> >     at
>> >
>> org.apache.lucene.util.TestRuleAssertionsRequired$1.evaluate(TestRuleAssertio
>> > nsRequired.java:40)
>> >     at
>> >
>> org.apache.lucene.util.TestRuleMarkFailure$1.evaluate(TestRuleMarkFailure.ja
>> > va:48)
>> >     at
>> >
>> org.apache.lucene.util.TestRuleIgnoreAfterMaxFailures$1.evaluate(TestRuleIgn
>> > oreAfterMaxFailures.java:70)
>> >     at
>> >
>> org.apache.lucene.util.TestRuleIgnoreTestSuites$1.evaluate(TestRuleIgnoreTest
>> > Suites.java:55)
>> >     at
>> >
>> com.carrotsearch.randomizedtesting.rules.StatementAdapter.evaluate(Stateme
>> > ntAdapter.java:36)
>> >     at
>> >
>> com.carrotsearch.randomizedtesting.ThreadLeakControl$StatementRunner.run
>> > (ThreadLeakControl.java:358)
>> >     at java.lang.Thread.run(Thread.java:722)
>> > Caused by: java.io.IOException: Could not remove:
>> > C:\Jenkins\workspace\Lucene-Solr-trunk-
>> > Windows\lucene\build\core\test\J0\.\testSeekSliceEnd4659546760tmp
>> >     at org.apache.lucene.util.CloseableFile.close(CloseableFile.java:47)
>> >     at
>> >
>> com.carrotsearch.randomizedtesting.RandomizedRunner$2$1.apply(Randomize
>> > dRunner.java:602)
>> >     at
>> >
>> com.carrotsearch.randomizedtesting.RandomizedRunner$2$1.apply(Randomize
>> > dRunner.java:599)
>> >     at
>> >
>> com.carrotsearch.randomizedtesting.RandomizedContext.closeResources(Rand
>> > omizedContext.java:167)
>> >     at
>> >
>> com.carrotsearch.randomizedtesting.RandomizedRunner$2.afterAlways(Rando
>> > mizedRunner.java:615)
>> >     at
>> >
>> com.carrotsearch.randomizedtesting.rules.StatementAdapter.evaluate(Stateme
>> > ntAdapter.java:43)
>> >     ... 2 more
>> >
>> >
>> > FAILED:  junit.framework.TestSuite.org.apache.lucene.store.TestMultiMMap
>> >
>> > Error Message:
>> > Resource in scope SUITE failed to close. Resource was registered from thread
>> > Thread[id=695, name=TEST-TestMultiMMap.testSeekSliceEnd-
>> > seed#[AA4F04524D760878], state=RUNNABLE, group=TGRP-
>> TestMultiMMap],
>> > registration stack trace below.
>> >
>> > Stack Trace:
>> > com.carrotsearch.randomizedtesting.ResourceDisposalError: Resource in
>> scope
>> > SUITE failed to close. Resource was registered from thread Thread[id=695,
>> > name=TEST-TestMultiMMap.testSeekSliceEnd-seed#[AA4F04524D760878],
>> > state=RUNNABLE, group=TGRP-TestMultiMMap], registration stack trace
>> > below.
>> >     at java.lang.Thread.getStackTrace(Thread.java:1567)
>> >     at
>> >
>> com.carrotsearch.randomizedtesting.RandomizedContext.closeAtEnd(Randomiz
>> > edContext.java:150)
>> >     at
>> >
>> org.apache.lucene.util.LuceneTestCase.closeAfterSuite(LuceneTestCase.java:48
>> > 5)
>> >     at org.apache.lucene.util._TestUtil.getTempDir(_TestUtil.java:97)
>> >     at
>> >
>> org.apache.lucene.store.TestMultiMMap.testSeekSliceEnd(TestMultiMMap.jav
>> > a:164)
>> >     at sun.reflect.NativeMethodAccessorImpl.invoke0(Native Method)
>> >     at
>> >
>> sun.reflect.NativeMethodAccessorImpl.invoke(NativeMethodAccessorImpl.java:
>> > 57)
>> >     at
>> >
>> sun.reflect.DelegatingMethodAccessorImpl.invoke(DelegatingMethodAccessorI
>> > mpl.java:43)
>> >     at java.lang.reflect.Method.invoke(Method.java:601)
>> >     at
>> >
>> com.carrotsearch.randomizedtesting.RandomizedRunner.invoke(RandomizedRu
>> > nner.java:1559)
>> >     at
>> >
>> com.carrotsearch.randomizedtesting.RandomizedRunner.access$600(Randomiz
>> > edRunner.java:79)
>> >     at
>> >
>> com.carrotsearch.randomizedtesting.RandomizedRunner$6.evaluate(Randomiz
>> > edRunner.java:737)
>> >     at
>> >
>> com.carrotsearch.randomizedtesting.RandomizedRunner$7.evaluate(Randomiz
>> > edRunner.java:773)
>> >     at
>> >
>> com.carrotsearch.randomizedtesting.RandomizedRunner$8.evaluate(Randomiz
>> > edRunner.java:787)
>> >     at
>> >
>> org.apache.lucene.util.TestRuleSetupTeardownChained$1.evaluate(TestRuleSet
>> > upTeardownChained.java:50)
>> >     at
>> >
>> org.apache.lucene.util.TestRuleFieldCacheSanity$1.evaluate(TestRuleFieldCach
>> > eSanity.java:51)
>> >     at
>> >
>> org.apache.lucene.util.AbstractBeforeAfterRule$1.evaluate(AbstractBeforeAfte
>> > rRule.java:45)
>> >     at
>> >
>> com.carrotsearch.randomizedtesting.rules.SystemPropertiesInvariantRule$1.ev
>> > aluate(SystemPropertiesInvariantRule.java:55)
>> >     at
>> >
>> org.apache.lucene.util.TestRuleThreadAndTestName$1.evaluate(TestRuleThrea
>> > dAndTestName.java:48)
>> >     at
>> >
>> org.apache.lucene.util.TestRuleIgnoreAfterMaxFailures$1.evaluate(TestRuleIgn
>> > oreAfterMaxFailures.java:70)
>> >     at
>> >
>> org.apache.lucene.util.TestRuleMarkFailure$1.evaluate(TestRuleMarkFailure.ja
>> > va:48)
>> >     at
>> >
>> com.carrotsearch.randomizedtesting.rules.StatementAdapter.evaluate(Stateme
>> > ntAdapter.java:36)
>> >     at
>> >
>> com.carrotsearch.randomizedtesting.ThreadLeakControl$StatementRunner.run
>> > (ThreadLeakControl.java:358)
>> >     at
>> >
>> com.carrotsearch.randomizedtesting.ThreadLeakControl.forkTimeoutingTask(T
>> > hreadLeakControl.java:782)
>> >     at
>> >
>> com.carrotsearch.randomizedtesting.ThreadLeakControl$3.evaluate(ThreadLea
>> > kControl.java:442)
>> >     at
>> >
>> com.carrotsearch.randomizedtesting.RandomizedRunner.runSingleTest(Rando
>> > mizedRunner.java:746)
>> >     at
>> >
>> com.carrotsearch.randomizedtesting.RandomizedRunner$3.evaluate(Randomiz
>> > edRunner.java:648)
>> >     at
>> >
>> com.carrotsearch.randomizedtesting.RandomizedRunner$4.evaluate(Randomiz
>> > edRunner.java:682)
>> >     at
>> >
>> com.carrotsearch.randomizedtesting.RandomizedRunner$5.evaluate(Randomiz
>> > edRunner.java:693)
>> >     at
>> >
>> org.apache.lucene.util.AbstractBeforeAfterRule$1.evaluate(AbstractBeforeAfte
>> > rRule.java:45)
>> >     at
>> >
>> org.apache.lucene.util.TestRuleStoreClassName$1.evaluate(TestRuleStoreClass
>> > Name.java:42)
>> >     at
>> >
>> com.carrotsearch.randomizedtesting.rules.SystemPropertiesInvariantRule$1.ev
>> > aluate(SystemPropertiesInvariantRule.java:55)
>> >     at
>> >
>> com.carrotsearch.randomizedtesting.rules.NoShadowingOrOverridesOnMethod
>> > sRule$1.evaluate(NoShadowingOrOverridesOnMethodsRule.java:39)
>> >     at
>> >
>> com.carrotsearch.randomizedtesting.rules.NoShadowingOrOverridesOnMethod
>> > sRule$1.evaluate(NoShadowingOrOverridesOnMethodsRule.java:39)
>> >     at
>> >
>> org.apache.lucene.util.TestRuleAssertionsRequired$1.evaluate(TestRuleAssertio
>> > nsRequired.java:40)
>> >     at
>> >
>> org.apache.lucene.util.TestRuleMarkFailure$1.evaluate(TestRuleMarkFailure.ja
>> > va:48)
>> >     at
>> >
>> org.apache.lucene.util.TestRuleIgnoreAfterMaxFailures$1.evaluate(TestRuleIgn
>> > oreAfterMaxFailures.java:70)
>> >     at
>> >
>> org.apache.lucene.util.TestRuleIgnoreTestSuites$1.evaluate(TestRuleIgnoreTest
>> > Suites.java:55)
>> >     at
>> >
>> com.carrotsearch.randomizedtesting.rules.StatementAdapter.evaluate(Stateme
>> > ntAdapter.java:36)
>> >     at
>> >
>> com.carrotsearch.randomizedtesting.ThreadLeakControl$StatementRunner.run
>> > (ThreadLeakControl.java:358)
>> >     at java.lang.Thread.run(Thread.java:722)
>> > Caused by: java.io.IOException: Could not remove:
>> > C:\Jenkins\workspace\Lucene-Solr-trunk-
>> > Windows\lucene\build\core\test\J0\.\testSeekSliceEnd4659546761tmp
>> >     at org.apache.lucene.util.CloseableFile.close(CloseableFile.java:47)
>> >     at
>> >
>> com.carrotsearch.randomizedtesting.RandomizedRunner$2$1.apply(Randomize
>> > dRunner.java:602)
>> >     at
>> >
>> com.carrotsearch.randomizedtesting.RandomizedRunner$2$1.apply(Randomize
>> > dRunner.java:599)
>> >     at
>> >
>> com.carrotsearch.randomizedtesting.RandomizedContext.closeResources(Rand
>> > omizedContext.java:167)
>> >     at
>> >
>> com.carrotsearch.randomizedtesting.RandomizedRunner$2.afterAlways(Rando
>> > mizedRunner.java:615)
>> >     at
>> >
>> com.carrotsearch.randomizedtesting.rules.StatementAdapter.evaluate(Stateme
>> > ntAdapter.java:43)
>> >     ... 2 more
>> >
>> >
>> > FAILED:  junit.framework.TestSuite.org.apache.lucene.store.TestMultiMMap
>> >
>> > Error Message:
>> > Resource in scope SUITE failed to close. Resource was registered from thread
>> > Thread[id=695, name=TEST-TestMultiMMap.testSeekSliceEnd-
>> > seed#[AA4F04524D760878], state=RUNNABLE, group=TGRP-
>> TestMultiMMap],
>> > registration stack trace below.
>> >
>> > Stack Trace:
>> > com.carrotsearch.randomizedtesting.ResourceDisposalError: Resource in
>> scope
>> > SUITE failed to close. Resource was registered from thread Thread[id=695,
>> > name=TEST-TestMultiMMap.testSeekSliceEnd-seed#[AA4F04524D760878],
>> > state=RUNNABLE, group=TGRP-TestMultiMMap], registration stack trace
>> > below.
>> >     at java.lang.Thread.getStackTrace(Thread.java:1567)
>> >     at
>> >
>> com.carrotsearch.randomizedtesting.RandomizedContext.closeAtEnd(Randomiz
>> > edContext.java:150)
>> >     at
>> >
>> org.apache.lucene.util.LuceneTestCase.closeAfterSuite(LuceneTestCase.java:48
>> > 5)
>> >     at org.apache.lucene.util._TestUtil.getTempDir(_TestUtil.java:97)
>> >     at
>> >
>> org.apache.lucene.store.TestMultiMMap.testSeekSliceEnd(TestMultiMMap.jav
>> > a:164)
>> >     at sun.reflect.NativeMethodAccessorImpl.invoke0(Native Method)
>> >     at
>> >
>> sun.reflect.NativeMethodAccessorImpl.invoke(NativeMethodAccessorImpl.java:
>> > 57)
>> >     at
>> >
>> sun.reflect.DelegatingMethodAccessorImpl.invoke(DelegatingMethodAccessorI
>> > mpl.java:43)
>> >     at java.lang.reflect.Method.invoke(Method.java:601)
>> >     at
>> >
>> com.carrotsearch.randomizedtesting.RandomizedRunner.invoke(RandomizedRu
>> > nner.java:1559)
>> >     at
>> >
>> com.carrotsearch.randomizedtesting.RandomizedRunner.access$600(Randomiz
>> > edRunner.java:79)
>> >     at
>> >
>> com.carrotsearch.randomizedtesting.RandomizedRunner$6.evaluate(Randomiz
>> > edRunner.java:737)
>> >     at
>> >
>> com.carrotsearch.randomizedtesting.RandomizedRunner$7.evaluate(Randomiz
>> > edRunner.java:773)
>> >     at
>> >
>> com.carrotsearch.randomizedtesting.RandomizedRunner$8.evaluate(Randomiz
>> > edRunner.java:787)
>> >     at
>> >
>> org.apache.lucene.util.TestRuleSetupTeardownChained$1.evaluate(TestRuleSet
>> > upTeardownChained.java:50)
>> >     at
>> >
>> org.apache.lucene.util.TestRuleFieldCacheSanity$1.evaluate(TestRuleFieldCach
>> > eSanity.java:51)
>> >     at
>> >
>> org.apache.lucene.util.AbstractBeforeAfterRule$1.evaluate(AbstractBeforeAfte
>> > rRule.java:45)
>> >     at
>> >
>> com.carrotsearch.randomizedtesting.rules.SystemPropertiesInvariantRule$1.ev
>> > aluate(SystemPropertiesInvariantRule.java:55)
>> >     at
>> >
>> org.apache.lucene.util.TestRuleThreadAndTestName$1.evaluate(TestRuleThrea
>> > dAndTestName.java:48)
>> >     at
>> >
>> org.apache.lucene.util.TestRuleIgnoreAfterMaxFailures$1.evaluate(TestRuleIgn
>> > oreAfterMaxFailures.java:70)
>> >     at
>> >
>> org.apache.lucene.util.TestRuleMarkFailure$1.evaluate(TestRuleMarkFailure.ja
>> > va:48)
>> >     at
>> >
>> com.carrotsearch.randomizedtesting.rules.StatementAdapter.evaluate(Stateme
>> > ntAdapter.java:36)
>> >     at
>> >
>> com.carrotsearch.randomizedtesting.ThreadLeakControl$StatementRunner.run
>> > (ThreadLeakControl.java:358)
>> >     at
>> >
>> com.carrotsearch.randomizedtesting.ThreadLeakControl.forkTimeoutingTask(T
>> > hreadLeakControl.java:782)
>> >     at
>> >
>> com.carrotsearch.randomizedtesting.ThreadLeakControl$3.evaluate(ThreadLea
>> > kControl.java:442)
>> >     at
>> >
>> com.carrotsearch.randomizedtesting.RandomizedRunner.runSingleTest(Rando
>> > mizedRunner.java:746)
>> >     at
>> >
>> com.carrotsearch.randomizedtesting.RandomizedRunner$3.evaluate(Randomiz
>> > edRunner.java:648)
>> >     at
>> >
>> com.carrotsearch.randomizedtesting.RandomizedRunner$4.evaluate(Randomiz
>> > edRunner.java:682)
>> >     at
>> >
>> com.carrotsearch.randomizedtesting.RandomizedRunner$5.evaluate(Randomiz
>> > edRunner.java:693)
>> >     at
>> >
>> org.apache.lucene.util.AbstractBeforeAfterRule$1.evaluate(AbstractBeforeAfte
>> > rRule.java:45)
>> >     at
>> >
>> org.apache.lucene.util.TestRuleStoreClassName$1.evaluate(TestRuleStoreClass
>> > Name.java:42)
>> >     at
>> >
>> com.carrotsearch.randomizedtesting.rules.SystemPropertiesInvariantRule$1.ev
>> > aluate(SystemPropertiesInvariantRule.java:55)
>> >     at
>> >
>> com.carrotsearch.randomizedtesting.rules.NoShadowingOrOverridesOnMethod
>> > sRule$1.evaluate(NoShadowingOrOverridesOnMethodsRule.java:39)
>> >     at
>> >
>> com.carrotsearch.randomizedtesting.rules.NoShadowingOrOverridesOnMethod
>> > sRule$1.evaluate(NoShadowingOrOverridesOnMethodsRule.java:39)
>> >     at
>> >
>> org.apache.lucene.util.TestRuleAssertionsRequired$1.evaluate(TestRuleAssertio
>> > nsRequired.java:40)
>> >     at
>> >
>> org.apache.lucene.util.TestRuleMarkFailure$1.evaluate(TestRuleMarkFailure.ja
>> > va:48)
>> >     at
>> >
>> org.apache.lucene.util.TestRuleIgnoreAfterMaxFailures$1.evaluate(TestRuleIgn
>> > oreAfterMaxFailures.java:70)
>> >     at
>> >
>> org.apache.lucene.util.TestRuleIgnoreTestSuites$1.evaluate(TestRuleIgnoreTest
>> > Suites.java:55)
>> >     at
>> >
>> com.carrotsearch.randomizedtesting.rules.StatementAdapter.evaluate(Stateme
>> > ntAdapter.java:36)
>> >     at
>> >
>> com.carrotsearch.randomizedtesting.ThreadLeakControl$StatementRunner.run
>> > (ThreadLeakControl.java:358)
>> >     at java.lang.Thread.run(Thread.java:722)
>> > Caused by: java.io.IOException: Could not remove:
>> > C:\Jenkins\workspace\Lucene-Solr-trunk-
>> > Windows\lucene\build\core\test\J0\.\testSeekSliceEnd4659546762tmp
>> >     at org.apache.lucene.util.CloseableFile.close(CloseableFile.java:47)
>> >     at
>> >
>> com.carrotsearch.randomizedtesting.RandomizedRunner$2$1.apply(Randomize
>> > dRunner.java:602)
>> >     at
>> >
>> com.carrotsearch.randomizedtesting.RandomizedRunner$2$1.apply(Randomize
>> > dRunner.java:599)
>> >     at
>> >
>> com.carrotsearch.randomizedtesting.RandomizedContext.closeResources(Rand
>> > omizedContext.java:167)
>> >     at
>> >
>> com.carrotsearch.randomizedtesting.RandomizedRunner$2.afterAlways(Rando
>> > mizedRunner.java:615)
>> >     at
>> >
>> com.carrotsearch.randomizedtesting.rules.StatementAdapter.evaluate(Stateme
>> > ntAdapter.java:43)
>> >     ... 2 more
>> >
>> >
>> > FAILED:  junit.framework.TestSuite.org.apache.lucene.store.TestMultiMMap
>> >
>> > Error Message:
>> > Resource in scope SUITE failed to close. Resource was registered from thread
>> > Thread[id=695, name=TEST-TestMultiMMap.testSeekSliceEnd-
>> > seed#[AA4F04524D760878], state=RUNNABLE, group=TGRP-
>> TestMultiMMap],
>> > registration stack trace below.
>> >
>> > Stack Trace:
>> > com.carrotsearch.randomizedtesting.ResourceDisposalError: Resource in
>> scope
>> > SUITE failed to close. Resource was registered from thread Thread[id=695,
>> > name=TEST-TestMultiMMap.testSeekSliceEnd-seed#[AA4F04524D760878],
>> > state=RUNNABLE, group=TGRP-TestMultiMMap], registration stack trace
>> > below.
>> >     at java.lang.Thread.getStackTrace(Thread.java:1567)
>> >     at
>> >
>> com.carrotsearch.randomizedtesting.RandomizedContext.closeAtEnd(Randomiz
>> > edContext.java:150)
>> >     at
>> >
>> org.apache.lucene.util.LuceneTestCase.closeAfterSuite(LuceneTestCase.java:48
>> > 5)
>> >     at org.apache.lucene.util._TestUtil.getTempDir(_TestUtil.java:97)
>> >     at
>> >
>> org.apache.lucene.store.TestMultiMMap.testSeekSliceEnd(TestMultiMMap.jav
>> > a:164)
>> >     at sun.reflect.NativeMethodAccessorImpl.invoke0(Native Method)
>> >     at
>> >
>> sun.reflect.NativeMethodAccessorImpl.invoke(NativeMethodAccessorImpl.java:
>> > 57)
>> >     at
>> >
>> sun.reflect.DelegatingMethodAccessorImpl.invoke(DelegatingMethodAccessorI
>> > mpl.java:43)
>> >     at java.lang.reflect.Method.invoke(Method.java:601)
>> >     at
>> >
>> com.carrotsearch.randomizedtesting.RandomizedRunner.invoke(RandomizedRu
>> > nner.java:1559)
>> >     at
>> >
>> com.carrotsearch.randomizedtesting.RandomizedRunner.access$600(Randomiz
>> > edRunner.java:79)
>> >     at
>> >
>> com.carrotsearch.randomizedtesting.RandomizedRunner$6.evaluate(Randomiz
>> > edRunner.java:737)
>> >     at
>> >
>> com.carrotsearch.randomizedtesting.RandomizedRunner$7.evaluate(Randomiz
>> > edRunner.java:773)
>> >     at
>> >
>> com.carrotsearch.randomizedtesting.RandomizedRunner$8.evaluate(Randomiz
>> > edRunner.java:787)
>> >     at
>> >
>> org.apache.lucene.util.TestRuleSetupTeardownChained$1.evaluate(TestRuleSet
>> > upTeardownChained.java:50)
>> >     at
>> >
>> org.apache.lucene.util.TestRuleFieldCacheSanity$1.evaluate(TestRuleFieldCach
>> > eSanity.java:51)
>> >     at
>> >
>> org.apache.lucene.util.AbstractBeforeAfterRule$1.evaluate(AbstractBeforeAfte
>> > rRule.java:45)
>> >     at
>> >
>> com.carrotsearch.randomizedtesting.rules.SystemPropertiesInvariantRule$1.ev
>> > aluate(SystemPropertiesInvariantRule.java:55)
>> >     at
>> >
>> org.apache.lucene.util.TestRuleThreadAndTestName$1.evaluate(TestRuleThrea
>> > dAndTestName.java:48)
>> >     at
>> >
>> org.apache.lucene.util.TestRuleIgnoreAfterMaxFailures$1.evaluate(TestRuleIgn
>> > oreAfterMaxFailures.java:70)
>> >     at
>> >
>> org.apache.lucene.util.TestRuleMarkFailure$1.evaluate(TestRuleMarkFailure.ja
>> > va:48)
>> >     at
>> >
>> com.carrotsearch.randomizedtesting.rules.StatementAdapter.evaluate(Stateme
>> > ntAdapter.java:36)
>> >     at
>> >
>> com.carrotsearch.randomizedtesting.ThreadLeakControl$StatementRunner.run
>> > (ThreadLeakControl.java:358)
>> >     at
>> >
>> com.carrotsearch.randomizedtesting.ThreadLeakControl.forkTimeoutingTask(T
>> > hreadLeakControl.java:782)
>> >     at
>> >
>> com.carrotsearch.randomizedtesting.ThreadLeakControl$3.evaluate(ThreadLea
>> > kControl.java:442)
>> >     at
>> >
>> com.carrotsearch.randomizedtesting.RandomizedRunner.runSingleTest(Rando
>> > mizedRunner.java:746)
>> >     at
>> >
>> com.carrotsearch.randomizedtesting.RandomizedRunner$3.evaluate(Randomiz
>> > edRunner.java:648)
>> >     at
>> >
>> com.carrotsearch.randomizedtesting.RandomizedRunner$4.evaluate(Randomiz
>> > edRunner.java:682)
>> >     at
>> >
>> com.carrotsearch.randomizedtesting.RandomizedRunner$5.evaluate(Randomiz
>> > edRunner.java:693)
>> >     at
>> >
>> org.apache.lucene.util.AbstractBeforeAfterRule$1.evaluate(AbstractBeforeAfte
>> > rRule.java:45)
>> >     at
>> >
>> org.apache.lucene.util.TestRuleStoreClassName$1.evaluate(TestRuleStoreClass
>> > Name.java:42)
>> >     at
>> >
>> com.carrotsearch.randomizedtesting.rules.SystemPropertiesInvariantRule$1.ev
>> > aluate(SystemPropertiesInvariantRule.java:55)
>> >     at
>> >
>> com.carrotsearch.randomizedtesting.rules.NoShadowingOrOverridesOnMethod
>> > sRule$1.evaluate(NoShadowingOrOverridesOnMethodsRule.java:39)
>> >     at
>> >
>> com.carrotsearch.randomizedtesting.rules.NoShadowingOrOverridesOnMethod
>> > sRule$1.evaluate(NoShadowingOrOverridesOnMethodsRule.java:39)
>> >     at
>> >
>> org.apache.lucene.util.TestRuleAssertionsRequired$1.evaluate(TestRuleAssertio
>> > nsRequired.java:40)
>> >     at
>> >
>> org.apache.lucene.util.TestRuleMarkFailure$1.evaluate(TestRuleMarkFailure.ja
>> > va:48)
>> >     at
>> >
>> org.apache.lucene.util.TestRuleIgnoreAfterMaxFailures$1.evaluate(TestRuleIgn
>> > oreAfterMaxFailures.java:70)
>> >     at
>> >
>> org.apache.lucene.util.TestRuleIgnoreTestSuites$1.evaluate(TestRuleIgnoreTest
>> > Suites.java:55)
>> >     at
>> >
>> com.carrotsearch.randomizedtesting.rules.StatementAdapter.evaluate(Stateme
>> > ntAdapter.java:36)
>> >     at
>> >
>> com.carrotsearch.randomizedtesting.ThreadLeakControl$StatementRunner.run
>> > (ThreadLeakControl.java:358)
>> >     at java.lang.Thread.run(Thread.java:722)
>> > Caused by: java.io.IOException: Could not remove:
>> > C:\Jenkins\workspace\Lucene-Solr-trunk-
>> > Windows\lucene\build\core\test\J0\.\testSeekSliceEnd4659546763tmp
>> >     at org.apache.lucene.util.CloseableFile.close(CloseableFile.java:47)
>> >     at
>> >
>> com.carrotsearch.randomizedtesting.RandomizedRunner$2$1.apply(Randomize
>> > dRunner.java:602)
>> >     at
>> >
>> com.carrotsearch.randomizedtesting.RandomizedRunner$2$1.apply(Randomize
>> > dRunner.java:599)
>> >     at
>> >
>> com.carrotsearch.randomizedtesting.RandomizedContext.closeResources(Rand
>> > omizedContext.java:167)
>> >     at
>> >
>> com.carrotsearch.randomizedtesting.RandomizedRunner$2.afterAlways(Rando
>> > mizedRunner.java:615)
>> >     at
>> >
>> com.carrotsearch.randomizedtesting.rules.StatementAdapter.evaluate(Stateme
>> > ntAdapter.java:43)
>> >     ... 2 more
>> >
>> >
>> > FAILED:  junit.framework.TestSuite.org.apache.lucene.store.TestMultiMMap
>> >
>> > Error Message:
>> > Resource in scope SUITE failed to close. Resource was registered from thread
>> > Thread[id=695, name=TEST-TestMultiMMap.testSeekSliceEnd-
>> > seed#[AA4F04524D760878], state=RUNNABLE, group=TGRP-
>> TestMultiMMap],
>> > registration stack trace below.
>> >
>> > Stack Trace:
>> > com.carrotsearch.randomizedtesting.ResourceDisposalError: Resource in
>> scope
>> > SUITE failed to close. Resource was registered from thread Thread[id=695,
>> > name=TEST-TestMultiMMap.testSeekSliceEnd-seed#[AA4F04524D760878],
>> > state=RUNNABLE, group=TGRP-TestMultiMMap], registration stack trace
>> > below.
>> >     at java.lang.Thread.getStackTrace(Thread.java:1567)
>> >     at
>> >
>> com.carrotsearch.randomizedtesting.RandomizedContext.closeAtEnd(Randomiz
>> > edContext.java:150)
>> >     at
>> >
>> org.apache.lucene.util.LuceneTestCase.closeAfterSuite(LuceneTestCase.java:48
>> > 5)
>> >     at org.apache.lucene.util._TestUtil.getTempDir(_TestUtil.java:97)
>> >     at
>> >
>> org.apache.lucene.store.TestMultiMMap.testSeekSliceEnd(TestMultiMMap.jav
>> > a:164)
>> >     at sun.reflect.NativeMethodAccessorImpl.invoke0(Native Method)
>> >     at
>> >
>> sun.reflect.NativeMethodAccessorImpl.invoke(NativeMethodAccessorImpl.java:
>> > 57)
>> >     at
>> >
>> sun.reflect.DelegatingMethodAccessorImpl.invoke(DelegatingMethodAccessorI
>> > mpl.java:43)
>> >     at java.lang.reflect.Method.invoke(Method.java:601)
>> >     at
>> >
>> com.carrotsearch.randomizedtesting.RandomizedRunner.invoke(RandomizedRu
>> > nner.java:1559)
>> >     at
>> >
>> com.carrotsearch.randomizedtesting.RandomizedRunner.access$600(Randomiz
>> > edRunner.java:79)
>> >     at
>> >
>> com.carrotsearch.randomizedtesting.RandomizedRunner$6.evaluate(Randomiz
>> > edRunner.java:737)
>> >     at
>> >
>> com.carrotsearch.randomizedtesting.RandomizedRunner$7.evaluate(Randomiz
>> > edRunner.java:773)
>> >     at
>> >
>> com.carrotsearch.randomizedtesting.RandomizedRunner$8.evaluate(Randomiz
>> > edRunner.java:787)
>> >     at
>> >
>> org.apache.lucene.util.TestRuleSetupTeardownChained$1.evaluate(TestRuleSet
>> > upTeardownChained.java:50)
>> >     at
>> >
>> org.apache.lucene.util.TestRuleFieldCacheSanity$1.evaluate(TestRuleFieldCach
>> > eSanity.java:51)
>> >     at
>> >
>> org.apache.lucene.util.AbstractBeforeAfterRule$1.evaluate(AbstractBeforeAfte
>> > rRule.java:45)
>> >     at
>> >
>> com.carrotsearch.randomizedtesting.rules.SystemPropertiesInvariantRule$1.ev
>> > aluate(SystemPropertiesInvariantRule.java:55)
>> >     at
>> >
>> org.apache.lucene.util.TestRuleThreadAndTestName$1.evaluate(TestRuleThrea
>> > dAndTestName.java:48)
>> >     at
>> >
>> org.apache.lucene.util.TestRuleIgnoreAfterMaxFailures$1.evaluate(TestRuleIgn
>> > oreAfterMaxFailures.java:70)
>> >     at
>> >
>> org.apache.lucene.util.TestRuleMarkFailure$1.evaluate(TestRuleMarkFailure.ja
>> > va:48)
>> >     at
>> >
>> com.carrotsearch.randomizedtesting.rules.StatementAdapter.evaluate(Stateme
>> > ntAdapter.java:36)
>> >     at
>> >
>> com.carrotsearch.randomizedtesting.ThreadLeakControl$StatementRunner.run
>> > (ThreadLeakControl.java:358)
>> >     at
>> >
>> com.carrotsearch.randomizedtesting.ThreadLeakControl.forkTimeoutingTask(T
>> > hreadLeakControl.java:782)
>> >     at
>> >
>> com.carrotsearch.randomizedtesting.ThreadLeakControl$3.evaluate(ThreadLea
>> > kControl.java:442)
>> >     at
>> >
>> com.carrotsearch.randomizedtesting.RandomizedRunner.runSingleTest(Rando
>> > mizedRunner.java:746)
>> >     at
>> >
>> com.carrotsearch.randomizedtesting.RandomizedRunner$3.evaluate(Randomiz
>> > edRunner.java:648)
>> >     at
>> >
>> com.carrotsearch.randomizedtesting.RandomizedRunner$4.evaluate(Randomiz
>> > edRunner.java:682)
>> >     at
>> >
>> com.carrotsearch.randomizedtesting.RandomizedRunner$5.evaluate(Randomiz
>> > edRunner.java:693)
>> >     at
>> >
>> org.apache.lucene.util.AbstractBeforeAfterRule$1.evaluate(AbstractBeforeAfte
>> > rRule.java:45)
>> >     at
>> >
>> org.apache.lucene.util.TestRuleStoreClassName$1.evaluate(TestRuleStoreClass
>> > Name.java:42)
>> >     at
>> >
>> com.carrotsearch.randomizedtesting.rules.SystemPropertiesInvariantRule$1.ev
>> > aluate(SystemPropertiesInvariantRule.java:55)
>> >     at
>> >
>> com.carrotsearch.randomizedtesting.rules.NoShadowingOrOverridesOnMethod
>> > sRule$1.evaluate(NoShadowingOrOverridesOnMethodsRule.java:39)
>> >     at
>> >
>> com.carrotsearch.randomizedtesting.rules.NoShadowingOrOverridesOnMethod
>> > sRule$1.evaluate(NoShadowingOrOverridesOnMethodsRule.java:39)
>> >     at
>> >
>> org.apache.lucene.util.TestRuleAssertionsRequired$1.evaluate(TestRuleAssertio
>> > nsRequired.java:40)
>> >     at
>> >
>> org.apache.lucene.util.TestRuleMarkFailure$1.evaluate(TestRuleMarkFailure.ja
>> > va:48)
>> >     at
>> >
>> org.apache.lucene.util.TestRuleIgnoreAfterMaxFailures$1.evaluate(TestRuleIgn
>> > oreAfterMaxFailures.java:70)
>> >     at
>> >
>> org.apache.lucene.util.TestRuleIgnoreTestSuites$1.evaluate(TestRuleIgnoreTest
>> > Suites.java:55)
>> >     at
>> >
>> com.carrotsearch.randomizedtesting.rules.StatementAdapter.evaluate(Stateme
>> > ntAdapter.java:36)
>> >     at
>> >
>> com.carrotsearch.randomizedtesting.ThreadLeakControl$StatementRunner.run
>> > (ThreadLeakControl.java:358)
>> >     at java.lang.Thread.run(Thread.java:722)
>> > Caused by: java.io.IOException: Could not remove:
>> > C:\Jenkins\workspace\Lucene-Solr-trunk-
>> > Windows\lucene\build\core\test\J0\.\testSeekSliceEnd4659546764tmp
>> >     at org.apache.lucene.util.CloseableFile.close(CloseableFile.java:47)
>> >     at
>> >
>> com.carrotsearch.randomizedtesting.RandomizedRunner$2$1.apply(Randomize
>> > dRunner.java:602)
>> >     at
>> >
>> com.carrotsearch.randomizedtesting.RandomizedRunner$2$1.apply(Randomize
>> > dRunner.java:599)
>> >     at
>> >
>> com.carrotsearch.randomizedtesting.RandomizedContext.closeResources(Rand
>> > omizedContext.java:167)
>> >     at
>> >
>> com.carrotsearch.randomizedtesting.RandomizedRunner$2.afterAlways(Rando
>> > mizedRunner.java:615)
>> >     at
>> >
>> com.carrotsearch.randomizedtesting.rules.StatementAdapter.evaluate(Stateme
>> > ntAdapter.java:43)
>> >     ... 2 more
>> >
>> >
>> > FAILED:  junit.framework.TestSuite.org.apache.lucene.store.TestMultiMMap
>> >
>> > Error Message:
>> > Resource in scope SUITE failed to close. Resource was registered from thread
>> > Thread[id=695, name=TEST-TestMultiMMap.testSeekSliceEnd-
>> > seed#[AA4F04524D760878], state=RUNNABLE, group=TGRP-
>> TestMultiMMap],
>> > registration stack trace below.
>> >
>> > Stack Trace:
>> > com.carrotsearch.randomizedtesting.ResourceDisposalError: Resource in
>> scope
>> > SUITE failed to close. Resource was registered from thread Thread[id=695,
>> > name=TEST-TestMultiMMap.testSeekSliceEnd-seed#[AA4F04524D760878],
>> > state=RUNNABLE, group=TGRP-TestMultiMMap], registration stack trace
>> > below.
>> >     at java.lang.Thread.getStackTrace(Thread.java:1567)
>> >     at
>> >
>> com.carrotsearch.randomizedtesting.RandomizedContext.closeAtEnd(Randomiz
>> > edContext.java:150)
>> >     at
>> >
>> org.apache.lucene.util.LuceneTestCase.closeAfterSuite(LuceneTestCase.java:48
>> > 5)
>> >     at org.apache.lucene.util._TestUtil.getTempDir(_TestUtil.java:97)
>> >     at
>> >
>> org.apache.lucene.store.TestMultiMMap.testSeekSliceEnd(TestMultiMMap.jav
>> > a:164)
>> >     at sun.reflect.NativeMethodAccessorImpl.invoke0(Native Method)
>> >     at
>> >
>> sun.reflect.NativeMethodAccessorImpl.invoke(NativeMethodAccessorImpl.java:
>> > 57)
>> >     at
>> >
>> sun.reflect.DelegatingMethodAccessorImpl.invoke(DelegatingMethodAccessorI
>> > mpl.java:43)
>> >     at java.lang.reflect.Method.invoke(Method.java:601)
>> >     at
>> >
>> com.carrotsearch.randomizedtesting.RandomizedRunner.invoke(RandomizedRu
>> > nner.java:1559)
>> >     at
>> >
>> com.carrotsearch.randomizedtesting.RandomizedRunner.access$600(Randomiz
>> > edRunner.java:79)
>> >     at
>> >
>> com.carrotsearch.randomizedtesting.RandomizedRunner$6.evaluate(Randomiz
>> > edRunner.java:737)
>> >     at
>> >
>> com.carrotsearch.randomizedtesting.RandomizedRunner$7.evaluate(Randomiz
>> > edRunner.java:773)
>> >     at
>> >
>> com.carrotsearch.randomizedtesting.RandomizedRunner$8.evaluate(Randomiz
>> > edRunner.java:787)
>> >     at
>> >
>> org.apache.lucene.util.TestRuleSetupTeardownChained$1.evaluate(TestRuleSet
>> > upTeardownChained.java:50)
>> >     at
>> >
>> org.apache.lucene.util.TestRuleFieldCacheSanity$1.evaluate(TestRuleFieldCach
>> > eSanity.java:51)
>> >     at
>> >
>> org.apache.lucene.util.AbstractBeforeAfterRule$1.evaluate(AbstractBeforeAfte
>> > rRule.java:45)
>> >     at
>> >
>> com.carrotsearch.randomizedtesting.rules.SystemPropertiesInvariantRule$1.ev
>> > aluate(SystemPropertiesInvariantRule.java:55)
>> >     at
>> >
>> org.apache.lucene.util.TestRuleThreadAndTestName$1.evaluate(TestRuleThrea
>> > dAndTestName.java:48)
>> >     at
>> >
>> org.apache.lucene.util.TestRuleIgnoreAfterMaxFailures$1.evaluate(TestRuleIgn
>> > oreAfterMaxFailures.java:70)
>> >     at
>> >
>> org.apache.lucene.util.TestRuleMarkFailure$1.evaluate(TestRuleMarkFailure.ja
>> > va:48)
>> >     at
>> >
>> com.carrotsearch.randomizedtesting.rules.StatementAdapter.evaluate(Stateme
>> > ntAdapter.java:36)
>> >     at
>> >
>> com.carrotsearch.randomizedtesting.ThreadLeakControl$StatementRunner.run
>> > (ThreadLeakControl.java:358)
>> >     at
>> >
>> com.carrotsearch.randomizedtesting.ThreadLeakControl.forkTimeoutingTask(T
>> > hreadLeakControl.java:782)
>> >     at
>> >
>> com.carrotsearch.randomizedtesting.ThreadLeakControl$3.evaluate(ThreadLea
>> > kControl.java:442)
>> >     at
>> >
>> com.carrotsearch.randomizedtesting.RandomizedRunner.runSingleTest(Rando
>> > mizedRunner.java:746)
>> >     at
>> >
>> com.carrotsearch.randomizedtesting.RandomizedRunner$3.evaluate(Randomiz
>> > edRunner.java:648)
>> >     at
>> >
>> com.carrotsearch.randomizedtesting.RandomizedRunner$4.evaluate(Randomiz
>> > edRunner.java:682)
>> >     at
>> >
>> com.carrotsearch.randomizedtesting.RandomizedRunner$5.evaluate(Randomiz
>> > edRunner.java:693)
>> >     at
>> >
>> org.apache.lucene.util.AbstractBeforeAfterRule$1.evaluate(AbstractBeforeAfte
>> > rRule.java:45)
>> >     at
>> >
>> org.apache.lucene.util.TestRuleStoreClassName$1.evaluate(TestRuleStoreClass
>> > Name.java:42)
>> >     at
>> >
>> com.carrotsearch.randomizedtesting.rules.SystemPropertiesInvariantRule$1.ev
>> > aluate(SystemPropertiesInvariantRule.java:55)
>> >     at
>> >
>> com.carrotsearch.randomizedtesting.rules.NoShadowingOrOverridesOnMethod
>> > sRule$1.evaluate(NoShadowingOrOverridesOnMethodsRule.java:39)
>> >     at
>> >
>> com.carrotsearch.randomizedtesting.rules.NoShadowingOrOverridesOnMethod
>> > sRule$1.evaluate(NoShadowingOrOverridesOnMethodsRule.java:39)
>> >     at
>> >
>> org.apache.lucene.util.TestRuleAssertionsRequired$1.evaluate(TestRuleAssertio
>> > nsRequired.java:40)
>> >     at
>> >
>> org.apache.lucene.util.TestRuleMarkFailure$1.evaluate(TestRuleMarkFailure.ja
>> > va:48)
>> >     at
>> >
>> org.apache.lucene.util.TestRuleIgnoreAfterMaxFailures$1.evaluate(TestRuleIgn
>> > oreAfterMaxFailures.java:70)
>> >     at
>> >
>> org.apache.lucene.util.TestRuleIgnoreTestSuites$1.evaluate(TestRuleIgnoreTest
>> > Suites.java:55)
>> >     at
>> >
>> com.carrotsearch.randomizedtesting.rules.StatementAdapter.evaluate(Stateme
>> > ntAdapter.java:36)
>> >     at
>> >
>> com.carrotsearch.randomizedtesting.ThreadLeakControl$StatementRunner.run
>> > (ThreadLeakControl.java:358)
>> >     at java.lang.Thread.run(Thread.java:722)
>> > Caused by: java.io.IOException: Could not remove:
>> > C:\Jenkins\workspace\Lucene-Solr-trunk-
>> > Windows\lucene\build\core\test\J0\.\testSeekSliceEnd4659546765tmp
>> >     at org.apache.lucene.util.CloseableFile.close(CloseableFile.java:47)
>> >     at
>> >
>> com.carrotsearch.randomizedtesting.RandomizedRunner$2$1.apply(Randomize
>> > dRunner.java:602)
>> >     at
>> >
>> com.carrotsearch.randomizedtesting.RandomizedRunner$2$1.apply(Randomize
>> > dRunner.java:599)
>> >     at
>> >
>> com.carrotsearch.randomizedtesting.RandomizedContext.closeResources(Rand
>> > omizedContext.java:167)
>> >     at
>> >
>> com.carrotsearch.randomizedtesting.RandomizedRunner$2.afterAlways(Rando
>> > mizedRunner.java:615)
>> >     at
>> >
>> com.carrotsearch.randomizedtesting.rules.StatementAdapter.evaluate(Stateme
>> > ntAdapter.java:43)
>> >     ... 2 more
>> >
>> >
>> > FAILED:  junit.framework.TestSuite.org.apache.lucene.store.TestMultiMMap
>> >
>> > Error Message:
>> > Resource in scope SUITE failed to close. Resource was registered from thread
>> > Thread[id=695, name=TEST-TestMultiMMap.testSeekSliceEnd-
>> > seed#[AA4F04524D760878], state=RUNNABLE, group=TGRP-
>> TestMultiMMap],
>> > registration stack trace below.
>> >
>> > Stack Trace:
>> > com.carrotsearch.randomizedtesting.ResourceDisposalError: Resource in
>> scope
>> > SUITE failed to close. Resource was registered from thread Thread[id=695,
>> > name=TEST-TestMultiMMap.testSeekSliceEnd-seed#[AA4F04524D760878],
>> > state=RUNNABLE, group=TGRP-TestMultiMMap], registration stack trace
>> > below.
>> >     at java.lang.Thread.getStackTrace(Thread.java:1567)
>> >     at
>> >
>> com.carrotsearch.randomizedtesting.RandomizedContext.closeAtEnd(Randomiz
>> > edContext.java:150)
>> >     at
>> >
>> org.apache.lucene.util.LuceneTestCase.closeAfterSuite(LuceneTestCase.java:48
>> > 5)
>> >     at org.apache.lucene.util._TestUtil.getTempDir(_TestUtil.java:97)
>> >     at
>> >
>> org.apache.lucene.store.TestMultiMMap.testSeekSliceEnd(TestMultiMMap.jav
>> > a:164)
>> >     at sun.reflect.NativeMethodAccessorImpl.invoke0(Native Method)
>> >     at
>> >
>> sun.reflect.NativeMethodAccessorImpl.invoke(NativeMethodAccessorImpl.java:
>> > 57)
>> >     at
>> >
>> sun.reflect.DelegatingMethodAccessorImpl.invoke(DelegatingMethodAccessorI
>> > mpl.java:43)
>> >     at java.lang.reflect.Method.invoke(Method.java:601)
>> >     at
>> >
>> com.carrotsearch.randomizedtesting.RandomizedRunner.invoke(RandomizedRu
>> > nner.java:1559)
>> >     at
>> >
>> com.carrotsearch.randomizedtesting.RandomizedRunner.access$600(Randomiz
>> > edRunner.java:79)
>> >     at
>> >
>> com.carrotsearch.randomizedtesting.RandomizedRunner$6.evaluate(Randomiz
>> > edRunner.java:737)
>> >     at
>> >
>> com.carrotsearch.randomizedtesting.RandomizedRunner$7.evaluate(Randomiz
>> > edRunner.java:773)
>> >     at
>> >
>> com.carrotsearch.randomizedtesting.RandomizedRunner$8.evaluate(Randomiz
>> > edRunner.java:787)
>> >     at
>> >
>> org.apache.lucene.util.TestRuleSetupTeardownChained$1.evaluate(TestRuleSet
>> > upTeardownChained.java:50)
>> >     at
>> >
>> org.apache.lucene.util.TestRuleFieldCacheSanity$1.evaluate(TestRuleFieldCach
>> > eSanity.java:51)
>> >     at
>> >
>> org.apache.lucene.util.AbstractBeforeAfterRule$1.evaluate(AbstractBeforeAfte
>> > rRule.java:45)
>> >     at
>> >
>> com.carrotsearch.randomizedtesting.rules.SystemPropertiesInvariantRule$1.ev
>> > aluate(SystemPropertiesInvariantRule.java:55)
>> >     at
>> >
>> org.apache.lucene.util.TestRuleThreadAndTestName$1.evaluate(TestRuleThrea
>> > dAndTestName.java:48)
>> >     at
>> >
>> org.apache.lucene.util.TestRuleIgnoreAfterMaxFailures$1.evaluate(TestRuleIgn
>> > oreAfterMaxFailures.java:70)
>> >     at
>> >
>> org.apache.lucene.util.TestRuleMarkFailure$1.evaluate(TestRuleMarkFailure.ja
>> > va:48)
>> >     at
>> >
>> com.carrotsearch.randomizedtesting.rules.StatementAdapter.evaluate(Stateme
>> > ntAdapter.java:36)
>> >     at
>> >
>> com.carrotsearch.randomizedtesting.ThreadLeakControl$StatementRunner.run
>> > (ThreadLeakControl.java:358)
>> >     at
>> >
>> com.carrotsearch.randomizedtesting.ThreadLeakControl.forkTimeoutingTask(T
>> > hreadLeakControl.java:782)
>> >     at
>> >
>> com.carrotsearch.randomizedtesting.ThreadLeakControl$3.evaluate(ThreadLea
>> > kControl.java:442)
>> >     at
>> >
>> com.carrotsearch.randomizedtesting.RandomizedRunner.runSingleTest(Rando
>> > mizedRunner.java:746)
>> >     at
>> >
>> com.carrotsearch.randomizedtesting.RandomizedRunner$3.evaluate(Randomiz
>> > edRunner.java:648)
>> >     at
>> >
>> com.carrotsearch.randomizedtesting.RandomizedRunner$4.evaluate(Randomiz
>> > edRunner.java:682)
>> >     at
>> >
>> com.carrotsearch.randomizedtesting.RandomizedRunner$5.evaluate(Randomiz
>> > edRunner.java:693)
>> >     at
>> >
>> org.apache.lucene.util.AbstractBeforeAfterRule$1.evaluate(AbstractBeforeAfte
>> > rRule.java:45)
>> >     at
>> >
>> org.apache.lucene.util.TestRuleStoreClassName$1.evaluate(TestRuleStoreClass
>> > Name.java:42)
>> >     at
>> >
>> com.carrotsearch.randomizedtesting.rules.SystemPropertiesInvariantRule$1.ev
>> > aluate(SystemPropertiesInvariantRule.java:55)
>> >     at
>> >
>> com.carrotsearch.randomizedtesting.rules.NoShadowingOrOverridesOnMethod
>> > sRule$1.evaluate(NoShadowingOrOverridesOnMethodsRule.java:39)
>> >     at
>> >
>> com.carrotsearch.randomizedtesting.rules.NoShadowingOrOverridesOnMethod
>> > sRule$1.evaluate(NoShadowingOrOverridesOnMethodsRule.java:39)
>> >     at
>> >
>> org.apache.lucene.util.TestRuleAssertionsRequired$1.evaluate(TestRuleAssertio
>> > nsRequired.java:40)
>> >     at
>> >
>> org.apache.lucene.util.TestRuleMarkFailure$1.evaluate(TestRuleMarkFailure.ja
>> > va:48)
>> >     at
>> >
>> org.apache.lucene.util.TestRuleIgnoreAfterMaxFailures$1.evaluate(TestRuleIgn
>> > oreAfterMaxFailures.java:70)
>> >     at
>> >
>> org.apache.lucene.util.TestRuleIgnoreTestSuites$1.evaluate(TestRuleIgnoreTest
>> > Suites.java:55)
>> >     at
>> >
>> com.carrotsearch.randomizedtesting.rules.StatementAdapter.evaluate(Stateme
>> > ntAdapter.java:36)
>> >     at
>> >
>> com.carrotsearch.randomizedtesting.ThreadLeakControl$StatementRunner.run
>> > (ThreadLeakControl.java:358)
>> >     at java.lang.Thread.run(Thread.java:722)
>> > Caused by: java.io.IOException: Could not remove:
>> > C:\Jenkins\workspace\Lucene-Solr-trunk-
>> > Windows\lucene\build\core\test\J0\.\testSeekSliceEnd4659546766tmp
>> >     at org.apache.lucene.util.CloseableFile.close(CloseableFile.java:47)
>> >     at
>> >
>> com.carrotsearch.randomizedtesting.RandomizedRunner$2$1.apply(Randomize
>> > dRunner.java:602)
>> >     at
>> >
>> com.carrotsearch.randomizedtesting.RandomizedRunner$2$1.apply(Randomize
>> > dRunner.java:599)
>> >     at
>> >
>> com.carrotsearch.randomizedtesting.RandomizedContext.closeResources(Rand
>> > omizedContext.java:167)
>> >     at
>> >
>> com.carrotsearch.randomizedtesting.RandomizedRunner$2.afterAlways(Rando
>> > mizedRunner.java:615)
>> >     at
>> >
>> com.carrotsearch.randomizedtesting.rules.StatementAdapter.evaluate(Stateme
>> > ntAdapter.java:43)
>> >     ... 2 more
>> >
>> >
>> >
>> >
>> > Build Log:
>> > [...truncated 441 lines...]
>> > [junit4:junit4] Suite: org.apache.lucene.store.TestMultiMMap
>> > [junit4:junit4]   2> NOTE: test params are: codec=Lucene40:
>> > {docid=MockVariableIntBlock(baseBlockSize=98),
>> > junk=MockFixedIntBlock(blockSize=1243)},
>> > sim=RandomSimilarityProvider(queryNorm=false,coord=yes): {}, locale=ja,
>> > timezone=America/Sitka
>> > [junit4:junit4]   2> NOTE: Windows 7 6.1 amd64/Oracle Corporation 1.7.0_07
>> > (64-bit)/cpus=2,threads=1,free=109472240,total=193003520
>> > [junit4:junit4]   2> NOTE: All tests run in this JVM: [TestReaderClosed,
>> > TestNeverDelete, TestIndexWriterMerging, TestCrashCausesCorruptIndex,
>> > TestDirectoryReaderReopen, TestPerFieldPostingsFormat,
>> > TestFieldCacheRangeFilter, TestSimilarityProvider,
>> TestTwoPhaseCommitTool,
>> > TestParallelCompositeReader, TestCheckIndex, TestNamedSPILoader,
>> > TestPerSegmentDeletes, TestMultiThreadTermVectors, TestDeletionPolicy,
>> > TestNRTReaderWithThreads, TestBooleanMinShouldMatch,
>> > TestPostingsOffsets, TestCloseableThreadLocal, TestByteArrayDataInput,
>> > TestConjunctions, TestPayloadNearQuery, TestFilterAtomicReader,
>> > TestExternalCodecs, TestBytesRef, TestCrash, TestBooleanQuery,
>> TestDirectory,
>> > TestOmitPositions, TestPersistentSnapshotDeletionPolicy, TestSort,
>> > TestRecyclingByteBlockAllocator, TestGraphTokenizers, TestTermdocPerf,
>> > TestSearchForDuplicates, TestNRTThreads,
>> TestSpanMultiTermQueryWrapper,
>> > TestIndexWriterDelete, TestSimilarityBase, TestPayloadsOnVectors,
>> > InBeforeClass, InAfterClass, NonStringProperties, InTestMethod,
>> > TestSegmentTermDocs, TestQueryWrapperFilter,
>> TestConsistentFieldNumbers,
>> > TestCopyBytes, TestNumericUtils, TestParallelAtomicReader,
>> > TestNoMergePolicy, TestTermsEnum2, TestMinimize, TestRAMDirectory,
>> > ThrowInUncaught, TestElevationComparator, TestPrefixRandom,
>> > TestUTF32ToUTF8, TestNumericTokenStream, NestedTeardownChain,
>> > NestedSetupChain, TestTimeLimitingCollector, TestWildcard,
>> TestTransactions,
>> > TestDocValuesTypeCompatibility, TestSearchWithThreads,
>> > TestDocumentWriter, TestStressIndexing,
>> > TestMultiValuedNumericRangeQuery, TestWindowsMMap,
>> > TestIndexWriterConfig, TestPrefixQuery, TestCharsRef,
>> TestParallelTermEnum,
>> > TestBitVector, TestSimilarity, TestSortedVIntList,
>> > TestPositiveScoresOnlyCollector, TestStressNRT, TestDateSort,
>> > TestPhrasePrefixQuery, TestMultiMMap]
>> > [junit4:junit4]   2> NOTE: reproduce with: ant test  -
>> Dtestcase=TestMultiMMap
>> > -Dtests.seed=AA4F04524D760878 -Dtests.slow=true -Dtests.locale=ja -
>> > Dtests.timezone=America/Sitka -Dtests.file.encoding=ISO-8859-1
>> > [junit4:junit4] ERROR   0.00s | TestMultiMMap (suite) <<<
>> > [junit4:junit4]    > Throwable #1:
>> > com.carrotsearch.randomizedtesting.ResourceDisposalError: Resource in
>> scope
>> > SUITE failed to close. Resource was registered from thread Thread[id=695,
>> > name=TEST-TestMultiMMap.testSeekSliceEnd-seed#[AA4F04524D760878],
>> > state=RUNNABLE, group=TGRP-TestMultiMMap], registration stack trace
>> > below.
>> > [junit4:junit4]    >        at java.lang.Thread.getStackTrace(Thread.java:1567)
>> > [junit4:junit4]    >        at
>> >
>> com.carrotsearch.randomizedtesting.RandomizedContext.closeAtEnd(Randomiz
>> > edContext.java:150)
>> > [junit4:junit4]    >        at
>> >
>> org.apache.lucene.util.LuceneTestCase.closeAfterSuite(LuceneTestCase.java:48
>> > 5)
>> > [junit4:junit4]    >        at
>> > org.apache.lucene.util._TestUtil.getTempDir(_TestUtil.java:97)
>> > [junit4:junit4]    >        at
>> >
>> org.apache.lucene.store.TestMultiMMap.testSeekSliceEnd(TestMultiMMap.jav
>> > a:164)
>> > [junit4:junit4]    >        at
>> > sun.reflect.NativeMethodAccessorImpl.invoke0(Native Method)
>> > [junit4:junit4]    >        at
>> >
>> sun.reflect.NativeMethodAccessorImpl.invoke(NativeMethodAccessorImpl.java:
>> > 57)
>> > [junit4:junit4]    >        at
>> >
>> sun.reflect.DelegatingMethodAccessorImpl.invoke(DelegatingMethodAccessorI
>> > mpl.java:43)
>> > [junit4:junit4]    >        at java.lang.reflect.Method.invoke(Method.java:601)
>> > [junit4:junit4]    >        at
>> >
>> com.carrotsearch.randomizedtesting.RandomizedRunner.invoke(RandomizedRu
>> > nner.java:1559)
>> > [junit4:junit4]    >        at
>> >
>> com.carrotsearch.randomizedtesting.RandomizedRunner.access$600(Randomiz
>> > edRunner.java:79)
>> > [junit4:junit4]    >        at
>> >
>> com.carrotsearch.randomizedtesting.RandomizedRunner$6.evaluate(Randomiz
>> > edRunner.java:737)
>> > [junit4:junit4]    >        at
>> >
>> com.carrotsearch.randomizedtesting.RandomizedRunner$7.evaluate(Randomiz
>> > edRunner.java:773)
>> > [junit4:junit4]    >        at
>> >
>> com.carrotsearch.randomizedtesting.RandomizedRunner$8.evaluate(Randomiz
>> > edRunner.java:787)
>> > [junit4:junit4]    >        at
>> >
>> org.apache.lucene.util.TestRuleSetupTeardownChained$1.evaluate(TestRuleSet
>> > upTeardownChained.java:50)
>> > [junit4:junit4]    >        at
>> >
>> org.apache.lucene.util.TestRuleFieldCacheSanity$1.evaluate(TestRuleFieldCach
>> > eSanity.java:51)
>> > [junit4:junit4]    >        at
>> >
>> org.apache.lucene.util.AbstractBeforeAfterRule$1.evaluate(AbstractBeforeAfte
>> > rRule.java:45)
>> > [junit4:junit4]    >        at
>> >
>> com.carrotsearch.randomizedtesting.rules.SystemPropertiesInvariantRule$1.ev
>> > aluate(SystemPropertiesInvariantRule.java:55)
>> > [junit4:junit4]    >        at
>> >
>> org.apache.lucene.util.TestRuleThreadAndTestName$1.evaluate(TestRuleThrea
>> > dAndTestName.java:48)
>> > [junit4:junit4]    >        at
>> >
>> org.apache.lucene.util.TestRuleIgnoreAfterMaxFailures$1.evaluate(TestRuleIgn
>> > oreAfterMaxFailures.java:70)
>> > [junit4:junit4]    >        at
>> >
>> org.apache.lucene.util.TestRuleMarkFailure$1.evaluate(TestRuleMarkFailure.ja
>> > va:48)
>> > [junit4:junit4]    >        at
>> >
>> com.carrotsearch.randomizedtesting.rules.StatementAdapter.evaluate(Stateme
>> > ntAdapter.java:36)
>> > [junit4:junit4]    >        at
>> >
>> com.carrotsearch.randomizedtesting.ThreadLeakControl$StatementRunner.run
>> > (ThreadLeakControl.java:358)
>> > [junit4:junit4]    >        at
>> >
>> com.carrotsearch.randomizedtesting.ThreadLeakControl.forkTimeoutingTask(T
>> > hreadLeakControl.java:782)
>> > [junit4:junit4]    >        at
>> >
>> com.carrotsearch.randomizedtesting.ThreadLeakControl$3.evaluate(ThreadLea
>> > kControl.java:442)
>> > [junit4:junit4]    >        at
>> >
>> com.carrotsearch.randomizedtesting.RandomizedRunner.runSingleTest(Rando
>> > mizedRunner.java:746)
>> > [junit4:junit4]    >        at
>> >
>> com.carrotsearch.randomizedtesting.RandomizedRunner$3.evaluate(Randomiz
>> > edRunner.java:648)
>> > [junit4:junit4]    >        at
>> >
>> com.carrotsearch.randomizedtesting.RandomizedRunner$4.evaluate(Randomiz
>> > edRunner.java:682)
>> > [junit4:junit4]    >        at
>> >
>> com.carrotsearch.randomizedtesting.RandomizedRunner$5.evaluate(Randomiz
>> > edRunner.java:693)
>> > [junit4:junit4]    >        at
>> >
>> org.apache.lucene.util.AbstractBeforeAfterRule$1.evaluate(AbstractBeforeAfte
>> > rRule.java:45)
>> > [junit4:junit4]    >        at
>> >
>> org.apache.lucene.util.TestRuleStoreClassName$1.evaluate(TestRuleStoreClass
>> > Name.java:42)
>> > [junit4:junit4]    >        at
>> >
>> com.carrotsearch.randomizedtesting.rules.SystemPropertiesInvariantRule$1.ev
>> > aluate(SystemPropertiesInvariantRule.java:55)
>> > [junit4:junit4]    >        at
>> >
>> com.carrotsearch.randomizedtesting.rules.NoShadowingOrOverridesOnMethod
>> > sRule$1.evaluate(NoShadowingOrOverridesOnMethodsRule.java:39)
>> > [junit4:junit4]    >        at
>> >
>> com.carrotsearch.randomizedtesting.rules.NoShadowingOrOverridesOnMethod
>> > sRule$1.evaluate(NoShadowingOrOverridesOnMethodsRule.java:39)
>> > [junit4:junit4]    >        at
>> >
>> org.apache.lucene.util.TestRuleAssertionsRequired$1.evaluate(TestRuleAssertio
>> > nsRequired.java:40)
>> > [junit4:junit4]    >        at
>> >
>> org.apache.lucene.util.TestRuleMarkFailure$1.evaluate(TestRuleMarkFailure.ja
>> > va:48)
>> > [junit4:junit4]    >        at
>> >
>> org.apache.lucene.util.TestRuleIgnoreAfterMaxFailures$1.evaluate(TestRuleIgn
>> > oreAfterMaxFailures.java:70)
>> > [junit4:junit4]    >        at
>> >
>> org.apache.lucene.util.TestRuleIgnoreTestSuites$1.evaluate(TestRuleIgnoreTest
>> > Suites.java:55)
>> > [junit4:junit4]    >        at
>> >
>> com.carrotsearch.randomizedtesting.rules.StatementAdapter.evaluate(Stateme
>> > ntAdapter.java:36)
>> > [junit4:junit4]    >        at
>> >
>> com.carrotsearch.randomizedtesting.ThreadLeakControl$StatementRunner.run
>> > (ThreadLeakControl.java:358)
>> > [junit4:junit4]    >        at java.lang.Thread.run(Thread.java:722)
>> > [junit4:junit4]    > Caused by: java.io.IOException: Could not remove:
>> > C:\Jenkins\workspace\Lucene-Solr-trunk-
>> > Windows\lucene\build\core\test\J0\.\testSeekSliceEnd4659546750tmp
>> > [junit4:junit4]    >        at
>> > org.apache.lucene.util.CloseableFile.close(CloseableFile.java:47)
>> > [junit4:junit4]    >        at
>> >
>> com.carrotsearch.randomizedtesting.RandomizedRunner$2$1.apply(Randomize
>> > dRunner.java:602)
>> > [junit4:junit4]    >        at
>> >
>> com.carrotsearch.randomizedtesting.RandomizedRunner$2$1.apply(Randomize
>> > dRunner.java:599)
>> > [junit4:junit4]    >        at
>> >
>> com.carrotsearch.randomizedtesting.RandomizedContext.closeResources(Rand
>> > omizedContext.java:167)
>> > [junit4:junit4]    >        at
>> >
>> com.carrotsearch.randomizedtesting.RandomizedRunner$2.afterAlways(Rando
>> > mizedRunner.java:615)
>> > [junit4:junit4]    >        at
>> >
>> com.carrotsearch.randomizedtesting.rules.StatementAdapter.evaluate(Stateme
>> > ntAdapter.java:43)
>> > [junit4:junit4]    >        ... 2 more
>> > [junit4:junit4]    > Throwable #2:
>> > com.carrotsearch.randomizedtesting.ResourceDisposalError: Resource in
>> scope
>> > SUITE failed to close. Resource was registered from thread Thread[id=695,
>> > name=TEST-TestMultiMMap.testSeekSliceEnd-seed#[AA4F04524D760878],
>> > state=RUNNABLE, group=TGRP-TestMultiMMap], registration stack trace
>> > below.
>> > [junit4:junit4]    >        at java.lang.Thread.getStackTrace(Thread.java:1567)
>> > [junit4:junit4]    >        at
>> >
>> com.carrotsearch.randomizedtesting.RandomizedContext.closeAtEnd(Randomiz
>> > edContext.java:150)
>> > [junit4:junit4]    >        at
>> >
>> org.apache.lucene.util.LuceneTestCase.closeAfterSuite(LuceneTestCase.java:48
>> > 5)
>> > [junit4:junit4]    >        at
>> > org.apache.lucene.util._TestUtil.getTempDir(_TestUtil.java:97)
>> > [junit4:junit4]    >        at
>> >
>> org.apache.lucene.store.TestMultiMMap.testSeekSliceEnd(TestMultiMMap.jav
>> > a:164)
>> > [junit4:junit4]    >        at
>> > sun.reflect.NativeMethodAccessorImpl.invoke0(Native Method)
>> > [junit4:junit4]    >        at
>> >
>> sun.reflect.NativeMethodAccessorImpl.invoke(NativeMethodAccessorImpl.java:
>> > 57)
>> > [junit4:junit4]    >        at
>> >
>> sun.reflect.DelegatingMethodAccessorImpl.invoke(DelegatingMethodAccessorI
>> > mpl.java:43)
>> > [junit4:junit4]    >        at java.lang.reflect.Method.invoke(Method.java:601)
>> > [junit4:junit4]    >        at
>> >
>> com.carrotsearch.randomizedtesting.RandomizedRunner.invoke(RandomizedRu
>> > nner.java:1559)
>> > [junit4:junit4]    >        at
>> >
>> com.carrotsearch.randomizedtesting.RandomizedRunner.access$600(Randomiz
>> > edRunner.java:79)
>> > [junit4:junit4]    >        at
>> >
>> com.carrotsearch.randomizedtesting.RandomizedRunner$6.evaluate(Randomiz
>> > edRunner.java:737)
>> > [junit4:junit4]    >        at
>> >
>> com.carrotsearch.randomizedtesting.RandomizedRunner$7.evaluate(Randomiz
>> > edRunner.java:773)
>> > [junit4:junit4]    >        at
>> >
>> com.carrotsearch.randomizedtesting.RandomizedRunner$8.evaluate(Randomiz
>> > edRunner.java:787)
>> > [junit4:junit4]    >        at
>> >
>> org.apache.lucene.util.TestRuleSetupTeardownChained$1.evaluate(TestRuleSet
>> > upTeardownChained.java:50)
>> > [junit4:junit4]    >        at
>> >
>> org.apache.lucene.util.TestRuleFieldCacheSanity$1.evaluate(TestRuleFieldCach
>> > eSanity.java:51)
>> > [junit4:junit4]    >        at
>> >
>> org.apache.lucene.util.AbstractBeforeAfterRule$1.evaluate(AbstractBeforeAfte
>> > rRule.java:45)
>> > [junit4:junit4]    >        at
>> >
>> com.carrotsearch.randomizedtesting.rules.SystemPropertiesInvariantRule$1.ev
>> > aluate(SystemPropertiesInvariantRule.java:55)
>> > [junit4:junit4]    >        at
>> >
>> org.apache.lucene.util.TestRuleThreadAndTestName$1.evaluate(TestRuleThrea
>> > dAndTestName.java:48)
>> > [junit4:junit4]    >        at
>> >
>> org.apache.lucene.util.TestRuleIgnoreAfterMaxFailures$1.evaluate(TestRuleIgn
>> > oreAfterMaxFailures.java:70)
>> > [junit4:junit4]    >        at
>> >
>> org.apache.lucene.util.TestRuleMarkFailure$1.evaluate(TestRuleMarkFailure.ja
>> > va:48)
>> > [junit4:junit4]    >        at
>> >
>> com.carrotsearch.randomizedtesting.rules.StatementAdapter.evaluate(Stateme
>> > ntAdapter.java:36)
>> > [junit4:junit4]    >        at
>> >
>> com.carrotsearch.randomizedtesting.ThreadLeakControl$StatementRunner.run
>> > (ThreadLeakControl.java:358)
>> > [junit4:junit4]    >        at
>> >
>> com.carrotsearch.randomizedtesting.ThreadLeakControl.forkTimeoutingTask(T
>> > hreadLeakControl.java:782)
>> > [junit4:junit4]    >        at
>> >
>> com.carrotsearch.randomizedtesting.ThreadLeakControl$3.evaluate(ThreadLea
>> > kControl.java:442)
>> > [junit4:junit4]    >        at
>> >
>> com.carrotsearch.randomizedtesting.RandomizedRunner.runSingleTest(Rando
>> > mizedRunner.java:746)
>> > [junit4:junit4]    >        at
>> >
>> com.carrotsearch.randomizedtesting.RandomizedRunner$3.evaluate(Randomiz
>> > edRunner.java:648)
>> > [junit4:junit4]    >        at
>> >
>> com.carrotsearch.randomizedtesting.RandomizedRunner$4.evaluate(Randomiz
>> > edRunner.java:682)
>> > [junit4:junit4]    >        at
>> >
>> com.carrotsearch.randomizedtesting.RandomizedRunner$5.evaluate(Randomiz
>> > edRunner.java:693)
>> > [junit4:junit4]    >        at
>> >
>> org.apache.lucene.util.AbstractBeforeAfterRule$1.evaluate(AbstractBeforeAfte
>> > rRule.java:45)
>> > [junit4:junit4]    >        at
>> >
>> org.apache.lucene.util.TestRuleStoreClassName$1.evaluate(TestRuleStoreClass
>> > Name.java:42)
>> > [junit4:junit4]    >        at
>> >
>> com.carrotsearch.randomizedtesting.rules.SystemPropertiesInvariantRule$1.ev
>> > aluate(SystemPropertiesInvariantRule.java:55)
>> > [junit4:junit4]    >        at
>> >
>> com.carrotsearch.randomizedtesting.rules.NoShadowingOrOverridesOnMethod
>> > sRule$1.evaluate(NoShadowingOrOverridesOnMethodsRule.java:39)
>> > [junit4:junit4]    >        at
>> >
>> com.carrotsearch.randomizedtesting.rules.NoShadowingOrOverridesOnMethod
>> > sRule$1.evaluate(NoShadowingOrOverridesOnMethodsRule.java:39)
>> > [junit4:junit4]    >        at
>> >
>> org.apache.lucene.util.TestRuleAssertionsRequired$1.evaluate(TestRuleAssertio
>> > nsRequired.java:40)
>> > [junit4:junit4]    >        at
>> >
>> org.apache.lucene.util.TestRuleMarkFailure$1.evaluate(TestRuleMarkFailure.ja
>> > va:48)
>> > [junit4:junit4]    >        at
>> >
>> org.apache.lucene.util.TestRuleIgnoreAfterMaxFailures$1.evaluate(TestRuleIgn
>> > oreAfterMaxFailures.java:70)
>> > [junit4:junit4]    >        at
>> >
>> org.apache.lucene.util.TestRuleIgnoreTestSuites$1.evaluate(TestRuleIgnoreTest
>> > Suites.java:55)
>> > [junit4:junit4]    >        at
>> >
>> com.carrotsearch.randomizedtesting.rules.StatementAdapter.evaluate(Stateme
>> > ntAdapter.java:36)
>> > [junit4:junit4]    >        at
>> >
>> com.carrotsearch.randomizedtesting.ThreadLeakControl$StatementRunner.run
>> > (ThreadLeakControl.java:358)
>> > [junit4:junit4]    >        at java.lang.Thread.run(Thread.java:722)
>> > [junit4:junit4]    > Caused by: java.io.IOException: Could not remove:
>> > C:\Jenkins\workspace\Lucene-Solr-trunk-
>> > Windows\lucene\build\core\test\J0\.\testSeekSliceEnd4659546751tmp
>> > [junit4:junit4]    >        at
>> > org.apache.lucene.util.CloseableFile.close(CloseableFile.java:47)
>> > [junit4:junit4]    >        at
>> >
>> com.carrotsearch.randomizedtesting.RandomizedRunner$2$1.apply(Randomize
>> > dRunner.java:602)
>> > [junit4:junit4]    >        at
>> >
>> com.carrotsearch.randomizedtesting.RandomizedRunner$2$1.apply(Randomize
>> > dRunner.java:599)
>> > [junit4:junit4]    >        at
>> >
>> com.carrotsearch.randomizedtesting.RandomizedContext.closeResources(Rand
>> > omizedContext.java:167)
>> > [junit4:junit4]    >        at
>> >
>> com.carrotsearch.randomizedtesting.RandomizedRunner$2.afterAlways(Rando
>> > mizedRunner.java:615)
>> > [junit4:junit4]    >        at
>> >
>> com.carrotsearch.randomizedtesting.rules.StatementAdapter.evaluate(Stateme
>> > ntAdapter.java:43)
>> > [junit4:junit4]    >        ... 2 more
>> > [junit4:junit4]    > Throwable #3:
>> > com.carrotsearch.randomizedtesting.ResourceDisposalError: Resource in
>> scope
>> > SUITE failed to close. Resource was registered from thread Thread[id=695,
>> > name=TEST-TestMultiMMap.testSeekSliceEnd-seed#[AA4F04524D760878],
>> > state=RUNNABLE, group=TGRP-TestMultiMMap], registration stack trace
>> > below.
>> > [junit4:junit4]    >        at java.lang.Thread.getStackTrace(Thread.java:1567)
>> > [junit4:junit4]    >        at
>> >
>> com.carrotsearch.randomizedtesting.RandomizedContext.closeAtEnd(Randomiz
>> > edContext.java:150)
>> > [junit4:junit4]    >        at
>> >
>> org.apache.lucene.util.LuceneTestCase.closeAfterSuite(LuceneTestCase.java:48
>> > 5)
>> > [junit4:junit4]    >        at
>> > org.apache.lucene.util._TestUtil.getTempDir(_TestUtil.java:97)
>> > [junit4:junit4]    >        at
>> >
>> org.apache.lucene.store.TestMultiMMap.testSeekSliceEnd(TestMultiMMap.jav
>> > a:164)
>> > [junit4:junit4]    >        at
>> > sun.reflect.NativeMethodAccessorImpl.invoke0(Native Method)
>> > [junit4:junit4]    >        at
>> >
>> sun.reflect.NativeMethodAccessorImpl.invoke(NativeMethodAccessorImpl.java:
>> > 57)
>> > [junit4:junit4]    >        at
>> >
>> sun.reflect.DelegatingMethodAccessorImpl.invoke(DelegatingMethodAccessorI
>> > mpl.java:43)
>> > [junit4:junit4]    >        at java.lang.reflect.Method.invoke(Method.java:601)
>> > [junit4:junit4]    >        at
>> >
>> com.carrotsearch.randomizedtesting.RandomizedRunner.invoke(RandomizedRu
>> > nner.java:1559)
>> > [junit4:junit4]    >        at
>> >
>> com.carrotsearch.randomizedtesting.RandomizedRunner.access$600(Randomiz
>> > edRunner.java:79)
>> > [junit4:junit4]    >        at
>> >
>> com.carrotsearch.randomizedtesting.RandomizedRunner$6.evaluate(Randomiz
>> > edRunner.java:737)
>> > [junit4:junit4]    >        at
>> >
>> com.carrotsearch.randomizedtesting.RandomizedRunner$7.evaluate(Randomiz
>> > edRunner.java:773)
>> > [junit4:junit4]    >        at
>> >
>> com.carrotsearch.randomizedtesting.RandomizedRunner$8.evaluate(Randomiz
>> > edRunner.java:787)
>> > [junit4:junit4]    >        at
>> >
>> org.apache.lucene.util.TestRuleSetupTeardownChained$1.evaluate(TestRuleSet
>> > upTeardownChained.java:50)
>> > [junit4:junit4]    >        at
>> >
>> org.apache.lucene.util.TestRuleFieldCacheSanity$1.evaluate(TestRuleFieldCach
>> > eSanity.java:51)
>> > [junit4:junit4]    >        at
>> >
>> org.apache.lucene.util.AbstractBeforeAfterRule$1.evaluate(AbstractBeforeAfte
>> > rRule.java:45)
>> > [junit4:junit4]    >        at
>> >
>> com.carrotsearch.randomizedtesting.rules.SystemPropertiesInvariantRule$1.ev
>> > aluate(SystemPropertiesInvariantRule.java:55)
>> > [junit4:junit4]    >        at
>> >
>> org.apache.lucene.util.TestRuleThreadAndTestName$1.evaluate(TestRuleThrea
>> > dAndTestName.java:48)
>> > [junit4:junit4]    >        at
>> >
>> org.apache.lucene.util.TestRuleIgnoreAfterMaxFailures$1.evaluate(TestRuleIgn
>> > oreAfterMaxFailures.java:70)
>> > [junit4:junit4]    >        at
>> >
>> org.apache.lucene.util.TestRuleMarkFailure$1.evaluate(TestRuleMarkFailure.ja
>> > va:48)
>> > [junit4:junit4]    >        at
>> >
>> com.carrotsearch.randomizedtesting.rules.StatementAdapter.evaluate(Stateme
>> > ntAdapter.java:36)
>> > [junit4:junit4]    >        at
>> >
>> com.carrotsearch.randomizedtesting.ThreadLeakControl$StatementRunner.run
>> > (ThreadLeakControl.java:358)
>> > [junit4:junit4]    >        at
>> >
>> com.carrotsearch.randomizedtesting.ThreadLeakControl.forkTimeoutingTask(T
>> > hreadLeakControl.java:782)
>> > [junit4:junit4]    >        at
>> >
>> com.carrotsearch.randomizedtesting.ThreadLeakControl$3.evaluate(ThreadLea
>> > kControl.java:442)
>> > [junit4:junit4]    >        at
>> >
>> com.carrotsearch.randomizedtesting.RandomizedRunner.runSingleTest(Rando
>> > mizedRunner.java:746)
>> > [junit4:junit4]    >        at
>> >
>> com.carrotsearch.randomizedtesting.RandomizedRunner$3.evaluate(Randomiz
>> > edRunner.java:648)
>> > [junit4:junit4]    >        at
>> >
>> com.carrotsearch.randomizedtesting.RandomizedRunner$4.evaluate(Randomiz
>> > edRunner.java:682)
>> > [junit4:junit4]    >        at
>> >
>> com.carrotsearch.randomizedtesting.RandomizedRunner$5.evaluate(Randomiz
>> > edRunner.java:693)
>> > [junit4:junit4]    >        at
>> >
>> org.apache.lucene.util.AbstractBeforeAfterRule$1.evaluate(AbstractBeforeAfte
>> > rRule.java:45)
>> > [junit4:junit4]    >        at
>> >
>> org.apache.lucene.util.TestRuleStoreClassName$1.evaluate(TestRuleStoreClass
>> > Name.java:42)
>> > [junit4:junit4]    >        at
>> >
>> com.carrotsearch.randomizedtesting.rules.SystemPropertiesInvariantRule$1.ev
>> > aluate(SystemPropertiesInvariantRule.java:55)
>> > [junit4:junit4]    >        at
>> >
>> com.carrotsearch.randomizedtesting.rules.NoShadowingOrOverridesOnMethod
>> > sRule$1.evaluate(NoShadowingOrOverridesOnMethodsRule.java:39)
>> > [junit4:junit4]    >        at
>> >
>> com.carrotsearch.randomizedtesting.rules.NoShadowingOrOverridesOnMethod
>> > sRule$1.evaluate(NoShadowingOrOverridesOnMethodsRule.java:39)
>> > [junit4:junit4]    >        at
>> >
>> org.apache.lucene.util.TestRuleAssertionsRequired$1.evaluate(TestRuleAssertio
>> > nsRequired.java:40)
>> > [junit4:junit4]    >        at
>> >
>> org.apache.lucene.util.TestRuleMarkFailure$1.evaluate(TestRuleMarkFailure.ja
>> > va:48)
>> > [junit4:junit4]    >        at
>> >
>> org.apache.lucene.util.TestRuleIgnoreAfterMaxFailures$1.evaluate(TestRuleIgn
>> > oreAfterMaxFailures.java:70)
>> > [junit4:junit4]    >        at
>> >
>> org.apache.lucene.util.TestRuleIgnoreTestSuites$1.evaluate(TestRuleIgnoreTest
>> > Suites.java:55)
>> > [junit4:junit4]    >        at
>> >
>> com.carrotsearch.randomizedtesting.rules.StatementAdapter.evaluate(Stateme
>> > ntAdapter.java:36)
>> > [junit4:junit4]    >        at
>> >
>> com.carrotsearch.randomizedtesting.ThreadLeakControl$StatementRunner.run
>> > (ThreadLeakControl.java:358)
>> > [junit4:junit4]    >        at java.lang.Thread.run(Thread.java:722)
>> > [junit4:junit4]    > Caused by: java.io.IOException: Could not remove:
>> > C:\Jenkins\workspace\Lucene-Solr-trunk-
>> > Windows\lucene\build\core\test\J0\.\testSeekSliceEnd4659546752tmp
>> > [junit4:junit4]    >        at
>> > org.apache.lucene.util.CloseableFile.close(CloseableFile.java:47)
>> > [junit4:junit4]    >        at
>> >
>> com.carrotsearch.randomizedtesting.RandomizedRunner$2$1.apply(Randomize
>> > dRunner.java:602)
>> > [junit4:junit4]    >        at
>> >
>> com.carrotsearch.randomizedtesting.RandomizedRunner$2$1.apply(Randomize
>> > dRunner.java:599)
>> > [junit4:junit4]    >        at
>> >
>> com.carrotsearch.randomizedtesting.RandomizedContext.closeResources(Rand
>> > omizedContext.java:167)
>> > [junit4:junit4]    >        at
>> >
>> com.carrotsearch.randomizedtesting.RandomizedRunner$2.afterAlways(Rando
>> > mizedRunner.java:615)
>> > [junit4:junit4]    >        at
>> >
>> com.carrotsearch.randomizedtesting.rules.StatementAdapter.evaluate(Stateme
>> > ntAdapter.java:43)
>> > [junit4:junit4]    >        ... 2 more
>> > [junit4:junit4]    > Throwable #4:
>> > com.carrotsearch.randomizedtesting.ResourceDisposalError: Resource in
>> scope
>> > SUITE failed to close. Resource was registered from thread Thread[id=695,
>> > name=TEST-TestMultiMMap.testSeekSliceEnd-seed#[AA4F04524D760878],
>> > state=RUNNABLE, group=TGRP-TestMultiMMap], registration stack trace
>> > below.
>> > [junit4:junit4]    >        at java.lang.Thread.getStackTrace(Thread.java:1567)
>> > [junit4:junit4]    >        at
>> >
>> com.carrotsearch.randomizedtesting.RandomizedContext.closeAtEnd(Randomiz
>> > edContext.java:150)
>> > [junit4:junit4]    >        at
>> >
>> org.apache.lucene.util.LuceneTestCase.closeAfterSuite(LuceneTestCase.java:48
>> > 5)
>> > [junit4:junit4]    >        at
>> > org.apache.lucene.util._TestUtil.getTempDir(_TestUtil.java:97)
>> > [junit4:junit4]    >        at
>> >
>> org.apache.lucene.store.TestMultiMMap.testSeekSliceEnd(TestMultiMMap.jav
>> > a:164)
>> > [junit4:junit4]    >        at
>> > sun.reflect.NativeMethodAccessorImpl.invoke0(Native Method)
>> > [junit4:junit4]    >        at
>> >
>> sun.reflect.NativeMethodAccessorImpl.invoke(NativeMethodAccessorImpl.java:
>> > 57)
>> > [junit4:junit4]    >        at
>> >
>> sun.reflect.DelegatingMethodAccessorImpl.invoke(DelegatingMethodAccessorI
>> > mpl.java:43)
>> > [junit4:junit4]    >        at java.lang.reflect.Method.invoke(Method.java:601)
>> > [junit4:junit4]    >        at
>> >
>> com.carrotsearch.randomizedtesting.RandomizedRunner.invoke(RandomizedRu
>> > nner.java:1559)
>> > [junit4:junit4]    >        at
>> >
>> com.carrotsearch.randomizedtesting.RandomizedRunner.access$600(Randomiz
>> > edRunner.java:79)
>> > [junit4:junit4]    >        at
>> >
>> com.carrotsearch.randomizedtesting.RandomizedRunner$6.evaluate(Randomiz
>> > edRunner.java:737)
>> > [junit4:junit4]    >        at
>> >
>> com.carrotsearch.randomizedtesting.RandomizedRunner$7.evaluate(Randomiz
>> > edRunner.java:773)
>> > [junit4:junit4]    >        at
>> >
>> com.carrotsearch.randomizedtesting.RandomizedRunner$8.evaluate(Randomiz
>> > edRunner.java:787)
>> > [junit4:junit4]    >        at
>> >
>> org.apache.lucene.util.TestRuleSetupTeardownChained$1.evaluate(TestRuleSet
>> > upTeardownChained.java:50)
>> > [junit4:junit4]    >        at
>> >
>> org.apache.lucene.util.TestRuleFieldCacheSanity$1.evaluate(TestRuleFieldCach
>> > eSanity.java:51)
>> > [junit4:junit4]    >        at
>> >
>> org.apache.lucene.util.AbstractBeforeAfterRule$1.evaluate(AbstractBeforeAfte
>> > rRule.java:45)
>> > [junit4:junit4]    >        at
>> >
>> com.carrotsearch.randomizedtesting.rules.SystemPropertiesInvariantRule$1.ev
>> > aluate(SystemPropertiesInvariantRule.java:55)
>> > [junit4:junit4]    >        at
>> >
>> org.apache.lucene.util.TestRuleThreadAndTestName$1.evaluate(TestRuleThrea
>> > dAndTestName.java:48)
>> > [junit4:junit4]    >        at
>> >
>> org.apache.lucene.util.TestRuleIgnoreAfterMaxFailures$1.evaluate(TestRuleIgn
>> > oreAfterMaxFailures.java:70)
>> > [junit4:junit4]    >        at
>> >
>> org.apache.lucene.util.TestRuleMarkFailure$1.evaluate(TestRuleMarkFailure.ja
>> > va:48)
>> > [junit4:junit4]    >        at
>> >
>> com.carrotsearch.randomizedtesting.rules.StatementAdapter.evaluate(Stateme
>> > ntAdapter.java:36)
>> > [junit4:junit4]    >        at
>> >
>> com.carrotsearch.randomizedtesting.ThreadLeakControl$StatementRunner.run
>> > (ThreadLeakControl.java:358)
>> > [junit4:junit4]    >        at
>> >
>> com.carrotsearch.randomizedtesting.ThreadLeakControl.forkTimeoutingTask(T
>> > hreadLeakControl.java:782)
>> > [junit4:junit4]    >        at
>> >
>> com.carrotsearch.randomizedtesting.ThreadLeakControl$3.evaluate(ThreadLea
>> > kControl.java:442)
>> > [junit4:junit4]    >        at
>> >
>> com.carrotsearch.randomizedtesting.RandomizedRunner.runSingleTest(Rando
>> > mizedRunner.java:746)
>> > [junit4:junit4]    >        at
>> >
>> com.carrotsearch.randomizedtesting.RandomizedRunner$3.evaluate(Randomiz
>> > edRunner.java:648)
>> > [junit4:junit4]    >        at
>> >
>> com.carrotsearch.randomizedtesting.RandomizedRunner$4.evaluate(Randomiz
>> > edRunner.java:682)
>> > [junit4:junit4]    >        at
>> >
>> com.carrotsearch.randomizedtesting.RandomizedRunner$5.evaluate(Randomiz
>> > edRunner.java:693)
>> > [junit4:junit4]    >        at
>> >
>> org.apache.lucene.util.AbstractBeforeAfterRule$1.evaluate(AbstractBeforeAfte
>> > rRule.java:45)
>> > [junit4:junit4]    >        at
>> >
>> org.apache.lucene.util.TestRuleStoreClassName$1.evaluate(TestRuleStoreClass
>> > Name.java:42)
>> > [junit4:junit4]    >        at
>> >
>> com.carrotsearch.randomizedtesting.rules.SystemPropertiesInvariantRule$1.ev
>> > aluate(SystemPropertiesInvariantRule.java:55)
>> > [junit4:junit4]    >        at
>> >
>> com.carrotsearch.randomizedtesting.rules.NoShadowingOrOverridesOnMethod
>> > sRule$1.evaluate(NoShadowingOrOverridesOnMethodsRule.java:39)
>> > [junit4:junit4]    >        at
>> >
>> com.carrotsearch.randomizedtesting.rules.NoShadowingOrOverridesOnMethod
>> > sRule$1.evaluate(NoShadowingOrOverridesOnMethodsRule.java:39)
>> > [junit4:junit4]    >        at
>> >
>> org.apache.lucene.util.TestRuleAssertionsRequired$1.evaluate(TestRuleAssertio
>> > nsRequired.java:40)
>> > [junit4:junit4]    >        at
>> >
>> org.apache.lucene.util.TestRuleMarkFailure$1.evaluate(TestRuleMarkFailure.ja
>> > va:48)
>> > [junit4:junit4]    >        at
>> >
>> org.apache.lucene.util.TestRuleIgnoreAfterMaxFailures$1.evaluate(TestRuleIgn
>> > oreAfterMaxFailures.java:70)
>> > [junit4:junit4]    >        at
>> >
>> org.apache.lucene.util.TestRuleIgnoreTestSuites$1.evaluate(TestRuleIgnoreTest
>> > Suites.java:55)
>> > [junit4:junit4]    >        at
>> >
>> com.carrotsearch.randomizedtesting.rules.StatementAdapter.evaluate(Stateme
>> > ntAdapter.java:36)
>> > [junit4:junit4]    >        at
>> >
>> com.carrotsearch.randomizedtesting.ThreadLeakControl$StatementRunner.run
>> > (ThreadLeakControl.java:358)
>> > [junit4:junit4]    >        at java.lang.Thread.run(Thread.java:722)
>> > [junit4:junit4]    > Caused by: java.io.IOException: Could not remove:
>> > C:\Jenkins\workspace\Lucene-Solr-trunk-
>> > Windows\lucene\build\core\test\J0\.\testSeekSliceEnd4659546753tmp
>> > [junit4:junit4]    >        at
>> > org.apache.lucene.util.CloseableFile.close(CloseableFile.java:47)
>> > [junit4:junit4]    >        at
>> >
>> com.carrotsearch.randomizedtesting.RandomizedRunner$2$1.apply(Randomize
>> > dRunner.java:602)
>> > [junit4:junit4]    >        at
>> >
>> com.carrotsearch.randomizedtesting.RandomizedRunner$2$1.apply(Randomize
>> > dRunner.java:599)
>> > [junit4:junit4]    >        at
>> >
>> com.carrotsearch.randomizedtesting.RandomizedContext.closeResources(Rand
>> > omizedContext.java:167)
>> > [junit4:junit4]    >        at
>> >
>> com.carrotsearch.randomizedtesting.RandomizedRunner$2.afterAlways(Rando
>> > mizedRunner.java:615)
>> > [junit4:junit4]    >        at
>> >
>> com.carrotsearch.randomizedtesting.rules.StatementAdapter.evaluate(Stateme
>> > ntAdapter.java:43)
>> > [junit4:junit4]    >        ... 2 more
>> > [junit4:junit4]    > Throwable #5:
>> > com.carrotsearch.randomizedtesting.ResourceDisposalError: Resource in
>> scope
>> > SUITE failed to close. Resource was registered from thread Thread[id=695,
>> > name=TEST-TestMultiMMap.testSeekSliceEnd-seed#[AA4F04524D760878],
>> > state=RUNNABLE, group=TGRP-TestMultiMMap], registration stack trace
>> > below.
>> > [junit4:junit4]    >        at java.lang.Thread.getStackTrace(Thread.java:1567)
>> > [junit4:junit4]    >        at
>> >
>> com.carrotsearch.randomizedtesting.RandomizedContext.closeAtEnd(Randomiz
>> > edContext.java:150)
>> > [junit4:junit4]    >        at
>> >
>> org.apache.lucene.util.LuceneTestCase.closeAfterSuite(LuceneTestCase.java:48
>> > 5)
>> > [junit4:junit4]    >        at
>> > org.apache.lucene.util._TestUtil.getTempDir(_TestUtil.java:97)
>> > [junit4:junit4]    >        at
>> >
>> org.apache.lucene.store.TestMultiMMap.testSeekSliceEnd(TestMultiMMap.jav
>> > a:164)
>> > [junit4:junit4]    >        at
>> > sun.reflect.NativeMethodAccessorImpl.invoke0(Native Method)
>> > [junit4:junit4]    >        at
>> >
>> sun.reflect.NativeMethodAccessorImpl.invoke(NativeMethodAccessorImpl.java:
>> > 57)
>> > [junit4:junit4]    >        at
>> >
>> sun.reflect.DelegatingMethodAccessorImpl.invoke(DelegatingMethodAccessorI
>> > mpl.java:43)
>> > [junit4:junit4]    >        at java.lang.reflect.Method.invoke(Method.java:601)
>> > [junit4:junit4]    >        at
>> >
>> com.carrotsearch.randomizedtesting.RandomizedRunner.invoke(RandomizedRu
>> > nner.java:1559)
>> > [junit4:junit4]    >        at
>> >
>> com.carrotsearch.randomizedtesting.RandomizedRunner.access$600(Randomiz
>> > edRunner.java:79)
>> > [junit4:junit4]    >        at
>> >
>> com.carrotsearch.randomizedtesting.RandomizedRunner$6.evaluate(Randomiz
>> > edRunner.java:737)
>> > [junit4:junit4]    >        at
>> >
>> com.carrotsearch.randomizedtesting.RandomizedRunner$7.evaluate(Randomiz
>> > edRunner.java:773)
>> > [junit4:junit4]    >        at
>> >
>> com.carrotsearch.randomizedtesting.RandomizedRunner$8.evaluate(Randomiz
>> > edRunner.java:787)
>> > [junit4:junit4]    >        at
>> >
>> org.apache.lucene.util.TestRuleSetupTeardownChained$1.evaluate(TestRuleSet
>> > upTeardownChained.java:50)
>> > [junit4:junit4]    >        at
>> >
>> org.apache.lucene.util.TestRuleFieldCacheSanity$1.evaluate(TestRuleFieldCach
>> > eSanity.java:51)
>> > [junit4:junit4]    >        at
>> >
>> org.apache.lucene.util.AbstractBeforeAfterRule$1.evaluate(AbstractBeforeAfte
>> > rRule.java:45)
>> > [junit4:junit4]    >        at
>> >
>> com.carrotsearch.randomizedtesting.rules.SystemPropertiesInvariantRule$1.ev
>> > aluate(SystemPropertiesInvariantRule.java:55)
>> > [junit4:junit4]    >        at
>> >
>> org.apache.lucene.util.TestRuleThreadAndTestName$1.evaluate(TestRuleThrea
>> > dAndTestName.java:48)
>> > [junit4:junit4]    >        at
>> >
>> org.apache.lucene.util.TestRuleIgnoreAfterMaxFailures$1.evaluate(TestRuleIgn
>> > oreAfterMaxFailures.java:70)
>> > [junit4:junit4]    >        at
>> >
>> org.apache.lucene.util.TestRuleMarkFailure$1.evaluate(TestRuleMarkFailure.ja
>> > va:48)
>> > [junit4:junit4]    >        at
>> >
>> com.carrotsearch.randomizedtesting.rules.StatementAdapter.evaluate(Stateme
>> > ntAdapter.java:36)
>> > [junit4:junit4]    >        at
>> >
>> com.carrotsearch.randomizedtesting.ThreadLeakControl$StatementRunner.run
>> > (ThreadLeakControl.java:358)
>> > [junit4:junit4]    >        at
>> >
>> com.carrotsearch.randomizedtesting.ThreadLeakControl.forkTimeoutingTask(T
>> > hreadLeakControl.java:782)
>> > [junit4:junit4]    >        at
>> >
>> com.carrotsearch.randomizedtesting.ThreadLeakControl$3.evaluate(ThreadLea
>> > kControl.java:442)
>> > [junit4:junit4]    >        at
>> >
>> com.carrotsearch.randomizedtesting.RandomizedRunner.runSingleTest(Rando
>> > mizedRunner.java:746)
>> > [junit4:junit4]    >        at
>> >
>> com.carrotsearch.randomizedtesting.RandomizedRunner$3.evaluate(Randomiz
>> > edRunner.java:648)
>> > [junit4:junit4]    >        at
>> >
>> com.carrotsearch.randomizedtesting.RandomizedRunner$4.evaluate(Randomiz
>> > edRunner.java:682)
>> > [junit4:junit4]    >        at
>> >
>> com.carrotsearch.randomizedtesting.RandomizedRunner$5.evaluate(Randomiz
>> > edRunner.java:693)
>> > [junit4:junit4]    >        at
>> >
>> org.apache.lucene.util.AbstractBeforeAfterRule$1.evaluate(AbstractBeforeAfte
>> > rRule.java:45)
>> > [junit4:junit4]    >        at
>> >
>> org.apache.lucene.util.TestRuleStoreClassName$1.evaluate(TestRuleStoreClass
>> > Name.java:42)
>> > [junit4:junit4]    >        at
>> >
>> com.carrotsearch.randomizedtesting.rules.SystemPropertiesInvariantRule$1.ev
>> > aluate(SystemPropertiesInvariantRule.java:55)
>> > [junit4:junit4]    >        at
>> >
>> com.carrotsearch.randomizedtesting.rules.NoShadowingOrOverridesOnMethod
>> > sRule$1.evaluate(NoShadowingOrOverridesOnMethodsRule.java:39)
>> > [junit4:junit4]    >        at
>> >
>> com.carrotsearch.randomizedtesting.rules.NoShadowingOrOverridesOnMethod
>> > sRule$1.evaluate(NoShadowingOrOverridesOnMethodsRule.java:39)
>> > [junit4:junit4]    >        at
>> >
>> org.apache.lucene.util.TestRuleAssertionsRequired$1.evaluate(TestRuleAssertio
>> > nsRequired.java:40)
>> > [junit4:junit4]    >        at
>> >
>> org.apache.lucene.util.TestRuleMarkFailure$1.evaluate(TestRuleMarkFailure.ja
>> > va:48)
>> > [junit4:junit4]    >        at
>> >
>> org.apache.lucene.util.TestRuleIgnoreAfterMaxFailures$1.evaluate(TestRuleIgn
>> > oreAfterMaxFailures.java:70)
>> > [junit4:junit4]    >        at
>> >
>> org.apache.lucene.util.TestRuleIgnoreTestSuites$1.evaluate(TestRuleIgnoreTest
>> > Suites.java:55)
>> > [junit4:junit4]    >        at
>> >
>> com.carrotsearch.randomizedtesting.rules.StatementAdapter.evaluate(Stateme
>> > ntAdapter.java:36)
>> > [junit4:junit4]    >        at
>> >
>> com.carrotsearch.randomizedtesting.ThreadLeakControl$StatementRunner.run
>> > (ThreadLeakControl.java:358)
>> > [junit4:junit4]    >        at java.lang.Thread.run(Thread.java:722)
>> > [junit4:junit4]    > Caused by: java.io.IOException: Could not remove:
>> > C:\Jenkins\workspace\Lucene-Solr-trunk-
>> > Windows\lucene\build\core\test\J0\.\testSeekSliceEnd4659546754tmp
>> > [junit4:junit4]    >        at
>> > org.apache.lucene.util.CloseableFile.close(CloseableFile.java:47)
>> > [junit4:junit4]    >        at
>> >
>> com.carrotsearch.randomizedtesting.RandomizedRunner$2$1.apply(Randomize
>> > dRunner.java:602)
>> > [junit4:junit4]    >        at
>> >
>> com.carrotsearch.randomizedtesting.RandomizedRunner$2$1.apply(Randomize
>> > dRunner.java:599)
>> > [junit4:junit4]    >        at
>> >
>> com.carrotsearch.randomizedtesting.RandomizedContext.closeResources(Rand
>> > omizedContext.java:167)
>> > [junit4:junit4]    >        at
>> >
>> com.carrotsearch.randomizedtesting.RandomizedRunner$2.afterAlways(Rando
>> > mizedRunner.java:615)
>> > [junit4:junit4]    >        at
>> >
>> com.carrotsearch.randomizedtesting.rules.StatementAdapter.evaluate(Stateme
>> > ntAdapter.java:43)
>> > [junit4:junit4]    >        ... 2 more
>> > [junit4:junit4]    > Throwable #6:
>> > com.carrotsearch.randomizedtesting.ResourceDisposalError: Resource in
>> scope
>> > SUITE failed to close. Resource was registered from thread Thread[id=695,
>> > name=TEST-TestMultiMMap.testSeekSliceEnd-seed#[AA4F04524D760878],
>> > state=RUNNABLE, group=TGRP-TestMultiMMap], registration stack trace
>> > below.
>> > [junit4:junit4]    >        at java.lang.Thread.getStackTrace(Thread.java:1567)
>> > [junit4:junit4]    >        at
>> >
>> com.carrotsearch.randomizedtesting.RandomizedContext.closeAtEnd(Randomiz
>> > edContext.java:150)
>> > [junit4:junit4]    >        at
>> >
>> org.apache.lucene.util.LuceneTestCase.closeAfterSuite(LuceneTestCase.java:48
>> > 5)
>> > [junit4:junit4]    >        at
>> > org.apache.lucene.util._TestUtil.getTempDir(_TestUtil.java:97)
>> > [junit4:junit4]    >        at
>> >
>> org.apache.lucene.store.TestMultiMMap.testSeekSliceEnd(TestMultiMMap.jav
>> > a:164)
>> > [junit4:junit4]    >        at
>> > sun.reflect.NativeMethodAccessorImpl.invoke0(Native Method)
>> > [junit4:junit4]    >        at
>> >
>> sun.reflect.NativeMethodAccessorImpl.invoke(NativeMethodAccessorImpl.java:
>> > 57)
>> > [junit4:junit4]    >        at
>> >
>> sun.reflect.DelegatingMethodAccessorImpl.invoke(DelegatingMethodAccessorI
>> > mpl.java:43)
>> > [junit4:junit4]    >        at java.lang.reflect.Method.invoke(Method.java:601)
>> > [junit4:junit4]    >        at
>> >
>> com.carrotsearch.randomizedtesting.RandomizedRunner.invoke(RandomizedRu
>> > nner.java:1559)
>> > [junit4:junit4]    >        at
>> >
>> com.carrotsearch.randomizedtesting.RandomizedRunner.access$600(Randomiz
>> > edRunner.java:79)
>> > [junit4:junit4]    >        at
>> >
>> com.carrotsearch.randomizedtesting.RandomizedRunner$6.evaluate(Randomiz
>> > edRunner.java:737)
>> > [junit4:junit4]    >        at
>> >
>> com.carrotsearch.randomizedtesting.RandomizedRunner$7.evaluate(Randomiz
>> > edRunner.java:773)
>> > [junit4:junit4]    >        at
>> >
>> com.carrotsearch.randomizedtesting.RandomizedRunner$8.evaluate(Randomiz
>> > edRunner.java:787)
>> > [junit4:junit4]    >        at
>> >
>> org.apache.lucene.util.TestRuleSetupTeardownChained$1.evaluate(TestRuleSet
>> > upTeardownChained.java:50)
>> > [junit4:junit4]    >        at
>> >
>> org.apache.lucene.util.TestRuleFieldCacheSanity$1.evaluate(TestRuleFieldCach
>> > eSanity.java:51)
>> > [junit4:junit4]    >        at
>> >
>> org.apache.lucene.util.AbstractBeforeAfterRule$1.evaluate(AbstractBeforeAfte
>> > rRule.java:45)
>> > [junit4:junit4]    >        at
>> >
>> com.carrotsearch.randomizedtesting.rules.SystemPropertiesInvariantRule$1.ev
>> > aluate(SystemPropertiesInvariantRule.java:55)
>> > [junit4:junit4]    >        at
>> >
>> org.apache.lucene.util.TestRuleThreadAndTestName$1.evaluate(TestRuleThrea
>> > dAndTestName.java:48)
>> > [junit4:junit4]    >        at
>> >
>> org.apache.lucene.util.TestRuleIgnoreAfterMaxFailures$1.evaluate(TestRuleIgn
>> > oreAfterMaxFailures.java:70)
>> > [junit4:junit4]    >        at
>> >
>> org.apache.lucene.util.TestRuleMarkFailure$1.evaluate(TestRuleMarkFailure.ja
>> > va:48)
>> > [junit4:junit4]    >        at
>> >
>> com.carrotsearch.randomizedtesting.rules.StatementAdapter.evaluate(Stateme
>> > ntAdapter.java:36)
>> > [junit4:junit4]    >        at
>> >
>> com.carrotsearch.randomizedtesting.ThreadLeakControl$StatementRunner.run
>> > (ThreadLeakControl.java:358)
>> > [junit4:junit4]    >        at
>> >
>> com.carrotsearch.randomizedtesting.ThreadLeakControl.forkTimeoutingTask(T
>> > hreadLeakControl.java:782)
>> > [junit4:junit4]    >        at
>> >
>> com.carrotsearch.randomizedtesting.ThreadLeakControl$3.evaluate(ThreadLea
>> > kControl.java:442)
>> > [junit4:junit4]    >        at
>> >
>> com.carrotsearch.randomizedtesting.RandomizedRunner.runSingleTest(Rando
>> > mizedRunner.java:746)
>> > [junit4:junit4]    >        at
>> >
>> com.carrotsearch.randomizedtesting.RandomizedRunner$3.evaluate(Randomiz
>> > edRunner.java:648)
>> > [junit4:junit4]    >        at
>> >
>> com.carrotsearch.randomizedtesting.RandomizedRunner$4.evaluate(Randomiz
>> > edRunner.java:682)
>> > [junit4:junit4]    >        at
>> >
>> com.carrotsearch.randomizedtesting.RandomizedRunner$5.evaluate(Randomiz
>> > edRunner.java:693)
>> > [junit4:junit4]    >        at
>> >
>> org.apache.lucene.util.AbstractBeforeAfterRule$1.evaluate(AbstractBeforeAfte
>> > rRule.java:45)
>> > [junit4:junit4]    >        at
>> >
>> org.apache.lucene.util.TestRuleStoreClassName$1.evaluate(TestRuleStoreClass
>> > Name.java:42)
>> > [junit4:junit4]    >        at
>> >
>> com.carrotsearch.randomizedtesting.rules.SystemPropertiesInvariantRule$1.ev
>> > aluate(SystemPropertiesInvariantRule.java:55)
>> > [junit4:junit4]    >        at
>> >
>> com.carrotsearch.randomizedtesting.rules.NoShadowingOrOverridesOnMethod
>> > sRule$1.evaluate(NoShadowingOrOverridesOnMethodsRule.java:39)
>> > [junit4:junit4]    >        at
>> >
>> com.carrotsearch.randomizedtesting.rules.NoShadowingOrOverridesOnMethod
>> > sRule$1.evaluate(NoShadowingOrOverridesOnMethodsRule.java:39)
>> > [junit4:junit4]    >        at
>> >
>> org.apache.lucene.util.TestRuleAssertionsRequired$1.evaluate(TestRuleAssertio
>> > nsRequired.java:40)
>> > [junit4:junit4]    >        at
>> >
>> org.apache.lucene.util.TestRuleMarkFailure$1.evaluate(TestRuleMarkFailure.ja
>> > va:48)
>> > [junit4:junit4]    >        at
>> >
>> org.apache.lucene.util.TestRuleIgnoreAfterMaxFailures$1.evaluate(TestRuleIgn
>> > oreAfterMaxFailures.java:70)
>> > [junit4:junit4]    >        at
>> >
>> org.apache.lucene.util.TestRuleIgnoreTestSuites$1.evaluate(TestRuleIgnoreTest
>> > Suites.java:55)
>> > [junit4:junit4]    >        at
>> >
>> com.carrotsearch.randomizedtesting.rules.StatementAdapter.evaluate(Stateme
>> > ntAdapter.java:36)
>> > [junit4:junit4]    >        at
>> >
>> com.carrotsearch.randomizedtesting.ThreadLeakControl$StatementRunner.run
>> > (ThreadLeakControl.java:358)
>> > [junit4:junit4]    >        at java.lang.Thread.run(Thread.java:722)
>> > [junit4:junit4]    > Caused by: java.io.IOException: Could not remove:
>> > C:\Jenkins\workspace\Lucene-Solr-trunk-
>> > Windows\lucene\build\core\test\J0\.\testSeekSliceEnd4659546755tmp
>> > [junit4:junit4]    >        at
>> > org.apache.lucene.util.CloseableFile.close(CloseableFile.java:47)
>> > [junit4:junit4]    >        at
>> >
>> com.carrotsearch.randomizedtesting.RandomizedRunner$2$1.apply(Randomize
>> > dRunner.java:602)
>> > [junit4:junit4]    >        at
>> >
>> com.carrotsearch.randomizedtesting.RandomizedRunner$2$1.apply(Randomize
>> > dRunner.java:599)
>> > [junit4:junit4]    >        at
>> >
>> com.carrotsearch.randomizedtesting.RandomizedContext.closeResources(Rand
>> > omizedContext.java:167)
>> > [junit4:junit4]    >        at
>> >
>> com.carrotsearch.randomizedtesting.RandomizedRunner$2.afterAlways(Rando
>> > mizedRunner.java:615)
>> > [junit4:junit4]    >        at
>> >
>> com.carrotsearch.randomizedtesting.rules.StatementAdapter.evaluate(Stateme
>> > ntAdapter.java:43)
>> > [junit4:junit4]    >        ... 2 more
>> > [junit4:junit4]    > Throwable #7:
>> > com.carrotsearch.randomizedtesting.ResourceDisposalError: Resource in
>> scope
>> > SUITE failed to close. Resource was registered from thread Thread[id=695,
>> > name=TEST-TestMultiMMap.testSeekSliceEnd-seed#[AA4F04524D760878],
>> > state=RUNNABLE, group=TGRP-TestMultiMMap], registration stack trace
>> > below.
>> > [junit4:junit4]    >        at java.lang.Thread.getStackTrace(Thread.java:1567)
>> > [junit4:junit4]    >        at
>> >
>> com.carrotsearch.randomizedtesting.RandomizedContext.closeAtEnd(Randomiz
>> > edContext.java:150)
>> > [junit4:junit4]    >        at
>> >
>> org.apache.lucene.util.LuceneTestCase.closeAfterSuite(LuceneTestCase.java:48
>> > 5)
>> > [junit4:junit4]    >        at
>> > org.apache.lucene.util._TestUtil.getTempDir(_TestUtil.java:97)
>> > [junit4:junit4]    >        at
>> >
>> org.apache.lucene.store.TestMultiMMap.testSeekSliceEnd(TestMultiMMap.jav
>> > a:164)
>> > [junit4:junit4]    >        at
>> > sun.reflect.NativeMethodAccessorImpl.invoke0(Native Method)
>> > [junit4:junit4]    >        at
>> >
>> sun.reflect.NativeMethodAccessorImpl.invoke(NativeMethodAccessorImpl.java:
>> > 57)
>> > [junit4:junit4]    >        at
>> >
>> sun.reflect.DelegatingMethodAccessorImpl.invoke(DelegatingMethodAccessorI
>> > mpl.java:43)
>> > [junit4:junit4]    >        at java.lang.reflect.Method.invoke(Method.java:601)
>> > [junit4:junit4]    >        at
>> >
>> com.carrotsearch.randomizedtesting.RandomizedRunner.invoke(RandomizedRu
>> > nner.java:1559)
>> > [junit4:junit4]    >        at
>> >
>> com.carrotsearch.randomizedtesting.RandomizedRunner.access$600(Randomiz
>> > edRunner.java:79)
>> > [junit4:junit4]    >        at
>> >
>> com.carrotsearch.randomizedtesting.RandomizedRunner$6.evaluate(Randomiz
>> > edRunner.java:737)
>> > [junit4:junit4]    >        at
>> >
>> com.carrotsearch.randomizedtesting.RandomizedRunner$7.evaluate(Randomiz
>> > edRunner.java:773)
>> > [junit4:junit4]    >        at
>> >
>> com.carrotsearch.randomizedtesting.RandomizedRunner$8.evaluate(Randomiz
>> > edRunner.java:787)
>> > [junit4:junit4]    >        at
>> >
>> org.apache.lucene.util.TestRuleSetupTeardownChained$1.evaluate(TestRuleSet
>> > upTeardownChained.java:50)
>> > [junit4:junit4]    >        at
>> >
>> org.apache.lucene.util.TestRuleFieldCacheSanity$1.evaluate(TestRuleFieldCach
>> > eSanity.java:51)
>> > [junit4:junit4]    >        at
>> >
>> org.apache.lucene.util.AbstractBeforeAfterRule$1.evaluate(AbstractBeforeAfte
>> > rRule.java:45)
>> > [junit4:junit4]    >        at
>> >
>> com.carrotsearch.randomizedtesting.rules.SystemPropertiesInvariantRule$1.ev
>> > aluate(SystemPropertiesInvariantRule.java:55)
>> > [junit4:junit4]    >        at
>> >
>> org.apache.lucene.util.TestRuleThreadAndTestName$1.evaluate(TestRuleThrea
>> > dAndTestName.java:48)
>> > [junit4:junit4]    >        at
>> >
>> org.apache.lucene.util.TestRuleIgnoreAfterMaxFailures$1.evaluate(TestRuleIgn
>> > oreAfterMaxFailures.java:70)
>> > [junit4:junit4]    >        at
>> >
>> org.apache.lucene.util.TestRuleMarkFailure$1.evaluate(TestRuleMarkFailure.ja
>> > va:48)
>> > [junit4:junit4]    >        at
>> >
>> com.carrotsearch.randomizedtesting.rules.StatementAdapter.evaluate(Stateme
>> > ntAdapter.java:36)
>> > [junit4:junit4]    >        at
>> >
>> com.carrotsearch.randomizedtesting.ThreadLeakControl$StatementRunner.run
>> > (ThreadLeakControl.java:358)
>> > [junit4:junit4]    >        at
>> >
>> com.carrotsearch.randomizedtesting.ThreadLeakControl.forkTimeoutingTask(T
>> > hreadLeakControl.java:782)
>> > [junit4:junit4]    >        at
>> >
>> com.carrotsearch.randomizedtesting.ThreadLeakControl$3.evaluate(ThreadLea
>> > kControl.java:442)
>> > [junit4:junit4]    >        at
>> >
>> com.carrotsearch.randomizedtesting.RandomizedRunner.runSingleTest(Rando
>> > mizedRunner.java:746)
>> > [junit4:junit4]    >        at
>> >
>> com.carrotsearch.randomizedtesting.RandomizedRunner$3.evaluate(Randomiz
>> > edRunner.java:648)
>> > [junit4:junit4]    >        at
>> >
>> com.carrotsearch.randomizedtesting.RandomizedRunner$4.evaluate(Randomiz
>> > edRunner.java:682)
>> > [junit4:junit4]    >        at
>> >
>> com.carrotsearch.randomizedtesting.RandomizedRunner$5.evaluate(Randomiz
>> > edRunner.java:693)
>> > [junit4:junit4]    >        at
>> >
>> org.apache.lucene.util.AbstractBeforeAfterRule$1.evaluate(AbstractBeforeAfte
>> > rRule.java:45)
>> > [junit4:junit4]    >        at
>> >
>> org.apache.lucene.util.TestRuleStoreClassName$1.evaluate(TestRuleStoreClass
>> > Name.java:42)
>> > [junit4:junit4]    >        at
>> >
>> com.carrotsearch.randomizedtesting.rules.SystemPropertiesInvariantRule$1.ev
>> > aluate(SystemPropertiesInvariantRule.java:55)
>> > [junit4:junit4]    >        at
>> >
>> com.carrotsearch.randomizedtesting.rules.NoShadowingOrOverridesOnMethod
>> > sRule$1.evaluate(NoShadowingOrOverridesOnMethodsRule.java:39)
>> > [junit4:junit4]    >        at
>> >
>> com.carrotsearch.randomizedtesting.rules.NoShadowingOrOverridesOnMethod
>> > sRule$1.evaluate(NoShadowingOrOverridesOnMethodsRule.java:39)
>> > [junit4:junit4]    >        at
>> >
>> org.apache.lucene.util.TestRuleAssertionsRequired$1.evaluate(TestRuleAssertio
>> > nsRequired.java:40)
>> > [junit4:junit4]    >        at
>> >
>> org.apache.lucene.util.TestRuleMarkFailure$1.evaluate(TestRuleMarkFailure.ja
>> > va:48)
>> > [junit4:junit4]    >        at
>> >
>> org.apache.lucene.util.TestRuleIgnoreAfterMaxFailures$1.evaluate(TestRuleIgn
>> > oreAfterMaxFailures.java:70)
>> > [junit4:junit4]    >        at
>> >
>> org.apache.lucene.util.TestRuleIgnoreTestSuites$1.evaluate(TestRuleIgnoreTest
>> > Suites.java:55)
>> > [junit4:junit4]    >        at
>> >
>> com.carrotsearch.randomizedtesting.rules.StatementAdapter.evaluate(Stateme
>> > ntAdapter.java:36)
>> > [junit4:junit4]    >        at
>> >
>> com.carrotsearch.randomizedtesting.ThreadLeakControl$StatementRunner.run
>> > (ThreadLeakControl.java:358)
>> > [junit4:junit4]    >        at java.lang.Thread.run(Thread.java:722)
>> > [junit4:junit4]    > Caused by: java.io.IOException: Could not remove:
>> > C:\Jenkins\workspace\Lucene-Solr-trunk-
>> > Windows\lucene\build\core\test\J0\.\testSeekSliceEnd4659546756tmp
>> > [junit4:junit4]    >        at
>> > org.apache.lucene.util.CloseableFile.close(CloseableFile.java:47)
>> > [junit4:junit4]    >        at
>> >
>> com.carrotsearch.randomizedtesting.RandomizedRunner$2$1.apply(Randomize
>> > dRunner.java:602)
>> > [junit4:junit4]    >        at
>> >
>> com.carrotsearch.randomizedtesting.RandomizedRunner$2$1.apply(Randomize
>> > dRunner.java:599)
>> > [junit4:junit4]    >        at
>> >
>> com.carrotsearch.randomizedtesting.RandomizedContext.closeResources(Rand
>> > omizedContext.java:167)
>> > [junit4:junit4]    >        at
>> >
>> com.carrotsearch.randomizedtesting.RandomizedRunner$2.afterAlways(Rando
>> > mizedRunner.java:615)
>> > [junit4:junit4]    >        at
>> >
>> com.carrotsearch.randomizedtesting.rules.StatementAdapter.evaluate(Stateme
>> > ntAdapter.java:43)
>> > [junit4:junit4]    >        ... 2 more
>> > [junit4:junit4]    > Throwable #8:
>> > com.carrotsearch.randomizedtesting.ResourceDisposalError: Resource in
>> scope
>> > SUITE failed to close. Resource was registered from thread Thread[id=695,
>> > name=TEST-TestMultiMMap.testSeekSliceEnd-seed#[AA4F04524D760878],
>> > state=RUNNABLE, group=TGRP-TestMultiMMap], registration stack trace
>> > below.
>> > [junit4:junit4]    >        at java.lang.Thread.getStackTrace(Thread.java:1567)
>> > [junit4:junit4]    >        at
>> >
>> com.carrotsearch.randomizedtesting.RandomizedContext.closeAtEnd(Randomiz
>> > edContext.java:150)
>> > [junit4:junit4]    >        at
>> >
>> org.apache.lucene.util.LuceneTestCase.closeAfterSuite(LuceneTestCase.java:48
>> > 5)
>> > [junit4:junit4]    >        at
>> > org.apache.lucene.util._TestUtil.getTempDir(_TestUtil.java:97)
>> > [junit4:junit4]    >        at
>> >
>> org.apache.lucene.store.TestMultiMMap.testSeekSliceEnd(TestMultiMMap.jav
>> > a:164)
>> > [junit4:junit4]    >        at
>> > sun.reflect.NativeMethodAccessorImpl.invoke0(Native Method)
>> > [junit4:junit4]    >        at
>> >
>> sun.reflect.NativeMethodAccessorImpl.invoke(NativeMethodAccessorImpl.java:
>> > 57)
>> > [junit4:junit4]    >        at
>> >
>> sun.reflect.DelegatingMethodAccessorImpl.invoke(DelegatingMethodAccessorI
>> > mpl.java:43)
>> > [junit4:junit4]    >        at java.lang.reflect.Method.invoke(Method.java:601)
>> > [junit4:junit4]    >        at
>> >
>> com.carrotsearch.randomizedtesting.RandomizedRunner.invoke(RandomizedRu
>> > nner.java:1559)
>> > [junit4:junit4]    >        at
>> >
>> com.carrotsearch.randomizedtesting.RandomizedRunner.access$600(Randomiz
>> > edRunner.java:79)
>> > [junit4:junit4]    >        at
>> >
>> com.carrotsearch.randomizedtesting.RandomizedRunner$6.evaluate(Randomiz
>> > edRunner.java:737)
>> > [junit4:junit4]    >        at
>> >
>> com.carrotsearch.randomizedtesting.RandomizedRunner$7.evaluate(Randomiz
>> > edRunner.java:773)
>> > [junit4:junit4]    >        at
>> >
>> com.carrotsearch.randomizedtesting.RandomizedRunner$8.evaluate(Randomiz
>> > edRunner.java:787)
>> > [junit4:junit4]    >        at
>> >
>> org.apache.lucene.util.TestRuleSetupTeardownChained$1.evaluate(TestRuleSet
>> > upTeardownChained.java:50)
>> > [junit4:junit4]    >        at
>> >
>> org.apache.lucene.util.TestRuleFieldCacheSanity$1.evaluate(TestRuleFieldCach
>> > eSanity.java:51)
>> > [junit4:junit4]    >        at
>> >
>> org.apache.lucene.util.AbstractBeforeAfterRule$1.evaluate(AbstractBeforeAfte
>> > rRule.java:45)
>> > [junit4:junit4]    >        at
>> >
>> com.carrotsearch.randomizedtesting.rules.SystemPropertiesInvariantRule$1.ev
>> > aluate(SystemPropertiesInvariantRule.java:55)
>> > [junit4:junit4]    >        at
>> >
>> org.apache.lucene.util.TestRuleThreadAndTestName$1.evaluate(TestRuleThrea
>> > dAndTestName.java:48)
>> > [junit4:junit4]    >        at
>> >
>> org.apache.lucene.util.TestRuleIgnoreAfterMaxFailures$1.evaluate(TestRuleIgn
>> > oreAfterMaxFailures.java:70)
>> > [junit4:junit4]    >        at
>> >
>> org.apache.lucene.util.TestRuleMarkFailure$1.evaluate(TestRuleMarkFailure.ja
>> > va:48)
>> > [junit4:junit4]    >        at
>> >
>> com.carrotsearch.randomizedtesting.rules.StatementAdapter.evaluate(Stateme
>> > ntAdapter.java:36)
>> > [junit4:junit4]    >        at
>> >
>> com.carrotsearch.randomizedtesting.ThreadLeakControl$StatementRunner.run
>> > (ThreadLeakControl.java:358)
>> > [junit4:junit4]    >        at
>> >
>> com.carrotsearch.randomizedtesting.ThreadLeakControl.forkTimeoutingTask(T
>> > hreadLeakControl.java:782)
>> > [junit4:junit4]    >        at
>> >
>> com.carrotsearch.randomizedtesting.ThreadLeakControl$3.evaluate(ThreadLea
>> > kControl.java:442)
>> > [junit4:junit4]    >        at
>> >
>> com.carrotsearch.randomizedtesting.RandomizedRunner.runSingleTest(Rando
>> > mizedRunner.java:746)
>> > [junit4:junit4]    >        at
>> >
>> com.carrotsearch.randomizedtesting.RandomizedRunner$3.evaluate(Randomiz
>> > edRunner.java:648)
>> > [junit4:junit4]    >        at
>> >
>> com.carrotsearch.randomizedtesting.RandomizedRunner$4.evaluate(Randomiz
>> > edRunner.java:682)
>> > [junit4:junit4]    >        at
>> >
>> com.carrotsearch.randomizedtesting.RandomizedRunner$5.evaluate(Randomiz
>> > edRunner.java:693)
>> > [junit4:junit4]    >        at
>> >
>> org.apache.lucene.util.AbstractBeforeAfterRule$1.evaluate(AbstractBeforeAfte
>> > rRule.java:45)
>> > [junit4:junit4]    >        at
>> >
>> org.apache.lucene.util.TestRuleStoreClassName$1.evaluate(TestRuleStoreClass
>> > Name.java:42)
>> > [junit4:junit4]    >        at
>> >
>> com.carrotsearch.randomizedtesting.rules.SystemPropertiesInvariantRule$1.ev
>> > aluate(SystemPropertiesInvariantRule.java:55)
>> > [junit4:junit4]    >        at
>> >
>> com.carrotsearch.randomizedtesting.rules.NoShadowingOrOverridesOnMethod
>> > sRule$1.evaluate(NoShadowingOrOverridesOnMethodsRule.java:39)
>> > [junit4:junit4]    >        at
>> >
>> com.carrotsearch.randomizedtesting.rules.NoShadowingOrOverridesOnMethod
>> > sRule$1.evaluate(NoShadowingOrOverridesOnMethodsRule.java:39)
>> > [junit4:junit4]    >        at
>> >
>> org.apache.lucene.util.TestRuleAssertionsRequired$1.evaluate(TestRuleAssertio
>> > nsRequired.java:40)
>> > [junit4:junit4]    >        at
>> >
>> org.apache.lucene.util.TestRuleMarkFailure$1.evaluate(TestRuleMarkFailure.ja
>> > va:48)
>> > [junit4:junit4]    >        at
>> >
>> org.apache.lucene.util.TestRuleIgnoreAfterMaxFailures$1.evaluate(TestRuleIgn
>> > oreAfterMaxFailures.java:70)
>> > [junit4:junit4]    >        at
>> >
>> org.apache.lucene.util.TestRuleIgnoreTestSuites$1.evaluate(TestRuleIgnoreTest
>> > Suites.java:55)
>> > [junit4:junit4]    >        at
>> >
>> com.carrotsearch.randomizedtesting.rules.StatementAdapter.evaluate(Stateme
>> > ntAdapter.java:36)
>> > [junit4:junit4]    >        at
>> >
>> com.carrotsearch.randomizedtesting.ThreadLeakControl$StatementRunner.run
>> > (ThreadLeakControl.java:358)
>> > [junit4:junit4]    >        at java.lang.Thread.run(Thread.java:722)
>> > [junit4:junit4]    > Caused by: java.io.IOException: Could not remove:
>> > C:\Jenkins\workspace\Lucene-Solr-trunk-
>> > Windows\lucene\build\core\test\J0\.\testSeekSliceEnd4659546757tmp
>> > [junit4:junit4]    >        at
>> > org.apache.lucene.util.CloseableFile.close(CloseableFile.java:47)
>> > [junit4:junit4]    >        at
>> >
>> com.carrotsearch.randomizedtesting.RandomizedRunner$2$1.apply(Randomize
>> > dRunner.java:602)
>> > [junit4:junit4]    >        at
>> >
>> com.carrotsearch.randomizedtesting.RandomizedRunner$2$1.apply(Randomize
>> > dRunner.java:599)
>> > [junit4:junit4]    >        at
>> >
>> com.carrotsearch.randomizedtesting.RandomizedContext.closeResources(Rand
>> > omizedContext.java:167)
>> > [junit4:junit4]    >        at
>> >
>> com.carrotsearch.randomizedtesting.RandomizedRunner$2.afterAlways(Rando
>> > mizedRunner.java:615)
>> > [junit4:junit4]    >        at
>> >
>> com.carrotsearch.randomizedtesting.rules.StatementAdapter.evaluate(Stateme
>> > ntAdapter.java:43)
>> > [junit4:junit4]    >        ... 2 more
>> > [junit4:junit4]    > Throwable #9:
>> > com.carrotsearch.randomizedtesting.ResourceDisposalError: Resource in
>> scope
>> > SUITE failed to close. Resource was registered from thread Thread[id=695,
>> > name=TEST-TestMultiMMap.testSeekSliceEnd-seed#[AA4F04524D760878],
>> > state=RUNNABLE, group=TGRP-TestMultiMMap], registration stack trace
>> > below.
>> > [junit4:junit4]    >        at java.lang.Thread.getStackTrace(Thread.java:1567)
>> > [junit4:junit4]    >        at
>> >
>> com.carrotsearch.randomizedtesting.RandomizedContext.closeAtEnd(Randomiz
>> > edContext.java:150)
>> > [junit4:junit4]    >        at
>> >
>> org.apache.lucene.util.LuceneTestCase.closeAfterSuite(LuceneTestCase.java:48
>> > 5)
>> > [junit4:junit4]    >        at
>> > org.apache.lucene.util._TestUtil.getTempDir(_TestUtil.java:97)
>> > [junit4:junit4]    >        at
>> >
>> org.apache.lucene.store.TestMultiMMap.testSeekSliceEnd(TestMultiMMap.jav
>> > a:164)
>> > [junit4:junit4]    >        at
>> > sun.reflect.NativeMethodAccessorImpl.invoke0(Native Method)
>> > [junit4:junit4]    >        at
>> >
>> sun.reflect.NativeMethodAccessorImpl.invoke(NativeMethodAccessorImpl.java:
>> > 57)
>> > [junit4:junit4]    >        at
>> >
>> sun.reflect.DelegatingMethodAccessorImpl.invoke(DelegatingMethodAccessorI
>> > mpl.java:43)
>> > [junit4:junit4]    >        at java.lang.reflect.Method.invoke(Method.java:601)
>> > [junit4:junit4]    >        at
>> >
>> com.carrotsearch.randomizedtesting.RandomizedRunner.invoke(RandomizedRu
>> > nner.java:1559)
>> > [junit4:junit4]    >        at
>> >
>> com.carrotsearch.randomizedtesting.RandomizedRunner.access$600(Randomiz
>> > edRunner.java:79)
>> > [junit4:junit4]    >        at
>> >
>> com.carrotsearch.randomizedtesting.RandomizedRunner$6.evaluate(Randomiz
>> > edRunner.java:737)
>> > [junit4:junit4]    >        at
>> >
>> com.carrotsearch.randomizedtesting.RandomizedRunner$7.evaluate(Randomiz
>> > edRunner.java:773)
>> > [junit4:junit4]    >        at
>> >
>> com.carrotsearch.randomizedtesting.RandomizedRunner$8.evaluate(Randomiz
>> > edRunner.java:787)
>> > [junit4:junit4]    >        at
>> >
>> org.apache.lucene.util.TestRuleSetupTeardownChained$1.evaluate(TestRuleSet
>> > upTeardownChained.java:50)
>> > [junit4:junit4]    >        at
>> >
>> org.apache.lucene.util.TestRuleFieldCacheSanity$1.evaluate(TestRuleFieldCach
>> > eSanity.java:51)
>> > [junit4:junit4]    >        at
>> >
>> org.apache.lucene.util.AbstractBeforeAfterRule$1.evaluate(AbstractBeforeAfte
>> > rRule.java:45)
>> > [junit4:junit4]    >        at
>> >
>> com.carrotsearch.randomizedtesting.rules.SystemPropertiesInvariantRule$1.ev
>> > aluate(SystemPropertiesInvariantRule.java:55)
>> > [junit4:junit4]    >        at
>> >
>> org.apache.lucene.util.TestRuleThreadAndTestName$1.evaluate(TestRuleThrea
>> > dAndTestName.java:48)
>> > [junit4:junit4]    >        at
>> >
>> org.apache.lucene.util.TestRuleIgnoreAfterMaxFailures$1.evaluate(TestRuleIgn
>> > oreAfterMaxFailures.java:70)
>> > [junit4:junit4]    >        at
>> >
>> org.apache.lucene.util.TestRuleMarkFailure$1.evaluate(TestRuleMarkFailure.ja
>> > va:48)
>> > [junit4:junit4]    >        at
>> >
>> com.carrotsearch.randomizedtesting.rules.StatementAdapter.evaluate(Stateme
>> > ntAdapter.java:36)
>> > [junit4:junit4]    >        at
>> >
>> com.carrotsearch.randomizedtesting.ThreadLeakControl$StatementRunner.run
>> > (ThreadLeakControl.java:358)
>> > [junit4:junit4]    >        at
>> >
>> com.carrotsearch.randomizedtesting.ThreadLeakControl.forkTimeoutingTask(T
>> > hreadLeakControl.java:782)
>> > [junit4:junit4]    >        at
>> >
>> com.carrotsearch.randomizedtesting.ThreadLeakControl$3.evaluate(ThreadLea
>> > kControl.java:442)
>> > [junit4:junit4]    >        at
>> >
>> com.carrotsearch.randomizedtesting.RandomizedRunner.runSingleTest(Rando
>> > mizedRunner.java:746)
>> > [junit4:junit4]    >        at
>> >
>> com.carrotsearch.randomizedtesting.RandomizedRunner$3.evaluate(Randomiz
>> > edRunner.java:648)
>> > [junit4:junit4]    >        at
>> >
>> com.carrotsearch.randomizedtesting.RandomizedRunner$4.evaluate(Randomiz
>> > edRunner.java:682)
>> > [junit4:junit4]    >        at
>> >
>> com.carrotsearch.randomizedtesting.RandomizedRunner$5.evaluate(Randomiz
>> > edRunner.java:693)
>> > [junit4:junit4]    >        at
>> >
>> org.apache.lucene.util.AbstractBeforeAfterRule$1.evaluate(AbstractBeforeAfte
>> > rRule.java:45)
>> > [junit4:junit4]    >        at
>> >
>> org.apache.lucene.util.TestRuleStoreClassName$1.evaluate(TestRuleStoreClass
>> > Name.java:42)
>> > [junit4:junit4]    >        at
>> >
>> com.carrotsearch.randomizedtesting.rules.SystemPropertiesInvariantRule$1.ev
>> > aluate(SystemPropertiesInvariantRule.java:55)
>> > [junit4:junit4]    >        at
>> >
>> com.carrotsearch.randomizedtesting.rules.NoShadowingOrOverridesOnMethod
>> > sRule$1.evaluate(NoShadowingOrOverridesOnMethodsRule.java:39)
>> > [junit4:junit4]    >        at
>> >
>> com.carrotsearch.randomizedtesting.rules.NoShadowingOrOverridesOnMethod
>> > sRule$1.evaluate(NoShadowingOrOverridesOnMethodsRule.java:39)
>> > [junit4:junit4]    >        at
>> >
>> org.apache.lucene.util.TestRuleAssertionsRequired$1.evaluate(TestRuleAssertio
>> > nsRequired.java:40)
>> > [junit4:junit4]    >        at
>> >
>> org.apache.lucene.util.TestRuleMarkFailure$1.evaluate(TestRuleMarkFailure.ja
>> > va:48)
>> > [junit4:junit4]    >        at
>> >
>> org.apache.lucene.util.TestRuleIgnoreAfterMaxFailures$1.evaluate(TestRuleIgn
>> > oreAfterMaxFailures.java:70)
>> > [junit4:junit4]    >        at
>> >
>> org.apache.lucene.util.TestRuleIgnoreTestSuites$1.evaluate(TestRuleIgnoreTest
>> > Suites.java:55)
>> > [junit4:junit4]    >        at
>> >
>> com.carrotsearch.randomizedtesting.rules.StatementAdapter.evaluate(Stateme
>> > ntAdapter.java:36)
>> > [junit4:junit4]    >        at
>> >
>> com.carrotsearch.randomizedtesting.ThreadLeakControl$StatementRunner.run
>> > (ThreadLeakControl.java:358)
>> > [junit4:junit4]    >        at java.lang.Thread.run(Thread.java:722)
>> > [junit4:junit4]    > Caused by: java.io.IOException: Could not remove:
>> > C:\Jenkins\workspace\Lucene-Solr-trunk-
>> > Windows\lucene\build\core\test\J0\.\testSeekSliceEnd4659546758tmp
>> > [junit4:junit4]    >        at
>> > org.apache.lucene.util.CloseableFile.close(CloseableFile.java:47)
>> > [junit4:junit4]    >        at
>> >
>> com.carrotsearch.randomizedtesting.RandomizedRunner$2$1.apply(Randomize
>> > dRunner.java:602)
>> > [junit4:junit4]    >        at
>> >
>> com.carrotsearch.randomizedtesting.RandomizedRunner$2$1.apply(Randomize
>> > dRunner.java:599)
>> > [junit4:junit4]    >        at
>> >
>> com.carrotsearch.randomizedtesting.RandomizedContext.closeResources(Rand
>> > omizedContext.java:167)
>> > [junit4:junit4]    >        at
>> >
>> com.carrotsearch.randomizedtesting.RandomizedRunner$2.afterAlways(Rando
>> > mizedRunner.java:615)
>> > [junit4:junit4]    >        at
>> >
>> com.carrotsearch.randomizedtesting.rules.StatementAdapter.evaluate(Stateme
>> > ntAdapter.java:43)
>> > [junit4:junit4]    >        ... 2 more
>> > [junit4:junit4]    > Throwable #10:
>> > com.carrotsearch.randomizedtesting.ResourceDisposalError: Resource in
>> scope
>> > SUITE failed to close. Resource was registered from thread Thread[id=695,
>> > name=TEST-TestMultiMMap.testSeekSliceEnd-seed#[AA4F04524D760878],
>> > state=RUNNABLE, group=TGRP-TestMultiMMap], registration stack trace
>> > below.
>> > [junit4:junit4]    >        at java.lang.Thread.getStackTrace(Thread.java:1567)
>> > [junit4:junit4]    >        at
>> >
>> com.carrotsearch.randomizedtesting.RandomizedContext.closeAtEnd(Randomiz
>> > edContext.java:150)
>> > [junit4:junit4]    >        at
>> >
>> org.apache.lucene.util.LuceneTestCase.closeAfterSuite(LuceneTestCase.java:48
>> > 5)
>> > [junit4:junit4]    >        at
>> > org.apache.lucene.util._TestUtil.getTempDir(_TestUtil.java:97)
>> > [junit4:junit4]    >        at
>> >
>> org.apache.lucene.store.TestMultiMMap.testSeekSliceEnd(TestMultiMMap.jav
>> > a:164)
>> > [junit4:junit4]    >        at
>> > sun.reflect.NativeMethodAccessorImpl.invoke0(Native Method)
>> > [junit4:junit4]    >        at
>> >
>> sun.reflect.NativeMethodAccessorImpl.invoke(NativeMethodAccessorImpl.java:
>> > 57)
>> > [junit4:junit4]    >        at
>> >
>> sun.reflect.DelegatingMethodAccessorImpl.invoke(DelegatingMethodAccessorI
>> > mpl.java:43)
>> > [junit4:junit4]    >        at java.lang.reflect.Method.invoke(Method.java:601)
>> > [junit4:junit4]    >        at
>> >
>> com.carrotsearch.randomizedtesting.RandomizedRunner.invoke(RandomizedRu
>> > nner.java:1559)
>> > [junit4:junit4]    >        at
>> >
>> com.carrotsearch.randomizedtesting.RandomizedRunner.access$600(Randomiz
>> > edRunner.java:79)
>> > [junit4:junit4]    >        at
>> >
>> com.carrotsearch.randomizedtesting.RandomizedRunner$6.evaluate(Randomiz
>> > edRunner.java:737)
>> > [junit4:junit4]    >        at
>> >
>> com.carrotsearch.randomizedtesting.RandomizedRunner$7.evaluate(Randomiz
>> > edRunner.java:773)
>> > [junit4:junit4]    >        at
>> >
>> com.carrotsearch.randomizedtesting.RandomizedRunner$8.evaluate(Randomiz
>> > edRunner.java:787)
>> > [junit4:junit4]    >        at
>> >
>> org.apache.lucene.util.TestRuleSetupTeardownChained$1.evaluate(TestRuleSet
>> > upTeardownChained.java:50)
>> > [junit4:junit4]    >        at
>> >
>> org.apache.lucene.util.TestRuleFieldCacheSanity$1.evaluate(TestRuleFieldCach
>> > eSanity.java:51)
>> > [junit4:junit4]    >        at
>> >
>> org.apache.lucene.util.AbstractBeforeAfterRule$1.evaluate(AbstractBeforeAfte
>> > rRule.java:45)
>> > [junit4:junit4]    >        at
>> >
>> com.carrotsearch.randomizedtesting.rules.SystemPropertiesInvariantRule$1.ev
>> > aluate(SystemPropertiesInvariantRule.java:55)
>> > [junit4:junit4]    >        at
>> >
>> org.apache.lucene.util.TestRuleThreadAndTestName$1.evaluate(TestRuleThrea
>> > dAndTestName.java:48)
>> > [junit4:junit4]    >        at
>> >
>> org.apache.lucene.util.TestRuleIgnoreAfterMaxFailures$1.evaluate(TestRuleIgn
>> > oreAfterMaxFailures.java:70)
>> > [junit4:junit4]    >        at
>> >
>> org.apache.lucene.util.TestRuleMarkFailure$1.evaluate(TestRuleMarkFailure.ja
>> > va:48)
>> > [junit4:junit4]    >        at
>> >
>> com.carrotsearch.randomizedtesting.rules.StatementAdapter.evaluate(Stateme
>> > ntAdapter.java:36)
>> > [junit4:junit4]    >        at
>> >
>> com.carrotsearch.randomizedtesting.ThreadLeakControl$StatementRunner.run
>> > (ThreadLeakControl.java:358)
>> > [junit4:junit4]    >        at
>> >
>> com.carrotsearch.randomizedtesting.ThreadLeakControl.forkTimeoutingTask(T
>> > hreadLeakControl.java:782)
>> > [junit4:junit4]    >        at
>> >
>> com.carrotsearch.randomizedtesting.ThreadLeakControl$3.evaluate(ThreadLea
>> > kControl.java:442)
>> > [junit4:junit4]    >        at
>> >
>> com.carrotsearch.randomizedtesting.RandomizedRunner.runSingleTest(Rando
>> > mizedRunner.java:746)
>> > [junit4:junit4]    >        at
>> >
>> com.carrotsearch.randomizedtesting.RandomizedRunner$3.evaluate(Randomiz
>> > edRunner.java:648)
>> > [junit4:junit4]    >        at
>> >
>> com.carrotsearch.randomizedtesting.RandomizedRunner$4.evaluate(Randomiz
>> > edRunner.java:682)
>> > [junit4:junit4]    >        at
>> >
>> com.carrotsearch.randomizedtesting.RandomizedRunner$5.evaluate(Randomiz
>> > edRunner.java:693)
>> > [junit4:junit4]    >        at
>> >
>> org.apache.lucene.util.AbstractBeforeAfterRule$1.evaluate(AbstractBeforeAfte
>> > rRule.java:45)
>> > [junit4:junit4]    >        at
>> >
>> org.apache.lucene.util.TestRuleStoreClassName$1.evaluate(TestRuleStoreClass
>> > Name.java:42)
>> > [junit4:junit4]    >        at
>> >
>> com.carrotsearch.randomizedtesting.rules.SystemPropertiesInvariantRule$1.ev
>> > aluate(SystemPropertiesInvariantRule.java:55)
>> > [junit4:junit4]    >        at
>> >
>> com.carrotsearch.randomizedtesting.rules.NoShadowingOrOverridesOnMethod
>> > sRule$1.evaluate(NoShadowingOrOverridesOnMethodsRule.java:39)
>> > [junit4:junit4]    >        at
>> >
>> com.carrotsearch.randomizedtesting.rules.NoShadowingOrOverridesOnMethod
>> > sRule$1.evaluate(NoShadowingOrOverridesOnMethodsRule.java:39)
>> > [junit4:junit4]    >        at
>> >
>> org.apache.lucene.util.TestRuleAssertionsRequired$1.evaluate(TestRuleAssertio
>> > nsRequired.java:40)
>> > [junit4:junit4]    >        at
>> >
>> org.apache.lucene.util.TestRuleMarkFailure$1.evaluate(TestRuleMarkFailure.ja
>> > va:48)
>> > [junit4:junit4]    >        at
>> >
>> org.apache.lucene.util.TestRuleIgnoreAfterMaxFailures$1.evaluate(TestRuleIgn
>> > oreAfterMaxFailures.java:70)
>> > [junit4:junit4]    >        at
>> >
>> org.apache.lucene.util.TestRuleIgnoreTestSuites$1.evaluate(TestRuleIgnoreTest
>> > Suites.java:55)
>> > [junit4:junit4]    >        at
>> >
>> com.carrotsearch.randomizedtesting.rules.StatementAdapter.evaluate(Stateme
>> > ntAdapter.java:36)
>> > [junit4:junit4]    >        at
>> >
>> com.carrotsearch.randomizedtesting.ThreadLeakControl$StatementRunner.run
>> > (ThreadLeakControl.java:358)
>> > [junit4:junit4]    >        at java.lang.Thread.run(Thread.java:722)
>> > [junit4:junit4]    > Caused by: java.io.IOException: Could not remove:
>> > C:\Jenkins\workspace\Lucene-Solr-trunk-
>> > Windows\lucene\build\core\test\J0\.\testSeekSliceEnd4659546759tmp
>> > [junit4:junit4]    >        at
>> > org.apache.lucene.util.CloseableFile.close(CloseableFile.java:47)
>> > [junit4:junit4]    >        at
>> >
>> com.carrotsearch.randomizedtesting.RandomizedRunner$2$1.apply(Randomize
>> > dRunner.java:602)
>> > [junit4:junit4]    >        at
>> >
>> com.carrotsearch.randomizedtesting.RandomizedRunner$2$1.apply(Randomize
>> > dRunner.java:599)
>> > [junit4:junit4]    >        at
>> >
>> com.carrotsearch.randomizedtesting.RandomizedContext.closeResources(Rand
>> > omizedContext.java:167)
>> > [junit4:junit4]    >        at
>> >
>> com.carrotsearch.randomizedtesting.RandomizedRunner$2.afterAlways(Rando
>> > mizedRunner.java:615)
>> > [junit4:junit4]    >        at
>> >
>> com.carrotsearch.randomizedtesting.rules.StatementAdapter.evaluate(Stateme
>> > ntAdapter.java:43)
>> > [junit4:junit4]    >        ... 2 more
>> > [junit4:junit4]    > Throwable #11:
>> > com.carrotsearch.randomizedtesting.ResourceDisposalError: Resource in
>> scope
>> > SUITE failed to close. Resource was registered from thread Thread[id=695,
>> > name=TEST-TestMultiMMap.testSeekSliceEnd-seed#[AA4F04524D760878],
>> > state=RUNNABLE, group=TGRP-TestMultiMMap], registration stack trace
>> > below.
>> > [junit4:junit4]    >        at java.lang.Thread.getStackTrace(Thread.java:1567)
>> > [junit4:junit4]    >        at
>> >
>> com.carrotsearch.randomizedtesting.RandomizedContext.closeAtEnd(Randomiz
>> > edContext.java:150)
>> > [junit4:junit4]    >        at
>> >
>> org.apache.lucene.util.LuceneTestCase.closeAfterSuite(LuceneTestCase.java:48
>> > 5)
>> > [junit4:junit4]    >        at
>> > org.apache.lucene.util._TestUtil.getTempDir(_TestUtil.java:97)
>> > [junit4:junit4]    >        at
>> >
>> org.apache.lucene.store.TestMultiMMap.testSeekSliceEnd(TestMultiMMap.jav
>> > a:164)
>> > [junit4:junit4]    >        at
>> > sun.reflect.NativeMethodAccessorImpl.invoke0(Native Method)
>> > [junit4:junit4]    >        at
>> >
>> sun.reflect.NativeMethodAccessorImpl.invoke(NativeMethodAccessorImpl.java:
>> > 57)
>> > [junit4:junit4]    >        at
>> >
>> sun.reflect.DelegatingMethodAccessorImpl.invoke(DelegatingMethodAccessorI
>> > mpl.java:43)
>> > [junit4:junit4]    >        at java.lang.reflect.Method.invoke(Method.java:601)
>> > [junit4:junit4]    >        at
>> >
>> com.carrotsearch.randomizedtesting.RandomizedRunner.invoke(RandomizedRu
>> > nner.java:1559)
>> > [junit4:junit4]    >        at
>> >
>> com.carrotsearch.randomizedtesting.RandomizedRunner.access$600(Randomiz
>> > edRunner.java:79)
>> > [junit4:junit4]    >        at
>> >
>> com.carrotsearch.randomizedtesting.RandomizedRunner$6.evaluate(Randomiz
>> > edRunner.java:737)
>> > [junit4:junit4]    >        at
>> >
>> com.carrotsearch.randomizedtesting.RandomizedRunner$7.evaluate(Randomiz
>> > edRunner.java:773)
>> > [junit4:junit4]    >        at
>> >
>> com.carrotsearch.randomizedtesting.RandomizedRunner$8.evaluate(Randomiz
>> > edRunner.java:787)
>> > [junit4:junit4]    >        at
>> >
>> org.apache.lucene.util.TestRuleSetupTeardownChained$1.evaluate(TestRuleSet
>> > upTeardownChained.java:50)
>> > [junit4:junit4]    >        at
>> >
>> org.apache.lucene.util.TestRuleFieldCacheSanity$1.evaluate(TestRuleFieldCach
>> > eSanity.java:51)
>> > [junit4:junit4]    >        at
>> >
>> org.apache.lucene.util.AbstractBeforeAfterRule$1.evaluate(AbstractBeforeAfte
>> > rRule.java:45)
>> > [junit4:junit4]    >        at
>> >
>> com.carrotsearch.randomizedtesting.rules.SystemPropertiesInvariantRule$1.ev
>> > aluate(SystemPropertiesInvariantRule.java:55)
>> > [junit4:junit4]    >        at
>> >
>> org.apache.lucene.util.TestRuleThreadAndTestName$1.evaluate(TestRuleThrea
>> > dAndTestName.java:48)
>> > [junit4:junit4]    >        at
>> >
>> org.apache.lucene.util.TestRuleIgnoreAfterMaxFailures$1.evaluate(TestRuleIgn
>> > oreAfterMaxFailures.java:70)
>> > [junit4:junit4]    >        at
>> >
>> org.apache.lucene.util.TestRuleMarkFailure$1.evaluate(TestRuleMarkFailure.ja
>> > va:48)
>> > [junit4:junit4]    >        at
>> >
>> com.carrotsearch.randomizedtesting.rules.StatementAdapter.evaluate(Stateme
>> > ntAdapter.java:36)
>> > [junit4:junit4]    >        at
>> >
>> com.carrotsearch.randomizedtesting.ThreadLeakControl$StatementRunner.run
>> > (ThreadLeakControl.java:358)
>> > [junit4:junit4]    >        at
>> >
>> com.carrotsearch.randomizedtesting.ThreadLeakControl.forkTimeoutingTask(T
>> > hreadLeakControl.java:782)
>> > [junit4:junit4]    >        at
>> >
>> com.carrotsearch.randomizedtesting.ThreadLeakControl$3.evaluate(ThreadLea
>> > kControl.java:442)
>> > [junit4:junit4]    >        at
>> >
>> com.carrotsearch.randomizedtesting.RandomizedRunner.runSingleTest(Rando
>> > mizedRunner.java:746)
>> > [junit4:junit4]    >        at
>> >
>> com.carrotsearch.randomizedtesting.RandomizedRunner$3.evaluate(Randomiz
>> > edRunner.java:648)
>> > [junit4:junit4]    >        at
>> >
>> com.carrotsearch.randomizedtesting.RandomizedRunner$4.evaluate(Randomiz
>> > edRunner.java:682)
>> > [junit4:junit4]    >        at
>> >
>> com.carrotsearch.randomizedtesting.RandomizedRunner$5.evaluate(Randomiz
>> > edRunner.java:693)
>> > [junit4:junit4]    >        at
>> >
>> org.apache.lucene.util.AbstractBeforeAfterRule$1.evaluate(AbstractBeforeAfte
>> > rRule.java:45)
>> > [junit4:junit4]    >        at
>> >
>> org.apache.lucene.util.TestRuleStoreClassName$1.evaluate(TestRuleStoreClass
>> > Name.java:42)
>> > [junit4:junit4]    >        at
>> >
>> com.carrotsearch.randomizedtesting.rules.SystemPropertiesInvariantRule$1.ev
>> > aluate(SystemPropertiesInvariantRule.java:55)
>> > [junit4:junit4]    >        at
>> >
>> com.carrotsearch.randomizedtesting.rules.NoShadowingOrOverridesOnMethod
>> > sRule$1.evaluate(NoShadowingOrOverridesOnMethodsRule.java:39)
>> > [junit4:junit4]    >        at
>> >
>> com.carrotsearch.randomizedtesting.rules.NoShadowingOrOverridesOnMethod
>> > sRule$1.evaluate(NoShadowingOrOverridesOnMethodsRule.java:39)
>> > [junit4:junit4]    >        at
>> >
>> org.apache.lucene.util.TestRuleAssertionsRequired$1.evaluate(TestRuleAssertio
>> > nsRequired.java:40)
>> > [junit4:junit4]    >        at
>> >
>> org.apache.lucene.util.TestRuleMarkFailure$1.evaluate(TestRuleMarkFailure.ja
>> > va:48)
>> > [junit4:junit4]    >        at
>> >
>> org.apache.lucene.util.TestRuleIgnoreAfterMaxFailures$1.evaluate(TestRuleIgn
>> > oreAfterMaxFailures.java:70)
>> > [junit4:junit4]    >        at
>> >
>> org.apache.lucene.util.TestRuleIgnoreTestSuites$1.evaluate(TestRuleIgnoreTest
>> > Suites.java:55)
>> > [junit4:junit4]    >        at
>> >
>> com.carrotsearch.randomizedtesting.rules.StatementAdapter.evaluate(Stateme
>> > ntAdapter.java:36)
>> > [junit4:junit4]    >        at
>> >
>> com.carrotsearch.randomizedtesting.ThreadLeakControl$StatementRunner.run
>> > (ThreadLeakControl.java:358)
>> > [junit4:junit4]    >        at java.lang.Thread.run(Thread.java:722)
>> > [junit4:junit4]    > Caused by: java.io.IOException: Could not remove:
>> > C:\Jenkins\workspace\Lucene-Solr-trunk-
>> > Windows\lucene\build\core\test\J0\.\testSeekSliceEnd4659546760tmp
>> > [junit4:junit4]    >        at
>> > org.apache.lucene.util.CloseableFile.close(CloseableFile.java:47)
>> > [junit4:junit4]    >        at
>> >
>> com.carrotsearch.randomizedtesting.RandomizedRunner$2$1.apply(Randomize
>> > dRunner.java:602)
>> > [junit4:junit4]    >        at
>> >
>> com.carrotsearch.randomizedtesting.RandomizedRunner$2$1.apply(Randomize
>> > dRunner.java:599)
>> > [junit4:junit4]    >        at
>> >
>> com.carrotsearch.randomizedtesting.RandomizedContext.closeResources(Rand
>> > omizedContext.java:167)
>> > [junit4:junit4]    >        at
>> >
>> com.carrotsearch.randomizedtesting.RandomizedRunner$2.afterAlways(Rando
>> > mizedRunner.java:615)
>> > [junit4:junit4]    >        at
>> >
>> com.carrotsearch.randomizedtesting.rules.StatementAdapter.evaluate(Stateme
>> > ntAdapter.java:43)
>> > [junit4:junit4]    >        ... 2 more
>> > [junit4:junit4]    > Throwable #12:
>> > com.carrotsearch.randomizedtesting.ResourceDisposalError: Resource in
>> scope
>> > SUITE failed to close. Resource was registered from thread Thread[id=695,
>> > name=TEST-TestMultiMMap.testSeekSliceEnd-seed#[AA4F04524D760878],
>> > state=RUNNABLE, group=TGRP-TestMultiMMap], registration stack trace
>> > below.
>> > [junit4:junit4]    >        at java.lang.Thread.getStackTrace(Thread.java:1567)
>> > [junit4:junit4]    >        at
>> >
>> com.carrotsearch.randomizedtesting.RandomizedContext.closeAtEnd(Randomiz
>> > edContext.java:150)
>> > [junit4:junit4]    >        at
>> >
>> org.apache.lucene.util.LuceneTestCase.closeAfterSuite(LuceneTestCase.java:48
>> > 5)
>> > [junit4:junit4]    >        at
>> > org.apache.lucene.util._TestUtil.getTempDir(_TestUtil.java:97)
>> > [junit4:junit4]    >        at
>> >
>> org.apache.lucene.store.TestMultiMMap.testSeekSliceEnd(TestMultiMMap.jav
>> > a:164)
>> > [junit4:junit4]    >        at
>> > sun.reflect.NativeMethodAccessorImpl.invoke0(Native Method)
>> > [junit4:junit4]    >        at
>> >
>> sun.reflect.NativeMethodAccessorImpl.invoke(NativeMethodAccessorImpl.java:
>> > 57)
>> > [junit4:junit4]    >        at
>> >
>> sun.reflect.DelegatingMethodAccessorImpl.invoke(DelegatingMethodAccessorI
>> > mpl.java:43)
>> > [junit4:junit4]    >        at java.lang.reflect.Method.invoke(Method.java:601)
>> > [junit4:junit4]    >        at
>> >
>> com.carrotsearch.randomizedtesting.RandomizedRunner.invoke(RandomizedRu
>> > nner.java:1559)
>> > [junit4:junit4]    >        at
>> >
>> com.carrotsearch.randomizedtesting.RandomizedRunner.access$600(Randomiz
>> > edRunner.java:79)
>> > [junit4:junit4]    >        at
>> >
>> com.carrotsearch.randomizedtesting.RandomizedRunner$6.evaluate(Randomiz
>> > edRunner.java:737)
>> > [junit4:junit4]    >        at
>> >
>> com.carrotsearch.randomizedtesting.RandomizedRunner$7.evaluate(Randomiz
>> > edRunner.java:773)
>> > [junit4:junit4]    >        at
>> >
>> com.carrotsearch.randomizedtesting.RandomizedRunner$8.evaluate(Randomiz
>> > edRunner.java:787)
>> > [junit4:junit4]    >        at
>> >
>> org.apache.lucene.util.TestRuleSetupTeardownChained$1.evaluate(TestRuleSet
>> > upTeardownChained.java:50)
>> > [junit4:junit4]    >        at
>> >
>> org.apache.lucene.util.TestRuleFieldCacheSanity$1.evaluate(TestRuleFieldCach
>> > eSanity.java:51)
>> > [junit4:junit4]    >        at
>> >
>> org.apache.lucene.util.AbstractBeforeAfterRule$1.evaluate(AbstractBeforeAfte
>> > rRule.java:45)
>> > [junit4:junit4]    >        at
>> >
>> com.carrotsearch.randomizedtesting.rules.SystemPropertiesInvariantRule$1.ev
>> > aluate(SystemPropertiesInvariantRule.java:55)
>> > [junit4:junit4]    >        at
>> >
>> org.apache.lucene.util.TestRuleThreadAndTestName$1.evaluate(TestRuleThrea
>> > dAndTestName.java:48)
>> > [junit4:junit4]    >        at
>> >
>> org.apache.lucene.util.TestRuleIgnoreAfterMaxFailures$1.evaluate(TestRuleIgn
>> > oreAfterMaxFailures.java:70)
>> > [junit4:junit4]    >        at
>> >
>> org.apache.lucene.util.TestRuleMarkFailure$1.evaluate(TestRuleMarkFailure.ja
>> > va:48)
>> > [junit4:junit4]    >        at
>> >
>> com.carrotsearch.randomizedtesting.rules.StatementAdapter.evaluate(Stateme
>> > ntAdapter.java:36)
>> > [junit4:junit4]    >        at
>> >
>> com.carrotsearch.randomizedtesting.ThreadLeakControl$StatementRunner.run
>> > (ThreadLeakControl.java:358)
>> > [junit4:junit4]    >        at
>> >
>> com.carrotsearch.randomizedtesting.ThreadLeakControl.forkTimeoutingTask(T
>> > hreadLeakControl.java:782)
>> > [junit4:junit4]    >        at
>> >
>> com.carrotsearch.randomizedtesting.ThreadLeakControl$3.evaluate(ThreadLea
>> > kControl.java:442)
>> > [junit4:junit4]    >        at
>> >
>> com.carrotsearch.randomizedtesting.RandomizedRunner.runSingleTest(Rando
>> > mizedRunner.java:746)
>> > [junit4:junit4]    >        at
>> >
>> com.carrotsearch.randomizedtesting.RandomizedRunner$3.evaluate(Randomiz
>> > edRunner.java:648)
>> > [junit4:junit4]    >        at
>> >
>> com.carrotsearch.randomizedtesting.RandomizedRunner$4.evaluate(Randomiz
>> > edRunner.java:682)
>> > [junit4:junit4]    >        at
>> >
>> com.carrotsearch.randomizedtesting.RandomizedRunner$5.evaluate(Randomiz
>> > edRunner.java:693)
>> > [junit4:junit4]    >        at
>> >
>> org.apache.lucene.util.AbstractBeforeAfterRule$1.evaluate(AbstractBeforeAfte
>> > rRule.java:45)
>> > [junit4:junit4]    >        at
>> >
>> org.apache.lucene.util.TestRuleStoreClassName$1.evaluate(TestRuleStoreClass
>> > Name.java:42)
>> > [junit4:junit4]    >        at
>> >
>> com.carrotsearch.randomizedtesting.rules.SystemPropertiesInvariantRule$1.ev
>> > aluate(SystemPropertiesInvariantRule.java:55)
>> > [junit4:junit4]    >        at
>> >
>> com.carrotsearch.randomizedtesting.rules.NoShadowingOrOverridesOnMethod
>> > sRule$1.evaluate(NoShadowingOrOverridesOnMethodsRule.java:39)
>> > [junit4:junit4]    >        at
>> >
>> com.carrotsearch.randomizedtesting.rules.NoShadowingOrOverridesOnMethod
>> > sRule$1.evaluate(NoShadowingOrOverridesOnMethodsRule.java:39)
>> > [junit4:junit4]    >        at
>> >
>> org.apache.lucene.util.TestRuleAssertionsRequired$1.evaluate(TestRuleAssertio
>> > nsRequired.java:40)
>> > [junit4:junit4]    >        at
>> >
>> org.apache.lucene.util.TestRuleMarkFailure$1.evaluate(TestRuleMarkFailure.ja
>> > va:48)
>> > [junit4:junit4]    >        at
>> >
>> org.apache.lucene.util.TestRuleIgnoreAfterMaxFailures$1.evaluate(TestRuleIgn
>> > oreAfterMaxFailures.java:70)
>> > [junit4:junit4]    >        at
>> >
>> org.apache.lucene.util.TestRuleIgnoreTestSuites$1.evaluate(TestRuleIgnoreTest
>> > Suites.java:55)
>> > [junit4:junit4]    >        at
>> >
>> com.carrotsearch.randomizedtesting.rules.StatementAdapter.evaluate(Stateme
>> > ntAdapter.java:36)
>> > [junit4:junit4]    >        at
>> >
>> com.carrotsearch.randomizedtesting.ThreadLeakControl$StatementRunner.run
>> > (ThreadLeakControl.java:358)
>> > [junit4:junit4]    >        at java.lang.Thread.run(Thread.java:722)
>> > [junit4:junit4]    > Caused by: java.io.IOException: Could not remove:
>> > C:\Jenkins\workspace\Lucene-Solr-trunk-
>> > Windows\lucene\build\core\test\J0\.\testSeekSliceEnd4659546761tmp
>> > [junit4:junit4]    >        at
>> > org.apache.lucene.util.CloseableFile.close(CloseableFile.java:47)
>> > [junit4:junit4]    >        at
>> >
>> com.carrotsearch.randomizedtesting.RandomizedRunner$2$1.apply(Randomize
>> > dRunner.java:602)
>> > [junit4:junit4]    >        at
>> >
>> com.carrotsearch.randomizedtesting.RandomizedRunner$2$1.apply(Randomize
>> > dRunner.java:599)
>> > [junit4:junit4]    >        at
>> >
>> com.carrotsearch.randomizedtesting.RandomizedContext.closeResources(Rand
>> > omizedContext.java:167)
>> > [junit4:junit4]    >        at
>> >
>> com.carrotsearch.randomizedtesting.RandomizedRunner$2.afterAlways(Rando
>> > mizedRunner.java:615)
>> > [junit4:junit4]    >        at
>> >
>> com.carrotsearch.randomizedtesting.rules.StatementAdapter.evaluate(Stateme
>> > ntAdapter.java:43)
>> > [junit4:junit4]    >        ... 2 more
>> > [junit4:junit4]    > Throwable #13:
>> > com.carrotsearch.randomizedtesting.ResourceDisposalError: Resource in
>> scope
>> > SUITE failed to close. Resource was registered from thread Thread[id=695,
>> > name=TEST-TestMultiMMap.testSeekSliceEnd-seed#[AA4F04524D760878],
>> > state=RUNNABLE, group=TGRP-TestMultiMMap], registration stack trace
>> > below.
>> > [junit4:junit4]    >        at java.lang.Thread.getStackTrace(Thread.java:1567)
>> > [junit4:junit4]    >        at
>> >
>> com.carrotsearch.randomizedtesting.RandomizedContext.closeAtEnd(Randomiz
>> > edContext.java:150)
>> > [junit4:junit4]    >        at
>> >
>> org.apache.lucene.util.LuceneTestCase.closeAfterSuite(LuceneTestCase.java:48
>> > 5)
>> > [junit4:junit4]    >        at
>> > org.apache.lucene.util._TestUtil.getTempDir(_TestUtil.java:97)
>> > [junit4:junit4]    >        at
>> >
>> org.apache.lucene.store.TestMultiMMap.testSeekSliceEnd(TestMultiMMap.jav
>> > a:164)
>> > [junit4:junit4]    >        at
>> > sun.reflect.NativeMethodAccessorImpl.invoke0(Native Method)
>> > [junit4:junit4]    >        at
>> >
>> sun.reflect.NativeMethodAccessorImpl.invoke(NativeMethodAccessorImpl.java:
>> > 57)
>> > [junit4:junit4]    >        at
>> >
>> sun.reflect.DelegatingMethodAccessorImpl.invoke(DelegatingMethodAccessorI
>> > mpl.java:43)
>> > [junit4:junit4]    >        at java.lang.reflect.Method.invoke(Method.java:601)
>> > [junit4:junit4]    >        at
>> >
>> com.carrotsearch.randomizedtesting.RandomizedRunner.invoke(RandomizedRu
>> > nner.java:1559)
>> > [junit4:junit4]    >        at
>> >
>> com.carrotsearch.randomizedtesting.RandomizedRunner.access$600(Randomiz
>> > edRunner.java:79)
>> > [junit4:junit4]    >        at
>> >
>> com.carrotsearch.randomizedtesting.RandomizedRunner$6.evaluate(Randomiz
>> > edRunner.java:737)
>> > [junit4:junit4]    >        at
>> >
>> com.carrotsearch.randomizedtesting.RandomizedRunner$7.evaluate(Randomiz
>> > edRunner.java:773)
>> > [junit4:junit4]    >        at
>> >
>> com.carrotsearch.randomizedtesting.RandomizedRunner$8.evaluate(Randomiz
>> > edRunner.java:787)
>> > [junit4:junit4]    >        at
>> >
>> org.apache.lucene.util.TestRuleSetupTeardownChained$1.evaluate(TestRuleSet
>> > upTeardownChained.java:50)
>> > [junit4:junit4]    >        at
>> >
>> org.apache.lucene.util.TestRuleFieldCacheSanity$1.evaluate(TestRuleFieldCach
>> > eSanity.java:51)
>> > [junit4:junit4]    >        at
>> >
>> org.apache.lucene.util.AbstractBeforeAfterRule$1.evaluate(AbstractBeforeAfte
>> > rRule.java:45)
>> > [junit4:junit4]    >        at
>> >
>> com.carrotsearch.randomizedtesting.rules.SystemPropertiesInvariantRule$1.ev
>> > aluate(SystemPropertiesInvariantRule.java:55)
>> > [junit4:junit4]    >        at
>> >
>> org.apache.lucene.util.TestRuleThreadAndTestName$1.evaluate(TestRuleThrea
>> > dAndTestName.java:48)
>> > [junit4:junit4]    >        at
>> >
>> org.apache.lucene.util.TestRuleIgnoreAfterMaxFailures$1.evaluate(TestRuleIgn
>> > oreAfterMaxFailures.java:70)
>> > [junit4:junit4]    >        at
>> >
>> org.apache.lucene.util.TestRuleMarkFailure$1.evaluate(TestRuleMarkFailure.ja
>> > va:48)
>> > [junit4:junit4]    >        at
>> >
>> com.carrotsearch.randomizedtesting.rules.StatementAdapter.evaluate(Stateme
>> > ntAdapter.java:36)
>> > [junit4:junit4]    >        at
>> >
>> com.carrotsearch.randomizedtesting.ThreadLeakControl$StatementRunner.run
>> > (ThreadLeakControl.java:358)
>> > [junit4:junit4]    >        at
>> >
>> com.carrotsearch.randomizedtesting.ThreadLeakControl.forkTimeoutingTask(T
>> > hreadLeakControl.java:782)
>> > [junit4:junit4]    >        at
>> >
>> com.carrotsearch.randomizedtesting.ThreadLeakControl$3.evaluate(ThreadLea
>> > kControl.java:442)
>> > [junit4:junit4]    >        at
>> >
>> com.carrotsearch.randomizedtesting.RandomizedRunner.runSingleTest(Rando
>> > mizedRunner.java:746)
>> > [junit4:junit4]    >        at
>> >
>> com.carrotsearch.randomizedtesting.RandomizedRunner$3.evaluate(Randomiz
>> > edRunner.java:648)
>> > [junit4:junit4]    >        at
>> >
>> com.carrotsearch.randomizedtesting.RandomizedRunner$4.evaluate(Randomiz
>> > edRunner.java:682)
>> > [junit4:junit4]    >        at
>> >
>> com.carrotsearch.randomizedtesting.RandomizedRunner$5.evaluate(Randomiz
>> > edRunner.java:693)
>> > [junit4:junit4]    >        at
>> >
>> org.apache.lucene.util.AbstractBeforeAfterRule$1.evaluate(AbstractBeforeAfte
>> > rRule.java:45)
>> > [junit4:junit4]    >        at
>> >
>> org.apache.lucene.util.TestRuleStoreClassName$1.evaluate(TestRuleStoreClass
>> > Name.java:42)
>> > [junit4:junit4]    >        at
>> >
>> com.carrotsearch.randomizedtesting.rules.SystemPropertiesInvariantRule$1.ev
>> > aluate(SystemPropertiesInvariantRule.java:55)
>> > [junit4:junit4]    >        at
>> >
>> com.carrotsearch.randomizedtesting.rules.NoShadowingOrOverridesOnMethod
>> > sRule$1.evaluate(NoShadowingOrOverridesOnMethodsRule.java:39)
>> > [junit4:junit4]    >        at
>> >
>> com.carrotsearch.randomizedtesting.rules.NoShadowingOrOverridesOnMethod
>> > sRule$1.evaluate(NoShadowingOrOverridesOnMethodsRule.java:39)
>> > [junit4:junit4]    >        at
>> >
>> org.apache.lucene.util.TestRuleAssertionsRequired$1.evaluate(TestRuleAssertio
>> > nsRequired.java:40)
>> > [junit4:junit4]    >        at
>> >
>> org.apache.lucene.util.TestRuleMarkFailure$1.evaluate(TestRuleMarkFailure.ja
>> > va:48)
>> > [junit4:junit4]    >        at
>> >
>> org.apache.lucene.util.TestRuleIgnoreAfterMaxFailures$1.evaluate(TestRuleIgn
>> > oreAfterMaxFailures.java:70)
>> > [junit4:junit4]    >        at
>> >
>> org.apache.lucene.util.TestRuleIgnoreTestSuites$1.evaluate(TestRuleIgnoreTest
>> > Suites.java:55)
>> > [junit4:junit4]    >        at
>> >
>> com.carrotsearch.randomizedtesting.rules.StatementAdapter.evaluate(Stateme
>> > ntAdapter.java:36)
>> > [junit4:junit4]    >        at
>> >
>> com.carrotsearch.randomizedtesting.ThreadLeakControl$StatementRunner.run
>> > (ThreadLeakControl.java:358)
>> > [junit4:junit4]    >        at java.lang.Thread.run(Thread.java:722)
>> > [junit4:junit4]    > Caused by: java.io.IOException: Could not remove:
>> > C:\Jenkins\workspace\Lucene-Solr-trunk-
>> > Windows\lucene\build\core\test\J0\.\testSeekSliceEnd4659546762tmp
>> > [junit4:junit4]    >        at
>> > org.apache.lucene.util.CloseableFile.close(CloseableFile.java:47)
>> > [junit4:junit4]    >        at
>> >
>> com.carrotsearch.randomizedtesting.RandomizedRunner$2$1.apply(Randomize
>> > dRunner.java:602)
>> > [junit4:junit4]    >        at
>> >
>> com.carrotsearch.randomizedtesting.RandomizedRunner$2$1.apply(Randomize
>> > dRunner.java:599)
>> > [junit4:junit4]    >        at
>> >
>> com.carrotsearch.randomizedtesting.RandomizedContext.closeResources(Rand
>> > omizedContext.java:167)
>> > [junit4:junit4]    >        at
>> >
>> com.carrotsearch.randomizedtesting.RandomizedRunner$2.afterAlways(Rando
>> > mizedRunner.java:615)
>> > [junit4:junit4]    >        at
>> >
>> com.carrotsearch.randomizedtesting.rules.StatementAdapter.evaluate(Stateme
>> > ntAdapter.java:43)
>> > [junit4:junit4]    >        ... 2 more
>> > [junit4:junit4]    > Throwable #14:
>> > com.carrotsearch.randomizedtesting.ResourceDisposalError: Resource in
>> scope
>> > SUITE failed to close. Resource was registered from thread Thread[id=695,
>> > name=TEST-TestMultiMMap.testSeekSliceEnd-seed#[AA4F04524D760878],
>> > state=RUNNABLE, group=TGRP-TestMultiMMap], registration stack trace
>> > below.
>> > [junit4:junit4]    >        at java.lang.Thread.getStackTrace(Thread.java:1567)
>> > [junit4:junit4]    >        at
>> >
>> com.carrotsearch.randomizedtesting.RandomizedContext.closeAtEnd(Randomiz
>> > edContext.java:150)
>> > [junit4:junit4]    >        at
>> >
>> org.apache.lucene.util.LuceneTestCase.closeAfterSuite(LuceneTestCase.java:48
>> > 5)
>> > [junit4:junit4]    >        at
>> > org.apache.lucene.util._TestUtil.getTempDir(_TestUtil.java:97)
>> > [junit4:junit4]    >        at
>> >
>> org.apache.lucene.store.TestMultiMMap.testSeekSliceEnd(TestMultiMMap.jav
>> > a:164)
>> > [junit4:junit4]    >        at
>> > sun.reflect.NativeMethodAccessorImpl.invoke0(Native Method)
>> > [junit4:junit4]    >        at
>> >
>> sun.reflect.NativeMethodAccessorImpl.invoke(NativeMethodAccessorImpl.java:
>> > 57)
>> > [junit4:junit4]    >        at
>> >
>> sun.reflect.DelegatingMethodAccessorImpl.invoke(DelegatingMethodAccessorI
>> > mpl.java:43)
>> > [junit4:junit4]    >        at java.lang.reflect.Method.invoke(Method.java:601)
>> > [junit4:junit4]    >        at
>> >
>> com.carrotsearch.randomizedtesting.RandomizedRunner.invoke(RandomizedRu
>> > nner.java:1559)
>> > [junit4:junit4]    >        at
>> >
>> com.carrotsearch.randomizedtesting.RandomizedRunner.access$600(Randomiz
>> > edRunner.java:79)
>> > [junit4:junit4]    >        at
>> >
>> com.carrotsearch.randomizedtesting.RandomizedRunner$6.evaluate(Randomiz
>> > edRunner.java:737)
>> > [junit4:junit4]    >        at
>> >
>> com.carrotsearch.randomizedtesting.RandomizedRunner$7.evaluate(Randomiz
>> > edRunner.java:773)
>> > [junit4:junit4]    >        at
>> >
>> com.carrotsearch.randomizedtesting.RandomizedRunner$8.evaluate(Randomiz
>> > edRunner.java:787)
>> > [junit4:junit4]    >        at
>> >
>> org.apache.lucene.util.TestRuleSetupTeardownChained$1.evaluate(TestRuleSet
>> > upTeardownChained.java:50)
>> > [junit4:junit4]    >        at
>> >
>> org.apache.lucene.util.TestRuleFieldCacheSanity$1.evaluate(TestRuleFieldCach
>> > eSanity.java:51)
>> > [junit4:junit4]    >        at
>> >
>> org.apache.lucene.util.AbstractBeforeAfterRule$1.evaluate(AbstractBeforeAfte
>> > rRule.java:45)
>> > [junit4:junit4]    >        at
>> >
>> com.carrotsearch.randomizedtesting.rules.SystemPropertiesInvariantRule$1.ev
>> > aluate(SystemPropertiesInvariantRule.java:55)
>> > [junit4:junit4]    >        at
>> >
>> org.apache.lucene.util.TestRuleThreadAndTestName$1.evaluate(TestRuleThrea
>> > dAndTestName.java:48)
>> > [junit4:junit4]    >        at
>> >
>> org.apache.lucene.util.TestRuleIgnoreAfterMaxFailures$1.evaluate(TestRuleIgn
>> > oreAfterMaxFailures.java:70)
>> > [junit4:junit4]    >        at
>> >
>> org.apache.lucene.util.TestRuleMarkFailure$1.evaluate(TestRuleMarkFailure.ja
>> > va:48)
>> > [junit4:junit4]    >        at
>> >
>> com.carrotsearch.randomizedtesting.rules.StatementAdapter.evaluate(Stateme
>> > ntAdapter.java:36)
>> > [junit4:junit4]    >        at
>> >
>> com.carrotsearch.randomizedtesting.ThreadLeakControl$StatementRunner.run
>> > (ThreadLeakControl.java:358)
>> > [junit4:junit4]    >        at
>> >
>> com.carrotsearch.randomizedtesting.ThreadLeakControl.forkTimeoutingTask(T
>> > hreadLeakControl.java:782)
>> > [junit4:junit4]    >        at
>> >
>> com.carrotsearch.randomizedtesting.ThreadLeakControl$3.evaluate(ThreadLea
>> > kControl.java:442)
>> > [junit4:junit4]    >        at
>> >
>> com.carrotsearch.randomizedtesting.RandomizedRunner.runSingleTest(Rando
>> > mizedRunner.java:746)
>> > [junit4:junit4]    >        at
>> >
>> com.carrotsearch.randomizedtesting.RandomizedRunner$3.evaluate(Randomiz
>> > edRunner.java:648)
>> > [junit4:junit4]    >        at
>> >
>> com.carrotsearch.randomizedtesting.RandomizedRunner$4.evaluate(Randomiz
>> > edRunner.java:682)
>> > [junit4:junit4]    >        at
>> >
>> com.carrotsearch.randomizedtesting.RandomizedRunner$5.evaluate(Randomiz
>> > edRunner.java:693)
>> > [junit4:junit4]    >        at
>> >
>> org.apache.lucene.util.AbstractBeforeAfterRule$1.evaluate(AbstractBeforeAfte
>> > rRule.java:45)
>> > [junit4:junit4]    >        at
>> >
>> org.apache.lucene.util.TestRuleStoreClassName$1.evaluate(TestRuleStoreClass
>> > Name.java:42)
>> > [junit4:junit4]    >        at
>> >
>> com.carrotsearch.randomizedtesting.rules.SystemPropertiesInvariantRule$1.ev
>> > aluate(SystemPropertiesInvariantRule.java:55)
>> > [junit4:junit4]    >        at
>> >
>> com.carrotsearch.randomizedtesting.rules.NoShadowingOrOverridesOnMethod
>> > sRule$1.evaluate(NoShadowingOrOverridesOnMethodsRule.java:39)
>> > [junit4:junit4]    >        at
>> >
>> com.carrotsearch.randomizedtesting.rules.NoShadowingOrOverridesOnMethod
>> > sRule$1.evaluate(NoShadowingOrOverridesOnMethodsRule.java:39)
>> > [junit4:junit4]    >        at
>> >
>> org.apache.lucene.util.TestRuleAssertionsRequired$1.evaluate(TestRuleAssertio
>> > nsRequired.java:40)
>> > [junit4:junit4]    >        at
>> >
>> org.apache.lucene.util.TestRuleMarkFailure$1.evaluate(TestRuleMarkFailure.ja
>> > va:48)
>> > [junit4:junit4]    >        at
>> >
>> org.apache.lucene.util.TestRuleIgnoreAfterMaxFailures$1.evaluate(TestRuleIgn
>> > oreAfterMaxFailures.java:70)
>> > [junit4:junit4]    >        at
>> >
>> org.apache.lucene.util.TestRuleIgnoreTestSuites$1.evaluate(TestRuleIgnoreTest
>> > Suites.java:55)
>> > [junit4:junit4]    >        at
>> >
>> com.carrotsearch.randomizedtesting.rules.StatementAdapter.evaluate(Stateme
>> > ntAdapter.java:36)
>> > [junit4:junit4]    >        at
>> >
>> com.carrotsearch.randomizedtesting.ThreadLeakControl$StatementRunner.run
>> > (ThreadLeakControl.java:358)
>> > [junit4:junit4]    >        at java.lang.Thread.run(Thread.java:722)
>> > [junit4:junit4]    > Caused by: java.io.IOException: Could not remove:
>> > C:\Jenkins\workspace\Lucene-Solr-trunk-
>> > Windows\lucene\build\core\test\J0\.\testSeekSliceEnd4659546763tmp
>> > [junit4:junit4]    >        at
>> > org.apache.lucene.util.CloseableFile.close(CloseableFile.java:47)
>> > [junit4:junit4]    >        at
>> >
>> com.carrotsearch.randomizedtesting.RandomizedRunner$2$1.apply(Randomize
>> > dRunner.java:602)
>> > [junit4:junit4]    >        at
>> >
>> com.carrotsearch.randomizedtesting.RandomizedRunner$2$1.apply(Randomize
>> > dRunner.java:599)
>> > [junit4:junit4]    >        at
>> >
>> com.carrotsearch.randomizedtesting.RandomizedContext.closeResources(Rand
>> > omizedContext.java:167)
>> > [junit4:junit4]    >        at
>> >
>> com.carrotsearch.randomizedtesting.RandomizedRunner$2.afterAlways(Rando
>> > mizedRunner.java:615)
>> > [junit4:junit4]    >        at
>> >
>> com.carrotsearch.randomizedtesting.rules.StatementAdapter.evaluate(Stateme
>> > ntAdapter.java:43)
>> > [junit4:junit4]    >        ... 2 more
>> > [junit4:junit4]    > Throwable #15:
>> > com.carrotsearch.randomizedtesting.ResourceDisposalError: Resource in
>> scope
>> > SUITE failed to close. Resource was registered from thread Thread[id=695,
>> > name=TEST-TestMultiMMap.testSeekSliceEnd-seed#[AA4F04524D760878],
>> > state=RUNNABLE, group=TGRP-TestMultiMMap], registration stack trace
>> > below.
>> > [junit4:junit4]    >        at java.lang.Thread.getStackTrace(Thread.java:1567)
>> > [junit4:junit4]    >        at
>> >
>> com.carrotsearch.randomizedtesting.RandomizedContext.closeAtEnd(Randomiz
>> > edContext.java:150)
>> > [junit4:junit4]    >        at
>> >
>> org.apache.lucene.util.LuceneTestCase.closeAfterSuite(LuceneTestCase.java:48
>> > 5)
>> > [junit4:junit4]    >        at
>> > org.apache.lucene.util._TestUtil.getTempDir(_TestUtil.java:97)
>> > [junit4:junit4]    >        at
>> >
>> org.apache.lucene.store.TestMultiMMap.testSeekSliceEnd(TestMultiMMap.jav
>> > a:164)
>> > [junit4:junit4]    >        at
>> > sun.reflect.NativeMethodAccessorImpl.invoke0(Native Method)
>> > [junit4:junit4]    >        at
>> >
>> sun.reflect.NativeMethodAccessorImpl.invoke(NativeMethodAccessorImpl.java:
>> > 57)
>> > [junit4:junit4]    >        at
>> >
>> sun.reflect.DelegatingMethodAccessorImpl.invoke(DelegatingMethodAccessorI
>> > mpl.java:43)
>> > [junit4:junit4]    >        at java.lang.reflect.Method.invoke(Method.java:601)
>> > [junit4:junit4]    >        at
>> >
>> com.carrotsearch.randomizedtesting.RandomizedRunner.invoke(RandomizedRu
>> > nner.java:1559)
>> > [junit4:junit4]    >        at
>> >
>> com.carrotsearch.randomizedtesting.RandomizedRunner.access$600(Randomiz
>> > edRunner.java:79)
>> > [junit4:junit4]    >        at
>> >
>> com.carrotsearch.randomizedtesting.RandomizedRunner$6.evaluate(Randomiz
>> > edRunner.java:737)
>> > [junit4:junit4]    >        at
>> >
>> com.carrotsearch.randomizedtesting.RandomizedRunner$7.evaluate(Randomiz
>> > edRunner.java:773)
>> > [junit4:junit4]    >        at
>> >
>> com.carrotsearch.randomizedtesting.RandomizedRunner$8.evaluate(Randomiz
>> > edRunner.java:787)
>> > [junit4:junit4]    >        at
>> >
>> org.apache.lucene.util.TestRuleSetupTeardownChained$1.evaluate(TestRuleSet
>> > upTeardownChained.java:50)
>> > [junit4:junit4]    >        at
>> >
>> org.apache.lucene.util.TestRuleFieldCacheSanity$1.evaluate(TestRuleFieldCach
>> > eSanity.java:51)
>> > [junit4:junit4]    >        at
>> >
>> org.apache.lucene.util.AbstractBeforeAfterRule$1.evaluate(AbstractBeforeAfte
>> > rRule.java:45)
>> > [junit4:junit4]    >        at
>> >
>> com.carrotsearch.randomizedtesting.rules.SystemPropertiesInvariantRule$1.ev
>> > aluate(SystemPropertiesInvariantRule.java:55)
>> > [junit4:junit4]    >        at
>> >
>> org.apache.lucene.util.TestRuleThreadAndTestName$1.evaluate(TestRuleThrea
>> > dAndTestName.java:48)
>> > [junit4:junit4]    >        at
>> >
>> org.apache.lucene.util.TestRuleIgnoreAfterMaxFailures$1.evaluate(TestRuleIgn
>> > oreAfterMaxFailures.java:70)
>> > [junit4:junit4]    >        at
>> >
>> org.apache.lucene.util.TestRuleMarkFailure$1.evaluate(TestRuleMarkFailure.ja
>> > va:48)
>> > [junit4:junit4]    >        at
>> >
>> com.carrotsearch.randomizedtesting.rules.StatementAdapter.evaluate(Stateme
>> > ntAdapter.java:36)
>> > [junit4:junit4]    >        at
>> >
>> com.carrotsearch.randomizedtesting.ThreadLeakControl$StatementRunner.run
>> > (ThreadLeakControl.java:358)
>> > [junit4:junit4]    >        at
>> >
>> com.carrotsearch.randomizedtesting.ThreadLeakControl.forkTimeoutingTask(T
>> > hreadLeakControl.java:782)
>> > [junit4:junit4]    >        at
>> >
>> com.carrotsearch.randomizedtesting.ThreadLeakControl$3.evaluate(ThreadLea
>> > kControl.java:442)
>> > [junit4:junit4]    >        at
>> >
>> com.carrotsearch.randomizedtesting.RandomizedRunner.runSingleTest(Rando
>> > mizedRunner.java:746)
>> > [junit4:junit4]    >        at
>> >
>> com.carrotsearch.randomizedtesting.RandomizedRunner$3.evaluate(Randomiz
>> > edRunner.java:648)
>> > [junit4:junit4]    >        at
>> >
>> com.carrotsearch.randomizedtesting.RandomizedRunner$4.evaluate(Randomiz
>> > edRunner.java:682)
>> > [junit4:junit4]    >        at
>> >
>> com.carrotsearch.randomizedtesting.RandomizedRunner$5.evaluate(Randomiz
>> > edRunner.java:693)
>> > [junit4:junit4]    >        at
>> >
>> org.apache.lucene.util.AbstractBeforeAfterRule$1.evaluate(AbstractBeforeAfte
>> > rRule.java:45)
>> > [junit4:junit4]    >        at
>> >
>> org.apache.lucene.util.TestRuleStoreClassName$1.evaluate(TestRuleStoreClass
>> > Name.java:42)
>> > [junit4:junit4]    >        at
>> >
>> com.carrotsearch.randomizedtesting.rules.SystemPropertiesInvariantRule$1.ev
>> > aluate(SystemPropertiesInvariantRule.java:55)
>> > [junit4:junit4]    >        at
>> >
>> com.carrotsearch.randomizedtesting.rules.NoShadowingOrOverridesOnMethod
>> > sRule$1.evaluate(NoShadowingOrOverridesOnMethodsRule.java:39)
>> > [junit4:junit4]    >        at
>> >
>> com.carrotsearch.randomizedtesting.rules.NoShadowingOrOverridesOnMethod
>> > sRule$1.evaluate(NoShadowingOrOverridesOnMethodsRule.java:39)
>> > [junit4:junit4]    >        at
>> >
>> org.apache.lucene.util.TestRuleAssertionsRequired$1.evaluate(TestRuleAssertio
>> > nsRequired.java:40)
>> > [junit4:junit4]    >        at
>> >
>> org.apache.lucene.util.TestRuleMarkFailure$1.evaluate(TestRuleMarkFailure.ja
>> > va:48)
>> > [junit4:junit4]    >        at
>> >
>> org.apache.lucene.util.TestRuleIgnoreAfterMaxFailures$1.evaluate(TestRuleIgn
>> > oreAfterMaxFailures.java:70)
>> > [junit4:junit4]    >        at
>> >
>> org.apache.lucene.util.TestRuleIgnoreTestSuites$1.evaluate(TestRuleIgnoreTest
>> > Suites.java:55)
>> > [junit4:junit4]    >        at
>> >
>> com.carrotsearch.randomizedtesting.rules.StatementAdapter.evaluate(Stateme
>> > ntAdapter.java:36)
>> > [junit4:junit4]    >        at
>> >
>> com.carrotsearch.randomizedtesting.ThreadLeakControl$StatementRunner.run
>> > (ThreadLeakControl.java:358)
>> > [junit4:junit4]    >        at java.lang.Thread.run(Thread.java:722)
>> > [junit4:junit4]    > Caused by: java.io.IOException: Could not remove:
>> > C:\Jenkins\workspace\Lucene-Solr-trunk-
>> > Windows\lucene\build\core\test\J0\.\testSeekSliceEnd4659546764tmp
>> > [junit4:junit4]    >        at
>> > org.apache.lucene.util.CloseableFile.close(CloseableFile.java:47)
>> > [junit4:junit4]    >        at
>> >
>> com.carrotsearch.randomizedtesting.RandomizedRunner$2$1.apply(Randomize
>> > dRunner.java:602)
>> > [junit4:junit4]    >        at
>> >
>> com.carrotsearch.randomizedtesting.RandomizedRunner$2$1.apply(Randomize
>> > dRunner.java:599)
>> > [junit4:junit4]    >        at
>> >
>> com.carrotsearch.randomizedtesting.RandomizedContext.closeResources(Rand
>> > omizedContext.java:167)
>> > [junit4:junit4]    >        at
>> >
>> com.carrotsearch.randomizedtesting.RandomizedRunner$2.afterAlways(Rando
>> > mizedRunner.java:615)
>> > [junit4:junit4]    >        at
>> >
>> com.carrotsearch.randomizedtesting.rules.StatementAdapter.evaluate(Stateme
>> > ntAdapter.java:43)
>> > [junit4:junit4]    >        ... 2 more
>> > [junit4:junit4]    > Throwable #16:
>> > com.carrotsearch.randomizedtesting.ResourceDisposalError: Resource in
>> scope
>> > SUITE failed to close. Resource was registered from thread Thread[id=695,
>> > name=TEST-TestMultiMMap.testSeekSliceEnd-seed#[AA4F04524D760878],
>> > state=RUNNABLE, group=TGRP-TestMultiMMap], registration stack trace
>> > below.
>> > [junit4:junit4]    >        at java.lang.Thread.getStackTrace(Thread.java:1567)
>> > [junit4:junit4]    >        at
>> >
>> com.carrotsearch.randomizedtesting.RandomizedContext.closeAtEnd(Randomiz
>> > edContext.java:150)
>> > [junit4:junit4]    >        at
>> >
>> org.apache.lucene.util.LuceneTestCase.closeAfterSuite(LuceneTestCase.java:48
>> > 5)
>> > [junit4:junit4]    >        at
>> > org.apache.lucene.util._TestUtil.getTempDir(_TestUtil.java:97)
>> > [junit4:junit4]    >        at
>> >
>> org.apache.lucene.store.TestMultiMMap.testSeekSliceEnd(TestMultiMMap.jav
>> > a:164)
>> > [junit4:junit4]    >        at
>> > sun.reflect.NativeMethodAccessorImpl.invoke0(Native Method)
>> > [junit4:junit4]    >        at
>> >
>> sun.reflect.NativeMethodAccessorImpl.invoke(NativeMethodAccessorImpl.java:
>> > 57)
>> > [junit4:junit4]    >        at
>> >
>> sun.reflect.DelegatingMethodAccessorImpl.invoke(DelegatingMethodAccessorI
>> > mpl.java:43)
>> > [junit4:junit4]    >        at java.lang.reflect.Method.invoke(Method.java:601)
>> > [junit4:junit4]    >        at
>> >
>> com.carrotsearch.randomizedtesting.RandomizedRunner.invoke(RandomizedRu
>> > nner.java:1559)
>> > [junit4:junit4]    >        at
>> >
>> com.carrotsearch.randomizedtesting.RandomizedRunner.access$600(Randomiz
>> > edRunner.java:79)
>> > [junit4:junit4]    >        at
>> >
>> com.carrotsearch.randomizedtesting.RandomizedRunner$6.evaluate(Randomiz
>> > edRunner.java:737)
>> > [junit4:junit4]    >        at
>> >
>> com.carrotsearch.randomizedtesting.RandomizedRunner$7.evaluate(Randomiz
>> > edRunner.java:773)
>> > [junit4:junit4]    >        at
>> >
>> com.carrotsearch.randomizedtesting.RandomizedRunner$8.evaluate(Randomiz
>> > edRunner.java:787)
>> > [junit4:junit4]    >        at
>> >
>> org.apache.lucene.util.TestRuleSetupTeardownChained$1.evaluate(TestRuleSet
>> > upTeardownChained.java:50)
>> > [junit4:junit4]    >        at
>> >
>> org.apache.lucene.util.TestRuleFieldCacheSanity$1.evaluate(TestRuleFieldCach
>> > eSanity.java:51)
>> > [junit4:junit4]    >        at
>> >
>> org.apache.lucene.util.AbstractBeforeAfterRule$1.evaluate(AbstractBeforeAfte
>> > rRule.java:45)
>> > [junit4:junit4]    >        at
>> >
>> com.carrotsearch.randomizedtesting.rules.SystemPropertiesInvariantRule$1.ev
>> > aluate(SystemPropertiesInvariantRule.java:55)
>> > [junit4:junit4]    >        at
>> >
>> org.apache.lucene.util.TestRuleThreadAndTestName$1.evaluate(TestRuleThrea
>> > dAndTestName.java:48)
>> > [junit4:junit4]    >        at
>> >
>> org.apache.lucene.util.TestRuleIgnoreAfterMaxFailures$1.evaluate(TestRuleIgn
>> > oreAfterMaxFailures.java:70)
>> > [junit4:junit4]    >        at
>> >
>> org.apache.lucene.util.TestRuleMarkFailure$1.evaluate(TestRuleMarkFailure.ja
>> > va:48)
>> > [junit4:junit4]    >        at
>> >
>> com.carrotsearch.randomizedtesting.rules.StatementAdapter.evaluate(Stateme
>> > ntAdapter.java:36)
>> > [junit4:junit4]    >        at
>> >
>> com.carrotsearch.randomizedtesting.ThreadLeakControl$StatementRunner.run
>> > (ThreadLeakControl.java:358)
>> > [junit4:junit4]    >        at
>> >
>> com.carrotsearch.randomizedtesting.ThreadLeakControl.forkTimeoutingTask(T
>> > hreadLeakControl.java:782)
>> > [junit4:junit4]    >        at
>> >
>> com.carrotsearch.randomizedtesting.ThreadLeakControl$3.evaluate(ThreadLea
>> > kControl.java:442)
>> > [junit4:junit4]    >        at
>> >
>> com.carrotsearch.randomizedtesting.RandomizedRunner.runSingleTest(Rando
>> > mizedRunner.java:746)
>> > [junit4:junit4]    >        at
>> >
>> com.carrotsearch.randomizedtesting.RandomizedRunner$3.evaluate(Randomiz
>> > edRunner.java:648)
>> > [junit4:junit4]    >        at
>> >
>> com.carrotsearch.randomizedtesting.RandomizedRunner$4.evaluate(Randomiz
>> > edRunner.java:682)
>> > [junit4:junit4]    >        at
>> >
>> com.carrotsearch.randomizedtesting.RandomizedRunner$5.evaluate(Randomiz
>> > edRunner.java:693)
>> > [junit4:junit4]    >        at
>> >
>> org.apache.lucene.util.AbstractBeforeAfterRule$1.evaluate(AbstractBeforeAfte
>> > rRule.java:45)
>> > [junit4:junit4]    >        at
>> >
>> org.apache.lucene.util.TestRuleStoreClassName$1.evaluate(TestRuleStoreClass
>> > Name.java:42)
>> > [junit4:junit4]    >        at
>> >
>> com.carrotsearch.randomizedtesting.rules.SystemPropertiesInvariantRule$1.ev
>> > aluate(SystemPropertiesInvariantRule.java:55)
>> > [junit4:junit4]    >        at
>> >
>> com.carrotsearch.randomizedtesting.rules.NoShadowingOrOverridesOnMethod
>> > sRule$1.evaluate(NoShadowingOrOverridesOnMethodsRule.java:39)
>> > [junit4:junit4]    >        at
>> >
>> com.carrotsearch.randomizedtesting.rules.NoShadowingOrOverridesOnMethod
>> > sRule$1.evaluate(NoShadowingOrOverridesOnMethodsRule.java:39)
>> > [junit4:junit4]    >        at
>> >
>> org.apache.lucene.util.TestRuleAssertionsRequired$1.evaluate(TestRuleAssertio
>> > nsRequired.java:40)
>> > [junit4:junit4]    >        at
>> >
>> org.apache.lucene.util.TestRuleMarkFailure$1.evaluate(TestRuleMarkFailure.ja
>> > va:48)
>> > [junit4:junit4]    >        at
>> >
>> org.apache.lucene.util.TestRuleIgnoreAfterMaxFailures$1.evaluate(TestRuleIgn
>> > oreAfterMaxFailures.java:70)
>> > [junit4:junit4]    >        at
>> >
>> org.apache.lucene.util.TestRuleIgnoreTestSuites$1.evaluate(TestRuleIgnoreTest
>> > Suites.java:55)
>> > [junit4:junit4]    >        at
>> >
>> com.carrotsearch.randomizedtesting.rules.StatementAdapter.evaluate(Stateme
>> > ntAdapter.java:36)
>> > [junit4:junit4]    >        at
>> >
>> com.carrotsearch.randomizedtesting.ThreadLeakControl$StatementRunner.run
>> > (ThreadLeakControl.java:358)
>> > [junit4:junit4]    >        at java.lang.Thread.run(Thread.java:722)
>> > [junit4:junit4]    > Caused by: java.io.IOException: Could not remove:
>> > C:\Jenkins\workspace\Lucene-Solr-trunk-
>> > Windows\lucene\build\core\test\J0\.\testSeekSliceEnd4659546765tmp
>> > [junit4:junit4]    >        at
>> > org.apache.lucene.util.CloseableFile.close(CloseableFile.java:47)
>> > [junit4:junit4]    >        at
>> >
>> com.carrotsearch.randomizedtesting.RandomizedRunner$2$1.apply(Randomize
>> > dRunner.java:602)
>> > [junit4:junit4]    >        at
>> >
>> com.carrotsearch.randomizedtesting.RandomizedRunner$2$1.apply(Randomize
>> > dRunner.java:599)
>> > [junit4:junit4]    >        at
>> >
>> com.carrotsearch.randomizedtesting.RandomizedContext.closeResources(Rand
>> > omizedContext.java:167)
>> > [junit4:junit4]    >        at
>> >
>> com.carrotsearch.randomizedtesting.RandomizedRunner$2.afterAlways(Rando
>> > mizedRunner.java:615)
>> > [junit4:junit4]    >        at
>> >
>> com.carrotsearch.randomizedtesting.rules.StatementAdapter.evaluate(Stateme
>> > ntAdapter.java:43)
>> > [junit4:junit4]    >        ... 2 more
>> > [junit4:junit4]    > Throwable #17:
>> > com.carrotsearch.randomizedtesting.ResourceDisposalError: Resource in
>> scope
>> > SUITE failed to close. Resource was registered from thread Thread[id=695,
>> > name=TEST-TestMultiMMap.testSeekSliceEnd-seed#[AA4F04524D760878],
>> > state=RUNNABLE, group=TGRP-TestMultiMMap], registration stack trace
>> > below.
>> > [junit4:junit4]    >        at java.lang.Thread.getStackTrace(Thread.java:1567)
>> > [junit4:junit4]    >        at
>> >
>> com.carrotsearch.randomizedtesting.RandomizedContext.closeAtEnd(Randomiz
>> > edContext.java:150)
>> > [junit4:junit4]    >        at
>> >
>> org.apache.lucene.util.LuceneTestCase.closeAfterSuite(LuceneTestCase.java:48
>> > 5)
>> > [junit4:junit4]    >        at
>> > org.apache.lucene.util._TestUtil.getTempDir(_TestUtil.java:97)
>> > [junit4:junit4]    >        at
>> >
>> org.apache.lucene.store.TestMultiMMap.testSeekSliceEnd(TestMultiMMap.jav
>> > a:164)
>> > [junit4:junit4]    >        at
>> > sun.reflect.NativeMethodAccessorImpl.invoke0(Native Method)
>> > [junit4:junit4]    >        at
>> >
>> sun.reflect.NativeMethodAccessorImpl.invoke(NativeMethodAccessorImpl.java:
>> > 57)
>> > [junit4:junit4]    >        at
>> >
>> sun.reflect.DelegatingMethodAccessorImpl.invoke(DelegatingMethodAccessorI
>> > mpl.java:43)
>> > [junit4:junit4]    >        at java.lang.reflect.Method.invoke(Method.java:601)
>> > [junit4:junit4]    >        at
>> >
>> com.carrotsearch.randomizedtesting.RandomizedRunner.invoke(RandomizedRu
>> > nner.java:1559)
>> > [junit4:junit4]    >        at
>> >
>> com.carrotsearch.randomizedtesting.RandomizedRunner.access$600(Randomiz
>> > edRunner.java:79)
>> > [junit4:junit4]    >        at
>> >
>> com.carrotsearch.randomizedtesting.RandomizedRunner$6.evaluate(Randomiz
>> > edRunner.java:737)
>> > [junit4:junit4]    >        at
>> >
>> com.carrotsearch.randomizedtesting.RandomizedRunner$7.evaluate(Randomiz
>> > edRunner.java:773)
>> > [junit4:junit4]    >        at
>> >
>> com.carrotsearch.randomizedtesting.RandomizedRunner$8.evaluate(Randomiz
>> > edRunner.java:787)
>> > [junit4:junit4]    >        at
>> >
>> org.apache.lucene.util.TestRuleSetupTeardownChained$1.evaluate(TestRuleSet
>> > upTeardownChained.java:50)
>> > [junit4:junit4]    >        at
>> >
>> org.apache.lucene.util.TestRuleFieldCacheSanity$1.evaluate(TestRuleFieldCach
>> > eSanity.java:51)
>> > [junit4:junit4]    >        at
>> >
>> org.apache.lucene.util.AbstractBeforeAfterRule$1.evaluate(AbstractBeforeAfte
>> > rRule.java:45)
>> > [junit4:junit4]    >        at
>> >
>> com.carrotsearch.randomizedtesting.rules.SystemPropertiesInvariantRule$1.ev
>> > aluate(SystemPropertiesInvariantRule.java:55)
>> > [junit4:junit4]    >        at
>> >
>> org.apache.lucene.util.TestRuleThreadAndTestName$1.evaluate(TestRuleThrea
>> > dAndTestName.java:48)
>> > [junit4:junit4]    >        at
>> >
>> org.apache.lucene.util.TestRuleIgnoreAfterMaxFailures$1.evaluate(TestRuleIgn
>> > oreAfterMaxFailures.java:70)
>> > [junit4:junit4]    >        at
>> >
>> org.apache.lucene.util.TestRuleMarkFailure$1.evaluate(TestRuleMarkFailure.ja
>> > va:48)
>> > [junit4:junit4]    >        at
>> >
>> com.carrotsearch.randomizedtesting.rules.StatementAdapter.evaluate(Stateme
>> > ntAdapter.java:36)
>> > [junit4:junit4]    >        at
>> >
>> com.carrotsearch.randomizedtesting.ThreadLeakControl$StatementRunner.run
>> > (ThreadLeakControl.java:358)
>> > [junit4:junit4]    >        at
>> >
>> com.carrotsearch.randomizedtesting.ThreadLeakControl.forkTimeoutingTask(T
>> > hreadLeakControl.java:782)
>> > [junit4:junit4]    >        at
>> >
>> com.carrotsearch.randomizedtesting.ThreadLeakControl$3.evaluate(ThreadLea
>> > kControl.java:442)
>> > [junit4:junit4]    >        at
>> >
>> com.carrotsearch.randomizedtesting.RandomizedRunner.runSingleTest(Rando
>> > mizedRunner.java:746)
>> > [junit4:junit4]    >        at
>> >
>> com.carrotsearch.randomizedtesting.RandomizedRunner$3.evaluate(Randomiz
>> > edRunner.java:648)
>> > [junit4:junit4]    >        at
>> >
>> com.carrotsearch.randomizedtesting.RandomizedRunner$4.evaluate(Randomiz
>> > edRunner.java:682)
>> > [junit4:junit4]    >        at
>> >
>> com.carrotsearch.randomizedtesting.RandomizedRunner$5.evaluate(Randomiz
>> > edRunner.java:693)
>> > [junit4:junit4]    >        at
>> >
>> org.apache.lucene.util.AbstractBeforeAfterRule$1.evaluate(AbstractBeforeAfte
>> > rRule.java:45)
>> > [junit4:junit4]    >        at
>> >
>> org.apache.lucene.util.TestRuleStoreClassName$1.evaluate(TestRuleStoreClass
>> > Name.java:42)
>> > [junit4:junit4]    >        at
>> >
>> com.carrotsearch.randomizedtesting.rules.SystemPropertiesInvariantRule$1.ev
>> > aluate(SystemPropertiesInvariantRule.java:55)
>> > [junit4:junit4]    >        at
>> >
>> com.carrotsearch.randomizedtesting.rules.NoShadowingOrOverridesOnMethod
>> > sRule$1.evaluate(NoShadowingOrOverridesOnMethodsRule.java:39)
>> > [junit4:junit4]    >        at
>> >
>> com.carrotsearch.randomizedtesting.rules.NoShadowingOrOverridesOnMethod
>> > sRule$1.evaluate(NoShadowingOrOverridesOnMethodsRule.java:39)
>> > [junit4:junit4]    >        at
>> >
>> org.apache.lucene.util.TestRuleAssertionsRequired$1.evaluate(TestRuleAssertio
>> > nsRequired.java:40)
>> > [junit4:junit4]    >        at
>> >
>> org.apache.lucene.util.TestRuleMarkFailure$1.evaluate(TestRuleMarkFailure.ja
>> > va:48)
>> > [junit4:junit4]    >        at
>> >
>> org.apache.lucene.util.TestRuleIgnoreAfterMaxFailures$1.evaluate(TestRuleIgn
>> > oreAfterMaxFailures.java:70)
>> > [junit4:junit4]    >        at
>> >
>> org.apache.lucene.util.TestRuleIgnoreTestSuites$1.evaluate(TestRuleIgnoreTest
>> > Suites.java:55)
>> > [junit4:junit4]    >        at
>> >
>> com.carrotsearch.randomizedtesting.rules.StatementAdapter.evaluate(Stateme
>> > ntAdapter.java:36)
>> > [junit4:junit4]    >        at
>> >
>> com.carrotsearch.randomizedtesting.ThreadLeakControl$StatementRunner.run
>> > (ThreadLeakControl.java:358)
>> > [junit4:junit4]    >        at java.lang.Thread.run(Thread.java:722)
>> > [junit4:junit4]    > Caused by: java.io.IOException: Could not remove:
>> > C:\Jenkins\workspace\Lucene-Solr-trunk-
>> > Windows\lucene\build\core\test\J0\.\testSeekSliceEnd4659546766tmp
>> > [junit4:junit4]    >        at
>> > org.apache.lucene.util.CloseableFile.close(CloseableFile.java:47)
>> > [junit4:junit4]    >        at
>> >
>> com.carrotsearch.randomizedtesting.RandomizedRunner$2$1.apply(Randomize
>> > dRunner.java:602)
>> > [junit4:junit4]    >        at
>> >
>> com.carrotsearch.randomizedtesting.RandomizedRunner$2$1.apply(Randomize
>> > dRunner.java:599)
>> > [junit4:junit4]    >        at
>> >
>> com.carrotsearch.randomizedtesting.RandomizedContext.closeResources(Rand
>> > omizedContext.java:167)
>> > [junit4:junit4]    >        at
>> >
>> com.carrotsearch.randomizedtesting.RandomizedRunner$2.afterAlways(Rando
>> > mizedRunner.java:615)
>> > [junit4:junit4]    >        at
>> >
>> com.carrotsearch.randomizedtesting.rules.StatementAdapter.evaluate(Stateme
>> > ntAdapter.java:43)
>> > [junit4:junit4]    >        ... 2 more
>> > [junit4:junit4] Completed in 9.22s, 9 tests, 17 errors <<< FAILURES!
>> >
>> > [...truncated 705 lines...]
>> > BUILD FAILED
>> > C:\Jenkins\workspace\Lucene-Solr-trunk-Windows\build.xml:29: The following
>> > error occurred while executing this line:
>> > C:\Jenkins\workspace\Lucene-Solr-trunk-Windows\lucene\build.xml:49: The
>> > following error occurred while executing this line:
>> > C:\Jenkins\workspace\Lucene-Solr-trunk-Windows\lucene\common-
>> > build.xml:1133: The following error occurred while executing this line:
>> > C:\Jenkins\workspace\Lucene-Solr-trunk-Windows\lucene\common-
>> > build.xml:810: There were test failures: 307 suites, 1775 tests, 17 suite-level
>> > errors, 17 ignored (9 assumptions)
>> >
>> > Total time: 6 minutes 18 seconds
>> > Build step 'Invoke Ant' marked build as failure
>> > Recording test results
>> > Description set: Java: 64bit/jdk1.7.0_07 -XX:+UseParallelGC
>> > Email was triggered for: Failure
>> > Sending email for trigger: Failure
>> >
>>
>>
>>
>> ---------------------------------------------------------------------
>> To unsubscribe, e-mail: dev-unsubscribe@lucene.apache.org
>> For additional commands, e-mail: dev-help@lucene.apache.org
>
>
> ---------------------------------------------------------------------
> To unsubscribe, e-mail: dev-unsubscribe@lucene.apache.org
> For additional commands, e-mail: dev-help@lucene.apache.org
>



-- 
lucidworks.com

---------------------------------------------------------------------
To unsubscribe, e-mail: dev-unsubscribe@lucene.apache.org
For additional commands, e-mail: dev-help@lucene.apache.org


Mime
View raw message