lucene-dev mailing list archives

Site index · List index
Message view « Date » · « Thread »
Top « Date » · « Thread »
From Robert Muir <rcm...@gmail.com>
Subject Re: Build failed in Jenkins: Lucene-Solr-40-ReleaseSmoke #3
Date Sat, 22 Sep 2012 15:06:54 GMT
I have no idea about what this is, or what is going on here.

On Sat, Sep 22, 2012 at 10:41 AM,  <hudsonseviltwin@gmail.com> wrote:
>      [exec] Test Maven artifacts for Lucene and Solr...
>      [exec]     get POM templates ...................................................
>      [exec]     download artifacts ........................................................................................................................................................................................................................................................................................................................................................................................................................................................................................................................................................................
>      [exec]     verify that each binary artifact has a deployed POM...
>      [exec]     verify that there is an artifact for each POM template...
>      [exec] Traceback (most recent call last):
>      [exec]   File "/usr/lib/python3.2/xml/etree/ElementTree.py", line 1668, in feed
>      [exec]     self._parser.Parse(data, 0)
>      [exec] xml.parsers.expat.ExpatError: not well-formed (invalid token): line 1, column
8
>      [exec]
>      [exec] During handling of the above exception, another exception occurred:
>      [exec]
>      [exec] Traceback (most recent call last):
>      [exec]   File "dev-tools/scripts/smokeTestRelease.py", line 1107, in <module>
>      [exec]     main()
>      [exec]   File "dev-tools/scripts/smokeTestRelease.py", line 1057, in main
>      [exec]     smokeTest(baseURL, version, tmpDir, isSigned)
>      [exec]   File "dev-tools/scripts/smokeTestRelease.py", line 1103, in smokeTest
>      [exec]     checkMaven(baseURL, tmpDir, version, isSigned)
>      [exec]   File "dev-tools/scripts/smokeTestRelease.py", line 688, in checkMaven
>      [exec]     verifyArtifactPerPOMtemplate(POMtemplates, artifacts, tmpDir, version)
>      [exec]   File "dev-tools/scripts/smokeTestRelease.py", line 985, in verifyArtifactPerPOMtemplate
>      [exec]     treeRoot = ET.parse(POMtemplate).getroot()
>      [exec]   File "/usr/lib/python3.2/xml/etree/ElementTree.py", line 1223, in parse
>      [exec]     tree.parse(source, parser)
>      [exec]   File "/usr/lib/python3.2/xml/etree/ElementTree.py", line 678, in parse
>      [exec]     parser.feed(data)
>      [exec]   File "/usr/lib/python3.2/xml/etree/ElementTree.py", line 1670, in feed
>      [exec]     self._raiseerror(v)
>      [exec]   File "/usr/lib/python3.2/xml/etree/ElementTree.py", line 1543, in _raiseerror
>      [exec]     raise err
>      [exec]   File "<string>", line None
>      [exec] xml.etree.ElementTree.ParseError: not well-formed (invalid token): line 1,
column 8
>
> BUILD FAILED
> <http://sierranevada.servebeer.com/job/Lucene-Solr-40-ReleaseSmoke/ws/build.xml>:279:
exec returned: 1
>
> Total time: 22 minutes 2 seconds
> Build step 'Invoke Ant' marked build as failure
>
> ---------------------------------------------------------------------
> To unsubscribe, e-mail: dev-unsubscribe@lucene.apache.org
> For additional commands, e-mail: dev-help@lucene.apache.org
>



-- 
lucidworks.com

---------------------------------------------------------------------
To unsubscribe, e-mail: dev-unsubscribe@lucene.apache.org
For additional commands, e-mail: dev-help@lucene.apache.org


Mime
View raw message