lucene-dev mailing list archives

Site index · List index
Message view « Date » · « Thread »
Top « Date » · « Thread »
From Dawid Weiss <dawid.we...@cs.put.poznan.pl>
Subject Re: [JENKINS] Lucene-Solr-trunk-Linux (64bit/jdk1.7.0_07) - Build # 1262 - Still Failing!
Date Fri, 21 Sep 2012 09:27:09 GMT
This code in _TestUtil is wrong:

  public static final FilterStrategy randomFilterStrategy(final Random random) {
    switch(random.nextInt(6)) {
      case 5:
      case 4:
        return new FilteredQuery.RandomAccessFilterStrategy() {
          @Override
          protected boolean useRandomAccess(Bits bits, int firstFilterDoc) {
            return random.nextBoolean();
          }
        };

because it references a Random instance inside an anonymous class that
might (did in this test) belong to another thread. It should read:

          protected boolean useRandomAccess(Bits bits, int firstFilterDoc) {
            return LuceneTestCase.random().nextBoolean();
          }

Please fix if you have the code, I won't be able to do it today.

Dawid

On Fri, Sep 21, 2012 at 11:14 AM, Policeman Jenkins Server
<jenkins@sd-datasolutions.de> wrote:
> Build: http://jenkins.sd-datasolutions.de/job/Lucene-Solr-trunk-Linux/1262/
> Java: 64bit/jdk1.7.0_07 -XX:+UseParallelGC
>
> 3 tests failed.
> REGRESSION:  org.apache.lucene.search.TestFilteredQuery.testBooleanSHOULD
>
> Error Message:
> java.util.concurrent.ExecutionException: java.lang.IllegalStateException: This Random was created for/by another thread (Thread[TEST-TestFilteredQuery.testBooleanSHOULD-seed#[BA92C3F3C94685BF],5,TGRP-TestFilteredQuery]). Random instances must not be shared (acquire per-thread). Current thread: Thread[LuceneTestCase-385-thread-2,5,TGRP-TestFilteredQuery]
>
> Stack Trace:
> java.lang.RuntimeException: java.util.concurrent.ExecutionException: java.lang.IllegalStateException: This Random was created for/by another thread (Thread[TEST-TestFilteredQuery.testBooleanSHOULD-seed#[BA92C3F3C94685BF],5,TGRP-TestFilteredQuery]). Random instances must not be shared (acquire per-thread). Current thread: Thread[LuceneTestCase-385-thread-2,5,TGRP-TestFilteredQuery]
>         at __randomizedtesting.SeedInfo.seed([BA92C3F3C94685BF:7CFF6CDD204D517E]:0)
>         at org.apache.lucene.search.IndexSearcher$ExecutionHelper.next(IndexSearcher.java:820)
>         at org.apache.lucene.search.IndexSearcher.search(IndexSearcher.java:423)
>         at org.apache.lucene.search.IndexSearcher.search(IndexSearcher.java:261)
>         at org.apache.lucene.search.TestFilteredQuery.tBooleanSHOULD(TestFilteredQuery.java:252)
>         at org.apache.lucene.search.TestFilteredQuery.testBooleanSHOULD(TestFilteredQuery.java:243)
>         at sun.reflect.NativeMethodAccessorImpl.invoke0(Native Method)
>         at sun.reflect.NativeMethodAccessorImpl.invoke(NativeMethodAccessorImpl.java:57)
>         at sun.reflect.DelegatingMethodAccessorImpl.invoke(DelegatingMethodAccessorImpl.java:43)
>         at java.lang.reflect.Method.invoke(Method.java:601)
>         at com.carrotsearch.randomizedtesting.RandomizedRunner.invoke(RandomizedRunner.java:1559)
>         at com.carrotsearch.randomizedtesting.RandomizedRunner.access$600(RandomizedRunner.java:79)
>         at com.carrotsearch.randomizedtesting.RandomizedRunner$6.evaluate(RandomizedRunner.java:737)
>         at com.carrotsearch.randomizedtesting.RandomizedRunner$7.evaluate(RandomizedRunner.java:773)
>         at com.carrotsearch.randomizedtesting.RandomizedRunner$8.evaluate(RandomizedRunner.java:787)
>         at org.apache.lucene.util.TestRuleSetupTeardownChained$1.evaluate(TestRuleSetupTeardownChained.java:50)
>         at org.apache.lucene.util.TestRuleFieldCacheSanity$1.evaluate(TestRuleFieldCacheSanity.java:51)
>         at org.apache.lucene.util.AbstractBeforeAfterRule$1.evaluate(AbstractBeforeAfterRule.java:45)
>         at com.carrotsearch.randomizedtesting.rules.SystemPropertiesInvariantRule$1.evaluate(SystemPropertiesInvariantRule.java:55)
>         at org.apache.lucene.util.TestRuleThreadAndTestName$1.evaluate(TestRuleThreadAndTestName.java:48)
>         at org.apache.lucene.util.TestRuleIgnoreAfterMaxFailures$1.evaluate(TestRuleIgnoreAfterMaxFailures.java:70)
>         at org.apache.lucene.util.TestRuleMarkFailure$1.evaluate(TestRuleMarkFailure.java:48)
>         at com.carrotsearch.randomizedtesting.rules.StatementAdapter.evaluate(StatementAdapter.java:36)
>         at com.carrotsearch.randomizedtesting.ThreadLeakControl$StatementRunner.run(ThreadLeakControl.java:358)
>         at com.carrotsearch.randomizedtesting.ThreadLeakControl.forkTimeoutingTask(ThreadLeakControl.java:782)
>         at com.carrotsearch.randomizedtesting.ThreadLeakControl$3.evaluate(ThreadLeakControl.java:442)
>         at com.carrotsearch.randomizedtesting.RandomizedRunner.runSingleTest(RandomizedRunner.java:746)
>         at com.carrotsearch.randomizedtesting.RandomizedRunner$3.evaluate(RandomizedRunner.java:648)
>         at com.carrotsearch.randomizedtesting.RandomizedRunner$4.evaluate(RandomizedRunner.java:682)
>         at com.carrotsearch.randomizedtesting.RandomizedRunner$5.evaluate(RandomizedRunner.java:693)
>         at org.apache.lucene.util.AbstractBeforeAfterRule$1.evaluate(AbstractBeforeAfterRule.java:45)
>         at org.apache.lucene.util.TestRuleStoreClassName$1.evaluate(TestRuleStoreClassName.java:42)
>         at com.carrotsearch.randomizedtesting.rules.SystemPropertiesInvariantRule$1.evaluate(SystemPropertiesInvariantRule.java:55)
>         at com.carrotsearch.randomizedtesting.rules.NoShadowingOrOverridesOnMethodsRule$1.evaluate(NoShadowingOrOverridesOnMethodsRule.java:39)
>         at com.carrotsearch.randomizedtesting.rules.NoShadowingOrOverridesOnMethodsRule$1.evaluate(NoShadowingOrOverridesOnMethodsRule.java:39)
>         at com.carrotsearch.randomizedtesting.rules.StatementAdapter.evaluate(StatementAdapter.java:36)
>         at org.apache.lucene.util.TestRuleAssertionsRequired$1.evaluate(TestRuleAssertionsRequired.java:43)
>         at org.apache.lucene.util.TestRuleMarkFailure$1.evaluate(TestRuleMarkFailure.java:48)
>         at org.apache.lucene.util.TestRuleIgnoreAfterMaxFailures$1.evaluate(TestRuleIgnoreAfterMaxFailures.java:70)
>         at org.apache.lucene.util.TestRuleIgnoreTestSuites$1.evaluate(TestRuleIgnoreTestSuites.java:55)
>         at com.carrotsearch.randomizedtesting.rules.StatementAdapter.evaluate(StatementAdapter.java:36)
>         at com.carrotsearch.randomizedtesting.ThreadLeakControl$StatementRunner.run(ThreadLeakControl.java:358)
>         at java.lang.Thread.run(Thread.java:722)
> Caused by: java.util.concurrent.ExecutionException: java.lang.IllegalStateException: This Random was created for/by another thread (Thread[TEST-TestFilteredQuery.testBooleanSHOULD-seed#[BA92C3F3C94685BF],5,TGRP-TestFilteredQuery]). Random instances must not be shared (acquire per-thread). Current thread: Thread[LuceneTestCase-385-thread-2,5,TGRP-TestFilteredQuery]
>         at java.util.concurrent.FutureTask$Sync.innerGet(FutureTask.java:252)
>         at java.util.concurrent.FutureTask.get(FutureTask.java:111)
>         at org.apache.lucene.search.IndexSearcher$ExecutionHelper.next(IndexSearcher.java:816)
>         ... 41 more
> Caused by: java.lang.IllegalStateException: This Random was created for/by another thread (Thread[TEST-TestFilteredQuery.testBooleanSHOULD-seed#[BA92C3F3C94685BF],5,TGRP-TestFilteredQuery]). Random instances must not be shared (acquire per-thread). Current thread: Thread[LuceneTestCase-385-thread-2,5,TGRP-TestFilteredQuery]
>         at com.carrotsearch.randomizedtesting.AssertingRandom.checkValid(AssertingRandom.java:139)
>         at com.carrotsearch.randomizedtesting.AssertingRandom.nextBoolean(AssertingRandom.java:43)
>         at org.apache.lucene.util._TestUtil$3.useRandomAccess(_TestUtil.java:994)
>         at org.apache.lucene.search.FilteredQuery$RandomAccessFilterStrategy.filteredScorer(FilteredQuery.java:515)
>         at org.apache.lucene.search.FilteredQuery$1.scorer(FilteredQuery.java:133)
>         at org.apache.lucene.search.BooleanQuery$BooleanWeight.scorer(BooleanQuery.java:322)
>         at org.apache.lucene.search.AssertingIndexSearcher$1.scorer(AssertingIndexSearcher.java:80)
>         at org.apache.lucene.search.IndexSearcher.search(IndexSearcher.java:572)
>         at org.apache.lucene.search.IndexSearcher.search(IndexSearcher.java:453)
>         at org.apache.lucene.search.IndexSearcher$SearcherCallableNoSort.call(IndexSearcher.java:675)
>         at org.apache.lucene.search.IndexSearcher$SearcherCallableNoSort.call(IndexSearcher.java:653)
>         at java.util.concurrent.FutureTask$Sync.innerRun(FutureTask.java:334)
>         at java.util.concurrent.FutureTask.run(FutureTask.java:166)
>         at java.util.concurrent.Executors$RunnableAdapter.call(Executors.java:471)
>         at java.util.concurrent.FutureTask$Sync.innerRun(FutureTask.java:334)
>         at java.util.concurrent.FutureTask.run(FutureTask.java:166)
>         at java.util.concurrent.ThreadPoolExecutor.runWorker(ThreadPoolExecutor.java:1110)
>         at java.util.concurrent.ThreadPoolExecutor$Worker.run(ThreadPoolExecutor.java:603)
>         ... 1 more
> Caused by: com.carrotsearch.randomizedtesting.StackTraceHolder: Original allocation stack for this Random (allocated by Thread[TEST-TestFilteredQuery.testBooleanSHOULD-seed#[BA92C3F3C94685BF],5,TGRP-TestFilteredQuery])
>         at java.lang.Thread.getStackTrace(Thread.java:1567)
>         at com.carrotsearch.randomizedtesting.AssertingRandom.<init>(AssertingRandom.java:33)
>         at com.carrotsearch.randomizedtesting.Randomness.<init>(Randomness.java:22)
>         at com.carrotsearch.randomizedtesting.Randomness.<init>(Randomness.java:26)
>         at com.carrotsearch.randomizedtesting.RandomizedRunner$3.evaluate(RandomizedRunner.java:647)
>         at com.carrotsearch.randomizedtesting.RandomizedRunner$4.evaluate(RandomizedRunner.java:682)
>         at com.carrotsearch.randomizedtesting.RandomizedRunner$5.evaluate(RandomizedRunner.java:693)
>         at org.apache.lucene.util.AbstractBeforeAfterRule$1.evaluate(AbstractBeforeAfterRule.java:45)
>         at org.apache.lucene.util.TestRuleStoreClassName$1.evaluate(TestRuleStoreClassName.java:42)
>         at com.carrotsearch.randomizedtesting.rules.SystemPropertiesInvariantRule$1.evaluate(SystemPropertiesInvariantRule.java:55)
>         at com.carrotsearch.randomizedtesting.rules.NoShadowingOrOverridesOnMethodsRule$1.evaluate(NoShadowingOrOverridesOnMethodsRule.java:39)
>         at com.carrotsearch.randomizedtesting.rules.NoShadowingOrOverridesOnMethodsRule$1.evaluate(NoShadowingOrOverridesOnMethodsRule.java:39)
>         at com.carrotsearch.randomizedtesting.rules.StatementAdapter.evaluate(StatementAdapter.java:36)
>         at org.apache.lucene.util.TestRuleAssertionsRequired$1.evaluate(TestRuleAssertionsRequired.java:43)
>         at org.apache.lucene.util.TestRuleMarkFailure$1.evaluate(TestRuleMarkFailure.java:48)
>         at org.apache.lucene.util.TestRuleIgnoreAfterMaxFailures$1.evaluate(TestRuleIgnoreAfterMaxFailures.java:70)
>         at org.apache.lucene.util.TestRuleIgnoreTestSuites$1.evaluate(TestRuleIgnoreTestSuites.java:55)
>         at com.carrotsearch.randomizedtesting.rules.StatementAdapter.evaluate(StatementAdapter.java:36)
>         at com.carrotsearch.randomizedtesting.ThreadLeakControl$StatementRunner.run(ThreadLeakControl.java:358)
>         ... 1 more
>
>
> REGRESSION:  org.apache.lucene.search.spans.TestSpanSearchEquivalence.testSpanNearVersusBooleanAnd
>
> Error Message:
>
>
> Stack Trace:
> java.lang.AssertionError
>         at __randomizedtesting.SeedInfo.seed([BA92C3F3C94685BF:D39A437A1D8DD88]:0)
>         at org.apache.lucene.search.FilteredQuery$LeapFrogScorer.docID(FilteredQuery.java:292)
>         at org.apache.lucene.search.AssertingIndexSearcher$1.scorer(AssertingIndexSearcher.java:84)
>         at org.apache.lucene.search.IndexSearcher.search(IndexSearcher.java:572)
>         at org.apache.lucene.search.IndexSearcher.search(IndexSearcher.java:453)
>         at org.apache.lucene.search.IndexSearcher.search(IndexSearcher.java:410)
>         at org.apache.lucene.search.IndexSearcher.search(IndexSearcher.java:261)
>         at org.apache.lucene.search.SearchEquivalenceTestBase.assertSubsetOf(SearchEquivalenceTestBase.java:183)
>         at org.apache.lucene.search.SearchEquivalenceTestBase.assertSubsetOf(SearchEquivalenceTestBase.java:164)
>         at org.apache.lucene.search.SearchEquivalenceTestBase.assertSameSet(SearchEquivalenceTestBase.java:152)
>         at org.apache.lucene.search.spans.TestSpanSearchEquivalence.testSpanNearVersusBooleanAnd(TestSpanSearchEquivalence.java:87)
>         at sun.reflect.NativeMethodAccessorImpl.invoke0(Native Method)
>         at sun.reflect.NativeMethodAccessorImpl.invoke(NativeMethodAccessorImpl.java:57)
>         at sun.reflect.DelegatingMethodAccessorImpl.invoke(DelegatingMethodAccessorImpl.java:43)
>         at java.lang.reflect.Method.invoke(Method.java:601)
>         at com.carrotsearch.randomizedtesting.RandomizedRunner.invoke(RandomizedRunner.java:1559)
>         at com.carrotsearch.randomizedtesting.RandomizedRunner.access$600(RandomizedRunner.java:79)
>         at com.carrotsearch.randomizedtesting.RandomizedRunner$6.evaluate(RandomizedRunner.java:737)
>         at com.carrotsearch.randomizedtesting.RandomizedRunner$7.evaluate(RandomizedRunner.java:773)
>         at com.carrotsearch.randomizedtesting.RandomizedRunner$8.evaluate(RandomizedRunner.java:787)
>         at org.apache.lucene.util.TestRuleSetupTeardownChained$1.evaluate(TestRuleSetupTeardownChained.java:50)
>         at org.apache.lucene.util.TestRuleFieldCacheSanity$1.evaluate(TestRuleFieldCacheSanity.java:51)
>         at org.apache.lucene.util.AbstractBeforeAfterRule$1.evaluate(AbstractBeforeAfterRule.java:45)
>         at com.carrotsearch.randomizedtesting.rules.SystemPropertiesInvariantRule$1.evaluate(SystemPropertiesInvariantRule.java:55)
>         at org.apache.lucene.util.TestRuleThreadAndTestName$1.evaluate(TestRuleThreadAndTestName.java:48)
>         at org.apache.lucene.util.TestRuleIgnoreAfterMaxFailures$1.evaluate(TestRuleIgnoreAfterMaxFailures.java:70)
>         at org.apache.lucene.util.TestRuleMarkFailure$1.evaluate(TestRuleMarkFailure.java:48)
>         at com.carrotsearch.randomizedtesting.rules.StatementAdapter.evaluate(StatementAdapter.java:36)
>         at com.carrotsearch.randomizedtesting.ThreadLeakControl$StatementRunner.run(ThreadLeakControl.java:358)
>         at com.carrotsearch.randomizedtesting.ThreadLeakControl.forkTimeoutingTask(ThreadLeakControl.java:782)
>         at com.carrotsearch.randomizedtesting.ThreadLeakControl$3.evaluate(ThreadLeakControl.java:442)
>         at com.carrotsearch.randomizedtesting.RandomizedRunner.runSingleTest(RandomizedRunner.java:746)
>         at com.carrotsearch.randomizedtesting.RandomizedRunner$3.evaluate(RandomizedRunner.java:648)
>         at com.carrotsearch.randomizedtesting.RandomizedRunner$4.evaluate(RandomizedRunner.java:682)
>         at com.carrotsearch.randomizedtesting.RandomizedRunner$5.evaluate(RandomizedRunner.java:693)
>         at org.apache.lucene.util.AbstractBeforeAfterRule$1.evaluate(AbstractBeforeAfterRule.java:45)
>         at org.apache.lucene.util.TestRuleStoreClassName$1.evaluate(TestRuleStoreClassName.java:42)
>         at com.carrotsearch.randomizedtesting.rules.SystemPropertiesInvariantRule$1.evaluate(SystemPropertiesInvariantRule.java:55)
>         at com.carrotsearch.randomizedtesting.rules.NoShadowingOrOverridesOnMethodsRule$1.evaluate(NoShadowingOrOverridesOnMethodsRule.java:39)
>         at com.carrotsearch.randomizedtesting.rules.NoShadowingOrOverridesOnMethodsRule$1.evaluate(NoShadowingOrOverridesOnMethodsRule.java:39)
>         at com.carrotsearch.randomizedtesting.rules.StatementAdapter.evaluate(StatementAdapter.java:36)
>         at org.apache.lucene.util.TestRuleAssertionsRequired$1.evaluate(TestRuleAssertionsRequired.java:43)
>         at org.apache.lucene.util.TestRuleMarkFailure$1.evaluate(TestRuleMarkFailure.java:48)
>         at org.apache.lucene.util.TestRuleIgnoreAfterMaxFailures$1.evaluate(TestRuleIgnoreAfterMaxFailures.java:70)
>         at org.apache.lucene.util.TestRuleIgnoreTestSuites$1.evaluate(TestRuleIgnoreTestSuites.java:55)
>         at com.carrotsearch.randomizedtesting.rules.StatementAdapter.evaluate(StatementAdapter.java:36)
>         at com.carrotsearch.randomizedtesting.ThreadLeakControl$StatementRunner.run(ThreadLeakControl.java:358)
>         at java.lang.Thread.run(Thread.java:722)
>
>
> FAILED:  org.apache.lucene.search.spans.TestSpanSearchEquivalence.testSpanNearVersusPhrase
>
> Error Message:
>
>
> Stack Trace:
> java.lang.AssertionError
>         at __randomizedtesting.SeedInfo.seed([BA92C3F3C94685BF:51032302138171A1]:0)
>         at org.apache.lucene.search.FilteredQuery$LeapFrogScorer.docID(FilteredQuery.java:292)
>         at org.apache.lucene.search.AssertingIndexSearcher$1.scorer(AssertingIndexSearcher.java:84)
>         at org.apache.lucene.search.IndexSearcher.search(IndexSearcher.java:572)
>         at org.apache.lucene.search.IndexSearcher.search(IndexSearcher.java:453)
>         at org.apache.lucene.search.IndexSearcher.search(IndexSearcher.java:410)
>         at org.apache.lucene.search.IndexSearcher.search(IndexSearcher.java:261)
>         at org.apache.lucene.search.SearchEquivalenceTestBase.assertSubsetOf(SearchEquivalenceTestBase.java:183)
>         at org.apache.lucene.search.SearchEquivalenceTestBase.assertSubsetOf(SearchEquivalenceTestBase.java:164)
>         at org.apache.lucene.search.SearchEquivalenceTestBase.assertSameSet(SearchEquivalenceTestBase.java:152)
>         at org.apache.lucene.search.spans.TestSpanSearchEquivalence.testSpanNearVersusPhrase(TestSpanSearchEquivalence.java:75)
>         at sun.reflect.NativeMethodAccessorImpl.invoke0(Native Method)
>         at sun.reflect.NativeMethodAccessorImpl.invoke(NativeMethodAccessorImpl.java:57)
>         at sun.reflect.DelegatingMethodAccessorImpl.invoke(DelegatingMethodAccessorImpl.java:43)
>         at java.lang.reflect.Method.invoke(Method.java:601)
>         at com.carrotsearch.randomizedtesting.RandomizedRunner.invoke(RandomizedRunner.java:1559)
>         at com.carrotsearch.randomizedtesting.RandomizedRunner.access$600(RandomizedRunner.java:79)
>         at com.carrotsearch.randomizedtesting.RandomizedRunner$6.evaluate(RandomizedRunner.java:737)
>         at com.carrotsearch.randomizedtesting.RandomizedRunner$7.evaluate(RandomizedRunner.java:773)
>         at com.carrotsearch.randomizedtesting.RandomizedRunner$8.evaluate(RandomizedRunner.java:787)
>         at org.apache.lucene.util.TestRuleSetupTeardownChained$1.evaluate(TestRuleSetupTeardownChained.java:50)
>         at org.apache.lucene.util.TestRuleFieldCacheSanity$1.evaluate(TestRuleFieldCacheSanity.java:51)
>         at org.apache.lucene.util.AbstractBeforeAfterRule$1.evaluate(AbstractBeforeAfterRule.java:45)
>         at com.carrotsearch.randomizedtesting.rules.SystemPropertiesInvariantRule$1.evaluate(SystemPropertiesInvariantRule.java:55)
>         at org.apache.lucene.util.TestRuleThreadAndTestName$1.evaluate(TestRuleThreadAndTestName.java:48)
>         at org.apache.lucene.util.TestRuleIgnoreAfterMaxFailures$1.evaluate(TestRuleIgnoreAfterMaxFailures.java:70)
>         at org.apache.lucene.util.TestRuleMarkFailure$1.evaluate(TestRuleMarkFailure.java:48)
>         at com.carrotsearch.randomizedtesting.rules.StatementAdapter.evaluate(StatementAdapter.java:36)
>         at com.carrotsearch.randomizedtesting.ThreadLeakControl$StatementRunner.run(ThreadLeakControl.java:358)
>         at com.carrotsearch.randomizedtesting.ThreadLeakControl.forkTimeoutingTask(ThreadLeakControl.java:782)
>         at com.carrotsearch.randomizedtesting.ThreadLeakControl$3.evaluate(ThreadLeakControl.java:442)
>         at com.carrotsearch.randomizedtesting.RandomizedRunner.runSingleTest(RandomizedRunner.java:746)
>         at com.carrotsearch.randomizedtesting.RandomizedRunner$3.evaluate(RandomizedRunner.java:648)
>         at com.carrotsearch.randomizedtesting.RandomizedRunner$4.evaluate(RandomizedRunner.java:682)
>         at com.carrotsearch.randomizedtesting.RandomizedRunner$5.evaluate(RandomizedRunner.java:693)
>         at org.apache.lucene.util.AbstractBeforeAfterRule$1.evaluate(AbstractBeforeAfterRule.java:45)
>         at org.apache.lucene.util.TestRuleStoreClassName$1.evaluate(TestRuleStoreClassName.java:42)
>         at com.carrotsearch.randomizedtesting.rules.SystemPropertiesInvariantRule$1.evaluate(SystemPropertiesInvariantRule.java:55)
>         at com.carrotsearch.randomizedtesting.rules.NoShadowingOrOverridesOnMethodsRule$1.evaluate(NoShadowingOrOverridesOnMethodsRule.java:39)
>         at com.carrotsearch.randomizedtesting.rules.NoShadowingOrOverridesOnMethodsRule$1.evaluate(NoShadowingOrOverridesOnMethodsRule.java:39)
>         at com.carrotsearch.randomizedtesting.rules.StatementAdapter.evaluate(StatementAdapter.java:36)
>         at org.apache.lucene.util.TestRuleAssertionsRequired$1.evaluate(TestRuleAssertionsRequired.java:43)
>         at org.apache.lucene.util.TestRuleMarkFailure$1.evaluate(TestRuleMarkFailure.java:48)
>         at org.apache.lucene.util.TestRuleIgnoreAfterMaxFailures$1.evaluate(TestRuleIgnoreAfterMaxFailures.java:70)
>         at org.apache.lucene.util.TestRuleIgnoreTestSuites$1.evaluate(TestRuleIgnoreTestSuites.java:55)
>         at com.carrotsearch.randomizedtesting.rules.StatementAdapter.evaluate(StatementAdapter.java:36)
>         at com.carrotsearch.randomizedtesting.ThreadLeakControl$StatementRunner.run(ThreadLeakControl.java:358)
>         at java.lang.Thread.run(Thread.java:722)
>
>
>
>
> Build Log:
> [...truncated 209 lines...]
> [junit4:junit4] Suite: org.apache.lucene.search.spans.TestSpanSearchEquivalence
> [junit4:junit4]   2> NOTE: reproduce with: ant test  -Dtestcase=TestSpanSearchEquivalence -Dtests.method=testSpanNearVersusPhrase -Dtests.seed=BA92C3F3C94685BF -Dtests.multiplier=3 -Dtests.slow=true -Dtests.locale=es_PA -Dtests.timezone=America/Curacao -Dtests.file.encoding=UTF-8
> [junit4:junit4] FAILURE 0.07s J1 | TestSpanSearchEquivalence.testSpanNearVersusPhrase <<<
> [junit4:junit4]    > Throwable #1: java.lang.AssertionError
> [junit4:junit4]    >    at __randomizedtesting.SeedInfo.seed([BA92C3F3C94685BF:51032302138171A1]:0)
> [junit4:junit4]    >    at org.apache.lucene.search.FilteredQuery$LeapFrogScorer.docID(FilteredQuery.java:292)
> [junit4:junit4]    >    at org.apache.lucene.search.AssertingIndexSearcher$1.scorer(AssertingIndexSearcher.java:84)
> [junit4:junit4]    >    at org.apache.lucene.search.IndexSearcher.search(IndexSearcher.java:572)
> [junit4:junit4]    >    at org.apache.lucene.search.IndexSearcher.search(IndexSearcher.java:453)
> [junit4:junit4]    >    at org.apache.lucene.search.IndexSearcher.search(IndexSearcher.java:410)
> [junit4:junit4]    >    at org.apache.lucene.search.IndexSearcher.search(IndexSearcher.java:261)
> [junit4:junit4]    >    at org.apache.lucene.search.SearchEquivalenceTestBase.assertSubsetOf(SearchEquivalenceTestBase.java:183)
> [junit4:junit4]    >    at org.apache.lucene.search.SearchEquivalenceTestBase.assertSubsetOf(SearchEquivalenceTestBase.java:164)
> [junit4:junit4]    >    at org.apache.lucene.search.SearchEquivalenceTestBase.assertSameSet(SearchEquivalenceTestBase.java:152)
> [junit4:junit4]    >    at org.apache.lucene.search.spans.TestSpanSearchEquivalence.testSpanNearVersusPhrase(TestSpanSearchEquivalence.java:75)
> [junit4:junit4]    >    at sun.reflect.NativeMethodAccessorImpl.invoke0(Native Method)
> [junit4:junit4]    >    at sun.reflect.NativeMethodAccessorImpl.invoke(NativeMethodAccessorImpl.java:57)
> [junit4:junit4]    >    at sun.reflect.DelegatingMethodAccessorImpl.invoke(DelegatingMethodAccessorImpl.java:43)
> [junit4:junit4]    >    at java.lang.reflect.Method.invoke(Method.java:601)
> [junit4:junit4]    >    at com.carrotsearch.randomizedtesting.RandomizedRunner.invoke(RandomizedRunner.java:1559)
> [junit4:junit4]    >    at com.carrotsearch.randomizedtesting.RandomizedRunner.access$600(RandomizedRunner.java:79)
> [junit4:junit4]    >    at com.carrotsearch.randomizedtesting.RandomizedRunner$6.evaluate(RandomizedRunner.java:737)
> [junit4:junit4]    >    at com.carrotsearch.randomizedtesting.RandomizedRunner$7.evaluate(RandomizedRunner.java:773)
> [junit4:junit4]    >    at com.carrotsearch.randomizedtesting.RandomizedRunner$8.evaluate(RandomizedRunner.java:787)
> [junit4:junit4]    >    at org.apache.lucene.util.TestRuleSetupTeardownChained$1.evaluate(TestRuleSetupTeardownChained.java:50)
> [junit4:junit4]    >    at org.apache.lucene.util.TestRuleFieldCacheSanity$1.evaluate(TestRuleFieldCacheSanity.java:51)
> [junit4:junit4]    >    at org.apache.lucene.util.AbstractBeforeAfterRule$1.evaluate(AbstractBeforeAfterRule.java:45)
> [junit4:junit4]    >    at com.carrotsearch.randomizedtesting.rules.SystemPropertiesInvariantRule$1.evaluate(SystemPropertiesInvariantRule.java:55)
> [junit4:junit4]    >    at org.apache.lucene.util.TestRuleThreadAndTestName$1.evaluate(TestRuleThreadAndTestName.java:48)
> [junit4:junit4]    >    at org.apache.lucene.util.TestRuleIgnoreAfterMaxFailures$1.evaluate(TestRuleIgnoreAfterMaxFailures.java:70)
> [junit4:junit4]    >    at org.apache.lucene.util.TestRuleMarkFailure$1.evaluate(TestRuleMarkFailure.java:48)
> [junit4:junit4]    >    at com.carrotsearch.randomizedtesting.rules.StatementAdapter.evaluate(StatementAdapter.java:36)
> [junit4:junit4]    >    at com.carrotsearch.randomizedtesting.ThreadLeakControl$StatementRunner.run(ThreadLeakControl.java:358)
> [junit4:junit4]    >    at com.carrotsearch.randomizedtesting.ThreadLeakControl.forkTimeoutingTask(ThreadLeakControl.java:782)
> [junit4:junit4]    >    at com.carrotsearch.randomizedtesting.ThreadLeakControl$3.evaluate(ThreadLeakControl.java:442)
> [junit4:junit4]    >    at com.carrotsearch.randomizedtesting.RandomizedRunner.runSingleTest(RandomizedRunner.java:746)
> [junit4:junit4]    >    at com.carrotsearch.randomizedtesting.RandomizedRunner$3.evaluate(RandomizedRunner.java:648)
> [junit4:junit4]    >    at com.carrotsearch.randomizedtesting.RandomizedRunner$4.evaluate(RandomizedRunner.java:682)
> [junit4:junit4]    >    at com.carrotsearch.randomizedtesting.RandomizedRunner$5.evaluate(RandomizedRunner.java:693)
> [junit4:junit4]    >    at org.apache.lucene.util.AbstractBeforeAfterRule$1.evaluate(AbstractBeforeAfterRule.java:45)
> [junit4:junit4]    >    at org.apache.lucene.util.TestRuleStoreClassName$1.evaluate(TestRuleStoreClassName.java:42)
> [junit4:junit4]    >    at com.carrotsearch.randomizedtesting.rules.SystemPropertiesInvariantRule$1.evaluate(SystemPropertiesInvariantRule.java:55)
> [junit4:junit4]    >    at com.carrotsearch.randomizedtesting.rules.NoShadowingOrOverridesOnMethodsRule$1.evaluate(NoShadowingOrOverridesOnMethodsRule.java:39)
> [junit4:junit4]    >    at com.carrotsearch.randomizedtesting.rules.NoShadowingOrOverridesOnMethodsRule$1.evaluate(NoShadowingOrOverridesOnMethodsRule.java:39)
> [junit4:junit4]    >    at com.carrotsearch.randomizedtesting.rules.StatementAdapter.evaluate(StatementAdapter.java:36)
> [junit4:junit4]    >    at org.apache.lucene.util.TestRuleAssertionsRequired$1.evaluate(TestRuleAssertionsRequired.java:43)
> [junit4:junit4]    >    at org.apache.lucene.util.TestRuleMarkFailure$1.evaluate(TestRuleMarkFailure.java:48)
> [junit4:junit4]    >    at org.apache.lucene.util.TestRuleIgnoreAfterMaxFailures$1.evaluate(TestRuleIgnoreAfterMaxFailures.java:70)
> [junit4:junit4]    >    at org.apache.lucene.util.TestRuleIgnoreTestSuites$1.evaluate(TestRuleIgnoreTestSuites.java:55)
> [junit4:junit4]    >    at com.carrotsearch.randomizedtesting.rules.StatementAdapter.evaluate(StatementAdapter.java:36)
> [junit4:junit4]    >    at com.carrotsearch.randomizedtesting.ThreadLeakControl$StatementRunner.run(ThreadLeakControl.java:358)
> [junit4:junit4]    >    at java.lang.Thread.run(Thread.java:722)
> [junit4:junit4]   2> NOTE: reproduce with: ant test  -Dtestcase=TestSpanSearchEquivalence -Dtests.method=testSpanNearVersusBooleanAnd -Dtests.seed=BA92C3F3C94685BF -Dtests.multiplier=3 -Dtests.slow=true -Dtests.locale=es_PA -Dtests.timezone=America/Curacao -Dtests.file.encoding=UTF-8
> [junit4:junit4] FAILURE 0.04s J1 | TestSpanSearchEquivalence.testSpanNearVersusBooleanAnd <<<
> [junit4:junit4]    > Throwable #1: java.lang.AssertionError
> [junit4:junit4]    >    at __randomizedtesting.SeedInfo.seed([BA92C3F3C94685BF:D39A437A1D8DD88]:0)
> [junit4:junit4]    >    at org.apache.lucene.search.FilteredQuery$LeapFrogScorer.docID(FilteredQuery.java:292)
> [junit4:junit4]    >    at org.apache.lucene.search.AssertingIndexSearcher$1.scorer(AssertingIndexSearcher.java:84)
> [junit4:junit4]    >    at org.apache.lucene.search.IndexSearcher.search(IndexSearcher.java:572)
> [junit4:junit4]    >    at org.apache.lucene.search.IndexSearcher.search(IndexSearcher.java:453)
> [junit4:junit4]    >    at org.apache.lucene.search.IndexSearcher.search(IndexSearcher.java:410)
> [junit4:junit4]    >    at org.apache.lucene.search.IndexSearcher.search(IndexSearcher.java:261)
> [junit4:junit4]    >    at org.apache.lucene.search.SearchEquivalenceTestBase.assertSubsetOf(SearchEquivalenceTestBase.java:183)
> [junit4:junit4]    >    at org.apache.lucene.search.SearchEquivalenceTestBase.assertSubsetOf(SearchEquivalenceTestBase.java:164)
> [junit4:junit4]    >    at org.apache.lucene.search.SearchEquivalenceTestBase.assertSameSet(SearchEquivalenceTestBase.java:152)
> [junit4:junit4]    >    at org.apache.lucene.search.spans.TestSpanSearchEquivalence.testSpanNearVersusBooleanAnd(TestSpanSearchEquivalence.java:87)
> [junit4:junit4]    >    at sun.reflect.NativeMethodAccessorImpl.invoke0(Native Method)
> [junit4:junit4]    >    at sun.reflect.NativeMethodAccessorImpl.invoke(NativeMethodAccessorImpl.java:57)
> [junit4:junit4]    >    at sun.reflect.DelegatingMethodAccessorImpl.invoke(DelegatingMethodAccessorImpl.java:43)
> [junit4:junit4]    >    at java.lang.reflect.Method.invoke(Method.java:601)
> [junit4:junit4]    >    at com.carrotsearch.randomizedtesting.RandomizedRunner.invoke(RandomizedRunner.java:1559)
> [junit4:junit4]    >    at com.carrotsearch.randomizedtesting.RandomizedRunner.access$600(RandomizedRunner.java:79)
> [junit4:junit4]    >    at com.carrotsearch.randomizedtesting.RandomizedRunner$6.evaluate(RandomizedRunner.java:737)
> [junit4:junit4]    >    at com.carrotsearch.randomizedtesting.RandomizedRunner$7.evaluate(RandomizedRunner.java:773)
> [junit4:junit4]    >    at com.carrotsearch.randomizedtesting.RandomizedRunner$8.evaluate(RandomizedRunner.java:787)
> [junit4:junit4]    >    at org.apache.lucene.util.TestRuleSetupTeardownChained$1.evaluate(TestRuleSetupTeardownChained.java:50)
> [junit4:junit4]    >    at org.apache.lucene.util.TestRuleFieldCacheSanity$1.evaluate(TestRuleFieldCacheSanity.java:51)
> [junit4:junit4]    >    at org.apache.lucene.util.AbstractBeforeAfterRule$1.evaluate(AbstractBeforeAfterRule.java:45)
> [junit4:junit4]    >    at com.carrotsearch.randomizedtesting.rules.SystemPropertiesInvariantRule$1.evaluate(SystemPropertiesInvariantRule.java:55)
> [junit4:junit4]    >    at org.apache.lucene.util.TestRuleThreadAndTestName$1.evaluate(TestRuleThreadAndTestName.java:48)
> [junit4:junit4]    >    at org.apache.lucene.util.TestRuleIgnoreAfterMaxFailures$1.evaluate(TestRuleIgnoreAfterMaxFailures.java:70)
> [junit4:junit4]    >    at org.apache.lucene.util.TestRuleMarkFailure$1.evaluate(TestRuleMarkFailure.java:48)
> [junit4:junit4]    >    at com.carrotsearch.randomizedtesting.rules.StatementAdapter.evaluate(StatementAdapter.java:36)
> [junit4:junit4]    >    at com.carrotsearch.randomizedtesting.ThreadLeakControl$StatementRunner.run(ThreadLeakControl.java:358)
> [junit4:junit4]    >    at com.carrotsearch.randomizedtesting.ThreadLeakControl.forkTimeoutingTask(ThreadLeakControl.java:782)
> [junit4:junit4]    >    at com.carrotsearch.randomizedtesting.ThreadLeakControl$3.evaluate(ThreadLeakControl.java:442)
> [junit4:junit4]    >    at com.carrotsearch.randomizedtesting.RandomizedRunner.runSingleTest(RandomizedRunner.java:746)
> [junit4:junit4]    >    at com.carrotsearch.randomizedtesting.RandomizedRunner$3.evaluate(RandomizedRunner.java:648)
> [junit4:junit4]    >    at com.carrotsearch.randomizedtesting.RandomizedRunner$4.evaluate(RandomizedRunner.java:682)
> [junit4:junit4]    >    at com.carrotsearch.randomizedtesting.RandomizedRunner$5.evaluate(RandomizedRunner.java:693)
> [junit4:junit4]    >    at org.apache.lucene.util.AbstractBeforeAfterRule$1.evaluate(AbstractBeforeAfterRule.java:45)
> [junit4:junit4]    >    at org.apache.lucene.util.TestRuleStoreClassName$1.evaluate(TestRuleStoreClassName.java:42)
> [junit4:junit4]    >    at com.carrotsearch.randomizedtesting.rules.SystemPropertiesInvariantRule$1.evaluate(SystemPropertiesInvariantRule.java:55)
> [junit4:junit4]    >    at com.carrotsearch.randomizedtesting.rules.NoShadowingOrOverridesOnMethodsRule$1.evaluate(NoShadowingOrOverridesOnMethodsRule.java:39)
> [junit4:junit4]    >    at com.carrotsearch.randomizedtesting.rules.NoShadowingOrOverridesOnMethodsRule$1.evaluate(NoShadowingOrOverridesOnMethodsRule.java:39)
> [junit4:junit4]    >    at com.carrotsearch.randomizedtesting.rules.StatementAdapter.evaluate(StatementAdapter.java:36)
> [junit4:junit4]    >    at org.apache.lucene.util.TestRuleAssertionsRequired$1.evaluate(TestRuleAssertionsRequired.java:43)
> [junit4:junit4]    >    at org.apache.lucene.util.TestRuleMarkFailure$1.evaluate(TestRuleMarkFailure.java:48)
> [junit4:junit4]    >    at org.apache.lucene.util.TestRuleIgnoreAfterMaxFailures$1.evaluate(TestRuleIgnoreAfterMaxFailures.java:70)
> [junit4:junit4]    >    at org.apache.lucene.util.TestRuleIgnoreTestSuites$1.evaluate(TestRuleIgnoreTestSuites.java:55)
> [junit4:junit4]    >    at com.carrotsearch.randomizedtesting.rules.StatementAdapter.evaluate(StatementAdapter.java:36)
> [junit4:junit4]    >    at com.carrotsearch.randomizedtesting.ThreadLeakControl$StatementRunner.run(ThreadLeakControl.java:358)
> [junit4:junit4]    >    at java.lang.Thread.run(Thread.java:722)
> [junit4:junit4]   2> NOTE: test params are: codec=Asserting, sim=DefaultSimilarity, locale=es_PA, timezone=America/Curacao
> [junit4:junit4]   2> NOTE: Linux 3.2.0-30-generic amd64/Oracle Corporation 1.7.0_07 (64-bit)/cpus=8,threads=1,free=90453472,total=217317376
> [junit4:junit4]   2> NOTE: All tests run in this JVM: [TestTypePromotion, TestMaxTermFrequency, TestMockAnalyzer, TestVersion, TestQueryWrapperFilter, TestIndexWriterMerging, TestIndexWriterLockRelease, TestRandomStoredFields, TestNRTCachingDirectory, TestPriorityQueue, TestPayloadsOnVectors, TestDocValuesScoring, TestBoolean2, TestMockDirectoryWrapper, TestSloppyPhraseQuery2, TestBinaryTerms, TestFuzzyQuery, TestScoreCachingWrappingScorer, TestUniqueTermCount, TestPersistentSnapshotDeletionPolicy, TestSegmentMerger, TestDocValuesIndexing, TestPrefixRandom, TestIdentityHashSet, TestIndexWriterConfig, TestFieldsReader, TestCompiledAutomaton, TestSpanSearchEquivalence]
> [junit4:junit4] Completed on J1 in 0.52s, 8 tests, 2 failures <<< FAILURES!
>
> [...truncated 566 lines...]
> [junit4:junit4] Suite: org.apache.lucene.search.TestFilteredQuery
> [junit4:junit4]   2> NOTE: reproduce with: ant test  -Dtestcase=TestFilteredQuery -Dtests.method=testBooleanSHOULD -Dtests.seed=BA92C3F3C94685BF -Dtests.multiplier=3 -Dtests.slow=true -Dtests.locale=th_TH -Dtests.timezone=Universal -Dtests.file.encoding=UTF-8
> [junit4:junit4] ERROR   0.03s J0 | TestFilteredQuery.testBooleanSHOULD <<<
> [junit4:junit4]    > Throwable #1: java.lang.RuntimeException: java.util.concurrent.ExecutionException: java.lang.IllegalStateException: This Random was created for/by another thread (Thread[TEST-TestFilteredQuery.testBooleanSHOULD-seed#[BA92C3F3C94685BF],5,TGRP-TestFilteredQuery]). Random instances must not be shared (acquire per-thread). Current thread: Thread[LuceneTestCase-385-thread-2,5,TGRP-TestFilteredQuery]
> [junit4:junit4]    >    at __randomizedtesting.SeedInfo.seed([BA92C3F3C94685BF:7CFF6CDD204D517E]:0)
> [junit4:junit4]    >    at org.apache.lucene.search.IndexSearcher$ExecutionHelper.next(IndexSearcher.java:820)
> [junit4:junit4]    >    at org.apache.lucene.search.IndexSearcher.search(IndexSearcher.java:423)
> [junit4:junit4]    >    at org.apache.lucene.search.IndexSearcher.search(IndexSearcher.java:261)
> [junit4:junit4]    >    at org.apache.lucene.search.TestFilteredQuery.tBooleanSHOULD(TestFilteredQuery.java:252)
> [junit4:junit4]    >    at org.apache.lucene.search.TestFilteredQuery.testBooleanSHOULD(TestFilteredQuery.java:243)
> [junit4:junit4]    >    at sun.reflect.NativeMethodAccessorImpl.invoke0(Native Method)
> [junit4:junit4]    >    at sun.reflect.NativeMethodAccessorImpl.invoke(NativeMethodAccessorImpl.java:57)
> [junit4:junit4]    >    at sun.reflect.DelegatingMethodAccessorImpl.invoke(DelegatingMethodAccessorImpl.java:43)
> [junit4:junit4]    >    at java.lang.reflect.Method.invoke(Method.java:601)
> [junit4:junit4]    >    at com.carrotsearch.randomizedtesting.RandomizedRunner.invoke(RandomizedRunner.java:1559)
> [junit4:junit4]    >    at com.carrotsearch.randomizedtesting.RandomizedRunner.access$600(RandomizedRunner.java:79)
> [junit4:junit4]    >    at com.carrotsearch.randomizedtesting.RandomizedRunner$6.evaluate(RandomizedRunner.java:737)
> [junit4:junit4]    >    at com.carrotsearch.randomizedtesting.RandomizedRunner$7.evaluate(RandomizedRunner.java:773)
> [junit4:junit4]    >    at com.carrotsearch.randomizedtesting.RandomizedRunner$8.evaluate(RandomizedRunner.java:787)
> [junit4:junit4]    >    at org.apache.lucene.util.TestRuleSetupTeardownChained$1.evaluate(TestRuleSetupTeardownChained.java:50)
> [junit4:junit4]    >    at org.apache.lucene.util.TestRuleFieldCacheSanity$1.evaluate(TestRuleFieldCacheSanity.java:51)
> [junit4:junit4]    >    at org.apache.lucene.util.AbstractBeforeAfterRule$1.evaluate(AbstractBeforeAfterRule.java:45)
> [junit4:junit4]    >    at com.carrotsearch.randomizedtesting.rules.SystemPropertiesInvariantRule$1.evaluate(SystemPropertiesInvariantRule.java:55)
> [junit4:junit4]    >    at org.apache.lucene.util.TestRuleThreadAndTestName$1.evaluate(TestRuleThreadAndTestName.java:48)
> [junit4:junit4]    >    at org.apache.lucene.util.TestRuleIgnoreAfterMaxFailures$1.evaluate(TestRuleIgnoreAfterMaxFailures.java:70)
> [junit4:junit4]    >    at org.apache.lucene.util.TestRuleMarkFailure$1.evaluate(TestRuleMarkFailure.java:48)
> [junit4:junit4]    >    at com.carrotsearch.randomizedtesting.rules.StatementAdapter.evaluate(StatementAdapter.java:36)
> [junit4:junit4]    >    at com.carrotsearch.randomizedtesting.ThreadLeakControl$StatementRunner.run(ThreadLeakControl.java:358)
> [junit4:junit4]    >    at com.carrotsearch.randomizedtesting.ThreadLeakControl.forkTimeoutingTask(ThreadLeakControl.java:782)
> [junit4:junit4]    >    at com.carrotsearch.randomizedtesting.ThreadLeakControl$3.evaluate(ThreadLeakControl.java:442)
> [junit4:junit4]    >    at com.carrotsearch.randomizedtesting.RandomizedRunner.runSingleTest(RandomizedRunner.java:746)
> [junit4:junit4]    >    at com.carrotsearch.randomizedtesting.RandomizedRunner$3.evaluate(RandomizedRunner.java:648)
> [junit4:junit4]    >    at com.carrotsearch.randomizedtesting.RandomizedRunner$4.evaluate(RandomizedRunner.java:682)
> [junit4:junit4]    >    at com.carrotsearch.randomizedtesting.RandomizedRunner$5.evaluate(RandomizedRunner.java:693)
> [junit4:junit4]    >    at org.apache.lucene.util.AbstractBeforeAfterRule$1.evaluate(AbstractBeforeAfterRule.java:45)
> [junit4:junit4]    >    at org.apache.lucene.util.TestRuleStoreClassName$1.evaluate(TestRuleStoreClassName.java:42)
> [junit4:junit4]    >    at com.carrotsearch.randomizedtesting.rules.SystemPropertiesInvariantRule$1.evaluate(SystemPropertiesInvariantRule.java:55)
> [junit4:junit4]    >    at com.carrotsearch.randomizedtesting.rules.NoShadowingOrOverridesOnMethodsRule$1.evaluate(NoShadowingOrOverridesOnMethodsRule.java:39)
> [junit4:junit4]    >    at com.carrotsearch.randomizedtesting.rules.NoShadowingOrOverridesOnMethodsRule$1.evaluate(NoShadowingOrOverridesOnMethodsRule.java:39)
> [junit4:junit4]    >    at com.carrotsearch.randomizedtesting.rules.StatementAdapter.evaluate(StatementAdapter.java:36)
> [junit4:junit4]    >    at org.apache.lucene.util.TestRuleAssertionsRequired$1.evaluate(TestRuleAssertionsRequired.java:43)
> [junit4:junit4]    >    at org.apache.lucene.util.TestRuleMarkFailure$1.evaluate(TestRuleMarkFailure.java:48)
> [junit4:junit4]    >    at org.apache.lucene.util.TestRuleIgnoreAfterMaxFailures$1.evaluate(TestRuleIgnoreAfterMaxFailures.java:70)
> [junit4:junit4]    >    at org.apache.lucene.util.TestRuleIgnoreTestSuites$1.evaluate(TestRuleIgnoreTestSuites.java:55)
> [junit4:junit4]    >    at com.carrotsearch.randomizedtesting.rules.StatementAdapter.evaluate(StatementAdapter.java:36)
> [junit4:junit4]    >    at com.carrotsearch.randomizedtesting.ThreadLeakControl$StatementRunner.run(ThreadLeakControl.java:358)
> [junit4:junit4]    >    at java.lang.Thread.run(Thread.java:722)
> [junit4:junit4]    > Caused by: java.util.concurrent.ExecutionException: java.lang.IllegalStateException: This Random was created for/by another thread (Thread[TEST-TestFilteredQuery.testBooleanSHOULD-seed#[BA92C3F3C94685BF],5,TGRP-TestFilteredQuery]). Random instances must not be shared (acquire per-thread). Current thread: Thread[LuceneTestCase-385-thread-2,5,TGRP-TestFilteredQuery]
> [junit4:junit4]    >    at java.util.concurrent.FutureTask$Sync.innerGet(FutureTask.java:252)
> [junit4:junit4]    >    at java.util.concurrent.FutureTask.get(FutureTask.java:111)
> [junit4:junit4]    >    at org.apache.lucene.search.IndexSearcher$ExecutionHelper.next(IndexSearcher.java:816)
> [junit4:junit4]    >    ... 41 more
> [junit4:junit4]    > Caused by: java.lang.IllegalStateException: This Random was created for/by another thread (Thread[TEST-TestFilteredQuery.testBooleanSHOULD-seed#[BA92C3F3C94685BF],5,TGRP-TestFilteredQuery]). Random instances must not be shared (acquire per-thread). Current thread: Thread[LuceneTestCase-385-thread-2,5,TGRP-TestFilteredQuery]
> [junit4:junit4]    >    at com.carrotsearch.randomizedtesting.AssertingRandom.checkValid(AssertingRandom.java:139)
> [junit4:junit4]    >    at com.carrotsearch.randomizedtesting.AssertingRandom.nextBoolean(AssertingRandom.java:43)
> [junit4:junit4]    >    at org.apache.lucene.util._TestUtil$3.useRandomAccess(_TestUtil.java:994)
> [junit4:junit4]    >    at org.apache.lucene.search.FilteredQuery$RandomAccessFilterStrategy.filteredScorer(FilteredQuery.java:515)
> [junit4:junit4]    >    at org.apache.lucene.search.FilteredQuery$1.scorer(FilteredQuery.java:133)
> [junit4:junit4]    >    at org.apache.lucene.search.BooleanQuery$BooleanWeight.scorer(BooleanQuery.java:322)
> [junit4:junit4]    >    at org.apache.lucene.search.AssertingIndexSearcher$1.scorer(AssertingIndexSearcher.java:80)
> [junit4:junit4]    >    at org.apache.lucene.search.IndexSearcher.search(IndexSearcher.java:572)
> [junit4:junit4]    >    at org.apache.lucene.search.IndexSearcher.search(IndexSearcher.java:453)
> [junit4:junit4]    >    at org.apache.lucene.search.IndexSearcher$SearcherCallableNoSort.call(IndexSearcher.java:675)
> [junit4:junit4]    >    at org.apache.lucene.search.IndexSearcher$SearcherCallableNoSort.call(IndexSearcher.java:653)
> [junit4:junit4]    >    at java.util.concurrent.FutureTask$Sync.innerRun(FutureTask.java:334)
> [junit4:junit4]    >    at java.util.concurrent.FutureTask.run(FutureTask.java:166)
> [junit4:junit4]    >    at java.util.concurrent.Executors$RunnableAdapter.call(Executors.java:471)
> [junit4:junit4]    >    at java.util.concurrent.FutureTask$Sync.innerRun(FutureTask.java:334)
> [junit4:junit4]    >    at java.util.concurrent.FutureTask.run(FutureTask.java:166)
> [junit4:junit4]    >    at java.util.concurrent.ThreadPoolExecutor.runWorker(ThreadPoolExecutor.java:1110)
> [junit4:junit4]    >    at java.util.concurrent.ThreadPoolExecutor$Worker.run(ThreadPoolExecutor.java:603)
> [junit4:junit4]    >    ... 1 more
> [junit4:junit4]    > Caused by: com.carrotsearch.randomizedtesting.StackTraceHolder: Original allocation stack for this Random (allocated by Thread[TEST-TestFilteredQuery.testBooleanSHOULD-seed#[BA92C3F3C94685BF],5,TGRP-TestFilteredQuery])
> [junit4:junit4]    >    at java.lang.Thread.getStackTrace(Thread.java:1567)
> [junit4:junit4]    >    at com.carrotsearch.randomizedtesting.AssertingRandom.<init>(AssertingRandom.java:33)
> [junit4:junit4]    >    at com.carrotsearch.randomizedtesting.Randomness.<init>(Randomness.java:22)
> [junit4:junit4]    >    at com.carrotsearch.randomizedtesting.Randomness.<init>(Randomness.java:26)
> [junit4:junit4]    >    at com.carrotsearch.randomizedtesting.RandomizedRunner$3.evaluate(RandomizedRunner.java:647)
> [junit4:junit4]    >    at com.carrotsearch.randomizedtesting.RandomizedRunner$4.evaluate(RandomizedRunner.java:682)
> [junit4:junit4]    >    at com.carrotsearch.randomizedtesting.RandomizedRunner$5.evaluate(RandomizedRunner.java:693)
> [junit4:junit4]    >    at org.apache.lucene.util.AbstractBeforeAfterRule$1.evaluate(AbstractBeforeAfterRule.java:45)
> [junit4:junit4]    >    at org.apache.lucene.util.TestRuleStoreClassName$1.evaluate(TestRuleStoreClassName.java:42)
> [junit4:junit4]    >    at com.carrotsearch.randomizedtesting.rules.SystemPropertiesInvariantRule$1.evaluate(SystemPropertiesInvariantRule.java:55)
> [junit4:junit4]    >    at com.carrotsearch.randomizedtesting.rules.NoShadowingOrOverridesOnMethodsRule$1.evaluate(NoShadowingOrOverridesOnMethodsRule.java:39)
> [junit4:junit4]    >    at com.carrotsearch.randomizedtesting.rules.NoShadowingOrOverridesOnMethodsRule$1.evaluate(NoShadowingOrOverridesOnMethodsRule.java:39)
> [junit4:junit4]    >    at com.carrotsearch.randomizedtesting.rules.StatementAdapter.evaluate(StatementAdapter.java:36)
> [junit4:junit4]    >    at org.apache.lucene.util.TestRuleAssertionsRequired$1.evaluate(TestRuleAssertionsRequired.java:43)
> [junit4:junit4]    >    at org.apache.lucene.util.TestRuleMarkFailure$1.evaluate(TestRuleMarkFailure.java:48)
> [junit4:junit4]    >    at org.apache.lucene.util.TestRuleIgnoreAfterMaxFailures$1.evaluate(TestRuleIgnoreAfterMaxFailures.java:70)
> [junit4:junit4]    >    at org.apache.lucene.util.TestRuleIgnoreTestSuites$1.evaluate(TestRuleIgnoreTestSuites.java:55)
> [junit4:junit4]    >    at com.carrotsearch.randomizedtesting.rules.StatementAdapter.evaluate(StatementAdapter.java:36)
> [junit4:junit4]    >    at com.carrotsearch.randomizedtesting.ThreadLeakControl$StatementRunner.run(ThreadLeakControl.java:358)
> [junit4:junit4]    >    ... 1 more
> [junit4:junit4]   2> NOTE: test params are: codec=Lucene40: {field=PostingsFormat(name=MockRandom), sorter=PostingsFormat(name=NestedPulsing)}, sim=DefaultSimilarity, locale=th_TH, timezone=Universal
> [junit4:junit4]   2> NOTE: Linux 3.2.0-30-generic amd64/Oracle Corporation 1.7.0_07 (64-bit)/cpus=8,threads=1,free=189774152,total=461307904
> [junit4:junit4]   2> NOTE: All tests run in this JVM: [TestBitVector, TestMultiThreadTermVectors, Nested1, Nested2, Nested3, TestIndexWriterWithThreads, TestSnapshotDeletionPolicy, TestTermScorer, TestConcurrentMergeScheduler, TestOmitPositions, TestSort, TestGraphTokenizers, TestIndexCommit, TestCrash, TestSumDocFreq, TestSpanExplanationsOfNonMatches, TestNoDeletionPolicy, TestPhrasePrefixQuery, TestScorerPerf, TestCustomSearcherSort, TestField, TestSetOnce, TestConsistentFieldNumbers, TestWildcard, TestByteBlockPool, TestCachingCollector, TestCharTermAttributeImpl, TestByteArrayDataInput, TestFixedBitSet, TestFilterAtomicReader, TestSearchForDuplicates, TestFieldValueFilter, TestParallelAtomicReader, TestDeterminizeLexicon, TestIndexWriterNRTIsCurrent, TestCheckIndex, TestNGramPhraseQuery, TestSmallFloat, TestIndexFileDeleter, TestTransactions, TestShardSearching, TestMultiPhraseQuery, TestIndexableField, TestBooleanOr, TestSizeBoundedForceMerge, TestSimilarityBase, TestSloppyPhraseQuery, TestCharFilter, TestNumericUtils, TestRegexpRandom2, TestSpecialOperations, TestDocBoost, TestBytesRefHash, TestTermdocPerf, TestLazyProxSkipping, TestStressAdvance, Nested1, TestPayloads, TestRollingUpdates, TestSegmentReader, TestMergeSchedulerExternal, TestBooleanQuery, TestDisjunctionMaxQuery, TestByteSlices, TestArrayUtil, TestPayloadExplanations, TestDocValuesTypeCompatibility, TestIndexWriterCommit, TestDoubleBarrelLRUCache, TestStressNRT, TestNamedSPILoader, TestBitUtil, TestSearchAfter, TestMultiTermConstantScore, TestIndexWriter, TestIndexWriterOnDiskFull, TestRegexpQuery, TestCustomNorms, TestTransactionRollback, TestIndexWriterReader, TestLookaheadTokenFilter, TestIndexWriterExceptions, TestNumericRangeQuery32, TestBasics, TestDuelingCodecs, TestTermsEnum, TestLucene40PostingsReader, TestOpenBitSet, TestBackwardsCompatibility, TestNRTManager, TestIndexWriterDelete, TestDirectoryReaderReopen, TestBufferedIndexInput, TestIndexWriterForceMerge, TestPagedBytes, TestCompoundFile, TestDocumentsWriterStallControl, TestReuseDocsEnum, TestIndexInput, TestDoc, TestSimpleSearchEquivalence, TestPayloadNearQuery, TestFilteredQuery]
> [junit4:junit4] Completed on J0 in 0.28s, 9 tests, 1 error <<< FAILURES!
>
> [...truncated 270 lines...]
> BUILD FAILED
> /mnt/ssd/jenkins/workspace/Lucene-Solr-trunk-Linux/build.xml:32: The following error occurred while executing this line:
> /mnt/ssd/jenkins/workspace/Lucene-Solr-trunk-Linux/lucene/build.xml:49: The following error occurred while executing this line:
> /mnt/ssd/jenkins/workspace/Lucene-Solr-trunk-Linux/lucene/common-build.xml:1140: The following error occurred while executing this line:
> /mnt/ssd/jenkins/workspace/Lucene-Solr-trunk-Linux/lucene/common-build.xml:813: There were test failures: 305 suites, 1761 tests, 1 error, 2 failures, 19 ignored (11 assumptions)
>
> Total time: 5 minutes 7 seconds
> Build step 'Invoke Ant' marked build as failure
> Recording test results
> Description set: Java: 64bit/jdk1.7.0_07 -XX:+UseParallelGC
> Email was triggered for: Failure
> Sending email for trigger: Failure
>
>
>
>
> ---------------------------------------------------------------------
> To unsubscribe, e-mail: dev-unsubscribe@lucene.apache.org
> For additional commands, e-mail: dev-help@lucene.apache.org

---------------------------------------------------------------------
To unsubscribe, e-mail: dev-unsubscribe@lucene.apache.org
For additional commands, e-mail: dev-help@lucene.apache.org


Mime
View raw message