lucene-dev mailing list archives

Site index · List index
Message view « Date » · « Thread »
Top « Date » · « Thread »
From Michael McCandless <luc...@mikemccandless.com>
Subject Re: [JENKINS] Lucene-Solr-Tests-trunk-Java6 - Build # 15302 - Failure
Date Thu, 27 Sep 2012 16:28:10 GMT
I committed a fix.

Mike McCandless

http://blog.mikemccandless.com

On Thu, Sep 27, 2012 at 5:14 AM, Apache Jenkins Server
<jenkins@builds.apache.org> wrote:
> Build: https://builds.apache.org/job/Lucene-Solr-Tests-trunk-Java6/15302/
>
> 1 tests failed.
> REGRESSION:  org.apache.lucene.analysis.synonym.TestSynonymMapFilter.testRandomHuge
>
> Error Message:
> pos=96 posLen=1 token=sypd expected:<579> but was:<584>
>
> Stack Trace:
> java.lang.AssertionError: pos=96 posLen=1 token=sypd expected:<579> but was:<584>
>         at __randomizedtesting.SeedInfo.seed([4CB74D086684E350:8FF6751C770CAA75]:0)
>         at org.junit.Assert.fail(Assert.java:93)
>         at org.junit.Assert.failNotEquals(Assert.java:647)
>         at org.junit.Assert.assertEquals(Assert.java:128)
>         at org.junit.Assert.assertEquals(Assert.java:472)
>         at org.apache.lucene.analysis.BaseTokenStreamTestCase.assertTokenStreamContents(BaseTokenStreamTestCase.java:223)
>         at org.apache.lucene.analysis.BaseTokenStreamTestCase.checkAnalysisConsistency(BaseTokenStreamTestCase.java:743)
>         at org.apache.lucene.analysis.BaseTokenStreamTestCase.checkRandomData(BaseTokenStreamTestCase.java:542)
>         at org.apache.lucene.analysis.BaseTokenStreamTestCase.checkRandomData(BaseTokenStreamTestCase.java:443)
>         at org.apache.lucene.analysis.BaseTokenStreamTestCase.checkRandomData(BaseTokenStreamTestCase.java:371)
>         at org.apache.lucene.analysis.synonym.TestSynonymMapFilter.testRandomHuge(TestSynonymMapFilter.java:557)
>         at sun.reflect.NativeMethodAccessorImpl.invoke0(Native Method)
>         at sun.reflect.NativeMethodAccessorImpl.invoke(NativeMethodAccessorImpl.java:57)
>         at sun.reflect.DelegatingMethodAccessorImpl.invoke(DelegatingMethodAccessorImpl.java:43)
>         at java.lang.reflect.Method.invoke(Method.java:616)
>         at com.carrotsearch.randomizedtesting.RandomizedRunner.invoke(RandomizedRunner.java:1559)
>         at com.carrotsearch.randomizedtesting.RandomizedRunner.access$600(RandomizedRunner.java:79)
>         at com.carrotsearch.randomizedtesting.RandomizedRunner$6.evaluate(RandomizedRunner.java:737)
>         at com.carrotsearch.randomizedtesting.RandomizedRunner$7.evaluate(RandomizedRunner.java:773)
>         at com.carrotsearch.randomizedtesting.RandomizedRunner$8.evaluate(RandomizedRunner.java:787)
>         at org.apache.lucene.util.TestRuleSetupTeardownChained$1.evaluate(TestRuleSetupTeardownChained.java:50)
>         at org.apache.lucene.util.TestRuleFieldCacheSanity$1.evaluate(TestRuleFieldCacheSanity.java:51)
>         at org.apache.lucene.util.AbstractBeforeAfterRule$1.evaluate(AbstractBeforeAfterRule.java:45)
>         at com.carrotsearch.randomizedtesting.rules.SystemPropertiesInvariantRule$1.evaluate(SystemPropertiesInvariantRule.java:55)
>         at org.apache.lucene.util.TestRuleThreadAndTestName$1.evaluate(TestRuleThreadAndTestName.java:48)
>         at org.apache.lucene.util.TestRuleIgnoreAfterMaxFailures$1.evaluate(TestRuleIgnoreAfterMaxFailures.java:70)
>         at org.apache.lucene.util.TestRuleMarkFailure$1.evaluate(TestRuleMarkFailure.java:48)
>         at com.carrotsearch.randomizedtesting.rules.StatementAdapter.evaluate(StatementAdapter.java:36)
>         at com.carrotsearch.randomizedtesting.ThreadLeakControl$StatementRunner.run(ThreadLeakControl.java:358)
>         at com.carrotsearch.randomizedtesting.ThreadLeakControl.forkTimeoutingTask(ThreadLeakControl.java:782)
>         at com.carrotsearch.randomizedtesting.ThreadLeakControl$3.evaluate(ThreadLeakControl.java:442)
>         at com.carrotsearch.randomizedtesting.RandomizedRunner.runSingleTest(RandomizedRunner.java:746)
>         at com.carrotsearch.randomizedtesting.RandomizedRunner$3.evaluate(RandomizedRunner.java:648)
>         at com.carrotsearch.randomizedtesting.RandomizedRunner$4.evaluate(RandomizedRunner.java:682)
>         at com.carrotsearch.randomizedtesting.RandomizedRunner$5.evaluate(RandomizedRunner.java:693)
>         at org.apache.lucene.util.AbstractBeforeAfterRule$1.evaluate(AbstractBeforeAfterRule.java:45)
>         at org.apache.lucene.util.TestRuleStoreClassName$1.evaluate(TestRuleStoreClassName.java:42)
>         at com.carrotsearch.randomizedtesting.rules.SystemPropertiesInvariantRule$1.evaluate(SystemPropertiesInvariantRule.java:55)
>         at com.carrotsearch.randomizedtesting.rules.NoShadowingOrOverridesOnMethodsRule$1.evaluate(NoShadowingOrOverridesOnMethodsRule.java:39)
>         at com.carrotsearch.randomizedtesting.rules.NoShadowingOrOverridesOnMethodsRule$1.evaluate(NoShadowingOrOverridesOnMethodsRule.java:39)
>         at com.carrotsearch.randomizedtesting.rules.StatementAdapter.evaluate(StatementAdapter.java:36)
>         at org.apache.lucene.util.TestRuleAssertionsRequired$1.evaluate(TestRuleAssertionsRequired.java:43)
>         at org.apache.lucene.util.TestRuleMarkFailure$1.evaluate(TestRuleMarkFailure.java:48)
>         at org.apache.lucene.util.TestRuleIgnoreAfterMaxFailures$1.evaluate(TestRuleIgnoreAfterMaxFailures.java:70)
>         at org.apache.lucene.util.TestRuleIgnoreTestSuites$1.evaluate(TestRuleIgnoreTestSuites.java:55)
>         at com.carrotsearch.randomizedtesting.rules.StatementAdapter.evaluate(StatementAdapter.java:36)
>         at com.carrotsearch.randomizedtesting.ThreadLeakControl$StatementRunner.run(ThreadLeakControl.java:358)
>         at java.lang.Thread.run(Thread.java:679)
>
>
>
>
> Build Log:
> [...truncated 3430 lines...]
> [junit4:junit4] Suite: org.apache.lucene.analysis.synonym.TestSynonymMapFilter
> [junit4:junit4]   2> TEST FAIL: useCharFilter=false text='hskc \u292d\u290a\u292a\u2956\u297c\u293f\u293a
ab \ud7bd\ud7ff\ud7dc\ud7c3\ud7fa\ud7c3\ud7b9\ud7bd xmguo \u1029f \ufe2b\ufe20\ufe2f\ufe2a
\ue227\ub54bd]\u02c8\u9787\u500d7\u098c fmomz \ua61c\ua573\ua61f\ua559 -->;5 yyki wterudt
eyfvrt  ax \u117569W wgqb \u2ff5\u2ff4\u2fff  \u17a3\u17ad\u17fa efuo mf  \ua835\ua831\ua83f\ua83e\ua838\ua83e\ua83f
 \ua8ac\ua88e\ua8af\ua884\ua8b7\ua8ca \u0584\u0579\ue4d1\uf90fE ztcld \u91e15\u000e\u48df\uf465\ue93fC
efenxt \u197e\u196c\u1979\u1965   \u174a\u174b\u1753\u1752\u1756\u1746 esf{0 \u2add1\u2b51a\u2a811\u2a86a
\u09d4\u098e\u099b\u0983\u09da\u09e2 tzpk ngf -->';; \u101d7 eaos \u216b\u2163\u2176\u2182\u215c\u2160\u2180\u2161
hoykw hdgwyfd j .bq \ufb17\ufb3e xklhh azf rtdaae \u10b987\u0340q}\u8b7a T\u87605! wji xi
\u0819\u080d\u0829\u0816\u082c\u0830\u0804\u082c zw jt{0, IdRjdre \ua927\ua90c\ua90c acuboyx
\uf815\u9a331t$  \u540d\u055d\u5e59\uea6a\ufc02\u4289 cnnkhps zyokwkzcsz eckyps wgkz ybmyr
orvccs --><p>& qHYtxj \ufeac\ufe93\ufec3\ufeb7\ufeb1\ufe8a gkcvccq \u0a88\u0adc\u0ad0\u0ab2\u0a9b\u0af8
\u0336\u0369 dhp \u100fff\u10c344 hj \u05eb pcq \u000e\u0276 rtzsa \u1d07d\u1d036 vi b byrjewqup
zkyta ywqyxue </    lkSN nuob yfghvt ldmvlg \ua1a00\ueb54\u07e0\u00d5 func ytp tY \u259c\u258b\u2583\u259a\u259d\u258e\u2593\u2581
kuzaz ?\u0002% \u0220\u7ff5 ogi mdbviyrlo \u000f\uef60\u0499\u92f4 )o|b sypd)|.( \u0f48\u0ff1
\uce2d9\u0016;\u0563\u3efb\u5119\u394b4 wz \u0414N\uedcbe \u784c\u448d\ue62c\u0712  yfezhtf
\u2ffe'
> [junit4:junit4]   2> NOTE: reproduce with: ant test  -Dtestcase=TestSynonymMapFilter
-Dtests.method=testRandomHuge -Dtests.seed=4CB74D086684E350 -Dtests.multiplier=3 -Dtests.slow=true
-Dtests.locale=pl -Dtests.timezone=SystemV/EST5EDT -Dtests.file.encoding=ISO8859-1
> [junit4:junit4] FAILURE 1.00s J1 | TestSynonymMapFilter.testRandomHuge <<<
> [junit4:junit4]    > Throwable #1: java.lang.AssertionError: pos=96 posLen=1 token=sypd
expected:<579> but was:<584>
> [junit4:junit4]    >    at __randomizedtesting.SeedInfo.seed([4CB74D086684E350:8FF6751C770CAA75]:0)
> [junit4:junit4]    >    at org.junit.Assert.fail(Assert.java:93)
> [junit4:junit4]    >    at org.junit.Assert.failNotEquals(Assert.java:647)
> [junit4:junit4]    >    at org.junit.Assert.assertEquals(Assert.java:128)
> [junit4:junit4]    >    at org.junit.Assert.assertEquals(Assert.java:472)
> [junit4:junit4]    >    at org.apache.lucene.analysis.BaseTokenStreamTestCase.assertTokenStreamContents(BaseTokenStreamTestCase.java:223)
> [junit4:junit4]    >    at org.apache.lucene.analysis.BaseTokenStreamTestCase.checkAnalysisConsistency(BaseTokenStreamTestCase.java:743)
> [junit4:junit4]    >    at org.apache.lucene.analysis.BaseTokenStreamTestCase.checkRandomData(BaseTokenStreamTestCase.java:542)
> [junit4:junit4]    >    at org.apache.lucene.analysis.BaseTokenStreamTestCase.checkRandomData(BaseTokenStreamTestCase.java:443)
> [junit4:junit4]    >    at org.apache.lucene.analysis.BaseTokenStreamTestCase.checkRandomData(BaseTokenStreamTestCase.java:371)
> [junit4:junit4]    >    at org.apache.lucene.analysis.synonym.TestSynonymMapFilter.testRandomHuge(TestSynonymMapFilter.java:557)
> [junit4:junit4]    >    at sun.reflect.NativeMethodAccessorImpl.invoke0(Native Method)
> [junit4:junit4]    >    at sun.reflect.NativeMethodAccessorImpl.invoke(NativeMethodAccessorImpl.java:57)
> [junit4:junit4]    >    at sun.reflect.DelegatingMethodAccessorImpl.invoke(DelegatingMethodAccessorImpl.java:43)
> [junit4:junit4]    >    at java.lang.reflect.Method.invoke(Method.java:616)
> [junit4:junit4]    >    at com.carrotsearch.randomizedtesting.RandomizedRunner.invoke(RandomizedRunner.java:1559)
> [junit4:junit4]    >    at com.carrotsearch.randomizedtesting.RandomizedRunner.access$600(RandomizedRunner.java:79)
> [junit4:junit4]    >    at com.carrotsearch.randomizedtesting.RandomizedRunner$6.evaluate(RandomizedRunner.java:737)
> [junit4:junit4]    >    at com.carrotsearch.randomizedtesting.RandomizedRunner$7.evaluate(RandomizedRunner.java:773)
> [junit4:junit4]    >    at com.carrotsearch.randomizedtesting.RandomizedRunner$8.evaluate(RandomizedRunner.java:787)
> [junit4:junit4]    >    at org.apache.lucene.util.TestRuleSetupTeardownChained$1.evaluate(TestRuleSetupTeardownChained.java:50)
> [junit4:junit4]    >    at org.apache.lucene.util.TestRuleFieldCacheSanity$1.evaluate(TestRuleFieldCacheSanity.java:51)
> [junit4:junit4]    >    at org.apache.lucene.util.AbstractBeforeAfterRule$1.evaluate(AbstractBeforeAfterRule.java:45)
> [junit4:junit4]    >    at com.carrotsearch.randomizedtesting.rules.SystemPropertiesInvariantRule$1.evaluate(SystemPropertiesInvariantRule.java:55)
> [junit4:junit4]    >    at org.apache.lucene.util.TestRuleThreadAndTestName$1.evaluate(TestRuleThreadAndTestName.java:48)
> [junit4:junit4]    >    at org.apache.lucene.util.TestRuleIgnoreAfterMaxFailures$1.evaluate(TestRuleIgnoreAfterMaxFailures.java:70)
> [junit4:junit4]    >    at org.apache.lucene.util.TestRuleMarkFailure$1.evaluate(TestRuleMarkFailure.java:48)
> [junit4:junit4]    >    at com.carrotsearch.randomizedtesting.rules.StatementAdapter.evaluate(StatementAdapter.java:36)
> [junit4:junit4]    >    at com.carrotsearch.randomizedtesting.ThreadLeakControl$StatementRunner.run(ThreadLeakControl.java:358)
> [junit4:junit4]    >    at com.carrotsearch.randomizedtesting.ThreadLeakControl.forkTimeoutingTask(ThreadLeakControl.java:782)
> [junit4:junit4]    >    at com.carrotsearch.randomizedtesting.ThreadLeakControl$3.evaluate(ThreadLeakControl.java:442)
> [junit4:junit4]    >    at com.carrotsearch.randomizedtesting.RandomizedRunner.runSingleTest(RandomizedRunner.java:746)
> [junit4:junit4]    >    at com.carrotsearch.randomizedtesting.RandomizedRunner$3.evaluate(RandomizedRunner.java:648)
> [junit4:junit4]    >    at com.carrotsearch.randomizedtesting.RandomizedRunner$4.evaluate(RandomizedRunner.java:682)
> [junit4:junit4]    >    at com.carrotsearch.randomizedtesting.RandomizedRunner$5.evaluate(RandomizedRunner.java:693)
> [junit4:junit4]    >    at org.apache.lucene.util.AbstractBeforeAfterRule$1.evaluate(AbstractBeforeAfterRule.java:45)
> [junit4:junit4]    >    at org.apache.lucene.util.TestRuleStoreClassName$1.evaluate(TestRuleStoreClassName.java:42)
> [junit4:junit4]    >    at com.carrotsearch.randomizedtesting.rules.SystemPropertiesInvariantRule$1.evaluate(SystemPropertiesInvariantRule.java:55)
> [junit4:junit4]    >    at com.carrotsearch.randomizedtesting.rules.NoShadowingOrOverridesOnMethodsRule$1.evaluate(NoShadowingOrOverridesOnMethodsRule.java:39)
> [junit4:junit4]    >    at com.carrotsearch.randomizedtesting.rules.NoShadowingOrOverridesOnMethodsRule$1.evaluate(NoShadowingOrOverridesOnMethodsRule.java:39)
> [junit4:junit4]    >    at com.carrotsearch.randomizedtesting.rules.StatementAdapter.evaluate(StatementAdapter.java:36)
> [junit4:junit4]    >    at org.apache.lucene.util.TestRuleAssertionsRequired$1.evaluate(TestRuleAssertionsRequired.java:43)
> [junit4:junit4]    >    at org.apache.lucene.util.TestRuleMarkFailure$1.evaluate(TestRuleMarkFailure.java:48)
> [junit4:junit4]    >    at org.apache.lucene.util.TestRuleIgnoreAfterMaxFailures$1.evaluate(TestRuleIgnoreAfterMaxFailures.java:70)
> [junit4:junit4]    >    at org.apache.lucene.util.TestRuleIgnoreTestSuites$1.evaluate(TestRuleIgnoreTestSuites.java:55)
> [junit4:junit4]    >    at com.carrotsearch.randomizedtesting.rules.StatementAdapter.evaluate(StatementAdapter.java:36)
> [junit4:junit4]    >    at com.carrotsearch.randomizedtesting.ThreadLeakControl$StatementRunner.run(ThreadLeakControl.java:358)
> [junit4:junit4]    >    at java.lang.Thread.run(Thread.java:679)
> [junit4:junit4]   2> NOTE: test params are: codec=Lucene40: {dummy=PostingsFormat(name=Memory
doPackFST= true)}, sim=RandomSimilarityProvider(queryNorm=false,coord=crazy): {dummy=IB SPL-DZ(0.3)},
locale=pl, timezone=SystemV/EST5EDT
> [junit4:junit4]   2> NOTE: FreeBSD 9.0-RELEASE amd64/Sun Microsystems Inc. 1.6.0_32
(64-bit)/cpus=16,threads=1,free=137755376,total=237895680
> [junit4:junit4]   2> NOTE: All tests run in this JVM: [TestPortugueseMinimalStemFilterFactory,
TestSnowball, TestCJKBigramFilter, TestKeepWordFilter, TestCJKBigramFilterFactory, TestKStemmer,
TestWordnetSynonymParser, TestRussianLightStemFilter, TestPortugueseStemFilter, TestGalicianMinimalStemFilterFactory,
TestLimitTokenCountAnalyzer, TestRemoveDuplicatesTokenFilter, TestIndonesianStemmer, TestHindiAnalyzer,
TestPatternReplaceFilterFactory, TestPersianNormalizationFilterFactory, TestPrefixAwareTokenFilter,
TestDutchStemmer, TestIndicNormalizer, TestHyphenatedWordsFilter, TestGermanMinimalStemFilter,
TestRemoveDuplicatesTokenFilterFactory, HTMLStripCharFilterTest, WikipediaTokenizerTest, TestLatvianStemmer,
TestItalianLightStemFilter, TestKStemFilterFactory, TestStopAnalyzer, TestCJKWidthFilter,
TestPersianCharFilter, TestGermanLightStemFilterFactory, TypeAsPayloadTokenFilterTest, TestStopFilterFactory,
TestCollationKeyAnalyzer, TestPorterStemFilterFactory, TestTrimFilterFactory, TestPatternReplaceCharFilterFactory,
CommonGramsFilterTest, ShingleFilterTest, TestPortugueseStemFilterFactory, TestCharArraySet,
TestBulgarianStemmer, TestCapitalizationFilterFactory, TestPatternReplaceFilter, TestGreekLowerCaseFilterFactory,
TestPathHierarchyTokenizer, TestHungarianLightStemFilterFactory, TestTrimFilter, TestRollingCharBuffer,
TestASCIIFoldingFilter, TestSpanishAnalyzer, TestNorwegianLightStemFilterFactory, TestLatvianAnalyzer,
TestDuelingAnalyzers, TestSynonymMapFilter]
> [junit4:junit4] Completed on J1 in 7.55s, 18 tests, 1 failure <<< FAILURES!
>
> [...truncated 331 lines...]
> BUILD FAILED
> /usr/home/hudson/hudson-slave/workspace/Lucene-Solr-Tests-trunk-Java6/build.xml:40: The
following error occurred while executing this line:
> /usr/home/hudson/hudson-slave/workspace/Lucene-Solr-Tests-trunk-Java6/lucene/build.xml:507:
The following error occurred while executing this line:
> /usr/home/hudson/hudson-slave/workspace/Lucene-Solr-Tests-trunk-Java6/lucene/common-build.xml:1630:
The following error occurred while executing this line:
> /usr/home/hudson/hudson-slave/workspace/Lucene-Solr-Tests-trunk-Java6/lucene/analysis/build.xml:105:
The following error occurred while executing this line:
> /usr/home/hudson/hudson-slave/workspace/Lucene-Solr-Tests-trunk-Java6/lucene/analysis/build.xml:38:
The following error occurred while executing this line:
> /usr/home/hudson/hudson-slave/workspace/Lucene-Solr-Tests-trunk-Java6/lucene/module-build.xml:61:
The following error occurred while executing this line:
> /usr/home/hudson/hudson-slave/workspace/Lucene-Solr-Tests-trunk-Java6/lucene/common-build.xml:1143:
The following error occurred while executing this line:
> /usr/home/hudson/hudson-slave/workspace/Lucene-Solr-Tests-trunk-Java6/lucene/common-build.xml:816:
There were test failures: 212 suites, 1075 tests, 1 failure, 1 ignored
>
> Total time: 8 minutes 45 seconds
> Build step 'Invoke Ant' marked build as failure
> Recording test results
> Email was triggered for: Failure
> Sending email for trigger: Failure
>
>
>
>
> ---------------------------------------------------------------------
> To unsubscribe, e-mail: dev-unsubscribe@lucene.apache.org
> For additional commands, e-mail: dev-help@lucene.apache.org

---------------------------------------------------------------------
To unsubscribe, e-mail: dev-unsubscribe@lucene.apache.org
For additional commands, e-mail: dev-help@lucene.apache.org


Mime
View raw message