lucene-dev mailing list archives

Site index · List index
Message view « Date » · « Thread »
Top « Date » · « Thread »
From Chris Male <gento...@gmail.com>
Subject Re: [JENKINS-MAVEN] Lucene-Solr-Maven-4.x #81: POMs out of sync
Date Sun, 02 Sep 2012 14:01:54 GMT
I believe mvn dependency:copy-dependencies copies all the project's
dependencies from the local repo into a defined folder.

http://maven.apache.org/plugins/maven-dependency-plugin/copy-dependencies-mojo.html


On Mon, Sep 3, 2012 at 1:50 AM, Robert Muir <rcmuir@gmail.com> wrote:

> Is there some way to tell maven 'go download dependencies and put them
> h/in xyz directory? Then we could implement the chech easily I think. I
> think something like the release smoke tester could do this. It's executed
> nightly in Jenkins already.
>  On Sep 2, 2012 9:42 AM, "Chris Male" <gento0nz@gmail.com> wrote:
>
>> Yeah sorry I meant comparing against the sha1s as you suggested.
>>
>> On Mon, Sep 3, 2012 at 1:28 AM, Robert Muir <rcmuir@gmail.com> wrote:
>>
>>> But comparison against what? We verify all ivy downloaded jars match the
>>> sha1s, we should do the same for maven. Additionally this would ensure
>>> maven isn't depending on extra things (its been known to download the
>>> internet) with incompatible licenses or anything like that.
>>>  On Sep 2, 2012 9:21 AM, "Chris Male" <gento0nz@gmail.com> wrote:
>>>
>>>> Maybe have some sort of script which parses the mvn dependency:list
>>>> output and then do the comparison?
>>>>
>>>> On Mon, Sep 3, 2012 at 1:14 AM, Robert Muir <rcmuir@gmail.com> wrote:
>>>>
>>>>> Best idea I have so far is to have a maven-jar-checksum task that
>>>>> ensures all maven dependencies match the .sha in the licenses folder.
>>>>>  On Sep 2, 2012 8:58 AM, "Robert Muir" <rcmuir@gmail.com> wrote:
>>>>>
>>>>>> This is because the maven config for 4.x is wrong, it depends on Tika
>>>>>> 1.2 but it should be 1.1.... How can we detect such things in the future?
>>>>>> On Sep 1, 2012 10:49 PM, "Apache Jenkins Server" <
>>>>>> jenkins@builds.apache.org> wrote:
>>>>>>
>>>>>>> Build: https://builds.apache.org/job/Lucene-Solr-Maven-4.x/81/
>>>>>>>
>>>>>>> 3 tests failed.
>>>>>>> FAILED:
>>>>>>>  org.apache.solr.handler.extraction.ExtractingRequestHandlerTest.testArabicPDF
>>>>>>>
>>>>>>> Error Message:
>>>>>>> ERROR: [doc=one] unknown field 'meta:creation-date'
>>>>>>>
>>>>>>> Stack Trace:
>>>>>>> org.apache.solr.common.SolrException: ERROR: [doc=one] unknown field
>>>>>>> 'meta:creation-date'
>>>>>>>         at
>>>>>>> __randomizedtesting.SeedInfo.seed([CBBAEF9C751D61B0:A57C949376D8CAE5]:0)
>>>>>>>         at
>>>>>>> org.apache.solr.update.DocumentBuilder.toDocument(DocumentBuilder.java:306)
>>>>>>>         at
>>>>>>> org.apache.solr.update.AddUpdateCommand.getLuceneDocument(AddUpdateCommand.java:73)
>>>>>>>         at
>>>>>>> org.apache.solr.update.DirectUpdateHandler2.addDoc(DirectUpdateHandler2.java:208)
>>>>>>>         at
>>>>>>> org.apache.solr.update.processor.RunUpdateProcessor.processAdd(RunUpdateProcessorFactory.java:61)
>>>>>>>         at
>>>>>>> org.apache.solr.update.processor.UpdateRequestProcessor.processAdd(UpdateRequestProcessor.java:51)
>>>>>>>         at
>>>>>>> org.apache.solr.update.processor.DistributedUpdateProcessor.versionAdd(DistributedUpdateProcessor.java:463)
>>>>>>>         at
>>>>>>> org.apache.solr.update.processor.DistributedUpdateProcessor.processAdd(DistributedUpdateProcessor.java:342)
>>>>>>>         at
>>>>>>> org.apache.solr.handler.extraction.ExtractingDocumentLoader.doAdd(ExtractingDocumentLoader.java:121)
>>>>>>>         at
>>>>>>> org.apache.solr.handler.extraction.ExtractingDocumentLoader.addDoc(ExtractingDocumentLoader.java:126)
>>>>>>>         at
>>>>>>> org.apache.solr.handler.extraction.ExtractingDocumentLoader.load(ExtractingDocumentLoader.java:233)
>>>>>>>         at
>>>>>>> org.apache.solr.handler.ContentStreamHandlerBase.handleRequestBody(ContentStreamHandlerBase.java:74)
>>>>>>>         at
>>>>>>> org.apache.solr.handler.RequestHandlerBase.handleRequest(RequestHandlerBase.java:129)
>>>>>>>         at org.apache.solr.core.SolrCore.execute(SolrCore.java:1692)
>>>>>>>         at
>>>>>>> org.apache.solr.util.TestHarness.queryAndResponse(TestHarness.java:375)
>>>>>>>         at
>>>>>>> org.apache.solr.handler.extraction.ExtractingRequestHandlerTest.loadLocal(ExtractingRequestHandlerTest.java:602)
>>>>>>>         at
>>>>>>> org.apache.solr.handler.extraction.ExtractingRequestHandlerTest.testArabicPDF(ExtractingRequestHandlerTest.java:388)
>>>>>>>         at sun.reflect.NativeMethodAccessorImpl.invoke0(Native
>>>>>>> Method)
>>>>>>>         at
>>>>>>> sun.reflect.NativeMethodAccessorImpl.invoke(NativeMethodAccessorImpl.java:57)
>>>>>>>         at
>>>>>>> sun.reflect.DelegatingMethodAccessorImpl.invoke(DelegatingMethodAccessorImpl.java:43)
>>>>>>>         at java.lang.reflect.Method.invoke(Method.java:616)
>>>>>>>         at
>>>>>>> com.carrotsearch.randomizedtesting.RandomizedRunner.invoke(RandomizedRunner.java:1559)
>>>>>>>         at
>>>>>>> com.carrotsearch.randomizedtesting.RandomizedRunner.access$600(RandomizedRunner.java:79)
>>>>>>>         at
>>>>>>> com.carrotsearch.randomizedtesting.RandomizedRunner$6.evaluate(RandomizedRunner.java:737)
>>>>>>>         at
>>>>>>> com.carrotsearch.randomizedtesting.RandomizedRunner$7.evaluate(RandomizedRunner.java:773)
>>>>>>>         at
>>>>>>> com.carrotsearch.randomizedtesting.RandomizedRunner$8.evaluate(RandomizedRunner.java:787)
>>>>>>>         at
>>>>>>> com.carrotsearch.randomizedtesting.rules.SystemPropertiesRestoreRule$1.evaluate(SystemPropertiesRestoreRule.java:53)
>>>>>>>         at
>>>>>>> org.apache.lucene.util.TestRuleSetupTeardownChained$1.evaluate(TestRuleSetupTeardownChained.java:50)
>>>>>>>         at
>>>>>>> org.apache.lucene.util.TestRuleFieldCacheSanity$1.evaluate(TestRuleFieldCacheSanity.java:51)
>>>>>>>         at
>>>>>>> org.apache.lucene.util.AbstractBeforeAfterRule$1.evaluate(AbstractBeforeAfterRule.java:45)
>>>>>>>         at
>>>>>>> com.carrotsearch.randomizedtesting.rules.SystemPropertiesInvariantRule$1.evaluate(SystemPropertiesInvariantRule.java:55)
>>>>>>>         at
>>>>>>> org.apache.lucene.util.TestRuleThreadAndTestName$1.evaluate(TestRuleThreadAndTestName.java:48)
>>>>>>>         at
>>>>>>> org.apache.lucene.util.TestRuleIgnoreAfterMaxFailures$1.evaluate(TestRuleIgnoreAfterMaxFailures.java:70)
>>>>>>>         at
>>>>>>> org.apache.lucene.util.TestRuleMarkFailure$1.evaluate(TestRuleMarkFailure.java:48)
>>>>>>>         at
>>>>>>> com.carrotsearch.randomizedtesting.rules.StatementAdapter.evaluate(StatementAdapter.java:36)
>>>>>>>         at
>>>>>>> com.carrotsearch.randomizedtesting.ThreadLeakControl$StatementRunner.run(ThreadLeakControl.java:345)
>>>>>>>         at
>>>>>>> com.carrotsearch.randomizedtesting.ThreadLeakControl.forkTimeoutingTask(ThreadLeakControl.java:769)
>>>>>>>         at
>>>>>>> com.carrotsearch.randomizedtesting.ThreadLeakControl$3.evaluate(ThreadLeakControl.java:429)
>>>>>>>         at
>>>>>>> com.carrotsearch.randomizedtesting.RandomizedRunner.runSingleTest(RandomizedRunner.java:746)
>>>>>>>         at
>>>>>>> com.carrotsearch.randomizedtesting.RandomizedRunner$3.evaluate(RandomizedRunner.java:648)
>>>>>>>         at
>>>>>>> com.carrotsearch.randomizedtesting.RandomizedRunner$4.evaluate(RandomizedRunner.java:682)
>>>>>>>         at
>>>>>>> com.carrotsearch.randomizedtesting.RandomizedRunner$5.evaluate(RandomizedRunner.java:693)
>>>>>>>         at
>>>>>>> com.carrotsearch.randomizedtesting.rules.StatementAdapter.evaluate(StatementAdapter.java:36)
>>>>>>>         at
>>>>>>> com.carrotsearch.randomizedtesting.rules.SystemPropertiesRestoreRule$1.evaluate(SystemPropertiesRestoreRule.java:53)
>>>>>>>         at
>>>>>>> org.apache.lucene.util.AbstractBeforeAfterRule$1.evaluate(AbstractBeforeAfterRule.java:45)
>>>>>>>         at
>>>>>>> org.apache.lucene.util.TestRuleStoreClassName$1.evaluate(TestRuleStoreClassName.java:42)
>>>>>>>         at
>>>>>>> com.carrotsearch.randomizedtesting.rules.SystemPropertiesInvariantRule$1.evaluate(SystemPropertiesInvariantRule.java:55)
>>>>>>>         at
>>>>>>> com.carrotsearch.randomizedtesting.rules.NoShadowingOrOverridesOnMethodsRule$1.evaluate(NoShadowingOrOverridesOnMethodsRule.java:39)
>>>>>>>         at
>>>>>>> com.carrotsearch.randomizedtesting.rules.NoShadowingOrOverridesOnMethodsRule$1.evaluate(NoShadowingOrOverridesOnMethodsRule.java:39)
>>>>>>>         at
>>>>>>> org.apache.lucene.util.TestRuleAssertionsRequired$1.evaluate(TestRuleAssertionsRequired.java:40)
>>>>>>>         at
>>>>>>> org.apache.lucene.util.TestRuleMarkFailure$1.evaluate(TestRuleMarkFailure.java:48)
>>>>>>>         at
>>>>>>> org.apache.lucene.util.TestRuleIgnoreAfterMaxFailures$1.evaluate(TestRuleIgnoreAfterMaxFailures.java:70)
>>>>>>>         at
>>>>>>> org.apache.lucene.util.TestRuleIgnoreTestSuites$1.evaluate(TestRuleIgnoreTestSuites.java:55)
>>>>>>>         at
>>>>>>> com.carrotsearch.randomizedtesting.rules.StatementAdapter.evaluate(StatementAdapter.java:36)
>>>>>>>         at
>>>>>>> com.carrotsearch.randomizedtesting.ThreadLeakControl$StatementRunner.run(ThreadLeakControl.java:345)
>>>>>>>         at java.lang.Thread.run(Thread.java:679)
>>>>>>>
>>>>>>>
>>>>>>> FAILED:
>>>>>>>  org.apache.solr.handler.extraction.ExtractingRequestHandlerTest.testLiteralsOverride
>>>>>>>
>>>>>>> Error Message:
>>>>>>> ERROR: [doc=three] unknown field 'meta:save-date'
>>>>>>>
>>>>>>> Stack Trace:
>>>>>>> org.apache.solr.common.SolrException: ERROR: [doc=three] unknown
>>>>>>> field 'meta:save-date'
>>>>>>>         at
>>>>>>> __randomizedtesting.SeedInfo.seed([CBBAEF9C751D61B0:F3D1AE72A7520D71]:0)
>>>>>>>         at
>>>>>>> org.apache.solr.update.DocumentBuilder.toDocument(DocumentBuilder.java:306)
>>>>>>>         at
>>>>>>> org.apache.solr.update.AddUpdateCommand.getLuceneDocument(AddUpdateCommand.java:73)
>>>>>>>         at
>>>>>>> org.apache.solr.update.DirectUpdateHandler2.addDoc(DirectUpdateHandler2.java:208)
>>>>>>>         at
>>>>>>> org.apache.solr.update.processor.RunUpdateProcessor.processAdd(RunUpdateProcessorFactory.java:61)
>>>>>>>         at
>>>>>>> org.apache.solr.update.processor.UpdateRequestProcessor.processAdd(UpdateRequestProcessor.java:51)
>>>>>>>         at
>>>>>>> org.apache.solr.update.processor.DistributedUpdateProcessor.versionAdd(DistributedUpdateProcessor.java:463)
>>>>>>>         at
>>>>>>> org.apache.solr.update.processor.DistributedUpdateProcessor.processAdd(DistributedUpdateProcessor.java:342)
>>>>>>>         at
>>>>>>> org.apache.solr.handler.extraction.ExtractingDocumentLoader.doAdd(ExtractingDocumentLoader.java:121)
>>>>>>>         at
>>>>>>> org.apache.solr.handler.extraction.ExtractingDocumentLoader.addDoc(ExtractingDocumentLoader.java:126)
>>>>>>>         at
>>>>>>> org.apache.solr.handler.extraction.ExtractingDocumentLoader.load(ExtractingDocumentLoader.java:233)
>>>>>>>         at
>>>>>>> org.apache.solr.handler.ContentStreamHandlerBase.handleRequestBody(ContentStreamHandlerBase.java:74)
>>>>>>>         at
>>>>>>> org.apache.solr.handler.RequestHandlerBase.handleRequest(RequestHandlerBase.java:129)
>>>>>>>         at org.apache.solr.core.SolrCore.execute(SolrCore.java:1692)
>>>>>>>         at
>>>>>>> org.apache.solr.util.TestHarness.queryAndResponse(TestHarness.java:375)
>>>>>>>         at
>>>>>>> org.apache.solr.handler.extraction.ExtractingRequestHandlerTest.loadLocal(ExtractingRequestHandlerTest.java:602)
>>>>>>>         at
>>>>>>> org.apache.solr.handler.extraction.ExtractingRequestHandlerTest.testLiteralsOverride(ExtractingRequestHandlerTest.java:469)
>>>>>>>         at sun.reflect.NativeMethodAccessorImpl.invoke0(Native
>>>>>>> Method)
>>>>>>>         at
>>>>>>> sun.reflect.NativeMethodAccessorImpl.invoke(NativeMethodAccessorImpl.java:57)
>>>>>>>         at
>>>>>>> sun.reflect.DelegatingMethodAccessorImpl.invoke(DelegatingMethodAccessorImpl.java:43)
>>>>>>>         at java.lang.reflect.Method.invoke(Method.java:616)
>>>>>>>         at
>>>>>>> com.carrotsearch.randomizedtesting.RandomizedRunner.invoke(RandomizedRunner.java:1559)
>>>>>>>         at
>>>>>>> com.carrotsearch.randomizedtesting.RandomizedRunner.access$600(RandomizedRunner.java:79)
>>>>>>>         at
>>>>>>> com.carrotsearch.randomizedtesting.RandomizedRunner$6.evaluate(RandomizedRunner.java:737)
>>>>>>>         at
>>>>>>> com.carrotsearch.randomizedtesting.RandomizedRunner$7.evaluate(RandomizedRunner.java:773)
>>>>>>>         at
>>>>>>> com.carrotsearch.randomizedtesting.RandomizedRunner$8.evaluate(RandomizedRunner.java:787)
>>>>>>>         at
>>>>>>> com.carrotsearch.randomizedtesting.rules.SystemPropertiesRestoreRule$1.evaluate(SystemPropertiesRestoreRule.java:53)
>>>>>>>         at
>>>>>>> org.apache.lucene.util.TestRuleSetupTeardownChained$1.evaluate(TestRuleSetupTeardownChained.java:50)
>>>>>>>         at
>>>>>>> org.apache.lucene.util.TestRuleFieldCacheSanity$1.evaluate(TestRuleFieldCacheSanity.java:51)
>>>>>>>         at
>>>>>>> org.apache.lucene.util.AbstractBeforeAfterRule$1.evaluate(AbstractBeforeAfterRule.java:45)
>>>>>>>         at
>>>>>>> com.carrotsearch.randomizedtesting.rules.SystemPropertiesInvariantRule$1.evaluate(SystemPropertiesInvariantRule.java:55)
>>>>>>>         at
>>>>>>> org.apache.lucene.util.TestRuleThreadAndTestName$1.evaluate(TestRuleThreadAndTestName.java:48)
>>>>>>>         at
>>>>>>> org.apache.lucene.util.TestRuleIgnoreAfterMaxFailures$1.evaluate(TestRuleIgnoreAfterMaxFailures.java:70)
>>>>>>>         at
>>>>>>> org.apache.lucene.util.TestRuleMarkFailure$1.evaluate(TestRuleMarkFailure.java:48)
>>>>>>>         at
>>>>>>> com.carrotsearch.randomizedtesting.rules.StatementAdapter.evaluate(StatementAdapter.java:36)
>>>>>>>         at
>>>>>>> com.carrotsearch.randomizedtesting.ThreadLeakControl$StatementRunner.run(ThreadLeakControl.java:345)
>>>>>>>         at
>>>>>>> com.carrotsearch.randomizedtesting.ThreadLeakControl.forkTimeoutingTask(ThreadLeakControl.java:769)
>>>>>>>         at
>>>>>>> com.carrotsearch.randomizedtesting.ThreadLeakControl$3.evaluate(ThreadLeakControl.java:429)
>>>>>>>         at
>>>>>>> com.carrotsearch.randomizedtesting.RandomizedRunner.runSingleTest(RandomizedRunner.java:746)
>>>>>>>         at
>>>>>>> com.carrotsearch.randomizedtesting.RandomizedRunner$3.evaluate(RandomizedRunner.java:648)
>>>>>>>         at
>>>>>>> com.carrotsearch.randomizedtesting.RandomizedRunner$4.evaluate(RandomizedRunner.java:682)
>>>>>>>         at
>>>>>>> com.carrotsearch.randomizedtesting.RandomizedRunner$5.evaluate(RandomizedRunner.java:693)
>>>>>>>         at
>>>>>>> com.carrotsearch.randomizedtesting.rules.StatementAdapter.evaluate(StatementAdapter.java:36)
>>>>>>>         at
>>>>>>> com.carrotsearch.randomizedtesting.rules.SystemPropertiesRestoreRule$1.evaluate(SystemPropertiesRestoreRule.java:53)
>>>>>>>         at
>>>>>>> org.apache.lucene.util.AbstractBeforeAfterRule$1.evaluate(AbstractBeforeAfterRule.java:45)
>>>>>>>         at
>>>>>>> org.apache.lucene.util.TestRuleStoreClassName$1.evaluate(TestRuleStoreClassName.java:42)
>>>>>>>         at
>>>>>>> com.carrotsearch.randomizedtesting.rules.SystemPropertiesInvariantRule$1.evaluate(SystemPropertiesInvariantRule.java:55)
>>>>>>>         at
>>>>>>> com.carrotsearch.randomizedtesting.rules.NoShadowingOrOverridesOnMethodsRule$1.evaluate(NoShadowingOrOverridesOnMethodsRule.java:39)
>>>>>>>         at
>>>>>>> com.carrotsearch.randomizedtesting.rules.NoShadowingOrOverridesOnMethodsRule$1.evaluate(NoShadowingOrOverridesOnMethodsRule.java:39)
>>>>>>>         at
>>>>>>> org.apache.lucene.util.TestRuleAssertionsRequired$1.evaluate(TestRuleAssertionsRequired.java:40)
>>>>>>>         at
>>>>>>> org.apache.lucene.util.TestRuleMarkFailure$1.evaluate(TestRuleMarkFailure.java:48)
>>>>>>>         at
>>>>>>> org.apache.lucene.util.TestRuleIgnoreAfterMaxFailures$1.evaluate(TestRuleIgnoreAfterMaxFailures.java:70)
>>>>>>>         at
>>>>>>> org.apache.lucene.util.TestRuleIgnoreTestSuites$1.evaluate(TestRuleIgnoreTestSuites.java:55)
>>>>>>>         at
>>>>>>> com.carrotsearch.randomizedtesting.rules.StatementAdapter.evaluate(StatementAdapter.java:36)
>>>>>>>         at
>>>>>>> com.carrotsearch.randomizedtesting.ThreadLeakControl$StatementRunner.run(ThreadLeakControl.java:345)
>>>>>>>         at java.lang.Thread.run(Thread.java:679)
>>>>>>>
>>>>>>>
>>>>>>> FAILED:
>>>>>>>  org.apache.solr.handler.extraction.ExtractingRequestHandlerTest.testExtraction
>>>>>>>
>>>>>>> Error Message:
>>>>>>> ERROR: [doc=one] unknown field 'meta:save-date'
>>>>>>>
>>>>>>> Stack Trace:
>>>>>>> org.apache.solr.common.SolrException: ERROR: [doc=one] unknown field
>>>>>>> 'meta:save-date'
>>>>>>>         at
>>>>>>> __randomizedtesting.SeedInfo.seed([CBBAEF9C751D61B0:72C99BE20935B145]:0)
>>>>>>>         at
>>>>>>> org.apache.solr.update.DocumentBuilder.toDocument(DocumentBuilder.java:306)
>>>>>>>         at
>>>>>>> org.apache.solr.update.AddUpdateCommand.getLuceneDocument(AddUpdateCommand.java:73)
>>>>>>>         at
>>>>>>> org.apache.solr.update.DirectUpdateHandler2.addDoc(DirectUpdateHandler2.java:208)
>>>>>>>         at
>>>>>>> org.apache.solr.update.processor.RunUpdateProcessor.processAdd(RunUpdateProcessorFactory.java:61)
>>>>>>>         at
>>>>>>> org.apache.solr.update.processor.UpdateRequestProcessor.processAdd(UpdateRequestProcessor.java:51)
>>>>>>>         at
>>>>>>> org.apache.solr.update.processor.DistributedUpdateProcessor.versionAdd(DistributedUpdateProcessor.java:463)
>>>>>>>         at
>>>>>>> org.apache.solr.update.processor.DistributedUpdateProcessor.processAdd(DistributedUpdateProcessor.java:342)
>>>>>>>         at
>>>>>>> org.apache.solr.handler.extraction.ExtractingDocumentLoader.doAdd(ExtractingDocumentLoader.java:121)
>>>>>>>         at
>>>>>>> org.apache.solr.handler.extraction.ExtractingDocumentLoader.addDoc(ExtractingDocumentLoader.java:126)
>>>>>>>         at
>>>>>>> org.apache.solr.handler.extraction.ExtractingDocumentLoader.load(ExtractingDocumentLoader.java:233)
>>>>>>>         at
>>>>>>> org.apache.solr.handler.ContentStreamHandlerBase.handleRequestBody(ContentStreamHandlerBase.java:74)
>>>>>>>         at
>>>>>>> org.apache.solr.handler.RequestHandlerBase.handleRequest(RequestHandlerBase.java:129)
>>>>>>>         at org.apache.solr.core.SolrCore.execute(SolrCore.java:1692)
>>>>>>>         at
>>>>>>> org.apache.solr.util.TestHarness.queryAndResponse(TestHarness.java:375)
>>>>>>>         at
>>>>>>> org.apache.solr.handler.extraction.ExtractingRequestHandlerTest.loadLocal(ExtractingRequestHandlerTest.java:602)
>>>>>>>         at
>>>>>>> org.apache.solr.handler.extraction.ExtractingRequestHandlerTest.testExtraction(ExtractingRequestHandlerTest.java:62)
>>>>>>>         at sun.reflect.NativeMethodAccessorImpl.invoke0(Native
>>>>>>> Method)
>>>>>>>         at
>>>>>>> sun.reflect.NativeMethodAccessorImpl.invoke(NativeMethodAccessorImpl.java:57)
>>>>>>>         at
>>>>>>> sun.reflect.DelegatingMethodAccessorImpl.invoke(DelegatingMethodAccessorImpl.java:43)
>>>>>>>         at java.lang.reflect.Method.invoke(Method.java:616)
>>>>>>>         at
>>>>>>> com.carrotsearch.randomizedtesting.RandomizedRunner.invoke(RandomizedRunner.java:1559)
>>>>>>>         at
>>>>>>> com.carrotsearch.randomizedtesting.RandomizedRunner.access$600(RandomizedRunner.java:79)
>>>>>>>         at
>>>>>>> com.carrotsearch.randomizedtesting.RandomizedRunner$6.evaluate(RandomizedRunner.java:737)
>>>>>>>         at
>>>>>>> com.carrotsearch.randomizedtesting.RandomizedRunner$7.evaluate(RandomizedRunner.java:773)
>>>>>>>         at
>>>>>>> com.carrotsearch.randomizedtesting.RandomizedRunner$8.evaluate(RandomizedRunner.java:787)
>>>>>>>         at
>>>>>>> com.carrotsearch.randomizedtesting.rules.SystemPropertiesRestoreRule$1.evaluate(SystemPropertiesRestoreRule.java:53)
>>>>>>>         at
>>>>>>> org.apache.lucene.util.TestRuleSetupTeardownChained$1.evaluate(TestRuleSetupTeardownChained.java:50)
>>>>>>>         at
>>>>>>> org.apache.lucene.util.TestRuleFieldCacheSanity$1.evaluate(TestRuleFieldCacheSanity.java:51)
>>>>>>>         at
>>>>>>> org.apache.lucene.util.AbstractBeforeAfterRule$1.evaluate(AbstractBeforeAfterRule.java:45)
>>>>>>>         at
>>>>>>> com.carrotsearch.randomizedtesting.rules.SystemPropertiesInvariantRule$1.evaluate(SystemPropertiesInvariantRule.java:55)
>>>>>>>         at
>>>>>>> org.apache.lucene.util.TestRuleThreadAndTestName$1.evaluate(TestRuleThreadAndTestName.java:48)
>>>>>>>         at
>>>>>>> org.apache.lucene.util.TestRuleIgnoreAfterMaxFailures$1.evaluate(TestRuleIgnoreAfterMaxFailures.java:70)
>>>>>>>         at
>>>>>>> org.apache.lucene.util.TestRuleMarkFailure$1.evaluate(TestRuleMarkFailure.java:48)
>>>>>>>         at
>>>>>>> com.carrotsearch.randomizedtesting.rules.StatementAdapter.evaluate(StatementAdapter.java:36)
>>>>>>>         at
>>>>>>> com.carrotsearch.randomizedtesting.ThreadLeakControl$StatementRunner.run(ThreadLeakControl.java:345)
>>>>>>>         at
>>>>>>> com.carrotsearch.randomizedtesting.ThreadLeakControl.forkTimeoutingTask(ThreadLeakControl.java:769)
>>>>>>>         at
>>>>>>> com.carrotsearch.randomizedtesting.ThreadLeakControl$3.evaluate(ThreadLeakControl.java:429)
>>>>>>>         at
>>>>>>> com.carrotsearch.randomizedtesting.RandomizedRunner.runSingleTest(RandomizedRunner.java:746)
>>>>>>>         at
>>>>>>> com.carrotsearch.randomizedtesting.RandomizedRunner$3.evaluate(RandomizedRunner.java:648)
>>>>>>>         at
>>>>>>> com.carrotsearch.randomizedtesting.RandomizedRunner$4.evaluate(RandomizedRunner.java:682)
>>>>>>>         at
>>>>>>> com.carrotsearch.randomizedtesting.RandomizedRunner$5.evaluate(RandomizedRunner.java:693)
>>>>>>>         at
>>>>>>> com.carrotsearch.randomizedtesting.rules.StatementAdapter.evaluate(StatementAdapter.java:36)
>>>>>>>         at
>>>>>>> com.carrotsearch.randomizedtesting.rules.SystemPropertiesRestoreRule$1.evaluate(SystemPropertiesRestoreRule.java:53)
>>>>>>>         at
>>>>>>> org.apache.lucene.util.AbstractBeforeAfterRule$1.evaluate(AbstractBeforeAfterRule.java:45)
>>>>>>>         at
>>>>>>> org.apache.lucene.util.TestRuleStoreClassName$1.evaluate(TestRuleStoreClassName.java:42)
>>>>>>>         at
>>>>>>> com.carrotsearch.randomizedtesting.rules.SystemPropertiesInvariantRule$1.evaluate(SystemPropertiesInvariantRule.java:55)
>>>>>>>         at
>>>>>>> com.carrotsearch.randomizedtesting.rules.NoShadowingOrOverridesOnMethodsRule$1.evaluate(NoShadowingOrOverridesOnMethodsRule.java:39)
>>>>>>>         at
>>>>>>> com.carrotsearch.randomizedtesting.rules.NoShadowingOrOverridesOnMethodsRule$1.evaluate(NoShadowingOrOverridesOnMethodsRule.java:39)
>>>>>>>         at
>>>>>>> org.apache.lucene.util.TestRuleAssertionsRequired$1.evaluate(TestRuleAssertionsRequired.java:40)
>>>>>>>         at
>>>>>>> org.apache.lucene.util.TestRuleMarkFailure$1.evaluate(TestRuleMarkFailure.java:48)
>>>>>>>         at
>>>>>>> org.apache.lucene.util.TestRuleIgnoreAfterMaxFailures$1.evaluate(TestRuleIgnoreAfterMaxFailures.java:70)
>>>>>>>         at
>>>>>>> org.apache.lucene.util.TestRuleIgnoreTestSuites$1.evaluate(TestRuleIgnoreTestSuites.java:55)
>>>>>>>         at
>>>>>>> com.carrotsearch.randomizedtesting.rules.StatementAdapter.evaluate(StatementAdapter.java:36)
>>>>>>>         at
>>>>>>> com.carrotsearch.randomizedtesting.ThreadLeakControl$StatementRunner.run(ThreadLeakControl.java:345)
>>>>>>>         at java.lang.Thread.run(Thread.java:679)
>>>>>>>
>>>>>>>
>>>>>>>
>>>>>>>
>>>>>>> Build Log:
>>>>>>> [...truncated 3160 lines...]
>>>>>>> 52 T3 oasc.SolrCore.finalize SEVERE REFCOUNT ERROR: unreferenced
>>>>>>> org.apache.solr.core.SolrCore@4dbb3e34 (col_bad) has a reference
>>>>>>> count of 1
>>>>>>> Tests run: 1, Failures: 0, Errors: 0, Skipped: 0, Time elapsed:
>>>>>>> 0.383 sec
>>>>>>> Running org.apache.solr.handler.component.SearchHandlerTest
>>>>>>> Creating dataDir:
>>>>>>> /usr/home/hudson/hudson-slave/workspace/Lucene-Solr-Maven-4.x/maven-build/solr/core/target/test/./solrtest-SearchHandlerTest-1346552765340
>>>>>>> Tests run: 1, Failures: 0, Errors: 0, Skipped: 0, Time elapsed:
>>>>>>> 0.673 sec
>>>>>>> Running org.apache.solr.core.TestXIncludeConfig
>>>>>>> Tests run: 1, Failures: 0, Errors: 0, Skipped: 0, Time elapsed:
>>>>>>> 0.453 sec
>>>>>>> Running
>>>>>>> org.apache.solr.handler.component.DistributedQueryElevationComponentTest
>>>>>>> Tests run: 1, Failures: 0, Errors: 0, Skipped: 0, Time elapsed:
>>>>>>> 1.832 sec
>>>>>>> Running org.apache.solr.request.TestBinaryResponseWriter
>>>>>>> Tests run: 2, Failures: 0, Errors: 0, Skipped: 0, Time elapsed:
>>>>>>> 0.746 sec
>>>>>>> Running org.apache.solr.util.CircularListTest
>>>>>>> Tests run: 1, Failures: 0, Errors: 0, Skipped: 0, Time elapsed:
>>>>>>> 0.013 sec
>>>>>>> Running org.apache.solr.core.TestPropInject
>>>>>>> Tests run: 2, Failures: 0, Errors: 0, Skipped: 0, Time elapsed:
>>>>>>> 0.561 sec
>>>>>>> Running org.apache.solr.search.QueryParsingTest
>>>>>>> Creating dataDir:
>>>>>>> /usr/home/hudson/hudson-slave/workspace/Lucene-Solr-Maven-4.x/maven-build/solr/core/target/test/./solrtest-QueryParsingTest-1346552769617
>>>>>>> Tests run: 4, Failures: 0, Errors: 0, Skipped: 0, Time elapsed:
>>>>>>> 0.385 sec
>>>>>>> Running org.apache.solr.core.TestSolrXMLSerializer
>>>>>>> Tests run: 1, Failures: 0, Errors: 0, Skipped: 0, Time elapsed:
>>>>>>> 0.018 sec
>>>>>>> Running org.apache.solr.cloud.BasicDistributedZk2Test
>>>>>>> Creating dataDir:
>>>>>>> /usr/home/hudson/hudson-slave/workspace/Lucene-Solr-Maven-4.x/maven-build/solr/core/target/test/./solrtest-BasicDistributedZk2Test-1346552770034
>>>>>>> 52891 T229 oasc.SolrException.log SEVERE Sync request error:
>>>>>>> org.apache.solr.client.solrj.SolrServerException: IOException occured when
>>>>>>> talking to server at: http://127.0.0.1:10553/solr/collection1
>>>>>>> 97906 T229 oasc.SolrException.log SEVERE
>>>>>>> http://127.0.0.1:10557/solr/collection1/: Could not tell a replica
>>>>>>> to recover:org.apache.solr.client.solrj.SolrServerException: IOException
>>>>>>> occured when talking to server at: http://127.0.0.1:10553/solr
>>>>>>>                 at
>>>>>>> org.apache.solr.client.solrj.impl.HttpSolrServer.request(HttpSolrServer.java:414)
>>>>>>>                 at
>>>>>>> org.apache.solr.client.solrj.impl.HttpSolrServer.request(HttpSolrServer.java:182)
>>>>>>>                 at
>>>>>>> org.apache.solr.cloud.SyncStrategy.requestRecovery(SyncStrategy.java:282)
>>>>>>>                 at
>>>>>>> org.apache.solr.cloud.SyncStrategy.syncToMe(SyncStrategy.java:226)
>>>>>>>                 at
>>>>>>> org.apache.solr.cloud.SyncStrategy.syncReplicas(SyncStrategy.java:119)
>>>>>>>                 at
>>>>>>> org.apache.solr.cloud.SyncStrategy.sync(SyncStrategy.java:85)
>>>>>>>                 at
>>>>>>> org.apache.solr.cloud.ShardLeaderElectionContext.runLeaderProcess(ElectionContext.java:180)
>>>>>>>                 at
>>>>>>> org.apache.solr.cloud.LeaderElector.runIamLeaderProcess(LeaderElector.java:159)
>>>>>>>                 at
>>>>>>> org.apache.solr.cloud.LeaderElector.checkIfIamLeader(LeaderElector.java:103)
>>>>>>>                 at
>>>>>>> org.apache.solr.cloud.LeaderElector.access$000(LeaderElector.java:57)
>>>>>>>                 at
>>>>>>> org.apache.solr.cloud.LeaderElector$1.process(LeaderElector.java:132)
>>>>>>>                 at
>>>>>>> org.apache.zookeeper.ClientCnxn$EventThread.processEvent(ClientCnxn.java:526)
>>>>>>>                 at
>>>>>>> org.apache.zookeeper.ClientCnxn$EventThread.run(ClientCnxn.java:502)
>>>>>>>         Caused by: org.apache.http.conn.ConnectTimeoutException:
>>>>>>> Connect to 127.0.0.1:10553 timed out
>>>>>>>                 at
>>>>>>> org.apache.http.conn.scheme.PlainSocketFactory.connectSocket(PlainSocketFactory.java:125)
>>>>>>>                 at
>>>>>>> org.apache.http.impl.conn.DefaultClientConnectionOperator.openConnection(DefaultClientConnectionOperator.java:148)
>>>>>>>                 at
>>>>>>> org.apache.http.impl.conn.AbstractPoolEntry.open(AbstractPoolEntry.java:150)
>>>>>>>                 at
>>>>>>> org.apache.http.impl.conn.AbstractPooledConnAdapter.open(AbstractPooledConnAdapter.java:121)
>>>>>>>                 at
>>>>>>> org.apache.http.impl.client.DefaultRequestDirector.tryConnect(DefaultRequestDirector.java:575)
>>>>>>>                 at
>>>>>>> org.apache.http.impl.client.DefaultRequestDirector.execute(DefaultRequestDirector.java:425)
>>>>>>>                 at
>>>>>>> org.apache.http.impl.client.AbstractHttpClient.execute(AbstractHttpClient.java:820)
>>>>>>>                 at
>>>>>>> org.apache.http.impl.client.AbstractHttpClient.execute(AbstractHttpClient.java:754)
>>>>>>>                 at
>>>>>>> org.apache.http.impl.client.AbstractHttpClient.execute(AbstractHttpClient.java:732)
>>>>>>>                 at
>>>>>>> org.apache.solr.client.solrj.impl.HttpSolrServer.request(HttpSolrServer.java:353)
>>>>>>>                 ... 12 more
>>>>>>>
>>>>>>> ASYNC  NEW_CORE C0 name=collection1
>>>>>>> org.apache.solr.core.SolrCore@50d0843b url=
>>>>>>> http://127.0.0.1:10549/solr/collection1 node=127.0.0.1:10549_solr
>>>>>>> 138738 T170 C0 P10549 oasc.SolrException.log SEVERE
>>>>>>> org.apache.solr.common.SolrException: Document is missing mandatory
>>>>>>> uniqueKey field: id
>>>>>>>                 at
>>>>>>> org.apache.solr.update.AddUpdateCommand.getHashableId(AddUpdateCommand.java:132)
>>>>>>>                 at
>>>>>>> org.apache.solr.update.processor.DistributedUpdateProcessor.hash(DistributedUpdateProcessor.java:1067)
>>>>>>>                 at
>>>>>>> org.apache.solr.update.processor.DistributedUpdateProcessor.processAdd(DistributedUpdateProcessor.java:332)
>>>>>>>                 at
>>>>>>> org.apache.solr.handler.loader.XMLLoader.processUpdate(XMLLoader.java:230)
>>>>>>>                 at
>>>>>>> org.apache.solr.handler.loader.XMLLoader.load(XMLLoader.java:157)
>>>>>>>                 at
>>>>>>> org.apache.solr.handler.UpdateRequestHandler$1.load(UpdateRequestHandler.java:92)
>>>>>>>                 at
>>>>>>> org.apache.solr.handler.ContentStreamHandlerBase.handleRequestBody(ContentStreamHandlerBase.java:74)
>>>>>>>                 at
>>>>>>> org.apache.solr.handler.RequestHandlerBase.handleRequest(RequestHandlerBase.java:129)
>>>>>>>                 at
>>>>>>> org.apache.solr.core.SolrCore.execute(SolrCore.java:1692)
>>>>>>>                 at
>>>>>>> org.apache.solr.servlet.SolrDispatchFilter.execute(SolrDispatchFilter.java:454)
>>>>>>>                 at
>>>>>>> org.apache.solr.servlet.SolrDispatchFilter.doFilter(SolrDispatchFilter.java:275)
>>>>>>>                 at
>>>>>>> org.eclipse.jetty.servlet.ServletHandler$CachedChain.doFilter(ServletHandler.java:1337)
>>>>>>>                 at
>>>>>>> org.eclipse.jetty.servlet.ServletHandler.doHandle(ServletHandler.java:484)
>>>>>>>                 at
>>>>>>> org.eclipse.jetty.server.session.SessionHandler.doHandle(SessionHandler.java:231)
>>>>>>>                 at
>>>>>>> org.eclipse.jetty.server.handler.ScopedHandler.handle(ScopedHandler.java:119)
>>>>>>>                 at
>>>>>>> org.eclipse.jetty.server.handler.GzipHandler.handle(GzipHandler.java:267)
>>>>>>>                 at
>>>>>>> org.eclipse.jetty.server.handler.ContextHandler.doHandle(ContextHandler.java:1067)
>>>>>>>                 at
>>>>>>> org.eclipse.jetty.servlet.ServletHandler.doScope(ServletHandler.java:413)
>>>>>>>                 at
>>>>>>> org.eclipse.jetty.server.session.SessionHandler.doScope(SessionHandler.java:192)
>>>>>>>                 at
>>>>>>> org.eclipse.jetty.server.handler.ContextHandler.doScope(ContextHandler.java:999)
>>>>>>>                 at
>>>>>>> org.eclipse.jetty.server.handler.ScopedHandler.handle(ScopedHandler.java:117)
>>>>>>>                 at
>>>>>>> org.eclipse.jetty.server.handler.HandlerWrapper.handle(HandlerWrapper.java:111)
>>>>>>>                 at
>>>>>>> org.eclipse.jetty.server.Server.handle(Server.java:351)
>>>>>>>                 at
>>>>>>> org.eclipse.jetty.server.AbstractHttpConnection.handleRequest(AbstractHttpConnection.java:454)
>>>>>>>                 at
>>>>>>> org.eclipse.jetty.server.BlockingHttpConnection.handleRequest(BlockingHttpConnection.java:47)
>>>>>>>                 at
>>>>>>> org.eclipse.jetty.server.AbstractHttpConnection.content(AbstractHttpConnection.java:900)
>>>>>>>                 at
>>>>>>> org.eclipse.jetty.server.AbstractHttpConnection$RequestHandler.content(AbstractHttpConnection.java:954)
>>>>>>>                 at
>>>>>>> org.eclipse.jetty.http.HttpParser.parseNext(HttpParser.java:952)
>>>>>>>                 at
>>>>>>> org.eclipse.jetty.http.HttpParser.parseAvailable(HttpParser.java:235)
>>>>>>>                 at
>>>>>>> org.eclipse.jetty.server.BlockingHttpConnection.handle(BlockingHttpConnection.java:66)
>>>>>>>                 at
>>>>>>> org.eclipse.jetty.server.bio.SocketConnector$ConnectorEndPoint.run(SocketConnector.java:254)
>>>>>>>                 at
>>>>>>> org.eclipse.jetty.util.thread.QueuedThreadPool.runJob(QueuedThreadPool.java:599)
>>>>>>>                 at
>>>>>>> org.eclipse.jetty.util.thread.QueuedThreadPool$3.run(QueuedThreadPool.java:534)
>>>>>>>                 at java.lang.Thread.run(Thread.java:679)
>>>>>>>
>>>>>>> 138841 T216 oasc.SolrException.log SEVERE Sync Failed
>>>>>>> 140817 T346 oasc.SolrException.log SEVERE
>>>>>>> java.lang.InterruptedException: sleep interrupted
>>>>>>>                 at java.lang.Thread.sleep(Native Method)
>>>>>>>                 at
>>>>>>> org.apache.solr.handler.admin.CoreAdminHandler.handleWaitForStateAction(CoreAdminHandler.java:896)
>>>>>>>                 at
>>>>>>> org.apache.solr.handler.admin.CoreAdminHandler.handleRequestBody(CoreAdminHandler.java:185)
>>>>>>>                 at
>>>>>>> org.apache.solr.handler.RequestHandlerBase.handleRequest(RequestHandlerBase.java:129)
>>>>>>>                 at
>>>>>>> org.apache.solr.servlet.SolrDispatchFilter.handleAdminRequest(SolrDispatchFilter.java:371)
>>>>>>>                 at
>>>>>>> org.apache.solr.servlet.SolrDispatchFilter.doFilter(SolrDispatchFilter.java:180)
>>>>>>>                 at
>>>>>>> org.eclipse.jetty.servlet.ServletHandler$CachedChain.doFilter(ServletHandler.java:1337)
>>>>>>>                 at
>>>>>>> org.eclipse.jetty.servlet.ServletHandler.doHandle(ServletHandler.java:484)
>>>>>>>                 at
>>>>>>> org.eclipse.jetty.server.session.SessionHandler.doHandle(SessionHandler.java:231)
>>>>>>>                 at
>>>>>>> org.eclipse.jetty.server.handler.ScopedHandler.handle(ScopedHandler.java:119)
>>>>>>>                 at
>>>>>>> org.eclipse.jetty.server.handler.GzipHandler.handle(GzipHandler.java:267)
>>>>>>>                 at
>>>>>>> org.eclipse.jetty.server.handler.ContextHandler.doHandle(ContextHandler.java:1067)
>>>>>>>                 at
>>>>>>> org.eclipse.jetty.servlet.ServletHandler.doScope(ServletHandler.java:413)
>>>>>>>                 at
>>>>>>> org.eclipse.jetty.server.session.SessionHandler.doScope(SessionHandler.java:192)
>>>>>>>                 at
>>>>>>> org.eclipse.jetty.server.handler.ContextHandler.doScope(ContextHandler.java:999)
>>>>>>>                 at
>>>>>>> org.eclipse.jetty.server.handler.ScopedHandler.handle(ScopedHandler.java:117)
>>>>>>>                 at
>>>>>>> org.eclipse.jetty.server.handler.HandlerWrapper.handle(HandlerWrapper.java:111)
>>>>>>>                 at
>>>>>>> org.eclipse.jetty.server.Server.handle(Server.java:351)
>>>>>>>                 at
>>>>>>> org.eclipse.jetty.server.AbstractHttpConnection.handleRequest(AbstractHttpConnection.java:454)
>>>>>>>                 at
>>>>>>> org.eclipse.jetty.server.BlockingHttpConnection.handleRequest(BlockingHttpConnection.java:47)
>>>>>>>                 at
>>>>>>> org.eclipse.jetty.server.AbstractHttpConnection.headerComplete(AbstractHttpConnection.java:890)
>>>>>>>                 at
>>>>>>> org.eclipse.jetty.server.AbstractHttpConnection$RequestHandler.headerComplete(AbstractHttpConnection.java:944)
>>>>>>>                 at
>>>>>>> org.eclipse.jetty.http.HttpParser.parseNext(HttpParser.java:634)
>>>>>>>                 at
>>>>>>> org.eclipse.jetty.http.HttpParser.parseAvailable(HttpParser.java:230)
>>>>>>>                 at
>>>>>>> org.eclipse.jetty.server.BlockingHttpConnection.handle(BlockingHttpConnection.java:66)
>>>>>>>                 at
>>>>>>> org.eclipse.jetty.server.bio.SocketConnector$ConnectorEndPoint.run(SocketConnector.java:254)
>>>>>>>                 at
>>>>>>> org.eclipse.jetty.util.thread.QueuedThreadPool.runJob(QueuedThreadPool.java:599)
>>>>>>>                 at
>>>>>>> org.eclipse.jetty.util.thread.QueuedThreadPool$3.run(QueuedThreadPool.java:534)
>>>>>>>                 at java.lang.Thread.run(Thread.java:679)
>>>>>>>
>>>>>>> 140818 T346 oasc.SolrException.log SEVERE
>>>>>>> null:java.lang.InterruptedException: sleep interrupted
>>>>>>>                 at java.lang.Thread.sleep(Native Method)
>>>>>>>                 at
>>>>>>> org.apache.solr.handler.admin.CoreAdminHandler.handleWaitForStateAction(CoreAdminHandler.java:896)
>>>>>>>                 at
>>>>>>> org.apache.solr.handler.admin.CoreAdminHandler.handleRequestBody(CoreAdminHandler.java:185)
>>>>>>>                 at
>>>>>>> org.apache.solr.handler.RequestHandlerBase.handleRequest(RequestHandlerBase.java:129)
>>>>>>>                 at
>>>>>>> org.apache.solr.servlet.SolrDispatchFilter.handleAdminRequest(SolrDispatchFilter.java:371)
>>>>>>>                 at
>>>>>>> org.apache.solr.servlet.SolrDispatchFilter.doFilter(SolrDispatchFilter.java:180)
>>>>>>>                 at
>>>>>>> org.eclipse.jetty.servlet.ServletHandler$CachedChain.doFilter(ServletHandler.java:1337)
>>>>>>>                 at
>>>>>>> org.eclipse.jetty.servlet.ServletHandler.doHandle(ServletHandler.java:484)
>>>>>>>                 at
>>>>>>> org.eclipse.jetty.server.session.SessionHandler.doHandle(SessionHandler.java:231)
>>>>>>>                 at
>>>>>>> org.eclipse.jetty.server.handler.ScopedHandler.handle(ScopedHandler.java:119)
>>>>>>>                 at
>>>>>>> org.eclipse.jetty.server.handler.GzipHandler.handle(GzipHandler.java:267)
>>>>>>>                 at
>>>>>>> org.eclipse.jetty.server.handler.ContextHandler.doHandle(ContextHandler.java:1067)
>>>>>>>                 at
>>>>>>> org.eclipse.jetty.servlet.ServletHandler.doScope(ServletHandler.java:413)
>>>>>>>                 at
>>>>>>> org.eclipse.jetty.server.session.SessionHandler.doScope(SessionHandler.java:192)
>>>>>>>                 at
>>>>>>> org.eclipse.jetty.server.handler.ContextHandler.doScope(ContextHandler.java:999)
>>>>>>>                 at
>>>>>>> org.eclipse.jetty.server.handler.ScopedHandler.handle(ScopedHandler.java:117)
>>>>>>>                 at
>>>>>>> org.eclipse.jetty.server.handler.HandlerWrapper.handle(HandlerWrapper.java:111)
>>>>>>>                 at
>>>>>>> org.eclipse.jetty.server.Server.handle(Server.java:351)
>>>>>>>                 at
>>>>>>> org.eclipse.jetty.server.AbstractHttpConnection.handleRequest(AbstractHttpConnection.java:454)
>>>>>>>                 at
>>>>>>> org.eclipse.jetty.server.BlockingHttpConnection.handleRequest(BlockingHttpConnection.java:47)
>>>>>>>                 at
>>>>>>> org.eclipse.jetty.server.AbstractHttpConnection.headerComplete(AbstractHttpConnection.java:890)
>>>>>>>                 at
>>>>>>> org.eclipse.jetty.server.AbstractHttpConnection$RequestHandler.headerComplete(AbstractHttpConnection.java:944)
>>>>>>>                 at
>>>>>>> org.eclipse.jetty.http.HttpParser.parseNext(HttpParser.java:634)
>>>>>>>                 at
>>>>>>> org.eclipse.jetty.http.HttpParser.parseAvailable(HttpParser.java:230)
>>>>>>>                 at
>>>>>>> org.eclipse.jetty.server.BlockingHttpConnection.handle(BlockingHttpConnection.java:66)
>>>>>>>                 at
>>>>>>> org.eclipse.jetty.server.bio.SocketConnector$ConnectorEndPoint.run(SocketConnector.java:254)
>>>>>>>                 at
>>>>>>> org.eclipse.jetty.util.thread.QueuedThreadPool.runJob(QueuedThreadPool.java:599)
>>>>>>>                 at
>>>>>>> org.eclipse.jetty.util.thread.QueuedThreadPool$3.run(QueuedThreadPool.java:534)
>>>>>>>                 at java.lang.Thread.run(Thread.java:679)
>>>>>>>
>>>>>>> 140819 T346 oasc.SolrException.log SEVERE
>>>>>>> null:org.eclipse.jetty.io.EofException
>>>>>>>                 at
>>>>>>> org.eclipse.jetty.server.HttpOutput.write(HttpOutput.java:154)
>>>>>>>                 at
>>>>>>> org.eclipse.jetty.server.HttpOutput.write(HttpOutput.java:101)
>>>>>>>                 at
>>>>>>> org.apache.solr.common.util.FastOutputStream.flush(FastOutputStream.java:204)
>>>>>>>                 at
>>>>>>> org.apache.solr.common.util.FastOutputStream.flushBuffer(FastOutputStream.java:197)
>>>>>>>                 at
>>>>>>> org.apache.solr.common.util.JavaBinCodec.marshal(JavaBinCodec.java:94)
>>>>>>>                 at
>>>>>>> org.apache.solr.response.BinaryResponseWriter.write(BinaryResponseWriter.java:49)
>>>>>>>                 at
>>>>>>> org.apache.solr.servlet.SolrDispatchFilter.writeResponse(SolrDispatchFilter.java:403)
>>>>>>>                 at
>>>>>>> org.apache.solr.servlet.SolrDispatchFilter.handleAdminRequest(SolrDispatchFilter.java:381)
>>>>>>>                 at
>>>>>>> org.apache.solr.servlet.SolrDispatchFilter.doFilter(SolrDispatchFilter.java:180)
>>>>>>>                 at
>>>>>>> org.eclipse.jetty.servlet.ServletHandler$CachedChain.doFilter(ServletHandler.java:1337)
>>>>>>>                 at
>>>>>>> org.eclipse.jetty.servlet.ServletHandler.doHandle(ServletHandler.java:484)
>>>>>>>                 at
>>>>>>> org.eclipse.jetty.server.session.SessionHandler.doHandle(SessionHandler.java:231)
>>>>>>>                 at
>>>>>>> org.eclipse.jetty.server.handler.ScopedHandler.handle(ScopedHandler.java:119)
>>>>>>>                 at
>>>>>>> org.eclipse.jetty.server.handler.GzipHandler.handle(GzipHandler.java:267)
>>>>>>>                 at
>>>>>>> org.eclipse.jetty.server.handler.ContextHandler.doHandle(ContextHandler.java:1067)
>>>>>>>                 at
>>>>>>> org.eclipse.jetty.servlet.ServletHandler.doScope(ServletHandler.java:413)
>>>>>>>                 at
>>>>>>> org.eclipse.jetty.server.session.SessionHandler.doScope(SessionHandler.java:192)
>>>>>>>                 at
>>>>>>> org.eclipse.jetty.server.handler.ContextHandler.doScope(ContextHandler.java:999)
>>>>>>>                 at
>>>>>>> org.eclipse.jetty.server.handler.ScopedHandler.handle(ScopedHandler.java:117)
>>>>>>>                 at
>>>>>>> org.eclipse.jetty.server.handler.HandlerWrapper.handle(HandlerWrapper.java:111)
>>>>>>>                 at
>>>>>>> org.eclipse.jetty.server.Server.handle(Server.java:351)
>>>>>>>                 at
>>>>>>> org.eclipse.jetty.server.AbstractHttpConnection.handleRequest(AbstractHttpConnection.java:454)
>>>>>>>                 at
>>>>>>> org.eclipse.jetty.server.BlockingHttpConnection.handleRequest(BlockingHttpConnection.java:47)
>>>>>>>                 at
>>>>>>> org.eclipse.jetty.server.AbstractHttpConnection.headerComplete(AbstractHttpConnection.java:890)
>>>>>>>                 at
>>>>>>> org.eclipse.jetty.server.AbstractHttpConnection$RequestHandler.headerComplete(AbstractHttpConnection.java:944)
>>>>>>>                 at
>>>>>>> org.eclipse.jetty.http.HttpParser.parseNext(HttpParser.java:634)
>>>>>>>                 at
>>>>>>> org.eclipse.jetty.http.HttpParser.parseAvailable(HttpParser.java:230)
>>>>>>>                 at
>>>>>>> org.eclipse.jetty.server.BlockingHttpConnection.handle(BlockingHttpConnection.java:66)
>>>>>>>                 at
>>>>>>> org.eclipse.jetty.server.bio.SocketConnector$ConnectorEndPoint.run(SocketConnector.java:254)
>>>>>>>                 at
>>>>>>> org.eclipse.jetty.util.thread.QueuedThreadPool.runJob(QueuedThreadPool.java:599)
>>>>>>>                 at
>>>>>>> org.eclipse.jetty.util.thread.QueuedThreadPool$3.run(QueuedThreadPool.java:534)
>>>>>>>                 at java.lang.Thread.run(Thread.java:679)
>>>>>>>
>>>>>>> 183882 T341 oasc.SolrException.log SEVERE
>>>>>>> http://127.0.0.1:29853/solr/collection1/: Could not tell a replica
>>>>>>> to recover:org.apache.solr.client.solrj.SolrServerException: Timeout
>>>>>>> occured while waiting response from server at:
>>>>>>> http://127.0.0.1:10555/solr
>>>>>>>                 at
>>>>>>> org.apache.solr.client.solrj.impl.HttpSolrServer.request(HttpSolrServer.java:410)
>>>>>>>                 at
>>>>>>> org.apache.solr.client.solrj.impl.HttpSolrServer.request(HttpSolrServer.java:182)
>>>>>>>                 at
>>>>>>> org.apache.solr.cloud.SyncStrategy.requestRecovery(SyncStrategy.java:282)
>>>>>>>                 at
>>>>>>> org.apache.solr.cloud.SyncStrategy.syncToMe(SyncStrategy.java:226)
>>>>>>>                 at
>>>>>>> org.apache.solr.cloud.SyncStrategy.syncReplicas(SyncStrategy.java:119)
>>>>>>>                 at
>>>>>>> org.apache.solr.cloud.SyncStrategy.sync(SyncStrategy.java:85)
>>>>>>>                 at
>>>>>>> org.apache.solr.cloud.ShardLeaderElectionContext.runLeaderProcess(ElectionContext.java:180)
>>>>>>>                 at
>>>>>>> org.apache.solr.cloud.LeaderElector.runIamLeaderProcess(LeaderElector.java:159)
>>>>>>>                 at
>>>>>>> org.apache.solr.cloud.LeaderElector.checkIfIamLeader(LeaderElector.java:103)
>>>>>>>                 at
>>>>>>> org.apache.solr.cloud.LeaderElector.access$000(LeaderElector.java:57)
>>>>>>>                 at
>>>>>>> org.apache.solr.cloud.LeaderElector$1.process(LeaderElector.java:132)
>>>>>>>                 at
>>>>>>> org.apache.zookeeper.ClientCnxn$EventThread.processEvent(ClientCnxn.java:526)
>>>>>>>                 at
>>>>>>> org.apache.zookeeper.ClientCnxn$EventThread.run(ClientCnxn.java:502)
>>>>>>>         Caused by: java.net.SocketTimeoutException: Read timed out
>>>>>>>                 at java.net.SocketInputStream.socketRead0(Native
>>>>>>> Method)
>>>>>>>                 at
>>>>>>> java.net.SocketInputStream.read(SocketInputStream.java:146)
>>>>>>>                 at
>>>>>>> org.apache.http.impl.io.AbstractSessionInputBuffer.fillBuffer(AbstractSessionInputBuffer.java:149)
>>>>>>>                 at
>>>>>>> org.apache.http.impl.io.SocketInputBuffer.fillBuffer(SocketInputBuffer.java:111)
>>>>>>>                 at
>>>>>>> org.apache.http.impl.io.AbstractSessionInputBuffer.readLine(AbstractSessionInputBuffer.java:264)
>>>>>>>                 at
>>>>>>> org.apache.http.impl.conn.DefaultResponseParser.parseHead(DefaultResponseParser.java:98)
>>>>>>>                 at
>>>>>>> org.apache.http.impl.io.AbstractMessageParser.parse(AbstractMessageParser.java:252)
>>>>>>>                 at
>>>>>>> org.apache.http.impl.AbstractHttpClientConnection.receiveResponseHeader(AbstractHttpClientConnection.java:282)
>>>>>>>                 at
>>>>>>> org.apache.http.impl.conn.DefaultClientConnection.receiveResponseHeader(DefaultClientConnection.java:247)
>>>>>>>                 at
>>>>>>> org.apache.http.impl.conn.AbstractClientConnAdapter.receiveResponseHeader(AbstractClientConnAdapter.java:216)
>>>>>>>                 at
>>>>>>> org.apache.http.protocol.HttpRequestExecutor.doReceiveResponse(HttpRequestExecutor.java:298)
>>>>>>>                 at
>>>>>>> org.apache.http.protocol.HttpRequestExecutor.execute(HttpRequestExecutor.java:125)
>>>>>>>                 at
>>>>>>> org.apache.http.impl.client.DefaultRequestDirector.tryExecute(DefaultRequestDirector.java:647)
>>>>>>>                 at
>>>>>>> org.apache.http.impl.client.DefaultRequestDirector.execute(DefaultRequestDirector.java:464)
>>>>>>>                 at
>>>>>>> org.apache.http.impl.client.AbstractHttpClient.execute(AbstractHttpClient.java:820)
>>>>>>>                 at
>>>>>>> org.apache.http.impl.client.AbstractHttpClient.execute(AbstractHttpClient.java:754)
>>>>>>>                 at
>>>>>>> org.apache.http.impl.client.AbstractHttpClient.execute(AbstractHttpClient.java:732)
>>>>>>>                 at
>>>>>>> org.apache.solr.client.solrj.impl.HttpSolrServer.request(HttpSolrServer.java:353)
>>>>>>>                 ... 12 more
>>>>>>>
>>>>>>> ASYNC  NEW_CORE C1 name=collection1
>>>>>>> org.apache.solr.core.SolrCore@787ad957 url=
>>>>>>> http://127.0.0.1:10555/solr/collection1 node=127.0.0.1:10555_solr
>>>>>>> 185767 T358 C1 P10555 oasc.SolrException.log SEVERE Error while
>>>>>>> trying to recover.
>>>>>>> core=collection1:org.apache.solr.client.solrj.SolrServerException:
>>>>>>> IOException occured when talking to server at:
>>>>>>> http://127.0.0.1:10551/solr
>>>>>>>                 at
>>>>>>> org.apache.solr.client.solrj.impl.HttpSolrServer.request(HttpSolrServer.java:414)
>>>>>>>                 at
>>>>>>> org.apache.solr.client.solrj.impl.HttpSolrServer.request(HttpSolrServer.java:182)
>>>>>>>                 at
>>>>>>> org.apache.solr.cloud.RecoveryStrategy.sendPrepRecoveryCmd(RecoveryStrategy.java:191)
>>>>>>>                 at
>>>>>>> org.apache.solr.cloud.RecoveryStrategy.doRecovery(RecoveryStrategy.java:320)
>>>>>>>                 at
>>>>>>> org.apache.solr.cloud.RecoveryStrategy.run(RecoveryStrategy.java:212)
>>>>>>>         Caused by: org.apache.http.conn.ConnectTimeoutException:
>>>>>>> Connect to 127.0.0.1:10551 timed out
>>>>>>>                 at
>>>>>>> org.apache.http.conn.scheme.PlainSocketFactory.connectSocket(PlainSocketFactory.java:125)
>>>>>>>                 at
>>>>>>> org.apache.http.impl.conn.DefaultClientConnectionOperator.openConnection(DefaultClientConnectionOperator.java:148)
>>>>>>>                 at
>>>>>>> org.apache.http.impl.conn.AbstractPoolEntry.open(AbstractPoolEntry.java:150)
>>>>>>>                 at
>>>>>>> org.apache.http.impl.conn.AbstractPooledConnAdapter.open(AbstractPooledConnAdapter.java:121)
>>>>>>>                 at
>>>>>>> org.apache.http.impl.client.DefaultRequestDirector.tryExecute(DefaultRequestDirector.java:636)
>>>>>>>                 at
>>>>>>> org.apache.http.impl.client.DefaultRequestDirector.execute(DefaultRequestDirector.java:464)
>>>>>>>                 at
>>>>>>> org.apache.http.impl.client.AbstractHttpClient.execute(AbstractHttpClient.java:820)
>>>>>>>                 at
>>>>>>> org.apache.http.impl.client.AbstractHttpClient.execute(AbstractHttpClient.java:754)
>>>>>>>                 at
>>>>>>> org.apache.http.impl.client.AbstractHttpClient.execute(AbstractHttpClient.java:732)
>>>>>>>                 at
>>>>>>> org.apache.solr.client.solrj.impl.HttpSolrServer.request(HttpSolrServer.java:353)
>>>>>>>                 ... 4 more
>>>>>>>
>>>>>>> 185767 T358 C1 P10555 oasc.RecoveryStrategy.doRecovery SEVERE
>>>>>>> Recovery failed - trying again... core=collection1
>>>>>>> Tests run: 1, Failures: 0, Errors: 0, Skipped: 0, Time elapsed:
>>>>>>> 188.241 sec
>>>>>>> Running org.apache.solr.search.TestFiltering
>>>>>>> Creating dataDir:
>>>>>>> /usr/home/hudson/hudson-slave/workspace/Lucene-Solr-Maven-4.x/maven-build/solr/core/target/test/./solrtest-TestFiltering-1346552958269
>>>>>>> Tests run: 2, Failures: 0, Errors: 0, Skipped: 0, Time elapsed:
>>>>>>> 2.991 sec
>>>>>>> Running org.apache.solr.internal.csv.CSVParserTest
>>>>>>> Tests run: 23, Failures: 0, Errors: 0, Skipped: 0, Time elapsed:
>>>>>>> 0.006 sec
>>>>>>> Running org.apache.solr.AnalysisAfterCoreReloadTest
>>>>>>> Tests run: 1, Failures: 0, Errors: 0, Skipped: 0, Time elapsed:
>>>>>>> 1.588 sec
>>>>>>> Running org.apache.solr.core.TestQuerySenderListener
>>>>>>> Creating dataDir:
>>>>>>> /usr/home/hudson/hudson-slave/workspace/Lucene-Solr-Maven-4.x/maven-build/solr/core/target/test/./solrtest-TestQuerySenderListener-1346552962859
>>>>>>> Tests run: 3, Failures: 0, Errors: 0, Skipped: 0, Time elapsed:
>>>>>>> 0.427 sec
>>>>>>> Running org.apache.solr.handler.component.SpellCheckComponentTest
>>>>>>> Creating dataDir:
>>>>>>> /usr/home/hudson/hudson-slave/workspace/Lucene-Solr-Maven-4.x/maven-build/solr/core/target/test/./solrtest-SpellCheckComponentTest-1346552963285
>>>>>>> Tests run: 9, Failures: 0, Errors: 0, Skipped: 0, Time elapsed:
>>>>>>> 4.494 sec
>>>>>>> Running org.apache.solr.update.processor.ScriptEngineTest
>>>>>>> Tests run: 6, Failures: 0, Errors: 0, Skipped: 1, Time elapsed:
>>>>>>> 0.235 sec
>>>>>>> Running org.apache.solr.handler.admin.ShowFileRequestHandlerTest
>>>>>>> Creating dataDir:
>>>>>>> /usr/home/hudson/hudson-slave/workspace/Lucene-Solr-Maven-4.x/maven-build/solr/core/target/test/./solrtest-ShowFileRequestHandlerTest-1346552968015
>>>>>>> Tests run: 2, Failures: 0, Errors: 0, Skipped: 0, Time elapsed:
>>>>>>> 0.866 sec
>>>>>>> Running org.apache.solr.servlet.SolrRequestParserTest
>>>>>>> Creating dataDir:
>>>>>>> /usr/home/hudson/hudson-slave/workspace/Lucene-Solr-Maven-4.x/maven-build/solr/core/target/test/./solrtest-SolrRequestParserTest-1346552968880
>>>>>>> Tests run: 4, Failures: 0, Errors: 0, Skipped: 0, Time elapsed: 1.25
>>>>>>> sec
>>>>>>> Running org.apache.solr.core.TestBadConfig
>>>>>>> Creating dataDir:
>>>>>>> /usr/home/hudson/hudson-slave/workspace/Lucene-Solr-Maven-4.x/maven-build/solr/core/target/test/./solrtest-TestBadConfig-1346552970136
>>>>>>> 683 T412 oasup.StatelessScriptUpdateProcessorFactory.inform SEVERE
>>>>>>> Unable to initialize scripts: No ScriptEngine found by name: giberish --
>>>>>>> supported names: js, rhino, JavaScript, javascript, ECMAScript, ecmascript
>>>>>>> Ignoring exception matching \Qgiberish\E
>>>>>>> Creating dataDir:
>>>>>>> /usr/home/hudson/hudson-slave/workspace/Lucene-Solr-Maven-4.x/maven-build/solr/core/target/test/./solrtest-TestBadConfig-1346552970827
>>>>>>> 1093 T412 oasup.StatelessScriptUpdateProcessorFactory.inform SEVERE
>>>>>>> Unable to initialize scripts: Unable to evaluate script:
>>>>>>> a-file-name-that-does-not-exist.js Ignoring exception matching
>>>>>>> \Qa-file-name-that-does-not-exist.js\E
>>>>>>> Creating dataDir:
>>>>>>> /usr/home/hudson/hudson-slave/workspace/Lucene-Solr-Maven-4.x/maven-build/solr/core/target/test/./solrtest-TestBadConfig-1346552971234
>>>>>>> 1443 T412 oasup.StatelessScriptUpdateProcessorFactory.inform SEVERE
>>>>>>> Unable to initialize scripts: Unable to evaluate script: currency.xml
>>>>>>> Ignoring exception matching \Qcurrency.xml\E
>>>>>>> Creating dataDir:
>>>>>>> /usr/home/hudson/hudson-slave/workspace/Lucene-Solr-Maven-4.x/maven-build/solr/core/target/test/./solrtest-TestBadConfig-1346552971577
>>>>>>> 1462 T3 oasc.CoreContainer.finalize SEVERE CoreContainer was not
>>>>>>> shutdown prior to finalize(), indicates a bug -- POSSIBLE RESOURCE LEAK!!!
>>>>>>>  instance=245029416
>>>>>>> Creating dataDir:
>>>>>>> /usr/home/hudson/hudson-slave/workspace/Lucene-Solr-Maven-4.x/maven-build/solr/core/target/test/./solrtest-TestBadConfig-1346552971840
>>>>>>> Tests run: 5, Failures: 0, Errors: 0, Skipped: 0, Time elapsed:
>>>>>>> 1.736 sec
>>>>>>> Running org.apache.solr.util.DOMUtilTest
>>>>>>> Tests run: 1, Failures: 0, Errors: 0, Skipped: 0, Time elapsed:
>>>>>>> 0.016 sec
>>>>>>> Running org.apache.solr.search.TestReload
>>>>>>> Creating dataDir:
>>>>>>> /usr/home/hudson/hudson-slave/workspace/Lucene-Solr-Maven-4.x/maven-build/solr/core/target/test/./solrtest-TestReload-1346552971880
>>>>>>> !!! softCommitfalse
>>>>>>> !!! softCommitfalse
>>>>>>> !!! softCommittrue
>>>>>>> !!! softCommitfalse
>>>>>>> !!! softCommitfalse
>>>>>>> !!! softCommittrue
>>>>>>> Tests run: 1, Failures: 0, Errors: 0, Skipped: 0, Time elapsed:
>>>>>>> 4.043 sec
>>>>>>> Running org.apache.solr.request.TestWriterPerf
>>>>>>> 4484 T3 oasc.CoreContainer.finalize SEVERE CoreContainer was not
>>>>>>> shutdown prior to finalize(), indicates a bug -- POSSIBLE RESOURCE LEAK!!!
>>>>>>>  instance=1309830940
>>>>>>> 4485 T3 oasc.CoreContainer.finalize SEVERE CoreContainer was not
>>>>>>> shutdown prior to finalize(), indicates a bug -- POSSIBLE RESOURCE LEAK!!!
>>>>>>>  instance=1346406963
>>>>>>> Tests run: 1, Failures: 0, Errors: 0, Skipped: 0, Time elapsed:
>>>>>>> 0.866 sec
>>>>>>> Running org.apache.solr.schema.TestOmitPositions
>>>>>>> Creating dataDir:
>>>>>>> /usr/home/hudson/hudson-slave/workspace/Lucene-Solr-Maven-4.x/maven-build/solr/core/target/test/./solrtest-TestOmitPositions-1346552976795
>>>>>>> Tests run: 2, Failures: 0, Errors: 0, Skipped: 0, Time elapsed:
>>>>>>> 0.529 sec
>>>>>>> Running org.apache.solr.TestGroupingSearch
>>>>>>> Creating dataDir:
>>>>>>> /usr/home/hudson/hudson-slave/workspace/Lucene-Solr-Maven-4.x/maven-build/solr/core/target/test/./solrtest-TestGroupingSearch-1346552977329
>>>>>>> Tests run: 12, Failures: 0, Errors: 0, Skipped: 0, Time elapsed:
>>>>>>> 2.481 sec
>>>>>>> Running org.apache.solr.internal.csv.writer.CSVFieldTest
>>>>>>> Tests run: 2, Failures: 0, Errors: 0, Skipped: 0, Time elapsed:
>>>>>>> 0.001 sec
>>>>>>> Running org.apache.solr.spelling.SpellCheckCollatorTest
>>>>>>> Creating dataDir:
>>>>>>> /usr/home/hudson/hudson-slave/workspace/Lucene-Solr-Maven-4.x/maven-build/solr/core/target/test/./solrtest-SpellCheckCollatorTest-1346552979804
>>>>>>> Tests run: 7, Failures: 0, Errors: 0, Skipped: 0, Time elapsed:
>>>>>>> 1.724 sec
>>>>>>> Running org.apache.solr.analysis.PathHierarchyTokenizerFactoryTest
>>>>>>> Creating dataDir:
>>>>>>> /usr/home/hudson/hudson-slave/workspace/Lucene-Solr-Maven-4.x/maven-build/solr/core/target/test/./solrtest-PathHierarchyTokenizerFactoryTest-1346552981531
>>>>>>> Tests run: 2, Failures: 0, Errors: 0, Skipped: 0, Time elapsed:
>>>>>>> 0.584 sec
>>>>>>> Running org.apache.solr.util.FileUtilsTest
>>>>>>> Tests run: 1, Failures: 0, Errors: 0, Skipped: 0, Time elapsed:
>>>>>>> 0.015 sec
>>>>>>> Running org.apache.solr.handler.TestCSVLoader
>>>>>>> Creating dataDir:
>>>>>>> /usr/home/hudson/hudson-slave/workspace/Lucene-Solr-Maven-4.x/maven-build/solr/core/target/test/./solrtest-TestCSVLoader-1346552982131
>>>>>>> Tests run: 5, Failures: 0, Errors: 0, Skipped: 0, Time elapsed:
>>>>>>> 0.771 sec
>>>>>>> Running org.apache.solr.handler.component.TermVectorComponentTest
>>>>>>> Creating dataDir:
>>>>>>> /usr/home/hudson/hudson-slave/workspace/Lucene-Solr-Maven-4.x/maven-build/solr/core/target/test/./solrtest-TermVectorComponentTest-1346552982899
>>>>>>> Tests run: 3, Failures: 0, Errors: 0, Skipped: 0, Time elapsed:
>>>>>>> 0.653 sec
>>>>>>> Running org.apache.solr.schema.IndexSchemaRuntimeFieldTest
>>>>>>> Creating dataDir:
>>>>>>> /usr/home/hudson/hudson-slave/workspace/Lucene-Solr-Maven-4.x/maven-build/solr/core/target/test/./solrtest-IndexSchemaRuntimeFieldTest-1346552983557
>>>>>>> Tests run: 1, Failures: 0, Errors: 0, Skipped: 0, Time elapsed: 0.52
>>>>>>> sec
>>>>>>> Running org.apache.solr.handler.component.QueryElevationComponentTest
>>>>>>> Creating dataDir:
>>>>>>> /usr/home/hudson/hudson-slave/workspace/Lucene-Solr-Maven-4.x/maven-build/solr/core/target/test/./solrtest-QueryElevationComponentTest-1346552984087
>>>>>>> Creating dataDir:
>>>>>>> /usr/home/hudson/hudson-slave/workspace/Lucene-Solr-Maven-4.x/maven-build/solr/core/target/test/./solrtest-QueryElevationComponentTest-1346552984490
>>>>>>> Creating dataDir:
>>>>>>> /usr/home/hudson/hudson-slave/workspace/Lucene-Solr-Maven-4.x/maven-build/solr/core/target/test/./solrtest-QueryElevationComponentTest-1346552985002
>>>>>>> Creating dataDir:
>>>>>>> /usr/home/hudson/hudson-slave/workspace/Lucene-Solr-Maven-4.x/maven-build/solr/core/target/test/./solrtest-QueryElevationComponentTest-1346552985257
>>>>>>> Creating dataDir:
>>>>>>> /usr/home/hudson/hudson-slave/workspace/Lucene-Solr-Maven-4.x/maven-build/solr/core/target/test/./solrtest-QueryElevationComponentTest-1346552985638
>>>>>>> Creating dataDir:
>>>>>>> /usr/home/hudson/hudson-slave/workspace/Lucene-Solr-Maven-4.x/maven-build/solr/core/target/test/./solrtest-QueryElevationComponentTest-1346552986081
>>>>>>> Creating dataDir:
>>>>>>> /usr/home/hudson/hudson-slave/workspace/Lucene-Solr-Maven-4.x/maven-build/solr/core/target/test/./solrtest-QueryElevationComponentTest-1346552986468
>>>>>>> Tests run: 7, Failures: 0, Errors: 0, Skipped: 0, Time elapsed:
>>>>>>> 2.697 sec
>>>>>>> Running org.apache.solr.MinimalSchemaTest
>>>>>>> Creating dataDir:
>>>>>>> /usr/home/hudson/hudson-slave/workspace/Lucene-Solr-Maven-4.x/maven-build/solr/core/target/test/./solrtest-MinimalSchemaTest-1346552986770
>>>>>>> Tests run: 3, Failures: 0, Errors: 0, Skipped: 0, Time elapsed:
>>>>>>> 0.394 sec
>>>>>>> Running org.apache.solr.spelling.suggest.SuggesterTest
>>>>>>> Creating dataDir:
>>>>>>> /usr/home/hudson/hudson-slave/workspace/Lucene-Solr-Maven-4.x/maven-build/solr/core/target/test/./solrtest-SuggesterTest-1346552987177
>>>>>>> NOTE: per solr.test.leavedatadir, dataDir will not be removed:
>>>>>>> /usr/home/hudson/hudson-slave/workspace/Lucene-Solr-Maven-4.x/maven-build/solr/core/target/test/./solrtest-SuggesterTest-1346552987177
>>>>>>> Tests run: 4, Failures: 0, Errors: 0, Skipped: 0, Time elapsed:
>>>>>>> 0.907 sec
>>>>>>> Running org.apache.solr.request.TestRemoteStreaming
>>>>>>> Creating dataDir:
>>>>>>> /usr/home/hudson/hudson-slave/workspace/Lucene-Solr-Maven-4.x/maven-build/solr/core/target/test/./solrtest-TestRemoteStreaming-1346552988080
>>>>>>> Tests run: 4, Failures: 0, Errors: 0, Skipped: 0, Time elapsed:
>>>>>>> 0.817 sec
>>>>>>> Running org.apache.solr.schema.BadIndexSchemaTest
>>>>>>> Creating dataDir:
>>>>>>> /usr/home/hudson/hudson-slave/workspace/Lucene-Solr-Maven-4.x/maven-build/solr/core/target/test/./solrtest-BadIndexSchemaTest-1346552988900
>>>>>>> 81 T501 oass.IndexSchema.readSchema SEVERE uniqueKey field (id) can
>>>>>>> not be the dest of a copyField (src=XXX)
>>>>>>> Creating dataDir:
>>>>>>> /usr/home/hudson/hudson-slave/workspace/Lucene-Solr-Maven-4.x/maven-build/solr/core/target/test/./solrtest-BadIndexSchemaTest-1346552988980
>>>>>>> 160 T501 oass.IndexSchema.readSchema SEVERE uniqueKey field (null)
>>>>>>> can not be configured with a default value (XXX)
>>>>>>> Creating dataDir:
>>>>>>> /usr/home/hudson/hudson-slave/workspace/Lucene-Solr-Maven-4.x/maven-build/solr/core/target/test/./solrtest-BadIndexSchemaTest-1346552989058
>>>>>>> 237 T501 oass.IndexSchema.readSchema SEVERE uniqueKey field (null)
>>>>>>> can not be configured to be multivalued
>>>>>>> Creating dataDir:
>>>>>>> /usr/home/hudson/hudson-slave/workspace/Lucene-Solr-Maven-4.x/maven-build/solr/core/target/test/./solrtest-BadIndexSchemaTest-1346552989138
>>>>>>> Creating dataDir:
>>>>>>> /usr/home/hudson/hudson-slave/workspace/Lucene-Solr-Maven-4.x/maven-build/solr/core/target/test/./solrtest-BadIndexSchemaTest-1346552989215
>>>>>>> Creating dataDir:
>>>>>>> /usr/home/hudson/hudson-slave/workspace/Lucene-Solr-Maven-4.x/maven-build/solr/core/target/test/./solrtest-BadIndexSchemaTest-1346552989289
>>>>>>> Creating dataDir:
>>>>>>> /usr/home/hudson/hudson-slave/workspace/Lucene-Solr-Maven-4.x/maven-build/solr/core/target/test/./solrtest-BadIndexSchemaTest-1346552989364
>>>>>>> Creating dataDir:
>>>>>>> /usr/home/hudson/hudson-slave/workspace/Lucene-Solr-Maven-4.x/maven-build/solr/core/target/test/./solrtest-BadIndexSchemaTest-1346552989441
>>>>>>> Creating dataDir:
>>>>>>> /usr/home/hudson/hudson-slave/workspace/Lucene-Solr-Maven-4.x/maven-build/solr/core/target/test/./solrtest-BadIndexSchemaTest-1346552989518
>>>>>>> 695 T501 oass.IndexSchema.readSchema SEVERE FieldType 'sim1' is
>>>>>>> configured with a similarity, but the global similarity does not support
>>>>>>> it: class org.apache.solr.search.similarities.DefaultSimilarityFactory
>>>>>>> Creating dataDir:
>>>>>>> /usr/home/hudson/hudson-slave/workspace/Lucene-Solr-Maven-4.x/maven-build/solr/core/target/test/./solrtest-BadIndexSchemaTest-1346552989596
>>>>>>> Creating dataDir:
>>>>>>> /usr/home/hudson/hudson-slave/workspace/Lucene-Solr-Maven-4.x/maven-build/solr/core/target/test/./solrtest-BadIndexSchemaTest-1346552989669
>>>>>>> 851 T501 oasc.SolrCore.initCodec SEVERE FieldType 'pulsing1' is
>>>>>>> configured with a postings format, but the codec does not support it: class
>>>>>>> org.apache.solr.core.SolrCore$3
>>>>>>> Creating dataDir:
>>>>>>> /usr/home/hudson/hudson-slave/workspace/Lucene-Solr-Maven-4.x/maven-build/solr/core/target/test/./solrtest-BadIndexSchemaTest-1346552989752
>>>>>>> Creating dataDir:
>>>>>>> /usr/home/hudson/hudson-slave/workspace/Lucene-Solr-Maven-4.x/maven-build/solr/core/target/test/./solrtest-BadIndexSchemaTest-1346552989821
>>>>>>> Creating dataDir:
>>>>>>> /usr/home/hudson/hudson-slave/workspace/Lucene-Solr-Maven-4.x/maven-build/solr/core/target/test/./solrtest-BadIndexSchemaTest-1346552989894
>>>>>>> 1058 T3 oasc.CoreContainer.finalize SEVERE CoreContainer was not
>>>>>>> shutdown prior to finalize(), indicates a bug -- POSSIBLE RESOURCE LEAK!!!
>>>>>>>  instance=1960578141
>>>>>>> 1060 T3 oasc.SolrCore.finalize SEVERE REFCOUNT ERROR: unreferenced
>>>>>>> org.apache.solr.core.SolrCore@1aafe99b (collection1) has a
>>>>>>> reference count of 1
>>>>>>> Creating dataDir:
>>>>>>> /usr/home/hudson/hudson-slave/workspace/Lucene-Solr-Maven-4.x/maven-build/solr/core/target/test/./solrtest-BadIndexSchemaTest-1346552989969
>>>>>>> Tests run: 9, Failures: 0, Errors: 0, Skipped: 0, Time elapsed:
>>>>>>> 1.166 sec
>>>>>>> Running org.apache.solr.search.TestStressRecovery
>>>>>>> Creating dataDir:
>>>>>>> /usr/home/hudson/hudson-slave/workspace/Lucene-Solr-Maven-4.x/maven-build/solr/core/target/test/./solrtest-TestStressRecovery-1346552990063
>>>>>>> 5878 T3 oasc.CoreContainer.finalize SEVERE CoreContainer was not
>>>>>>> shutdown prior to finalize(), indicates a bug -- POSSIBLE RESOURCE LEAK!!!
>>>>>>>  instance=601548273
>>>>>>> Tests run: 1, Failures: 0, Errors: 0, Skipped: 0, Time elapsed:
>>>>>>> 6.593 sec
>>>>>>> Running org.apache.solr.search.TestExtendedDismaxParser
>>>>>>> Tests run: 10, Failures: 0, Errors: 0, Skipped: 0, Time elapsed:
>>>>>>> 5.314 sec
>>>>>>> Running org.apache.solr.handler.XmlUpdateRequestHandlerTest
>>>>>>> Creating dataDir:
>>>>>>> /usr/home/hudson/hudson-slave/workspace/Lucene-Solr-Maven-4.x/maven-build/solr/core/target/test/./solrtest-XmlUpdateRequestHandlerTest-1346553001971
>>>>>>> Tests run: 3, Failures: 0, Errors: 0, Skipped: 0, Time elapsed:
>>>>>>> 0.451 sec
>>>>>>> Running org.apache.solr.update.DirectUpdateHandlerOptimizeTest
>>>>>>> Tests run: 1, Failures: 0, Errors: 0, Skipped: 0, Time elapsed:
>>>>>>> 0.485 sec
>>>>>>> Running org.apache.solr.util.TestFastWriter
>>>>>>> Tests run: 1, Failures: 0, Errors: 0, Skipped: 0, Time elapsed:
>>>>>>> 0.248 sec
>>>>>>> Running org.apache.solr.schema.PrimitiveFieldTypeTest
>>>>>>> Tests run: 1, Failures: 0, Errors: 0, Skipped: 0, Time elapsed: 0.64
>>>>>>> sec
>>>>>>> Running org.apache.solr.cloud.ZkNodePropsTest
>>>>>>> Tests run: 1, Failures: 0, Errors: 0, Skipped: 0, Time elapsed:
>>>>>>> 0.018 sec
>>>>>>> Running org.apache.solr.search.function.SortByFunctionTest
>>>>>>> Tests run: 2, Failures: 0, Errors: 0, Skipped: 0, Time elapsed:
>>>>>>> 1.075 sec
>>>>>>> Running
>>>>>>> org.apache.solr.search.similarities.TestLMJelinekMercerSimilarityFactory
>>>>>>> Creating dataDir:
>>>>>>> /usr/home/hudson/hudson-slave/workspace/Lucene-Solr-Maven-4.x/maven-build/solr/core/target/test/./solrtest-TestLMJelinekMercerSimilarityFactory-1346553004892
>>>>>>> Tests run: 2, Failures: 0, Errors: 0, Skipped: 0, Time elapsed:
>>>>>>> 0.139 sec
>>>>>>> Running org.apache.solr.cloud.BasicDistributedZkTest
>>>>>>> Creating dataDir:
>>>>>>> /usr/home/hudson/hudson-slave/workspace/Lucene-Solr-Maven-4.x/maven-build/solr/core/target/test/./solrtest-BasicDistributedZkTest-1346553005042
>>>>>>> 76575 T599 oasc.SolrException.log SEVERE Sync Failed
>>>>>>> 107716 T599 oasc.SolrException.log SEVERE Sync request error:
>>>>>>> org.apache.solr.client.solrj.SolrServerException: Timeout occured while
>>>>>>> waiting response from server at:
>>>>>>> http://127.0.0.1:37972/solr/collection2
>>>>>>> ASYNC  NEW_CORE C2 name=awholynewcollection_0
>>>>>>> org.apache.solr.core.SolrCore@356076ed url=
>>>>>>> http://127.0.0.1:24212/solr/awholynewcollection_0node=127.0.0.1:24212
>>>>>>> _solr
>>>>>>> 121606 T817 C2 P24212 oasc.SolrException.log SEVERE Error while
>>>>>>> trying to recover.
>>>>>>> core=awholynewcollection_0:org.apache.solr.client.solrj.SolrServerException:
>>>>>>> IOException occured when talking to server at:
>>>>>>> http://127.0.0.1:25990/solr
>>>>>>>                 at
>>>>>>> org.apache.solr.client.solrj.impl.HttpSolrServer.request(HttpSolrServer.java:414)
>>>>>>>                 at
>>>>>>> org.apache.solr.client.solrj.impl.HttpSolrServer.request(HttpSolrServer.java:182)
>>>>>>>                 at
>>>>>>> org.apache.solr.cloud.RecoveryStrategy.sendPrepRecoveryCmd(RecoveryStrategy.java:191)
>>>>>>>                 at
>>>>>>> org.apache.solr.cloud.RecoveryStrategy.doRecovery(RecoveryStrategy.java:320)
>>>>>>>                 at
>>>>>>> org.apache.solr.cloud.RecoveryStrategy.run(RecoveryStrategy.java:212)
>>>>>>>         Caused by: org.apache.http.conn.ConnectTimeoutException:
>>>>>>> Connect to 127.0.0.1:25990 timed out
>>>>>>>                 at
>>>>>>> org.apache.http.conn.scheme.PlainSocketFactory.connectSocket(PlainSocketFactory.java:125)
>>>>>>>                 at
>>>>>>> org.apache.http.impl.conn.DefaultClientConnectionOperator.openConnection(DefaultClientConnectionOperator.java:148)
>>>>>>>                 at
>>>>>>> org.apache.http.impl.conn.AbstractPoolEntry.open(AbstractPoolEntry.java:150)
>>>>>>>                 at
>>>>>>> org.apache.http.impl.conn.AbstractPooledConnAdapter.open(AbstractPooledConnAdapter.java:121)
>>>>>>>                 at
>>>>>>> org.apache.http.impl.client.DefaultRequestDirector.tryConnect(DefaultRequestDirector.java:575)
>>>>>>>                 at
>>>>>>> org.apache.http.impl.client.DefaultRequestDirector.execute(DefaultRequestDirector.java:425)
>>>>>>>                 at
>>>>>>> org.apache.http.impl.client.AbstractHttpClient.execute(AbstractHttpClient.java:820)
>>>>>>>                 at
>>>>>>> org.apache.http.impl.client.AbstractHttpClient.execute(AbstractHttpClient.java:754)
>>>>>>>                 at
>>>>>>> org.apache.http.impl.client.AbstractHttpClient.execute(AbstractHttpClient.java:732)
>>>>>>>                 at
>>>>>>> org.apache.solr.client.solrj.impl.HttpSolrServer.request(HttpSolrServer.java:353)
>>>>>>>                 ... 4 more
>>>>>>>
>>>>>>> 121610 T817 C2 P24212 oasc.RecoveryStrategy.doRecovery SEVERE
>>>>>>> Recovery failed - trying again... core=awholynewcollection_0
>>>>>>> ASYNC  NEW_CORE C3 name=collection3
>>>>>>> org.apache.solr.core.SolrCore@138684e7 url=
>>>>>>> http://127.0.0.1:37972/solr/collection3 node=127.0.0.1:37972_solr
>>>>>>> 122203 T825 C3 P37972 oasc.SolrException.log SEVERE Error while
>>>>>>> trying to recover.
>>>>>>> core=collection3:org.apache.solr.client.solrj.SolrServerException:
>>>>>>> IOException occured when talking to server at:
>>>>>>> http://127.0.0.1:30092/solr
>>>>>>>                 at
>>>>>>> org.apache.solr.client.solrj.impl.HttpSolrServer.request(HttpSolrServer.java:414)
>>>>>>>                 at
>>>>>>> org.apache.solr.client.solrj.impl.HttpSolrServer.request(HttpSolrServer.java:182)
>>>>>>>                 at
>>>>>>> org.apache.solr.cloud.RecoveryStrategy.sendPrepRecoveryCmd(RecoveryStrategy.java:191)
>>>>>>>                 at
>>>>>>> org.apache.solr.cloud.RecoveryStrategy.doRecovery(RecoveryStrategy.java:320)
>>>>>>>                 at
>>>>>>> org.apache.solr.cloud.RecoveryStrategy.run(RecoveryStrategy.java:212)
>>>>>>>         Caused by: org.apache.http.conn.ConnectTimeoutException:
>>>>>>> Connect to 127.0.0.1:30092 timed out
>>>>>>>                 at
>>>>>>> org.apache.http.conn.scheme.PlainSocketFactory.connectSocket(PlainSocketFactory.java:125)
>>>>>>>                 at
>>>>>>> org.apache.http.impl.conn.DefaultClientConnectionOperator.openConnection(DefaultClientConnectionOperator.java:148)
>>>>>>>                 at
>>>>>>> org.apache.http.impl.conn.AbstractPoolEntry.open(AbstractPoolEntry.java:150)
>>>>>>>                 at
>>>>>>> org.apache.http.impl.conn.AbstractPooledConnAdapter.open(AbstractPooledConnAdapter.java:121)
>>>>>>>                 at
>>>>>>> org.apache.http.impl.client.DefaultRequestDirector.tryConnect(DefaultRequestDirector.java:575)
>>>>>>>                 at
>>>>>>> org.apache.http.impl.client.DefaultRequestDirector.execute(DefaultRequestDirector.java:425)
>>>>>>>                 at
>>>>>>> org.apache.http.impl.client.AbstractHttpClient.execute(AbstractHttpClient.java:820)
>>>>>>>                 at
>>>>>>> org.apache.http.impl.client.AbstractHttpClient.execute(AbstractHttpClient.java:754)
>>>>>>>                 at
>>>>>>> org.apache.http.impl.client.AbstractHttpClient.execute(AbstractHttpClient.java:732)
>>>>>>>                 at
>>>>>>> org.apache.solr.client.solrj.impl.HttpSolrServer.request(HttpSolrServer.java:353)
>>>>>>>                 ... 4 more
>>>>>>>
>>>>>>> 122205 T825 C3 P37972 oasc.RecoveryStrategy.doRecovery SEVERE
>>>>>>> Recovery failed - trying again... core=collection3
>>>>>>> ASYNC  NEW_CORE C4 name=collection2
>>>>>>> org.apache.solr.core.SolrCore@3a577b23 url=
>>>>>>> http://127.0.0.1:37972/solr/collection2 node=127.0.0.1:37972_solr
>>>>>>> 153453 T829 C4 P37972 oasc.SolrException.log SEVERE Error while
>>>>>>> trying to recover.
>>>>>>> core=collection2:org.apache.solr.client.solrj.SolrServerException:
>>>>>>> IOException occured when talking to server at:
>>>>>>> http://127.0.0.1:24212/solr
>>>>>>>                 at
>>>>>>> org.apache.solr.client.solrj.impl.HttpSolrServer.request(HttpSolrServer.java:414)
>>>>>>>                 at
>>>>>>> org.apache.solr.client.solrj.impl.HttpSolrServer.request(HttpSolrServer.java:182)
>>>>>>>                 at
>>>>>>> org.apache.solr.cloud.RecoveryStrategy.sendPrepRecoveryCmd(RecoveryStrategy.java:191)
>>>>>>>                 at
>>>>>>> org.apache.solr.cloud.RecoveryStrategy.doRecovery(RecoveryStrategy.java:320)
>>>>>>>                 at
>>>>>>> org.apache.solr.cloud.RecoveryStrategy.run(RecoveryStrategy.java:212)
>>>>>>>         Caused by: org.apache.http.conn.ConnectTimeoutException:
>>>>>>> Connect to 127.0.0.1:24212 timed out
>>>>>>>                 at
>>>>>>> org.apache.http.conn.scheme.PlainSocketFactory.connectSocket(PlainSocketFactory.java:125)
>>>>>>>                 at
>>>>>>> org.apache.http.impl.conn.DefaultClientConnectionOperator.openConnection(DefaultClientConnectionOperator.java:148)
>>>>>>>                 at
>>>>>>> org.apache.http.impl.conn.AbstractPoolEntry.open(AbstractPoolEntry.java:150)
>>>>>>>                 at
>>>>>>> org.apache.http.impl.conn.AbstractPooledConnAdapter.open(AbstractPooledConnAdapter.java:121)
>>>>>>>                 at
>>>>>>> org.apache.http.impl.client.DefaultRequestDirector.tryConnect(DefaultRequestDirector.java:575)
>>>>>>>                 at
>>>>>>> org.apache.http.impl.client.DefaultRequestDirector.execute(DefaultRequestDirector.java:425)
>>>>>>>                 at
>>>>>>> org.apache.http.impl.client.AbstractHttpClient.execute(AbstractHttpClient.java:820)
>>>>>>>                 at
>>>>>>> org.apache.http.impl.client.AbstractHttpClient.execute(AbstractHttpClient.java:754)
>>>>>>>                 at
>>>>>>> org.apache.http.impl.client.AbstractHttpClient.execute(AbstractHttpClient.java:732)
>>>>>>>                 at
>>>>>>> org.apache.solr.client.solrj.impl.HttpSolrServer.request(HttpSolrServer.java:353)
>>>>>>>                 ... 4 more
>>>>>>>
>>>>>>> 153453 T829 C4 P37972 oasc.RecoveryStrategy.doRecovery SEVERE
>>>>>>> Recovery failed - trying again... core=collection2
>>>>>>>  C3_STATE=coll:collection3 core:collection3 props:{shard=shard1,
>>>>>>> roles=null, state=active, core=collection3, collection=collection3,
>>>>>>> node_name=127.0.0.1:37972_solr, base_url=http://127.0.0.1:37972/solr
>>>>>>> }
>>>>>>> 169218 T825 C3 P37972 oasc.SolrException.log SEVERE Error while
>>>>>>> trying to recover.
>>>>>>> core=collection3:org.apache.solr.client.solrj.SolrServerException:
>>>>>>> IOException occured when talking to server at:
>>>>>>> http://127.0.0.1:24212/solr
>>>>>>>                 at
>>>>>>> org.apache.solr.client.solrj.impl.HttpSolrServer.request(HttpSolrServer.java:414)
>>>>>>>                 at
>>>>>>> org.apache.solr.client.solrj.impl.HttpSolrServer.request(HttpSolrServer.java:182)
>>>>>>>                 at
>>>>>>> org.apache.solr.cloud.RecoveryStrategy.sendPrepRecoveryCmd(RecoveryStrategy.java:191)
>>>>>>>                 at
>>>>>>> org.apache.solr.cloud.RecoveryStrategy.doRecovery(RecoveryStrategy.java:320)
>>>>>>>                 at
>>>>>>> org.apache.solr.cloud.RecoveryStrategy.run(RecoveryStrategy.java:212)
>>>>>>>         Caused by: org.apache.http.conn.ConnectTimeoutException:
>>>>>>> Connect to 127.0.0.1:24212 timed out
>>>>>>>                 at
>>>>>>> org.apache.http.conn.scheme.PlainSocketFactory.connectSocket(PlainSocketFactory.java:125)
>>>>>>>                 at
>>>>>>> org.apache.http.impl.conn.DefaultClientConnectionOperator.openConnection(DefaultClientConnectionOperator.java:148)
>>>>>>>                 at
>>>>>>> org.apache.http.impl.conn.AbstractPoolEntry.open(AbstractPoolEntry.java:150)
>>>>>>>                 at
>>>>>>> org.apache.http.impl.conn.AbstractPooledConnAdapter.open(AbstractPooledConnAdapter.java:121)
>>>>>>>                 at
>>>>>>> org.apache.http.impl.client.DefaultRequestDirector.tryConnect(DefaultRequestDirector.java:575)
>>>>>>>                 at
>>>>>>> org.apache.http.impl.client.DefaultRequestDirector.execute(DefaultRequestDirector.java:425)
>>>>>>>                 at
>>>>>>> org.apache.http.impl.client.AbstractHttpClient.execute(AbstractHttpClient.java:820)
>>>>>>>                 at
>>>>>>> org.apache.http.impl.client.AbstractHttpClient.execute(AbstractHttpClient.java:754)
>>>>>>>                 at
>>>>>>> org.apache.http.impl.client.AbstractHttpClient.execute(AbstractHttpClient.java:732)
>>>>>>>                 at
>>>>>>> org.apache.solr.client.solrj.impl.HttpSolrServer.request(HttpSolrServer.java:353)
>>>>>>>                 ... 4 more
>>>>>>>
>>>>>>> 169218 T825 C3 P37972 oasc.RecoveryStrategy.doRecovery SEVERE
>>>>>>> Recovery failed - trying again... core=collection3
>>>>>>> Tests run: 1, Failures: 0, Errors: 0, Skipped: 0, Time elapsed:
>>>>>>> 172.218 sec
>>>>>>> Running org.apache.solr.handler.component.DebugComponentTest
>>>>>>> Creating dataDir:
>>>>>>> /usr/home/hudson/hudson-slave/workspace/Lucene-Solr-Maven-4.x/maven-build/solr/core/target/test/./solrtest-DebugComponentTest-1346553177252
>>>>>>> Tests run: 2, Failures: 0, Errors: 0, Skipped: 0, Time elapsed:
>>>>>>> 0.576 sec
>>>>>>> Running org.apache.solr.handler.admin.CoreAdminHandlerTest
>>>>>>> Creating dataDir:
>>>>>>> /usr/home/hudson/hudson-slave/workspace/Lucene-Solr-Maven-4.x/maven-build/solr/core/target/test/./solrtest-CoreAdminHandlerTest-1346553177828
>>>>>>> Tests run: 1, Failures: 0, Errors: 0, Skipped: 0, Time elapsed:
>>>>>>> 0.954 sec
>>>>>>> Running org.apache.solr.SolrInfoMBeanTest
>>>>>>> Creating dataDir:
>>>>>>> /usr/home/hudson/hudson-slave/workspace/Lucene-Solr-Maven-4.x/maven-build/solr/core/target/test/./solrtest-SolrInfoMBeanTest-1346553178783
>>>>>>> Tests run: 1, Failures: 0, Errors: 0, Skipped: 0, Time elapsed:
>>>>>>> 0.552 sec
>>>>>>> Running org.apache.solr.handler.DocumentAnalysisRequestHandlerTest
>>>>>>> Creating dataDir:
>>>>>>> /usr/home/hudson/hudson-slave/workspace/Lucene-Solr-Maven-4.x/maven-build/solr/core/target/test/./solrtest-DocumentAnalysisRequestHandlerTest-1346553179336
>>>>>>> Tests run: 4, Failures: 0, Errors: 0, Skipped: 0, Time elapsed:
>>>>>>> 0.504 sec
>>>>>>> Running org.apache.solr.cloud.BasicZkTest
>>>>>>> azt beforeclass
>>>>>>> Creating dataDir:
>>>>>>> /usr/home/hudson/hudson-slave/workspace/Lucene-Solr-Maven-4.x/maven-build/solr/core/target/test/./solrtest-BasicZkTest-1346553179840
>>>>>>> Tests run: 1, Failures: 0, Errors: 0, Skipped: 0, Time elapsed:
>>>>>>> 14.858 sec
>>>>>>> Running org.apache.solr.cloud.LeaderElectionTest
>>>>>>> Creating dataDir:
>>>>>>> /usr/home/hudson/hudson-slave/workspace/Lucene-Solr-Maven-4.x/maven-build/solr/core/target/test/./solrtest-LeaderElectionTest-1346553194700
>>>>>>> 3168 T901 oasc.LeaderElectionTest$ClientThread.run SEVERE setup
>>>>>>> failed org.apache.zookeeper.KeeperException$SessionExpiredException:
>>>>>>> KeeperErrorCode = Session expired for
>>>>>>> /collections/collection1/leader_elect/shard1/election
>>>>>>>         at
>>>>>>> org.apache.zookeeper.KeeperException.create(KeeperException.java:118)
>>>>>>>         at
>>>>>>> org.apache.zookeeper.KeeperException.create(KeeperException.java:42)
>>>>>>>         at org.apache.zookeeper.ZooKeeper.exists(ZooKeeper.java:815)
>>>>>>>         at
>>>>>>> org.apache.solr.common.cloud.SolrZkClient$4.execute(SolrZkClient.java:232)
>>>>>>>         at
>>>>>>> org.apache.solr.common.cloud.SolrZkClient$4.execute(SolrZkClient.java:229)
>>>>>>>         at
>>>>>>> org.apache.solr.common.cloud.ZkCmdExecutor.retryOperation(ZkCmdExecutor.java:67)
>>>>>>>         at
>>>>>>> org.apache.solr.common.cloud.SolrZkClient.exists(SolrZkClient.java:229)
>>>>>>>         at
>>>>>>> org.apache.solr.common.cloud.ZkCmdExecutor.ensureExists(ZkCmdExecutor.java:94)
>>>>>>>         at
>>>>>>> org.apache.solr.common.cloud.ZkCmdExecutor.ensureExists(ZkCmdExecutor.java:88)
>>>>>>>         at
>>>>>>> org.apache.solr.cloud.LeaderElector.setup(LeaderElector.java:279)
>>>>>>>         at
>>>>>>> org.apache.solr.cloud.LeaderElectionTest$ClientThread.setupOnConnect(LeaderElectionTest.java:116)
>>>>>>>         at
>>>>>>> org.apache.solr.cloud.LeaderElectionTest$ClientThread.run(LeaderElectionTest.java:125)
>>>>>>>         at
>>>>>>> java.util.concurrent.Executors$RunnableAdapter.call(Executors.java:471)
>>>>>>>         at
>>>>>>> java.util.concurrent.FutureTask$Sync.innerRun(FutureTask.java:334)
>>>>>>>         at java.util.concurrent.FutureTask.run(FutureTask.java:166)
>>>>>>>         at
>>>>>>> java.util.concurrent.ScheduledThreadPoolExecutor$ScheduledFutureTask.access$101(ScheduledThreadPoolExecutor.java:165)
>>>>>>>         at
>>>>>>> java.util.concurrent.ScheduledThreadPoolExecutor$ScheduledFutureTask.run(ScheduledThreadPoolExecutor.java:266)
>>>>>>>         at
>>>>>>> java.util.concurrent.ThreadPoolExecutor.runWorker(ThreadPoolExecutor.java:1110)
>>>>>>>         at
>>>>>>> java.util.concurrent.ThreadPoolExecutor$Worker.run(ThreadPoolExecutor.java:603)
>>>>>>>         at java.lang.Thread.run(Thread.java:679)
>>>>>>>
>>>>>>> 3187 T921 oasc.LeaderElectionTest$ClientThread.run SEVERE setup
>>>>>>> failed org.apache.zookeeper.KeeperException$SessionExpiredException:
>>>>>>> KeeperErrorCode = Session expired for
>>>>>>> /collections/collection1/leader_elect/shard1/election
>>>>>>>         at
>>>>>>> org.apache.zookeeper.KeeperException.create(KeeperException.java:118)
>>>>>>>         at
>>>>>>> org.apache.zookeeper.KeeperException.create(KeeperException.java:42)
>>>>>>>         at org.apache.zookeeper.ZooKeeper.exists(ZooKeeper.java:815)
>>>>>>>         at
>>>>>>> org.apache.solr.common.cloud.SolrZkClient$4.execute(SolrZkClient.java:232)
>>>>>>>         at
>>>>>>> org.apache.solr.common.cloud.SolrZkClient$4.execute(SolrZkClient.java:229)
>>>>>>>         at
>>>>>>> org.apache.solr.common.cloud.ZkCmdExecutor.retryOperation(ZkCmdExecutor.java:67)
>>>>>>>         at
>>>>>>> org.apache.solr.common.cloud.SolrZkClient.exists(SolrZkClient.java:229)
>>>>>>>         at
>>>>>>> org.apache.solr.common.cloud.ZkCmdExecutor.ensureExists(ZkCmdExecutor.java:94)
>>>>>>>         at
>>>>>>> org.apache.solr.common.cloud.ZkCmdExecutor.ensureExists(ZkCmdExecutor.java:88)
>>>>>>>         at
>>>>>>> org.apache.solr.cloud.LeaderElector.setup(LeaderElector.java:279)
>>>>>>>         at
>>>>>>> org.apache.solr.cloud.LeaderElectionTest$ClientThread.setupOnConnect(LeaderElectionTest.java:116)
>>>>>>>         at
>>>>>>> org.apache.solr.cloud.LeaderElectionTest$ClientThread.run(LeaderElectionTest.java:125)
>>>>>>>         at
>>>>>>> java.util.concurrent.Executors$RunnableAdapter.call(Executors.java:471)
>>>>>>>         at
>>>>>>> java.util.concurrent.FutureTask$Sync.innerRun(FutureTask.java:334)
>>>>>>>         at java.util.concurrent.FutureTask.run(FutureTask.java:166)
>>>>>>>         at
>>>>>>> java.util.concurrent.ScheduledThreadPoolExecutor$ScheduledFutureTask.access$101(ScheduledThreadPoolExecutor.java:165)
>>>>>>>         at
>>>>>>> java.util.concurrent.ScheduledThreadPoolExecutor$ScheduledFutureTask.run(ScheduledThreadPoolExecutor.java:266)
>>>>>>>         at
>>>>>>> java.util.concurrent.ThreadPoolExecutor.runWorker(ThreadPoolExecutor.java:1110)
>>>>>>>         at
>>>>>>> java.util.concurrent.ThreadPoolExecutor$Worker.run(ThreadPoolExecutor.java:603)
>>>>>>>         at java.lang.Thread.run(Thread.java:679)
>>>>>>>
>>>>>>> 3233 T894 oasc.LeaderElectionTest$ClientThread.run SEVERE setup
>>>>>>> failed org.apache.zookeeper.KeeperException$SessionExpiredException:
>>>>>>> KeeperErrorCode = Session expired for
>>>>>>> /collections/collection1/leader_elect/shard1/election
>>>>>>>         at
>>>>>>> org.apache.zookeeper.KeeperException.create(KeeperException.java:118)
>>>>>>>         at
>>>>>>> org.apache.zookeeper.KeeperException.create(KeeperException.java:42)
>>>>>>>         at org.apache.zookeeper.ZooKeeper.exists(ZooKeeper.java:815)
>>>>>>>         at
>>>>>>> org.apache.solr.common.cloud.SolrZkClient$4.execute(SolrZkClient.java:232)
>>>>>>>         at
>>>>>>> org.apache.solr.common.cloud.SolrZkClient$4.execute(SolrZkClient.java:229)
>>>>>>>         at
>>>>>>> org.apache.solr.common.cloud.ZkCmdExecutor.retryOperation(ZkCmdExecutor.java:67)
>>>>>>>         at
>>>>>>> org.apache.solr.common.cloud.SolrZkClient.exists(SolrZkClient.java:229)
>>>>>>>         at
>>>>>>> org.apache.solr.common.cloud.ZkCmdExecutor.ensureExists(ZkCmdExecutor.java:94)
>>>>>>>         at
>>>>>>> org.apache.solr.common.cloud.ZkCmdExecutor.ensureExists(ZkCmdExecutor.java:88)
>>>>>>>         at
>>>>>>> org.apache.solr.cloud.LeaderElector.setup(LeaderElector.java:279)
>>>>>>>         at
>>>>>>> org.apache.solr.cloud.LeaderElectionTest$ClientThread.setupOnConnect(LeaderElectionTest.java:116)
>>>>>>>         at
>>>>>>> org.apache.solr.cloud.LeaderElectionTest$ClientThread.run(LeaderElectionTest.java:125)
>>>>>>>         at
>>>>>>> java.util.concurrent.Executors$RunnableAdapter.call(Executors.java:471)
>>>>>>>         at
>>>>>>> java.util.concurrent.FutureTask$Sync.innerRun(FutureTask.java:334)
>>>>>>>         at java.util.concurrent.FutureTask.run(FutureTask.java:166)
>>>>>>>         at
>>>>>>> java.util.concurrent.ScheduledThreadPoolExecutor$ScheduledFutureTask.access$101(ScheduledThreadPoolExecutor.java:165)
>>>>>>>         at
>>>>>>> java.util.concurrent.ScheduledThreadPoolExecutor$ScheduledFutureTask.run(ScheduledThreadPoolExecutor.java:266)
>>>>>>>         at
>>>>>>> java.util.concurrent.ThreadPoolExecutor.runWorker(ThreadPoolExecutor.java:1110)
>>>>>>>         at
>>>>>>> java.util.concurrent.ThreadPoolExecutor$Worker.run(ThreadPoolExecutor.java:603)
>>>>>>>         at java.lang.Thread.run(Thread.java:679)
>>>>>>>
>>>>>>> 3292 T905 oasc.LeaderElectionTest$ClientThread.run SEVERE setup
>>>>>>> failed org.apache.zookeeper.KeeperException$SessionExpiredException:
>>>>>>> KeeperErrorCode = Session expired for
>>>>>>> /collections/collection1/leader_elect/shard1/election
>>>>>>>         at
>>>>>>> org.apache.zookeeper.KeeperException.create(KeeperException.java:118)
>>>>>>>         at
>>>>>>> org.apache.zookeeper.KeeperException.create(KeeperException.java:42)
>>>>>>>         at org.apache.zookeeper.ZooKeeper.exists(ZooKeeper.java:815)
>>>>>>>         at
>>>>>>> org.apache.solr.common.cloud.SolrZkClient$4.execute(SolrZkClient.java:232)
>>>>>>>         at
>>>>>>> org.apache.solr.common.cloud.SolrZkClient$4.execute(SolrZkClient.java:229)
>>>>>>>         at
>>>>>>> org.apache.solr.common.cloud.ZkCmdExecutor.retryOperation(ZkCmdExecutor.java:67)
>>>>>>>         at
>>>>>>> org.apache.solr.common.cloud.SolrZkClient.exists(SolrZkClient.java:229)
>>>>>>>         at
>>>>>>> org.apache.solr.common.cloud.ZkCmdExecutor.ensureExists(ZkCmdExecutor.java:94)
>>>>>>>         at
>>>>>>> org.apache.solr.common.cloud.ZkCmdExecutor.ensureExists(ZkCmdExecutor.java:88)
>>>>>>>         at
>>>>>>> org.apache.solr.cloud.LeaderElector.setup(LeaderElector.java:279)
>>>>>>>         at
>>>>>>> org.apache.solr.cloud.LeaderElectionTest$ClientThread.setupOnConnect(LeaderElectionTest.java:116)
>>>>>>>         at
>>>>>>> org.apache.solr.cloud.LeaderElectionTest$ClientThread.run(LeaderElectionTest.java:125)
>>>>>>>         at
>>>>>>> java.util.concurrent.Executors$RunnableAdapter.call(Executors.java:471)
>>>>>>>         at
>>>>>>> java.util.concurrent.FutureTask$Sync.innerRun(FutureTask.java:334)
>>>>>>>         at java.util.concurrent.FutureTask.run(FutureTask.java:166)
>>>>>>>         at
>>>>>>> java.util.concurrent.ScheduledThreadPoolExecutor$ScheduledFutureTask.access$101(ScheduledThreadPoolExecutor.java:165)
>>>>>>>         at
>>>>>>> java.util.concurrent.ScheduledThreadPoolExecutor$ScheduledFutureTask.run(ScheduledThreadPoolExecutor.java:266)
>>>>>>>         at
>>>>>>> java.util.concurrent.ThreadPoolExecutor.runWorker(ThreadPoolExecutor.java:1110)
>>>>>>>         at
>>>>>>> java.util.concurrent.ThreadPoolExecutor$Worker.run(ThreadPoolExecutor.java:603)
>>>>>>>         at java.lang.Thread.run(Thread.java:679)
>>>>>>>
>>>>>>> 6947 T894 oasc.LeaderElectionTest$ClientThread.run SEVERE setup
>>>>>>> failed java.lang.InterruptedException
>>>>>>>         at java.lang.Object.wait(Native Method)
>>>>>>>         at java.lang.Object.wait(Object.java:502)
>>>>>>>         at
>>>>>>> org.apache.zookeeper.ClientCnxn.submitRequest(ClientCnxn.java:1345)
>>>>>>>         at org.apache.zookeeper.ZooKeeper.exists(ZooKeeper.java:810)
>>>>>>>         at
>>>>>>> org.apache.solr.common.cloud.SolrZkClient$4.execute(SolrZkClient.java:232)
>>>>>>>         at
>>>>>>> org.apache.solr.common.cloud.SolrZkClient$4.execute(SolrZkClient.java:229)
>>>>>>>         at
>>>>>>> org.apache.solr.common.cloud.ZkCmdExecutor.retryOperation(ZkCmdExecutor.java:67)
>>>>>>>         at
>>>>>>> org.apache.solr.common.cloud.SolrZkClient.exists(SolrZkClient.java:229)
>>>>>>>         at
>>>>>>> org.apache.solr.common.cloud.ZkCmdExecutor.ensureExists(ZkCmdExecutor.java:94)
>>>>>>>         at
>>>>>>> org.apache.solr.common.cloud.ZkCmdExecutor.ensureExists(ZkCmdExecutor.java:88)
>>>>>>>         at
>>>>>>> org.apache.solr.cloud.LeaderElector.setup(LeaderElector.java:279)
>>>>>>>         at
>>>>>>> org.apache.solr.cloud.LeaderElectionTest$ClientThread.setupOnConnect(LeaderElectionTest.java:116)
>>>>>>>         at
>>>>>>> org.apache.solr.cloud.LeaderElectionTest$ClientThread.run(LeaderElectionTest.java:125)
>>>>>>>         at
>>>>>>> java.util.concurrent.Executors$RunnableAdapter.call(Executors.java:471)
>>>>>>>         at
>>>>>>> java.util.concurrent.FutureTask$Sync.innerRun(FutureTask.java:334)
>>>>>>>         at java.util.concurrent.FutureTask.run(FutureTask.java:166)
>>>>>>>         at
>>>>>>> java.util.concurrent.ScheduledThreadPoolExecutor$ScheduledFutureTask.access$101(ScheduledThreadPoolExecutor.java:165)
>>>>>>>         at
>>>>>>> java.util.concurrent.ScheduledThreadPoolExecutor$ScheduledFutureTask.run(ScheduledThreadPoolExecutor.java:266)
>>>>>>>         at
>>>>>>> java.util.concurrent.ThreadPoolExecutor.runWorker(ThreadPoolExecutor.java:1110)
>>>>>>>         at
>>>>>>> java.util.concurrent.ThreadPoolExecutor$Worker.run(ThreadPoolExecutor.java:603)
>>>>>>>         at java.lang.Thread.run(Thread.java:679)
>>>>>>>
>>>>>>> 13080 T990 oasc.SolrException.log SEVERE Failed setting
>>>>>>> watch:org.apache.zookeeper.KeeperException$NoNodeException: KeeperErrorCode
>>>>>>> = NoNode for
>>>>>>> /collections/collection1/leader_elect/shard1/election/88247710901010442-7-n_0000000003
>>>>>>>                 at
>>>>>>> org.apache.zookeeper.KeeperException.create(KeeperException.java:102)
>>>>>>>                 at
>>>>>>> org.apache.zookeeper.KeeperException.create(KeeperException.java:42)
>>>>>>>                 at
>>>>>>> org.apache.zookeeper.ZooKeeper.getData(ZooKeeper.java:927)
>>>>>>>                 at
>>>>>>> org.apache.solr.common.cloud.SolrZkClient$7.execute(SolrZkClient.java:301)
>>>>>>>                 at
>>>>>>> org.apache.solr.common.cloud.SolrZkClient$7.execute(SolrZkClient.java:298)
>>>>>>>                 at
>>>>>>> org.apache.solr.common.cloud.ZkCmdExecutor.retryOperation(ZkCmdExecutor.java:67)
>>>>>>>                 at
>>>>>>> org.apache.solr.common.cloud.SolrZkClient.getData(SolrZkClient.java:298)
>>>>>>>                 at
>>>>>>> org.apache.solr.cloud.LeaderElector.checkIfIamLeader(LeaderElector.java:120)
>>>>>>>                 at
>>>>>>> org.apache.solr.cloud.LeaderElector.access$000(LeaderElector.java:57)
>>>>>>>                 at
>>>>>>> org.apache.solr.cloud.LeaderElector$1.process(LeaderElector.java:132)
>>>>>>>                 at
>>>>>>> org.apache.zookeeper.ClientCnxn$EventThread.processEvent(ClientCnxn.java:526)
>>>>>>>                 at
>>>>>>> org.apache.zookeeper.ClientCnxn$EventThread.run(ClientCnxn.java:502)
>>>>>>>
>>>>>>> 14085 T960 oasc.SolrException.log SEVERE Failed setting
>>>>>>> watch:org.apache.zookeeper.KeeperException$NoNodeException: KeeperErrorCode
>>>>>>> = NoNode for
>>>>>>> /collections/collection1/leader_elect/shard1/election/88247710901010440-5-n_0000000002
>>>>>>>                 at
>>>>>>> org.apache.zookeeper.KeeperException.create(KeeperException.java:102)
>>>>>>>                 at
>>>>>>> org.apache.zookeeper.KeeperException.create(KeeperException.java:42)
>>>>>>>                 at
>>>>>>> org.apache.zookeeper.ZooKeeper.getData(ZooKeeper.java:927)
>>>>>>>                 at
>>>>>>> org.apache.solr.common.cloud.SolrZkClient$7.execute(SolrZkClient.java:301)
>>>>>>>                 at
>>>>>>> org.apache.solr.common.cloud.SolrZkClient$7.execute(SolrZkClient.java:298)
>>>>>>>                 at
>>>>>>> org.apache.solr.common.cloud.ZkCmdExecutor.retryOperation(ZkCmdExecutor.java:67)
>>>>>>>                 at
>>>>>>> org.apache.solr.common.cloud.SolrZkClient.getData(SolrZkClient.java:298)
>>>>>>>                 at
>>>>>>> org.apache.solr.cloud.LeaderElector.checkIfIamLeader(LeaderElector.java:120)
>>>>>>>                 at
>>>>>>> org.apache.solr.cloud.LeaderElector.access$000(LeaderElector.java:57)
>>>>>>>                 at
>>>>>>> org.apache.solr.cloud.LeaderElector$1.process(LeaderElector.java:132)
>>>>>>>                 at
>>>>>>> org.apache.zookeeper.ClientCnxn$EventThread.processEvent(ClientCnxn.java:526)
>>>>>>>                 at
>>>>>>> org.apache.zookeeper.ClientCnxn$EventThread.run(ClientCnxn.java:502)
>>>>>>>
>>>>>>> Tests run: 4, Failures: 0, Errors: 0, Skipped: 0, Time elapsed:
>>>>>>> 16.247 sec
>>>>>>> Running org.apache.solr.analysis.LegacyHTMLStripCharFilterTest
>>>>>>> Tests run: 13, Failures: 0, Errors: 0, Skipped: 1, Time elapsed:
>>>>>>> 0.283 sec
>>>>>>> Running org.apache.solr.core.PluginInfoTest
>>>>>>> Tests run: 9, Failures: 0, Errors: 0, Skipped: 0, Time elapsed:
>>>>>>> 0.082 sec
>>>>>>> Running org.apache.solr.spelling.SpellPossibilityIteratorTest
>>>>>>> Tests run: 3, Failures: 0, Errors: 0, Skipped: 0, Time elapsed:
>>>>>>> 0.653 sec
>>>>>>> Running org.apache.solr.TestDocumentBuilder
>>>>>>> doc1: SolrInputDocument[field1=value1, field2=value1, field3=value2,
>>>>>>> field4=15, field5=[45, 33, 20]]
>>>>>>> clone: SolrInputDocument[field1=value1, field2=value1,
>>>>>>> field3=value2, field4=15, field5=[45, 33, 20]]
>>>>>>> Tests run: 1, Failures: 0, Errors: 0, Skipped: 0, Time elapsed:
>>>>>>> 0.009 sec
>>>>>>> Running org.apache.solr.handler.MoreLikeThisHandlerTest
>>>>>>> Creating dataDir:
>>>>>>> /usr/home/hudson/hudson-slave/workspace/Lucene-Solr-Maven-4.x/maven-build/solr/core/target/test/./solrtest-MoreLikeThisHandlerTest-1346553211974
>>>>>>> Tests run: 1, Failures: 0, Errors: 0, Skipped: 0, Time elapsed:
>>>>>>> 0.381 sec
>>>>>>> Running org.apache.solr.cloud.ZkSolrClientTest
>>>>>>> Tests run: 4, Failures: 0, Errors: 0, Skipped: 0, Time elapsed:
>>>>>>> 7.482 sec
>>>>>>> Running org.apache.solr.core.TestJmxMonitoredMap
>>>>>>> Tests run: 2, Failures: 0, Errors: 0, Skipped: 0, Time elapsed:
>>>>>>> 0.143 sec
>>>>>>> Running org.apache.solr.schema.PreAnalyzedFieldTest
>>>>>>> Tests run: 3, Failures: 0, Errors: 0, Skipped: 0, Time elapsed:
>>>>>>> 0.035 sec
>>>>>>> Running org.apache.solr.core.TestSolrDeletionPolicy1
>>>>>>> Creating dataDir:
>>>>>>> /usr/home/hudson/hudson-slave/workspace/Lucene-Solr-Maven-4.x/maven-build/solr/core/target/test/./solrtest-TestSolrDeletionPolicy1-1346553220024
>>>>>>> Tests run: 3, Failures: 0, Errors: 0, Skipped: 0, Time elapsed:
>>>>>>> 0.776 sec
>>>>>>> Running
>>>>>>> org.apache.solr.update.processor.SignatureUpdateProcessorFactoryTest
>>>>>>> Creating dataDir:
>>>>>>> /usr/home/hudson/hudson-slave/workspace/Lucene-Solr-Maven-4.x/maven-build/solr/core/target/test/./solrtest-SignatureUpdateProcessorFactoryTest-1346553220803
>>>>>>> Tests run: 6, Failures: 0, Errors: 0, Skipped: 0, Time elapsed:
>>>>>>> 1.162 sec
>>>>>>> Running org.apache.solr.core.SOLR749Test
>>>>>>> Creating dataDir:
>>>>>>> /usr/home/hudson/hudson-slave/workspace/Lucene-Solr-Maven-4.x/maven-build/solr/core/target/test/./solrtest-SOLR749Test-1346553221959
>>>>>>> Tests run: 1, Failures: 0, Errors: 0, Skipped: 0, Time elapsed:
>>>>>>> 0.279 sec
>>>>>>> Running org.apache.solr.cloud.ZkControllerTest
>>>>>>> Creating dataDir:
>>>>>>> /usr/home/hudson/hudson-slave/workspace/Lucene-Solr-Maven-4.x/maven-build/solr/core/target/test/./solrtest-ZkControllerTest-1346553222237
>>>>>>> Tests run: 2, Failures: 0, Errors: 0, Skipped: 0, Time elapsed:
>>>>>>> 3.442 sec
>>>>>>> Running org.apache.solr.search.function.distance.DistanceFunctionTest
>>>>>>> Creating dataDir:
>>>>>>> /usr/home/hudson/hudson-slave/workspace/Lucene-Solr-Maven-4.x/maven-build/solr/core/target/test/./solrtest-DistanceFunctionTest-1346553225685
>>>>>>> Tests run: 3, Failures: 0, Errors: 0, Skipped: 0, Time elapsed:
>>>>>>> 0.642 sec
>>>>>>> Running org.apache.solr.update.SolrIndexConfigTest
>>>>>>> Tests run: 2, Failures: 0, Errors: 0, Skipped: 0, Time elapsed:
>>>>>>> 0.405 sec
>>>>>>> Running org.apache.solr.update.AutoCommitTest
>>>>>>> Tests run: 3, Failures: 0, Errors: 0, Skipped: 0, Time elapsed:
>>>>>>> 8.065 sec
>>>>>>> Running org.apache.solr.cloud.LeaderElectionIntegrationTest
>>>>>>> Creating dataDir:
>>>>>>> /usr/home/hudson/hudson-slave/workspace/Lucene-Solr-Maven-4.x/maven-build/solr/core/target/test/./solrtest-LeaderElectionIntegrationTest-1346553234803
>>>>>>> 7890 T1157 oasc.SyncStrategy.sync SEVERE No UpdateLog found - cannot
>>>>>>> sync
>>>>>>> 7895 T1160 oasc.SyncStrategy.sync SEVERE No UpdateLog found - cannot
>>>>>>> sync
>>>>>>> 7901 T1163 oasc.SyncStrategy.sync SEVERE No UpdateLog found - cannot
>>>>>>> sync
>>>>>>> 7906 T1166 oasc.SyncStrategy.sync SEVERE No UpdateLog found - cannot
>>>>>>> sync
>>>>>>> 7935 T1157 oasc.SyncStrategy.sync SEVERE No UpdateLog found - cannot
>>>>>>> sync
>>>>>>> 8994 T1160 oasc.SyncStrategy.sync SEVERE No UpdateLog found - cannot
>>>>>>> sync
>>>>>>> 10023 T1163 oasc.SyncStrategy.sync SEVERE No UpdateLog found -
>>>>>>> cannot sync
>>>>>>> 11026 T1166 oasc.SyncStrategy.sync SEVERE No UpdateLog found -
>>>>>>> cannot sync
>>>>>>> Creating dataDir:
>>>>>>> /usr/home/hudson/hudson-slave/workspace/Lucene-Solr-Maven-4.x/maven-build/solr/core/target/test/./solrtest-LeaderElectionIntegrationTest-1346553246983
>>>>>>> Tests run: 2, Failures: 0, Errors: 0, Skipped: 0, Time elapsed:
>>>>>>> 28.245 sec
>>>>>>> Running org.apache.solr.search.TestFoldingMultitermQuery
>>>>>>> Creating dataDir:
>>>>>>> /usr/home/hudson/hudson-slave/workspace/Lucene-Solr-Maven-4.x/maven-build/solr/core/target/test/./solrtest-TestFoldingMultitermQuery-1346553263049
>>>>>>> Tests run: 18, Failures: 0, Errors: 0, Skipped: 0, Time elapsed:
>>>>>>> 0.808 sec
>>>>>>> Running org.apache.solr.search.similarities.TestDFRSimilarityFactory
>>>>>>> Creating dataDir:
>>>>>>> /usr/home/hudson/hudson-slave/workspace/Lucene-Solr-Maven-4.x/maven-build/solr/core/target/test/./solrtest-TestDFRSimilarityFactory-1346553263854
>>>>>>> Tests run: 3, Failures: 0, Errors: 0, Skipped: 0, Time elapsed:
>>>>>>> 0.104 sec
>>>>>>> Running org.apache.solr.update.DocumentBuilderTest
>>>>>>> Creating dataDir:
>>>>>>> /usr/home/hudson/hudson-slave/workspace/Lucene-Solr-Maven-4.x/maven-build/solr/core/target/test/./solrtest-DocumentBuilderTest-1346553263962
>>>>>>> Tests run: 11, Failures: 0, Errors: 0, Skipped: 0, Time elapsed:
>>>>>>> 0.552 sec
>>>>>>> Running org.apache.solr.servlet.DirectSolrConnectionTest
>>>>>>> Tests run: 2, Failures: 0, Errors: 0, Skipped: 0, Time elapsed:
>>>>>>> 0.228 sec
>>>>>>> Running org.apache.solr.schema.NumericFieldsTest
>>>>>>> Creating dataDir:
>>>>>>> /usr/home/hudson/hudson-slave/workspace/Lucene-Solr-Maven-4.x/maven-build/solr/core/target/test/./solrtest-NumericFieldsTest-1346553264741
>>>>>>> Tests run: 1, Failures: 0, Errors: 0, Skipped: 0, Time elapsed:
>>>>>>> 0.266 sec
>>>>>>> Running org.apache.solr.TestDistributedGrouping
>>>>>>> Tests run: 1, Failures: 0, Errors: 0, Skipped: 0, Time elapsed:
>>>>>>> 12.954 sec
>>>>>>> Running org.apache.solr.cloud.OverseerTest
>>>>>>> Creating dataDir:
>>>>>>> /usr/home/hudson/hudson-slave/workspace/Lucene-Solr-Maven-4.x/maven-build/solr/core/target/test/./solrtest-OverseerTest-1346553277967
>>>>>>> Tests run: 8, Failures: 0, Errors: 0, Skipped: 0, Time elapsed:
>>>>>>> 34.847 sec
>>>>>>> Running org.apache.solr.spelling.suggest.SuggesterTSTTest
>>>>>>> Creating dataDir:
>>>>>>> /usr/home/hudson/hudson-slave/workspace/Lucene-Solr-Maven-4.x/maven-build/solr/core/target/test/./solrtest-SuggesterTSTTest-1346553312813
>>>>>>> NOTE: per solr.test.leavedatadir, dataDir will not be removed:
>>>>>>> /usr/home/hudson/hudson-slave/workspace/Lucene-Solr-Maven-4.x/maven-build/solr/core/target/test/./solrtest-SuggesterTSTTest-1346553312813
>>>>>>> Tests run: 4, Failures: 0, Errors: 0, Skipped: 0, Time elapsed:
>>>>>>> 0.862 sec
>>>>>>> Running org.apache.solr.response.TestPHPSerializedResponseWriter
>>>>>>> Creating dataDir:
>>>>>>> /usr/home/hudson/hudson-slave/workspace/Lucene-Solr-Maven-4.x/maven-build/solr/core/target/test/./solrtest-TestPHPSerializedResponseWriter-1346553313674
>>>>>>> Tests run: 2, Failures: 0, Errors: 0, Skipped: 0, Time elapsed:
>>>>>>> 0.497 sec
>>>>>>> Running org.apache.solr.TestSolrCoreProperties
>>>>>>> Tests run: 1, Failures: 0, Errors: 0, Skipped: 0, Time elapsed:
>>>>>>> 0.177 sec
>>>>>>> Running org.apache.solr.DisMaxRequestHandlerTest
>>>>>>> Creating dataDir:
>>>>>>> /usr/home/hudson/hudson-slave/workspace/Lucene-Solr-Maven-4.x/maven-build/solr/core/target/test/./solrtest-DisMaxRequestHandlerTest-1346553314349
>>>>>>> Tests run: 2, Failures: 0, Errors: 0, Skipped: 0, Time elapsed:
>>>>>>> 0.594 sec
>>>>>>> Running org.apache.solr.internal.csv.writer.CSVConfigTest
>>>>>>> Tests run: 7, Failures: 0, Errors: 0, Skipped: 0, Time elapsed:
>>>>>>> 0.002 sec
>>>>>>> Running org.apache.solr.schema.MultiTermTest
>>>>>>> Creating dataDir:
>>>>>>> /usr/home/hudson/hudson-slave/workspace/Lucene-Solr-Maven-4.x/maven-build/solr/core/target/test/./solrtest-MultiTermTest-1346553314948
>>>>>>> Tests run: 3, Failures: 0, Errors: 0, Skipped: 0, Time elapsed:
>>>>>>> 0.216 sec
>>>>>>> Running org.apache.solr.TestDistributedSearch
>>>>>>> Tests run: 1, Failures: 0, Errors: 0, Skipped: 0, Time elapsed:
>>>>>>> 90.456 sec
>>>>>>> Running org.apache.solr.core.AlternateDirectoryTest
>>>>>>> Creating dataDir:
>>>>>>> /usr/home/hudson/hudson-slave/workspace/Lucene-Solr-Maven-4.x/maven-build/solr/core/target/test/./solrtest-AlternateDirectoryTest-1346553405622
>>>>>>> Tests run: 1, Failures: 0, Errors: 0, Skipped: 0, Time elapsed:
>>>>>>> 0.415 sec
>>>>>>> Running org.apache.solr.search.TestStressVersions
>>>>>>> Creating dataDir:
>>>>>>> /usr/home/hudson/hudson-slave/workspace/Lucene-Solr-Maven-4.x/maven-build/solr/core/target/test/./solrtest-TestStressVersions-1346553406038
>>>>>>> Tests run: 1, Failures: 0, Errors: 0, Skipped: 0, Time elapsed:
>>>>>>> 3.752 sec
>>>>>>> Running org.apache.solr.search.similarities.TestBM25SimilarityFactory
>>>>>>> Creating dataDir:
>>>>>>> /usr/home/hudson/hudson-slave/workspace/Lucene-Solr-Maven-4.x/maven-build/solr/core/target/test/./solrtest-TestBM25SimilarityFactory-1346553409790
>>>>>>> Tests run: 2, Failures: 0, Errors: 0, Skipped: 0, Time elapsed:
>>>>>>> 0.094 sec
>>>>>>> Running org.apache.solr.search.TestQueryUtils
>>>>>>> Tests run: 1, Failures: 0, Errors: 0, Skipped: 0, Time elapsed:
>>>>>>> 0.611 sec
>>>>>>> Running org.apache.solr.handler.BinaryUpdateRequestHandlerTest
>>>>>>> Creating dataDir:
>>>>>>> /usr/home/hudson/hudson-slave/workspace/Lucene-Solr-Maven-4.x/maven-build/solr/core/target/test/./solrtest-BinaryUpdateRequestHandlerTest-1346553410497
>>>>>>> null
>>>>>>> Tests run: 1, Failures: 0, Errors: 0, Skipped: 0, Time elapsed:
>>>>>>> 0.622 sec
>>>>>>> Running org.apache.solr.schema.CurrencyFieldTest
>>>>>>> Creating dataDir:
>>>>>>> /usr/home/hudson/hudson-slave/workspace/Lucene-Solr-Maven-4.x/maven-build/solr/core/target/test/./solrtest-CurrencyFieldTest-1346553411122
>>>>>>> Tests run: 8, Failures: 0, Errors: 0, Skipped: 1, Time elapsed:
>>>>>>> 0.727 sec
>>>>>>> Running org.apache.solr.search.TestRTGBase
>>>>>>> Tests run: 0, Failures: 0, Errors: 0, Skipped: 0, Time elapsed:
>>>>>>> 0.017 sec
>>>>>>> Running org.apache.solr.search.SpatialFilterTest
>>>>>>> Creating dataDir:
>>>>>>> /usr/home/hudson/hudson-slave/workspace/Lucene-Solr-Maven-4.x/maven-build/solr/core/target/test/./solrtest-SpatialFilterTest-1346553411871
>>>>>>> Tests run: 3, Failures: 0, Errors: 0, Skipped: 0, Time elapsed:
>>>>>>> 0.931 sec
>>>>>>> Running org.apache.solr.core.RequestHandlersTest
>>>>>>> Creating dataDir:
>>>>>>> /usr/home/hudson/hudson-slave/workspace/Lucene-Solr-Maven-4.x/maven-build/solr/core/target/test/./solrtest-RequestHandlersTest-1346553412797
>>>>>>> Tests run: 3, Failures: 0, Errors: 0, Skipped: 0, Time elapsed:
>>>>>>> 0.522 sec
>>>>>>> Running org.apache.solr.servlet.NoCacheHeaderTest
>>>>>>> Creating dataDir:
>>>>>>> /usr/home/hudson/hudson-slave/workspace/Lucene-Solr-Maven-4.x/maven-build/solr/core/target/test/./solrtest-NoCacheHeaderTest-1346553413332
>>>>>>> Tests run: 3, Failures: 0, Errors: 0, Skipped: 0, Time elapsed:
>>>>>>> 0.531 sec
>>>>>>> Running org.apache.solr.search.TestSort
>>>>>>> Creating dataDir:
>>>>>>> /usr/home/hudson/hudson-slave/workspace/Lucene-Solr-Maven-4.x/maven-build/solr/core/target/test/./solrtest-TestSort-1346553413849
>>>>>>> Tests run: 2, Failures: 0, Errors: 0, Skipped: 0, Time elapsed:
>>>>>>> 4.064 sec
>>>>>>> Running org.apache.solr.cloud.ZkCLITest
>>>>>>> Creating dataDir:
>>>>>>> /usr/home/hudson/hudson-slave/workspace/Lucene-Solr-Maven-4.x/maven-build/solr/core/target/test/./solrtest-ZkCLITest-1346553417913
>>>>>>> Creating dataDir:
>>>>>>> /usr/home/hudson/hudson-slave/workspace/Lucene-Solr-Maven-4.x/maven-build/solr/core/target/test/./solrtest-ZkCLITest-1346553419171
>>>>>>> Creating dataDir:
>>>>>>> /usr/home/hudson/hudson-slave/workspace/Lucene-Solr-Maven-4.x/maven-build/solr/core/target/test/./solrtest-ZkCLITest-1346553419962
>>>>>>> Tests run: 3, Failures: 0, Errors: 0, Skipped: 0, Time elapsed:
>>>>>>> 5.199 sec
>>>>>>> Running org.apache.solr.OutputWriterTest
>>>>>>> Creating dataDir:
>>>>>>> /usr/home/hudson/hudson-slave/workspace/Lucene-Solr-Maven-4.x/maven-build/solr/core/target/test/./solrtest-OutputWriterTest-1346553423116
>>>>>>> Tests run: 5, Failures: 0, Errors: 0, Skipped: 0, Time elapsed:
>>>>>>> 0.266 sec
>>>>>>> Running org.apache.solr.update.UpdateParamsTest
>>>>>>> Tests run: 1, Failures: 0, Errors: 0, Skipped: 0, Time elapsed:
>>>>>>> 0.672 sec
>>>>>>> Running org.apache.solr.BasicFunctionalityTest
>>>>>>> Creating dataDir:
>>>>>>> /usr/home/hudson/hudson-slave/workspace/Lucene-Solr-Maven-4.x/maven-build/solr/core/target/test/./solrtest-BasicFunctionalityTest-1346553424057
>>>>>>> Tests run: 23, Failures: 0, Errors: 0, Skipped: 1, Time elapsed:
>>>>>>> 1.58 sec
>>>>>>> Running org.apache.solr.update.SoftAutoCommitTest
>>>>>>> Tests run: 3, Failures: 0, Errors: 0, Skipped: 0, Time elapsed:
>>>>>>> 9.253 sec
>>>>>>> Running org.apache.solr.search.TestRecovery
>>>>>>> Creating dataDir:
>>>>>>> /usr/home/hudson/hudson-slave/workspace/Lucene-Solr-Maven-4.x/maven-build/solr/core/target/test/./solrtest-TestRecovery-1346553434890
>>>>>>> Tests run: 9, Failures: 0, Errors: 0, Skipped: 0, Time elapsed:
>>>>>>> 6.241 sec
>>>>>>> Running org.apache.solr.spelling.SpellingQueryConverterTest
>>>>>>> Tests run: 5, Failures: 0, Errors: 0, Skipped: 0, Time elapsed:
>>>>>>> 0.035 sec
>>>>>>> Running org.apache.solr.core.TestCodecSupport
>>>>>>> Creating dataDir:
>>>>>>> /usr/home/hudson/hudson-slave/workspace/Lucene-Solr-Maven-4.x/maven-build/solr/core/target/test/./solrtest-TestCodecSupport-1346553441162
>>>>>>> Tests run: 3, Failures: 0, Errors: 0, Skipped: 0, Time elapsed:
>>>>>>> 0.074 sec
>>>>>>> Running org.apache.solr.util.TimeZoneUtilsTest
>>>>>>> Tests run: 5, Failures: 0, Errors: 0, Skipped: 0, Time elapsed:
>>>>>>> 0.114 sec
>>>>>>> Running org.apache.solr.core.TestQuerySenderNoQuery
>>>>>>> Creating dataDir:
>>>>>>> /usr/home/hudson/hudson-slave/workspace/Lucene-Solr-Maven-4.x/maven-build/solr/core/target/test/./solrtest-TestQuerySenderNoQuery-1346553441681
>>>>>>> Tests run: 3, Failures: 0, Errors: 0, Skipped: 0, Time elapsed:
>>>>>>> 0.725 sec
>>>>>>> Running
>>>>>>> org.apache.solr.handler.component.DistributedSpellCheckComponentTest
>>>>>>> Tests run: 1, Failures: 0, Errors: 0, Skipped: 0, Time elapsed:
>>>>>>> 7.274 sec
>>>>>>> Running org.apache.solr.handler.component.StatsComponentTest
>>>>>>> ASYNC  NEW_CORE C5 name=collection1
>>>>>>> org.apache.solr.core.SolrCore@61133cac
>>>>>>> 9539 T2154 C5 oasc.SolrException.log SEVERE
>>>>>>> org.apache.solr.common.SolrException: Stats can only facet on single-valued
>>>>>>> fields, not: foo_ss
>>>>>>>                 at
>>>>>>> org.apache.solr.handler.component.SimpleStats.getFieldCacheStats(StatsComponent.java:261)
>>>>>>>                 at
>>>>>>> org.apache.solr.handler.component.SimpleStats.getStatsFields(StatsComponent.java:227)
>>>>>>>                 at
>>>>>>> org.apache.solr.handler.component.SimpleStats.getStatsCounts(StatsComponent.j
>>>>>>
>>>>>> ...
>
>


-- 
Chris Male | Open Source Search Developer | elasticsearch |
www.e<http://www.dutchworks.nl>
lasticsearch.com

Mime
View raw message