lucene-dev mailing list archives

Site index · List index
Message view « Date » · « Thread »
Top « Date » · « Thread »
From Martijn v Groningen <martijn.v.gronin...@gmail.com>
Subject Re: [JENKINS] Lucene-Solr-Tests-4.x-Java6 - Build # 608 - Failure
Date Sun, 09 Sep 2012 23:52:13 GMT
Committed a fix for this.

On 9 September 2012 21:31, Michael McCandless <lucene@mikemccandless.com> wrote:
> This failure reproduces ... I'm not sure what's up ...
>
> ant test  -Dtestcase=GroupFacetCollectorTest -Dtests.method=testRandom
> -Dtests.seed=115039C6A89AE1D1 -Dtests.multiplier=3 -Dtests.slow=true
> -Dtests.locale=vi_VN -Dtests.timezone=Jamaica
> -Dtests.file.encoding=UTF-8
>
> Mike McCandless
>
> http://blog.mikemccandless.com
>
>
> On Sat, Sep 8, 2012 at 9:44 PM, Apache Jenkins Server
> <jenkins@builds.apache.org> wrote:
>> Build: https://builds.apache.org/job/Lucene-Solr-Tests-4.x-Java6/608/
>>
>> 1 tests failed.
>> REGRESSION:  org.apache.lucene.search.grouping.GroupFacetCollectorTest.testRandom
>>
>> Error Message:
>> expected:<9> but was:<8>
>>
>> Stack Trace:
>> java.lang.AssertionError: expected:<9> but was:<8>
>>         at __randomizedtesting.SeedInfo.seed([115039C6A89AE1D1:631C1CC919FA57A2]:0)
>>         at org.junit.Assert.fail(Assert.java:93)
>>         at org.junit.Assert.failNotEquals(Assert.java:647)
>>         at org.junit.Assert.assertEquals(Assert.java:128)
>>         at org.junit.Assert.assertEquals(Assert.java:472)
>>         at org.junit.Assert.assertEquals(Assert.java:456)
>>         at org.apache.lucene.search.grouping.GroupFacetCollectorTest.testRandom(GroupFacetCollectorTest.java:393)
>>         at sun.reflect.NativeMethodAccessorImpl.invoke0(Native Method)
>>         at sun.reflect.NativeMethodAccessorImpl.invoke(NativeMethodAccessorImpl.java:57)
>>         at sun.reflect.DelegatingMethodAccessorImpl.invoke(DelegatingMethodAccessorImpl.java:43)
>>         at java.lang.reflect.Method.invoke(Method.java:616)
>>         at com.carrotsearch.randomizedtesting.RandomizedRunner.invoke(RandomizedRunner.java:1559)
>>         at com.carrotsearch.randomizedtesting.RandomizedRunner.access$600(RandomizedRunner.java:79)
>>         at com.carrotsearch.randomizedtesting.RandomizedRunner$6.evaluate(RandomizedRunner.java:737)
>>         at com.carrotsearch.randomizedtesting.RandomizedRunner$7.evaluate(RandomizedRunner.java:773)
>>         at com.carrotsearch.randomizedtesting.RandomizedRunner$8.evaluate(RandomizedRunner.java:787)
>>         at org.apache.lucene.util.TestRuleSetupTeardownChained$1.evaluate(TestRuleSetupTeardownChained.java:50)
>>         at org.apache.lucene.util.TestRuleFieldCacheSanity$1.evaluate(TestRuleFieldCacheSanity.java:51)
>>         at org.apache.lucene.util.AbstractBeforeAfterRule$1.evaluate(AbstractBeforeAfterRule.java:45)
>>         at com.carrotsearch.randomizedtesting.rules.SystemPropertiesInvariantRule$1.evaluate(SystemPropertiesInvariantRule.java:55)
>>         at org.apache.lucene.util.TestRuleThreadAndTestName$1.evaluate(TestRuleThreadAndTestName.java:48)
>>         at org.apache.lucene.util.TestRuleIgnoreAfterMaxFailures$1.evaluate(TestRuleIgnoreAfterMaxFailures.java:70)
>>         at org.apache.lucene.util.TestRuleMarkFailure$1.evaluate(TestRuleMarkFailure.java:48)
>>         at com.carrotsearch.randomizedtesting.rules.StatementAdapter.evaluate(StatementAdapter.java:36)
>>         at com.carrotsearch.randomizedtesting.ThreadLeakControl$StatementRunner.run(ThreadLeakControl.java:358)
>>         at com.carrotsearch.randomizedtesting.ThreadLeakControl.forkTimeoutingTask(ThreadLeakControl.java:782)
>>         at com.carrotsearch.randomizedtesting.ThreadLeakControl$3.evaluate(ThreadLeakControl.java:442)
>>         at com.carrotsearch.randomizedtesting.RandomizedRunner.runSingleTest(RandomizedRunner.java:746)
>>         at com.carrotsearch.randomizedtesting.RandomizedRunner$3.evaluate(RandomizedRunner.java:648)
>>         at com.carrotsearch.randomizedtesting.RandomizedRunner$4.evaluate(RandomizedRunner.java:682)
>>         at com.carrotsearch.randomizedtesting.RandomizedRunner$5.evaluate(RandomizedRunner.java:693)
>>         at org.apache.lucene.util.AbstractBeforeAfterRule$1.evaluate(AbstractBeforeAfterRule.java:45)
>>         at org.apache.lucene.util.TestRuleStoreClassName$1.evaluate(TestRuleStoreClassName.java:42)
>>         at com.carrotsearch.randomizedtesting.rules.SystemPropertiesInvariantRule$1.evaluate(SystemPropertiesInvariantRule.java:55)
>>         at com.carrotsearch.randomizedtesting.rules.NoShadowingOrOverridesOnMethodsRule$1.evaluate(NoShadowingOrOverridesOnMethodsRule.java:39)
>>         at com.carrotsearch.randomizedtesting.rules.NoShadowingOrOverridesOnMethodsRule$1.evaluate(NoShadowingOrOverridesOnMethodsRule.java:39)
>>         at org.apache.lucene.util.TestRuleAssertionsRequired$1.evaluate(TestRuleAssertionsRequired.java:40)
>>         at org.apache.lucene.util.TestRuleMarkFailure$1.evaluate(TestRuleMarkFailure.java:48)
>>         at org.apache.lucene.util.TestRuleIgnoreAfterMaxFailures$1.evaluate(TestRuleIgnoreAfterMaxFailures.java:70)
>>         at org.apache.lucene.util.TestRuleIgnoreTestSuites$1.evaluate(TestRuleIgnoreTestSuites.java:55)
>>         at com.carrotsearch.randomizedtesting.rules.StatementAdapter.evaluate(StatementAdapter.java:36)
>>         at com.carrotsearch.randomizedtesting.ThreadLeakControl$StatementRunner.run(ThreadLeakControl.java:358)
>>         at java.lang.Thread.run(Thread.java:679)
>>
>>
>>
>>
>> Build Log:
>> [...truncated 5344 lines...]
>> [junit4:junit4] Suite: org.apache.lucene.search.grouping.GroupFacetCollectorTest
>> [junit4:junit4]   2> NOTE: reproduce with: ant test  -Dtestcase=GroupFacetCollectorTest
-Dtests.method=testRandom -Dtests.seed=115039C6A89AE1D1 -Dtests.multiplier=3 -Dtests.slow=true
-Dtests.locale=vi_VN -Dtests.timezone=Jamaica -Dtests.file.encoding=UTF-8
>> [junit4:junit4] FAILURE 3.44s J1 | GroupFacetCollectorTest.testRandom <<<
>> [junit4:junit4]    > Throwable #1: java.lang.AssertionError: expected:<9>
but was:<8>
>> [junit4:junit4]    >    at __randomizedtesting.SeedInfo.seed([115039C6A89AE1D1:631C1CC919FA57A2]:0)
>> [junit4:junit4]    >    at org.junit.Assert.fail(Assert.java:93)
>> [junit4:junit4]    >    at org.junit.Assert.failNotEquals(Assert.java:647)
>> [junit4:junit4]    >    at org.junit.Assert.assertEquals(Assert.java:128)
>> [junit4:junit4]    >    at org.junit.Assert.assertEquals(Assert.java:472)
>> [junit4:junit4]    >    at org.junit.Assert.assertEquals(Assert.java:456)
>> [junit4:junit4]    >    at org.apache.lucene.search.grouping.GroupFacetCollectorTest.testRandom(GroupFacetCollectorTest.java:393)
>> [junit4:junit4]    >    at sun.reflect.NativeMethodAccessorImpl.invoke0(Native
Method)
>> [junit4:junit4]    >    at sun.reflect.NativeMethodAccessorImpl.invoke(NativeMethodAccessorImpl.java:57)
>> [junit4:junit4]    >    at sun.reflect.DelegatingMethodAccessorImpl.invoke(DelegatingMethodAccessorImpl.java:43)
>> [junit4:junit4]    >    at java.lang.reflect.Method.invoke(Method.java:616)
>> [junit4:junit4]    >    at com.carrotsearch.randomizedtesting.RandomizedRunner.invoke(RandomizedRunner.java:1559)
>> [junit4:junit4]    >    at com.carrotsearch.randomizedtesting.RandomizedRunner.access$600(RandomizedRunner.java:79)
>> [junit4:junit4]    >    at com.carrotsearch.randomizedtesting.RandomizedRunner$6.evaluate(RandomizedRunner.java:737)
>> [junit4:junit4]    >    at com.carrotsearch.randomizedtesting.RandomizedRunner$7.evaluate(RandomizedRunner.java:773)
>> [junit4:junit4]    >    at com.carrotsearch.randomizedtesting.RandomizedRunner$8.evaluate(RandomizedRunner.java:787)
>> [junit4:junit4]    >    at org.apache.lucene.util.TestRuleSetupTeardownChained$1.evaluate(TestRuleSetupTeardownChained.java:50)
>> [junit4:junit4]    >    at org.apache.lucene.util.TestRuleFieldCacheSanity$1.evaluate(TestRuleFieldCacheSanity.java:51)
>> [junit4:junit4]    >    at org.apache.lucene.util.AbstractBeforeAfterRule$1.evaluate(AbstractBeforeAfterRule.java:45)
>> [junit4:junit4]    >    at com.carrotsearch.randomizedtesting.rules.SystemPropertiesInvariantRule$1.evaluate(SystemPropertiesInvariantRule.java:55)
>> [junit4:junit4]    >    at org.apache.lucene.util.TestRuleThreadAndTestName$1.evaluate(TestRuleThreadAndTestName.java:48)
>> [junit4:junit4]    >    at org.apache.lucene.util.TestRuleIgnoreAfterMaxFailures$1.evaluate(TestRuleIgnoreAfterMaxFailures.java:70)
>> [junit4:junit4]    >    at org.apache.lucene.util.TestRuleMarkFailure$1.evaluate(TestRuleMarkFailure.java:48)
>> [junit4:junit4]    >    at com.carrotsearch.randomizedtesting.rules.StatementAdapter.evaluate(StatementAdapter.java:36)
>> [junit4:junit4]    >    at com.carrotsearch.randomizedtesting.ThreadLeakControl$StatementRunner.run(ThreadLeakControl.java:358)
>> [junit4:junit4]    >    at com.carrotsearch.randomizedtesting.ThreadLeakControl.forkTimeoutingTask(ThreadLeakControl.java:782)
>> [junit4:junit4]    >    at com.carrotsearch.randomizedtesting.ThreadLeakControl$3.evaluate(ThreadLeakControl.java:442)
>> [junit4:junit4]    >    at com.carrotsearch.randomizedtesting.RandomizedRunner.runSingleTest(RandomizedRunner.java:746)
>> [junit4:junit4]    >    at com.carrotsearch.randomizedtesting.RandomizedRunner$3.evaluate(RandomizedRunner.java:648)
>> [junit4:junit4]    >    at com.carrotsearch.randomizedtesting.RandomizedRunner$4.evaluate(RandomizedRunner.java:682)
>> [junit4:junit4]    >    at com.carrotsearch.randomizedtesting.RandomizedRunner$5.evaluate(RandomizedRunner.java:693)
>> [junit4:junit4]    >    at org.apache.lucene.util.AbstractBeforeAfterRule$1.evaluate(AbstractBeforeAfterRule.java:45)
>> [junit4:junit4]    >    at org.apache.lucene.util.TestRuleStoreClassName$1.evaluate(TestRuleStoreClassName.java:42)
>> [junit4:junit4]    >    at com.carrotsearch.randomizedtesting.rules.SystemPropertiesInvariantRule$1.evaluate(SystemPropertiesInvariantRule.java:55)
>> [junit4:junit4]    >    at com.carrotsearch.randomizedtesting.rules.NoShadowingOrOverridesOnMethodsRule$1.evaluate(NoShadowingOrOverridesOnMethodsRule.java:39)
>> [junit4:junit4]    >    at com.carrotsearch.randomizedtesting.rules.NoShadowingOrOverridesOnMethodsRule$1.evaluate(NoShadowingOrOverridesOnMethodsRule.java:39)
>> [junit4:junit4]    >    at org.apache.lucene.util.TestRuleAssertionsRequired$1.evaluate(TestRuleAssertionsRequired.java:40)
>> [junit4:junit4]    >    at org.apache.lucene.util.TestRuleMarkFailure$1.evaluate(TestRuleMarkFailure.java:48)
>> [junit4:junit4]    >    at org.apache.lucene.util.TestRuleIgnoreAfterMaxFailures$1.evaluate(TestRuleIgnoreAfterMaxFailures.java:70)
>> [junit4:junit4]    >    at org.apache.lucene.util.TestRuleIgnoreTestSuites$1.evaluate(TestRuleIgnoreTestSuites.java:55)
>> [junit4:junit4]    >    at com.carrotsearch.randomizedtesting.rules.StatementAdapter.evaluate(StatementAdapter.java:36)
>> [junit4:junit4]    >    at com.carrotsearch.randomizedtesting.ThreadLeakControl$StatementRunner.run(ThreadLeakControl.java:358)
>> [junit4:junit4]    >    at java.lang.Thread.run(Thread.java:679)
>> [junit4:junit4]   2> NOTE: test params are: codec=Lucene40: {content=MockVariableIntBlock(baseBlockSize=79),
airport=PostingsFormat(name=Memory doPackFST= false), duration=Lucene40(minBlockSize=85 maxBlockSize=174),
facet=PostingsFormat(name=Memory doPackFST= false), hotel=PostingsFormat(name=MockSep), group=PostingsFormat(name=Memory
doPackFST= false), x=PostingsFormat(name=MockSep)}, sim=DefaultSimilarity, locale=vi_VN, timezone=Jamaica
>> [junit4:junit4]   2> NOTE: FreeBSD 9.0-RELEASE amd64/Sun Microsystems Inc. 1.6.0_32
(64-bit)/cpus=16,threads=1,free=94194928,total=110166016
>> [junit4:junit4]   2> NOTE: All tests run in this JVM: [GroupFacetCollectorTest]
>> [junit4:junit4] Completed on J1 in 4.53s, 3 tests, 1 failure <<< FAILURES!
>>
>> [...truncated 20 lines...]
>> BUILD FAILED
>> /usr/home/hudson/hudson-slave/workspace/Lucene-Solr-Tests-4.x-Java6/build.xml:29:
The following error occurred while executing this line:
>> /usr/home/hudson/hudson-slave/workspace/Lucene-Solr-Tests-4.x-Java6/lucene/build.xml:492:
The following error occurred while executing this line:
>> /usr/home/hudson/hudson-slave/workspace/Lucene-Solr-Tests-4.x-Java6/lucene/common-build.xml:1569:
The following error occurred while executing this line:
>> /usr/home/hudson/hudson-slave/workspace/Lucene-Solr-Tests-4.x-Java6/lucene/module-build.xml:63:
The following error occurred while executing this line:
>> /usr/home/hudson/hudson-slave/workspace/Lucene-Solr-Tests-4.x-Java6/lucene/common-build.xml:1133:
The following error occurred while executing this line:
>> /usr/home/hudson/hudson-slave/workspace/Lucene-Solr-Tests-4.x-Java6/lucene/common-build.xml:810:
There were test failures: 6 suites, 11 tests, 1 failure
>>
>> Total time: 12 minutes 28 seconds
>> Build step 'Invoke Ant' marked build as failure
>> Recording test results
>> Email was triggered for: Failure
>> Sending email for trigger: Failure
>>
>>
>>
>>
>> ---------------------------------------------------------------------
>> To unsubscribe, e-mail: dev-unsubscribe@lucene.apache.org
>> For additional commands, e-mail: dev-help@lucene.apache.org
>
> ---------------------------------------------------------------------
> To unsubscribe, e-mail: dev-unsubscribe@lucene.apache.org
> For additional commands, e-mail: dev-help@lucene.apache.org
>



-- 
Met vriendelijke groet,

Martijn van Groningen

---------------------------------------------------------------------
To unsubscribe, e-mail: dev-unsubscribe@lucene.apache.org
For additional commands, e-mail: dev-help@lucene.apache.org


Mime
View raw message