lucene-dev mailing list archives

Site index · List index
Message view « Date » · « Thread »
Top « Date » · « Thread »
From Apache Jenkins Server <jenk...@builds.apache.org>
Subject [JENKINS] Lucene-Solr-Tests-4.x-java7 - Build # 463 - Still Failing
Date Mon, 17 Sep 2012 13:34:26 GMT
Build: https://builds.apache.org/job/Lucene-Solr-Tests-4.x-java7/463/

2 tests failed.
REGRESSION:  org.apache.solr.cloud.SyncSliceTest.testDistribSearch

Error Message:
There are still nodes recoverying

Stack Trace:
java.lang.AssertionError: There are still nodes recoverying
	at __randomizedtesting.SeedInfo.seed([28AA5C2F778B5C8D:A94CD23700D43CB1]:0)
	at org.junit.Assert.fail(Assert.java:93)
	at org.apache.solr.cloud.AbstractDistribZkTestBase.waitForRecoveriesToFinish(AbstractDistribZkTestBase.java:154)
	at org.apache.solr.cloud.AbstractFullDistribZkTestBase.waitForRecoveriesToFinish(AbstractFullDistribZkTestBase.java:560)
	at org.apache.solr.cloud.AbstractFullDistribZkTestBase.waitForThingsToLevelOut(AbstractFullDistribZkTestBase.java:1135)
	at org.apache.solr.cloud.SyncSliceTest.doTest(SyncSliceTest.java:162)
	at org.apache.solr.BaseDistributedSearchTestCase.testDistribSearch(BaseDistributedSearchTestCase.java:695)
	at sun.reflect.NativeMethodAccessorImpl.invoke0(Native Method)
	at sun.reflect.NativeMethodAccessorImpl.invoke(NativeMethodAccessorImpl.java:57)
	at sun.reflect.DelegatingMethodAccessorImpl.invoke(DelegatingMethodAccessorImpl.java:43)
	at java.lang.reflect.Method.invoke(Method.java:601)
	at com.carrotsearch.randomizedtesting.RandomizedRunner.invoke(RandomizedRunner.java:1559)
	at com.carrotsearch.randomizedtesting.RandomizedRunner.access$600(RandomizedRunner.java:79)
	at com.carrotsearch.randomizedtesting.RandomizedRunner$6.evaluate(RandomizedRunner.java:737)
	at com.carrotsearch.randomizedtesting.RandomizedRunner$7.evaluate(RandomizedRunner.java:773)
	at com.carrotsearch.randomizedtesting.RandomizedRunner$8.evaluate(RandomizedRunner.java:787)
	at com.carrotsearch.randomizedtesting.rules.SystemPropertiesRestoreRule$1.evaluate(SystemPropertiesRestoreRule.java:53)
	at org.apache.lucene.util.TestRuleSetupTeardownChained$1.evaluate(TestRuleSetupTeardownChained.java:50)
	at org.apache.lucene.util.TestRuleFieldCacheSanity$1.evaluate(TestRuleFieldCacheSanity.java:51)
	at org.apache.lucene.util.AbstractBeforeAfterRule$1.evaluate(AbstractBeforeAfterRule.java:45)
	at com.carrotsearch.randomizedtesting.rules.SystemPropertiesInvariantRule$1.evaluate(SystemPropertiesInvariantRule.java:55)
	at org.apache.lucene.util.TestRuleThreadAndTestName$1.evaluate(TestRuleThreadAndTestName.java:48)
	at org.apache.lucene.util.TestRuleIgnoreAfterMaxFailures$1.evaluate(TestRuleIgnoreAfterMaxFailures.java:70)
	at org.apache.lucene.util.TestRuleMarkFailure$1.evaluate(TestRuleMarkFailure.java:48)
	at com.carrotsearch.randomizedtesting.rules.StatementAdapter.evaluate(StatementAdapter.java:36)
	at com.carrotsearch.randomizedtesting.ThreadLeakControl$StatementRunner.run(ThreadLeakControl.java:358)
	at com.carrotsearch.randomizedtesting.ThreadLeakControl.forkTimeoutingTask(ThreadLeakControl.java:782)
	at com.carrotsearch.randomizedtesting.ThreadLeakControl$3.evaluate(ThreadLeakControl.java:442)
	at com.carrotsearch.randomizedtesting.RandomizedRunner.runSingleTest(RandomizedRunner.java:746)
	at com.carrotsearch.randomizedtesting.RandomizedRunner$3.evaluate(RandomizedRunner.java:648)
	at com.carrotsearch.randomizedtesting.RandomizedRunner$4.evaluate(RandomizedRunner.java:682)
	at com.carrotsearch.randomizedtesting.RandomizedRunner$5.evaluate(RandomizedRunner.java:693)
	at com.carrotsearch.randomizedtesting.rules.StatementAdapter.evaluate(StatementAdapter.java:36)
	at com.carrotsearch.randomizedtesting.rules.SystemPropertiesRestoreRule$1.evaluate(SystemPropertiesRestoreRule.java:53)
	at org.apache.lucene.util.AbstractBeforeAfterRule$1.evaluate(AbstractBeforeAfterRule.java:45)
	at org.apache.lucene.util.TestRuleStoreClassName$1.evaluate(TestRuleStoreClassName.java:42)
	at com.carrotsearch.randomizedtesting.rules.SystemPropertiesInvariantRule$1.evaluate(SystemPropertiesInvariantRule.java:55)
	at com.carrotsearch.randomizedtesting.rules.NoShadowingOrOverridesOnMethodsRule$1.evaluate(NoShadowingOrOverridesOnMethodsRule.java:39)
	at com.carrotsearch.randomizedtesting.rules.NoShadowingOrOverridesOnMethodsRule$1.evaluate(NoShadowingOrOverridesOnMethodsRule.java:39)
	at com.carrotsearch.randomizedtesting.rules.StatementAdapter.evaluate(StatementAdapter.java:36)
	at org.apache.lucene.util.TestRuleAssertionsRequired$1.evaluate(TestRuleAssertionsRequired.java:43)
	at org.apache.lucene.util.TestRuleMarkFailure$1.evaluate(TestRuleMarkFailure.java:48)
	at org.apache.lucene.util.TestRuleIgnoreAfterMaxFailures$1.evaluate(TestRuleIgnoreAfterMaxFailures.java:70)
	at org.apache.lucene.util.TestRuleIgnoreTestSuites$1.evaluate(TestRuleIgnoreTestSuites.java:55)
	at com.carrotsearch.randomizedtesting.rules.StatementAdapter.evaluate(StatementAdapter.java:36)
	at com.carrotsearch.randomizedtesting.ThreadLeakControl$StatementRunner.run(ThreadLeakControl.java:358)
	at java.lang.Thread.run(Thread.java:722)


FAILED:  org.apache.solr.cloud.BasicDistributedZk2Test.testDistribSearch

Error Message:
Shard still reported as live in zk

Stack Trace:
java.lang.AssertionError: Shard still reported as live in zk
	at __randomizedtesting.SeedInfo.seed([28AA5C2F778B5C8D:A94CD23700D43CB1]:0)
	at org.junit.Assert.fail(Assert.java:93)
	at org.apache.solr.cloud.AbstractFullDistribZkTestBase.waitToSeeNotLive(AbstractFullDistribZkTestBase.java:1220)
	at org.apache.solr.cloud.BasicDistributedZk2Test.brindDownShardIndexSomeDocsAndRecover(BasicDistributedZk2Test.java:190)
	at org.apache.solr.cloud.BasicDistributedZk2Test.doTest(BasicDistributedZk2Test.java:83)
	at org.apache.solr.BaseDistributedSearchTestCase.testDistribSearch(BaseDistributedSearchTestCase.java:695)
	at sun.reflect.NativeMethodAccessorImpl.invoke0(Native Method)
	at sun.reflect.NativeMethodAccessorImpl.invoke(NativeMethodAccessorImpl.java:57)
	at sun.reflect.DelegatingMethodAccessorImpl.invoke(DelegatingMethodAccessorImpl.java:43)
	at java.lang.reflect.Method.invoke(Method.java:601)
	at com.carrotsearch.randomizedtesting.RandomizedRunner.invoke(RandomizedRunner.java:1559)
	at com.carrotsearch.randomizedtesting.RandomizedRunner.access$600(RandomizedRunner.java:79)
	at com.carrotsearch.randomizedtesting.RandomizedRunner$6.evaluate(RandomizedRunner.java:737)
	at com.carrotsearch.randomizedtesting.RandomizedRunner$7.evaluate(RandomizedRunner.java:773)
	at com.carrotsearch.randomizedtesting.RandomizedRunner$8.evaluate(RandomizedRunner.java:787)
	at com.carrotsearch.randomizedtesting.rules.SystemPropertiesRestoreRule$1.evaluate(SystemPropertiesRestoreRule.java:53)
	at org.apache.lucene.util.TestRuleSetupTeardownChained$1.evaluate(TestRuleSetupTeardownChained.java:50)
	at org.apache.lucene.util.TestRuleFieldCacheSanity$1.evaluate(TestRuleFieldCacheSanity.java:51)
	at org.apache.lucene.util.AbstractBeforeAfterRule$1.evaluate(AbstractBeforeAfterRule.java:45)
	at com.carrotsearch.randomizedtesting.rules.SystemPropertiesInvariantRule$1.evaluate(SystemPropertiesInvariantRule.java:55)
	at org.apache.lucene.util.TestRuleThreadAndTestName$1.evaluate(TestRuleThreadAndTestName.java:48)
	at org.apache.lucene.util.TestRuleIgnoreAfterMaxFailures$1.evaluate(TestRuleIgnoreAfterMaxFailures.java:70)
	at org.apache.lucene.util.TestRuleMarkFailure$1.evaluate(TestRuleMarkFailure.java:48)
	at com.carrotsearch.randomizedtesting.rules.StatementAdapter.evaluate(StatementAdapter.java:36)
	at com.carrotsearch.randomizedtesting.ThreadLeakControl$StatementRunner.run(ThreadLeakControl.java:358)
	at com.carrotsearch.randomizedtesting.ThreadLeakControl.forkTimeoutingTask(ThreadLeakControl.java:782)
	at com.carrotsearch.randomizedtesting.ThreadLeakControl$3.evaluate(ThreadLeakControl.java:442)
	at com.carrotsearch.randomizedtesting.RandomizedRunner.runSingleTest(RandomizedRunner.java:746)
	at com.carrotsearch.randomizedtesting.RandomizedRunner$3.evaluate(RandomizedRunner.java:648)
	at com.carrotsearch.randomizedtesting.RandomizedRunner$4.evaluate(RandomizedRunner.java:682)
	at com.carrotsearch.randomizedtesting.RandomizedRunner$5.evaluate(RandomizedRunner.java:693)
	at com.carrotsearch.randomizedtesting.rules.StatementAdapter.evaluate(StatementAdapter.java:36)
	at com.carrotsearch.randomizedtesting.rules.SystemPropertiesRestoreRule$1.evaluate(SystemPropertiesRestoreRule.java:53)
	at org.apache.lucene.util.AbstractBeforeAfterRule$1.evaluate(AbstractBeforeAfterRule.java:45)
	at org.apache.lucene.util.TestRuleStoreClassName$1.evaluate(TestRuleStoreClassName.java:42)
	at com.carrotsearch.randomizedtesting.rules.SystemPropertiesInvariantRule$1.evaluate(SystemPropertiesInvariantRule.java:55)
	at com.carrotsearch.randomizedtesting.rules.NoShadowingOrOverridesOnMethodsRule$1.evaluate(NoShadowingOrOverridesOnMethodsRule.java:39)
	at com.carrotsearch.randomizedtesting.rules.NoShadowingOrOverridesOnMethodsRule$1.evaluate(NoShadowingOrOverridesOnMethodsRule.java:39)
	at com.carrotsearch.randomizedtesting.rules.StatementAdapter.evaluate(StatementAdapter.java:36)
	at org.apache.lucene.util.TestRuleAssertionsRequired$1.evaluate(TestRuleAssertionsRequired.java:43)
	at org.apache.lucene.util.TestRuleMarkFailure$1.evaluate(TestRuleMarkFailure.java:48)
	at org.apache.lucene.util.TestRuleIgnoreAfterMaxFailures$1.evaluate(TestRuleIgnoreAfterMaxFailures.java:70)
	at org.apache.lucene.util.TestRuleIgnoreTestSuites$1.evaluate(TestRuleIgnoreTestSuites.java:55)
	at com.carrotsearch.randomizedtesting.rules.StatementAdapter.evaluate(StatementAdapter.java:36)
	at com.carrotsearch.randomizedtesting.ThreadLeakControl$StatementRunner.run(ThreadLeakControl.java:358)
	at java.lang.Thread.run(Thread.java:722)




Build Log:
[...truncated 7804 lines...]
[junit4:junit4] Suite: org.apache.solr.cloud.BasicDistributedZk2Test
[junit4:junit4]   2> 6 T1371 oas.SolrTestCaseJ4.setUp ###Starting testDistribSearch
[junit4:junit4]   2> Creating dataDir: /usr/home/hudson/hudson-slave/workspace/Lucene-Solr-Tests-4.x-java7/solr/build/solr-core/test/J1/./solrtest-BasicDistributedZk2Test-1347888266842
[junit4:junit4]   2> 7 T1371 oasc.ZkTestServer.run STARTING ZK TEST SERVER
[junit4:junit4]   2> 11 T1372 oazs.ZooKeeperServer.setTickTime tickTime set to 1000
[junit4:junit4]   2> 12 T1372 oazs.NIOServerCnxn$Factory.<init> binding to port 0.0.0.0/0.0.0.0:0
[junit4:junit4]   2> 13 T1372 oazsp.FileTxnSnapLog.save Snapshotting: 0
[junit4:junit4]   2> 109 T1371 oasc.ZkTestServer.run start zk server on port:18103
[junit4:junit4]   2> 109 T1371 oaz.ZooKeeper.<init> Initiating client connection, connectString=127.0.0.1:18103 sessionTimeout=10000 watcher=org.apache.solr.common.cloud.ConnectionManager@441d5bec
[junit4:junit4]   2> 110 T1377 oaz.ClientCnxn$SendThread.startConnect Opening socket connection to server /127.0.0.1:18103
[junit4:junit4]   2> 110 T1371 oascc.ConnectionManager.waitForConnected Waiting for client to connect to ZooKeeper
[junit4:junit4]   2> 111 T1377 oaz.ClientCnxn$SendThread.primeConnection Socket connection established to localhost/127.0.0.1:18103, initiating session
[junit4:junit4]   2> 112 T1373 oazs.NIOServerCnxn$Factory.run Accepted socket connection from /140.211.11.196:18104
[junit4:junit4]   2> 112 T1373 oazs.NIOServerCnxn.readConnectRequest Client attempting to establish new session at /140.211.11.196:18104
[junit4:junit4]   2> 112 T1375 oazsp.FileTxnLog.append Creating new log file: log.1
[junit4:junit4]   2> 116 T1375 oazs.NIOServerCnxn.finishSessionInit Established session 0x139d466be610000 with negotiated timeout 10000 for client /140.211.11.196:18104
[junit4:junit4]   2> 116 T1377 oaz.ClientCnxn$SendThread.readConnectResult Session establishment complete on server localhost/127.0.0.1:18103, sessionid = 0x139d466be610000, negotiated timeout = 10000
[junit4:junit4]   2> 116 T1378 oascc.ConnectionManager.process Watcher org.apache.solr.common.cloud.ConnectionManager@441d5bec name:ZooKeeperConnection Watcher:127.0.0.1:18103 got event WatchedEvent state:SyncConnected type:None path:null path:null type:None
[junit4:junit4]   2> 116 T1371 oascc.ConnectionManager.waitForConnected Client is connected to ZooKeeper
[junit4:junit4]   2> 117 T1371 oascc.SolrZkClient.makePath makePath: /solr
[junit4:junit4]   2> 120 T1376 oazs.PrepRequestProcessor.pRequest Processed session termination for sessionid: 0x139d466be610000
[junit4:junit4]   2> 128 T1378 oaz.ClientCnxn$EventThread.run EventThread shut down
[junit4:junit4]   2> 128 T1371 oaz.ZooKeeper.close Session: 0x139d466be610000 closed
[junit4:junit4]   2> 130 T1373 oazs.NIOServerCnxn.closeSock Closed socket connection for client /140.211.11.196:18104 which had sessionid 0x139d466be610000
[junit4:junit4]   2> 132 T1371 oaz.ZooKeeper.<init> Initiating client connection, connectString=127.0.0.1:18103/solr sessionTimeout=10000 watcher=org.apache.solr.common.cloud.ConnectionManager@7fb1e0d6
[junit4:junit4]   2> 133 T1379 oaz.ClientCnxn$SendThread.startConnect Opening socket connection to server /127.0.0.1:18103
[junit4:junit4]   2> 133 T1371 oascc.ConnectionManager.waitForConnected Waiting for client to connect to ZooKeeper
[junit4:junit4]   2> 134 T1379 oaz.ClientCnxn$SendThread.primeConnection Socket connection established to localhost/127.0.0.1:18103, initiating session
[junit4:junit4]   2> 134 T1373 oazs.NIOServerCnxn$Factory.run Accepted socket connection from /140.211.11.196:18105
[junit4:junit4]   2> 134 T1373 oazs.NIOServerCnxn.readConnectRequest Client attempting to establish new session at /140.211.11.196:18105
[junit4:junit4]   2> 136 T1375 oazs.NIOServerCnxn.finishSessionInit Established session 0x139d466be610001 with negotiated timeout 10000 for client /140.211.11.196:18105
[junit4:junit4]   2> 136 T1379 oaz.ClientCnxn$SendThread.readConnectResult Session establishment complete on server localhost/127.0.0.1:18103, sessionid = 0x139d466be610001, negotiated timeout = 10000
[junit4:junit4]   2> 136 T1380 oascc.ConnectionManager.process Watcher org.apache.solr.common.cloud.ConnectionManager@7fb1e0d6 name:ZooKeeperConnection Watcher:127.0.0.1:18103/solr got event WatchedEvent state:SyncConnected type:None path:null path:null type:None
[junit4:junit4]   2> 136 T1371 oascc.ConnectionManager.waitForConnected Client is connected to ZooKeeper
[junit4:junit4]   2> 137 T1371 oascc.SolrZkClient.makePath makePath: /collections/collection1
[junit4:junit4]   2> 146 T1371 oascc.SolrZkClient.makePath makePath: /collections/collection1/shards
[junit4:junit4]   2> 148 T1371 oascc.SolrZkClient.makePath makePath: /collections/control_collection
[junit4:junit4]   2> 150 T1371 oascc.SolrZkClient.makePath makePath: /collections/control_collection/shards
[junit4:junit4]   2> 158 T1371 oasc.AbstractZkTestCase.putConfig put /usr/home/hudson/hudson-slave/workspace/Lucene-Solr-Tests-4.x-java7/solr/build/solr-core/test-files/solr/collection1/conf/solrconfig.xml to /configs/conf1/solrconfig.xml
[junit4:junit4]   2> 159 T1371 oascc.SolrZkClient.makePath makePath: /configs/conf1/solrconfig.xml
[junit4:junit4]   2> 170 T1371 oasc.AbstractZkTestCase.putConfig put /usr/home/hudson/hudson-slave/workspace/Lucene-Solr-Tests-4.x-java7/solr/build/solr-core/test-files/solr/collection1/conf/schema.xml to /configs/conf1/schema.xml
[junit4:junit4]   2> 171 T1371 oascc.SolrZkClient.makePath makePath: /configs/conf1/schema.xml
[junit4:junit4]   2> 274 T1371 oasc.AbstractZkTestCase.putConfig put /usr/home/hudson/hudson-slave/workspace/Lucene-Solr-Tests-4.x-java7/solr/build/solr-core/test-files/solr/collection1/conf/solrconfig.xml to /configs/conf1/solrconfig.xml
[junit4:junit4]   2> 275 T1371 oascc.SolrZkClient.makePath makePath: /configs/conf1/solrconfig.xml
[junit4:junit4]   2> 279 T1371 oasc.AbstractZkTestCase.putConfig put /usr/home/hudson/hudson-slave/workspace/Lucene-Solr-Tests-4.x-java7/solr/build/solr-core/test-files/solr/collection1/conf/stopwords.txt to /configs/conf1/stopwords.txt
[junit4:junit4]   2> 280 T1371 oascc.SolrZkClient.makePath makePath: /configs/conf1/stopwords.txt
[junit4:junit4]   2> 295 T1371 oasc.AbstractZkTestCase.putConfig put /usr/home/hudson/hudson-slave/workspace/Lucene-Solr-Tests-4.x-java7/solr/build/solr-core/test-files/solr/collection1/conf/protwords.txt to /configs/conf1/protwords.txt
[junit4:junit4]   2> 296 T1371 oascc.SolrZkClient.makePath makePath: /configs/conf1/protwords.txt
[junit4:junit4]   2> 299 T1371 oasc.AbstractZkTestCase.putConfig put /usr/home/hudson/hudson-slave/workspace/Lucene-Solr-Tests-4.x-java7/solr/build/solr-core/test-files/solr/collection1/conf/currency.xml to /configs/conf1/currency.xml
[junit4:junit4]   2> 300 T1371 oascc.SolrZkClient.makePath makePath: /configs/conf1/currency.xml
[junit4:junit4]   2> 303 T1371 oasc.AbstractZkTestCase.putConfig put /usr/home/hudson/hudson-slave/workspace/Lucene-Solr-Tests-4.x-java7/solr/build/solr-core/test-files/solr/collection1/conf/open-exchange-rates.json to /configs/conf1/open-exchange-rates.json
[junit4:junit4]   2> 304 T1371 oascc.SolrZkClient.makePath makePath: /configs/conf1/open-exchange-rates.json
[junit4:junit4]   2> 307 T1371 oasc.AbstractZkTestCase.putConfig put /usr/home/hudson/hudson-slave/workspace/Lucene-Solr-Tests-4.x-java7/solr/build/solr-core/test-files/solr/collection1/conf/mapping-ISOLatin1Accent.txt to /configs/conf1/mapping-ISOLatin1Accent.txt
[junit4:junit4]   2> 308 T1371 oascc.SolrZkClient.makePath makePath: /configs/conf1/mapping-ISOLatin1Accent.txt
[junit4:junit4]   2> 310 T1371 oasc.AbstractZkTestCase.putConfig put /usr/home/hudson/hudson-slave/workspace/Lucene-Solr-Tests-4.x-java7/solr/build/solr-core/test-files/solr/collection1/conf/old_synonyms.txt to /configs/conf1/old_synonyms.txt
[junit4:junit4]   2> 311 T1371 oascc.SolrZkClient.makePath makePath: /configs/conf1/old_synonyms.txt
[junit4:junit4]   2> 318 T1371 oasc.AbstractZkTestCase.putConfig put /usr/home/hudson/hudson-slave/workspace/Lucene-Solr-Tests-4.x-java7/solr/build/solr-core/test-files/solr/collection1/conf/synonyms.txt to /configs/conf1/synonyms.txt
[junit4:junit4]   2> 319 T1371 oascc.SolrZkClient.makePath makePath: /configs/conf1/synonyms.txt
[junit4:junit4]   2> 322 T1376 oazs.PrepRequestProcessor.pRequest Processed session termination for sessionid: 0x139d466be610001
[junit4:junit4]   2> 323 T1380 oaz.ClientCnxn$EventThread.run EventThread shut down
[junit4:junit4]   2> 323 T1373 oazs.NIOServerCnxn.closeSock Closed socket connection for client /140.211.11.196:18105 which had sessionid 0x139d466be610001
[junit4:junit4]   2> 323 T1371 oaz.ZooKeeper.close Session: 0x139d466be610001 closed
[junit4:junit4]   2> 327 T1371 oejs.Server.doStart jetty-8.1.2.v20120308
[junit4:junit4]   2> 332 T1371 oejs.AbstractConnector.doStart Started SocketConnector@0.0.0.0:18106
[junit4:junit4]   2> 333 T1371 oasc.SolrResourceLoader.locateSolrHome JNDI not configured for solr (NoInitialContextEx)
[junit4:junit4]   2> 334 T1371 oasc.SolrResourceLoader.locateSolrHome using system property solr.solr.home: /usr/home/hudson/hudson-slave/workspace/Lucene-Solr-Tests-4.x-java7/solr/build/solr-core/test-files/solr
[junit4:junit4]   2> 334 T1371 oasc.SolrResourceLoader.<init> new SolrResourceLoader for deduced Solr Home: '/usr/home/hudson/hudson-slave/workspace/Lucene-Solr-Tests-4.x-java7/solr/build/solr-core/test-files/solr/'
[junit4:junit4]   2> 417 T1371 oass.SolrDispatchFilter.init SolrDispatchFilter.init()
[junit4:junit4]   2> 418 T1371 oasc.SolrResourceLoader.locateSolrHome JNDI not configured for solr (NoInitialContextEx)
[junit4:junit4]   2> 418 T1371 oasc.SolrResourceLoader.locateSolrHome using system property solr.solr.home: /usr/home/hudson/hudson-slave/workspace/Lucene-Solr-Tests-4.x-java7/solr/build/solr-core/test-files/solr
[junit4:junit4]   2> 419 T1371 oasc.CoreContainer$Initializer.initialize looking for solr.xml: /usr/home/hudson/hudson-slave/workspace/Lucene-Solr-Tests-4.x-java7/solr/build/solr-core/test-files/solr/solr.xml
[junit4:junit4]   2> 420 T1371 oasc.CoreContainer.<init> New CoreContainer 1621590725
[junit4:junit4]   2> 421 T1371 oasc.CoreContainer.load Loading CoreContainer using Solr Home: '/usr/home/hudson/hudson-slave/workspace/Lucene-Solr-Tests-4.x-java7/solr/build/solr-core/test-files/solr/'
[junit4:junit4]   2> 422 T1371 oasc.SolrResourceLoader.<init> new SolrResourceLoader for directory: '/usr/home/hudson/hudson-slave/workspace/Lucene-Solr-Tests-4.x-java7/solr/build/solr-core/test-files/solr/'
[junit4:junit4]   2> 481 T1371 oasc.CoreContainer.load Registering Log Listener
[junit4:junit4]   2> 508 T1371 oasc.CoreContainer.initZooKeeper Zookeeper client=127.0.0.1:18103/solr
[junit4:junit4]   2> 509 T1371 oaz.ZooKeeper.<init> Initiating client connection, connectString=127.0.0.1:18103/solr sessionTimeout=5000 watcher=org.apache.solr.common.cloud.ConnectionManager@45813c1b
[junit4:junit4]   2> 510 T1390 oaz.ClientCnxn$SendThread.startConnect Opening socket connection to server /127.0.0.1:18103
[junit4:junit4]   2> 510 T1371 oascc.ConnectionManager.waitForConnected Waiting for client to connect to ZooKeeper
[junit4:junit4]   2> 512 T1390 oaz.ClientCnxn$SendThread.primeConnection Socket connection established to localhost/127.0.0.1:18103, initiating session
[junit4:junit4]   2> 512 T1373 oazs.NIOServerCnxn$Factory.run Accepted socket connection from /140.211.11.196:18107
[junit4:junit4]   2> 512 T1373 oazs.NIOServerCnxn.readConnectRequest Client attempting to establish new session at /140.211.11.196:18107
[junit4:junit4]   2> 640 T1375 oazs.NIOServerCnxn.finishSessionInit Established session 0x139d466be610002 with negotiated timeout 5000 for client /140.211.11.196:18107
[junit4:junit4]   2> 640 T1390 oaz.ClientCnxn$SendThread.readConnectResult Session establishment complete on server localhost/127.0.0.1:18103, sessionid = 0x139d466be610002, negotiated timeout = 5000
[junit4:junit4]   2> 641 T1391 oascc.ConnectionManager.process Watcher org.apache.solr.common.cloud.ConnectionManager@45813c1b name:ZooKeeperConnection Watcher:127.0.0.1:18103/solr got event WatchedEvent state:SyncConnected type:None path:null path:null type:None
[junit4:junit4]   2> 641 T1371 oascc.ConnectionManager.waitForConnected Client is connected to ZooKeeper
[junit4:junit4]   2> 651 T1376 oazs.PrepRequestProcessor.pRequest Got user-level KeeperException when processing sessionid:0x139d466be610002 type:create cxid:0x2 zxid:0xfffffffffffffffe txntype:unknown reqpath:n/a Error Path:/solr/overseer Error:KeeperErrorCode = NodeExists for /solr/overseer
[junit4:junit4]   2> 659 T1371 oascc.SolrZkClient.makePath makePath: /live_nodes
[junit4:junit4]   2> 668 T1371 oasc.ZkController.createEphemeralLiveNode Register node as live in ZooKeeper:/live_nodes/127.0.0.1:18106_solr
[junit4:junit4]   2> 669 T1376 oazs.PrepRequestProcessor.pRequest Got user-level KeeperException when processing sessionid:0x139d466be610002 type:delete cxid:0x7 zxid:0xfffffffffffffffe txntype:unknown reqpath:n/a Error Path:/solr/live_nodes/127.0.0.1:18106_solr Error:KeeperErrorCode = NoNode for /solr/live_nodes/127.0.0.1:18106_solr
[junit4:junit4]   2> 680 T1371 oascc.SolrZkClient.makePath makePath: /live_nodes/127.0.0.1:18106_solr
[junit4:junit4]   2> 689 T1371 oashc.HttpShardHandlerFactory.getParameter Setting socketTimeout to: 0
[junit4:junit4]   2> 689 T1371 oashc.HttpShardHandlerFactory.getParameter Setting urlScheme to: http://
[junit4:junit4]   2> 690 T1371 oashc.HttpShardHandlerFactory.getParameter Setting connTimeout to: 0
[junit4:junit4]   2> 690 T1371 oashc.HttpShardHandlerFactory.getParameter Setting maxConnectionsPerHost to: 20
[junit4:junit4]   2> 691 T1371 oashc.HttpShardHandlerFactory.getParameter Setting corePoolSize to: 0
[junit4:junit4]   2> 691 T1371 oashc.HttpShardHandlerFactory.getParameter Setting maximumPoolSize to: 2147483647
[junit4:junit4]   2> 692 T1371 oashc.HttpShardHandlerFactory.getParameter Setting maxThreadIdleTime to: 5
[junit4:junit4]   2> 692 T1371 oashc.HttpShardHandlerFactory.getParameter Setting sizeOfQueue to: -1
[junit4:junit4]   2> 693 T1371 oashc.HttpShardHandlerFactory.getParameter Setting fairnessPolicy to: false
[junit4:junit4]   2> 693 T1371 oascsi.HttpClientUtil.createClient Creating new http client, config:maxConnectionsPerHost=20&maxConnections=10000&socketTimeout=0&connTimeout=0&retry=false
[junit4:junit4]   2> 710 T1371 oascc.SolrZkClient.makePath makePath: /overseer_elect/election
[junit4:junit4]   2> 723 T1376 oazs.PrepRequestProcessor.pRequest Got user-level KeeperException when processing sessionid:0x139d466be610002 type:delete cxid:0x15 zxid:0xfffffffffffffffe txntype:unknown reqpath:n/a Error Path:/solr/overseer_elect/leader Error:KeeperErrorCode = NoNode for /solr/overseer_elect/leader
[junit4:junit4]   2> 724 T1371 oascc.SolrZkClient.makePath makePath: /overseer_elect/leader
[junit4:junit4]   2> 726 T1371 oasc.Overseer.start Overseer (id=88335205456216066-127.0.0.1:18106_solr-n_0000000000) starting
[junit4:junit4]   2> 726 T1376 oazs.PrepRequestProcessor.pRequest Got user-level KeeperException when processing sessionid:0x139d466be610002 type:create cxid:0x1a zxid:0xfffffffffffffffe txntype:unknown reqpath:n/a Error Path:/solr/overseer Error:KeeperErrorCode = NodeExists for /solr/overseer
[junit4:junit4]   2> 727 T1376 oazs.PrepRequestProcessor.pRequest Got user-level KeeperException when processing sessionid:0x139d466be610002 type:create cxid:0x1b zxid:0xfffffffffffffffe txntype:unknown reqpath:n/a Error Path:/solr/overseer Error:KeeperErrorCode = NodeExists for /solr/overseer
[junit4:junit4]   2> 728 T1376 oazs.PrepRequestProcessor.pRequest Got user-level KeeperException when processing sessionid:0x139d466be610002 type:create cxid:0x1c zxid:0xfffffffffffffffe txntype:unknown reqpath:n/a Error Path:/solr/overseer Error:KeeperErrorCode = NodeExists for /solr/overseer
[junit4:junit4]   2> 729 T1376 oazs.PrepRequestProcessor.pRequest Got user-level KeeperException when processing sessionid:0x139d466be610002 type:create cxid:0x1d zxid:0xfffffffffffffffe txntype:unknown reqpath:n/a Error Path:/solr/overseer Error:KeeperErrorCode = NodeExists for /solr/overseer
[junit4:junit4]   2> 730 T1393 oasc.OverseerCollectionProcessor.run Process current queue of collection creations
[junit4:junit4]   2> 731 T1371 oascc.SolrZkClient.makePath makePath: /clusterstate.json
[junit4:junit4]   2> 733 T1371 oascc.ZkStateReader.createClusterStateWatchersAndUpdate Updating cluster state from ZooKeeper... 
[junit4:junit4]   2> 734 T1392 oasc.Overseer$ClusterStateUpdater.run Starting to work on the main queue
[junit4:junit4]   2> 739 T1371 oasc.CoreContainer.create Creating SolrCore 'collection1' using instanceDir: /usr/home/hudson/hudson-slave/workspace/Lucene-Solr-Tests-4.x-java7/solr/build/solr-core/test-files/solr/collection1
[junit4:junit4]   2> 740 T1371 oasc.ZkController.createCollectionZkNode Check for collection zkNode:control_collection
[junit4:junit4]   2> 741 T1371 oasc.ZkController.createCollectionZkNode Collection zkNode exists
[junit4:junit4]   2> 741 T1371 oasc.ZkController.readConfigName Load collection config from:/collections/control_collection
[junit4:junit4]   2> 743 T1371 oasc.SolrResourceLoader.<init> new SolrResourceLoader for directory: '/usr/home/hudson/hudson-slave/workspace/Lucene-Solr-Tests-4.x-java7/solr/build/solr-core/test-files/solr/collection1/'
[junit4:junit4]   2> 744 T1371 oasc.SolrResourceLoader.replaceClassLoader Adding 'file:/usr/home/hudson/hudson-slave/workspace/Lucene-Solr-Tests-4.x-java7/solr/build/solr-core/test-files/solr/collection1/lib/README' to classloader
[junit4:junit4]   2> 745 T1371 oasc.SolrResourceLoader.replaceClassLoader Adding 'file:/usr/home/hudson/hudson-slave/workspace/Lucene-Solr-Tests-4.x-java7/solr/build/solr-core/test-files/solr/collection1/lib/classes/' to classloader
[junit4:junit4]   2> 799 T1371 oasc.SolrConfig.<init> Using Lucene MatchVersion: LUCENE_40
[junit4:junit4]   2> 871 T1371 oasc.SolrConfig.<init> Loaded SolrConfig: solrconfig.xml
[junit4:junit4]   2> 972 T1371 oass.IndexSchema.readSchema Reading Solr Schema
[junit4:junit4]   2> 981 T1371 oass.IndexSchema.readSchema Schema name=test
[junit4:junit4]   2> 1654 T1371 oass.OpenExchangeRatesOrgProvider.init Initialized with rates=open-exchange-rates.json, refreshInterval=1440.
[junit4:junit4]   2> 1666 T1371 oass.IndexSchema.readSchema default search field in schema is text
[junit4:junit4]   2> 1671 T1371 oass.IndexSchema.readSchema unique key field: id
[junit4:junit4]   2> 1687 T1371 oass.FileExchangeRateProvider.reload Reloading exchange rates from file currency.xml
[junit4:junit4]   2> 1693 T1371 oass.FileExchangeRateProvider.reload Reloading exchange rates from file currency.xml
[junit4:junit4]   2> 1699 T1371 oass.OpenExchangeRatesOrgProvider.reload Reloading exchange rates from open-exchange-rates.json
[junit4:junit4]   2> 1700 T1371 oass.OpenExchangeRatesOrgProvider.reload Reloading exchange rates from open-exchange-rates.json
[junit4:junit4]   2> 1701 T1371 oasc.SolrCore.<init> [collection1] Opening new SolrCore at /usr/home/hudson/hudson-slave/workspace/Lucene-Solr-Tests-4.x-java7/solr/build/solr-core/test-files/solr/collection1/, dataDir=./org.apache.solr.cloud.BasicDistributedZk2Test-1347888266841/control/data/
[junit4:junit4]   2> 1702 T1371 oasc.JmxMonitoredMap.<init> JMX monitoring is enabled. Adding Solr mbeans to JMX Server: com.sun.jmx.mbeanserver.JmxMBeanServer@577feece
[junit4:junit4]   2> 1704 T1371 oasc.SolrCore.getNewIndexDir WARNING New index directory detected: old=null new=./org.apache.solr.cloud.BasicDistributedZk2Test-1347888266841/control/data/index/
[junit4:junit4]   2> 1705 T1371 oasc.SolrCore.initIndex WARNING [collection1] Solr index directory './org.apache.solr.cloud.BasicDistributedZk2Test-1347888266841/control/data/index' doesn't exist. Creating new index...
[junit4:junit4]   2> 1707 T1371 oasc.CachingDirectoryFactory.get return new directory for /usr/home/hudson/hudson-slave/workspace/Lucene-Solr-Tests-4.x-java7/solr/build/solr-core/test/J1/./org.apache.solr.cloud.BasicDistributedZk2Test-1347888266841/control/data/index forceNew:false
[junit4:junit4]   2> 1780 T1371 oasc.SolrDeletionPolicy.onCommit SolrDeletionPolicy.onCommit: commits:num=1
[junit4:junit4]   2> 		commit{dir=NRTCachingDirectory(org.apache.lucene.store.NIOFSDirectory@/usr/home/hudson/hudson-slave/workspace/Lucene-Solr-Tests-4.x-java7/solr/build/solr-core/test/J1/org.apache.solr.cloud.BasicDistributedZk2Test-1347888266841/control/data/index lockFactory=org.apache.lucene.store.NativeFSLockFactory@7898a26c; maxCacheMB=48.0 maxMergeSizeMB=4.0),segFN=segments_1,generation=1,filenames=[segments_1]
[junit4:junit4]   2> 1781 T1371 oasc.SolrDeletionPolicy.updateCommits newest commit = 1
[junit4:junit4]   2> 1782 T1371 oasc.SolrCore.initWriters created xml: solr.XMLResponseWriter
[junit4:junit4]   2> 1785 T1371 oasup.UpdateRequestProcessorChain.init inserting DistributedUpdateProcessorFactory into updateRequestProcessorChain "dedupe"
[junit4:junit4]   2> 1785 T1371 oasup.UpdateRequestProcessorChain.init inserting DistributedUpdateProcessorFactory into updateRequestProcessorChain "dedupe-allfields"
[junit4:junit4]   2> 1786 T1371 oasup.UpdateRequestProcessorChain.init inserting DistributedUpdateProcessorFactory into updateRequestProcessorChain "stored_sig"
[junit4:junit4]   2> 1786 T1371 oasup.UpdateRequestProcessorChain.init inserting DistributedUpdateProcessorFactory into updateRequestProcessorChain "uniq-fields"
[junit4:junit4]   2> 1787 T1371 oasup.UpdateRequestProcessorChain.init inserting DistributedUpdateProcessorFactory into updateRequestProcessorChain "distrib-dup-test-chain-implicit"
[junit4:junit4]   2> 1788 T1371 oasc.RequestHandlers.initHandlersFromConfig adding lazy requestHandler: solr.ReplicationHandler
[junit4:junit4]   2> 1788 T1371 oasc.RequestHandlers.initHandlersFromConfig created /replication: solr.ReplicationHandler
[junit4:junit4]   2> 1789 T1371 oasc.RequestHandlers.initHandlersFromConfig created standard: solr.StandardRequestHandler
[junit4:junit4]   2> 1790 T1371 oasc.RequestHandlers.initHandlersFromConfig created /get: solr.RealTimeGetHandler
[junit4:junit4]   2> 1790 T1371 oasc.RequestHandlers.initHandlersFromConfig created dismax: solr.SearchHandler
[junit4:junit4]   2> 1791 T1371 oasc.RequestHandlers.initHandlersFromConfig created mock: org.apache.solr.core.MockQuerySenderListenerReqHandler
[junit4:junit4]   2> 1792 T1371 oasc.RequestHandlers.initHandlersFromConfig created /admin/: org.apache.solr.handler.admin.AdminHandlers
[junit4:junit4]   2> 1792 T1371 oasc.RequestHandlers.initHandlersFromConfig created defaults: solr.StandardRequestHandler
[junit4:junit4]   2> 1793 T1371 oasc.RequestHandlers.initHandlersFromConfig adding lazy requestHandler: solr.StandardRequestHandler
[junit4:junit4]   2> 1793 T1371 oasc.RequestHandlers.initHandlersFromConfig created lazy: solr.StandardRequestHandler
[junit4:junit4]   2> 1794 T1371 oasc.RequestHandlers.initHandlersFromConfig created /update: solr.UpdateRequestHandler
[junit4:junit4]   2> 1795 T1371 oasc.RequestHandlers.initHandlersFromConfig created /terms: org.apache.solr.handler.component.SearchHandler
[junit4:junit4]   2> 1795 T1371 oasc.RequestHandlers.initHandlersFromConfig created spellCheckCompRH: org.apache.solr.handler.component.SearchHandler
[junit4:junit4]   2> 1796 T1371 oasc.RequestHandlers.initHandlersFromConfig created spellCheckCompRH_Direct: org.apache.solr.handler.component.SearchHandler
[junit4:junit4]   2> 1797 T1371 oasc.RequestHandlers.initHandlersFromConfig created spellCheckWithWordbreak: org.apache.solr.handler.component.SearchHandler
[junit4:junit4]   2> 1797 T1371 oasc.RequestHandlers.initHandlersFromConfig created spellCheckWithWordbreak_Direct: org.apache.solr.handler.component.SearchHandler
[junit4:junit4]   2> 1798 T1371 oasc.RequestHandlers.initHandlersFromConfig created spellCheckCompRH1: org.apache.solr.handler.component.SearchHandler
[junit4:junit4]   2> 1799 T1371 oasc.RequestHandlers.initHandlersFromConfig created tvrh: org.apache.solr.handler.component.SearchHandler
[junit4:junit4]   2> 1799 T1371 oasc.RequestHandlers.initHandlersFromConfig created /mlt: solr.MoreLikeThisHandler
[junit4:junit4]   2> 1800 T1371 oasc.RequestHandlers.initHandlersFromConfig created /debug/dump: solr.DumpRequestHandler
[junit4:junit4]   2> 1804 T1371 oashl.XMLLoader.init xsltCacheLifetimeSeconds=60
[junit4:junit4]   2> 1808 T1371 oasc.SolrCore.initDeprecatedSupport WARNING solrconfig.xml uses deprecated <admin/gettableFiles>, Please update your config to use the ShowFileRequestHandler.
[junit4:junit4]   2> 1809 T1371 oasc.SolrCore.initDeprecatedSupport WARNING adding ShowFileRequestHandler with hidden files: [SCHEMA.XML, OLD_SYNONYMS.TXT, STOPWORDS.TXT, PROTWORDS.TXT, OPEN-EXCHANGE-RATES.JSON, SYNONYMS.TXT, CURRENCY.XML, MAPPING-ISOLATIN1ACCENT.TXT]
[junit4:junit4]   2> 1813 T1371 oass.SolrIndexSearcher.<init> Opening Searcher@126e2752 main
[junit4:junit4]   2> 1815 T1371 oasu.CommitTracker.<init> Hard AutoCommit: disabled
[junit4:junit4]   2> 1815 T1371 oasu.CommitTracker.<init> Soft AutoCommit: disabled
[junit4:junit4]   2> 1816 T1371 oashc.SpellCheckComponent.inform Initializing spell checkers
[junit4:junit4]   2> 1861 T1371 oass.DirectSolrSpellChecker.init init: {name=direct,classname=DirectSolrSpellChecker,field=lowerfilt,minQueryLength=3}
[junit4:junit4]   2> 2224 T1394 oasc.SolrCore.registerSearcher [collection1] Registered new searcher Searcher@126e2752 main{StandardDirectoryReader(segments_1:1)}
[junit4:junit4]   2> 2229 T1376 oazs.PrepRequestProcessor.pRequest Got user-level KeeperException when processing sessionid:0x139d466be610002 type:create cxid:0x56 zxid:0xfffffffffffffffe txntype:unknown reqpath:n/a Error Path:/solr/overseer/queue Error:KeeperErrorCode = NoNode for /solr/overseer/queue
[junit4:junit4]   2> 2231 T1371 oasc.CoreContainer.register registering core: collection1
[junit4:junit4]   2> 2232 T1371 oasc.ZkController.register Register shard - core:collection1 address:http://127.0.0.1:18106/solr shardId:control_shard
[junit4:junit4]   2> 2233 T1371 oascc.SolrZkClient.makePath makePath: /collections/control_collection/leader_elect/control_shard/election
[junit4:junit4]   2> 2238 T1376 oazs.PrepRequestProcessor.pRequest Got user-level KeeperException when processing sessionid:0x139d466be610002 type:delete cxid:0x65 zxid:0xfffffffffffffffe txntype:unknown reqpath:n/a Error Path:/solr/collections/control_collection/leaders Error:KeeperErrorCode = NoNode for /solr/collections/control_collection/leaders
[junit4:junit4]   2> 2238 T1371 oasc.ShardLeaderElectionContext.runLeaderProcess Running the leader process.
[junit4:junit4]   2> 2239 T1376 oazs.PrepRequestProcessor.pRequest Got user-level KeeperException when processing sessionid:0x139d466be610002 type:create cxid:0x67 zxid:0xfffffffffffffffe txntype:unknown reqpath:n/a Error Path:/solr/overseer Error:KeeperErrorCode = NodeExists for /solr/overseer
[junit4:junit4]   2> 2241 T1392 oascc.ZkStateReader.updateClusterState Updating cloud state from ZooKeeper... 
[junit4:junit4]   2> 2241 T1376 oazs.PrepRequestProcessor.pRequest Got user-level KeeperException when processing sessionid:0x139d466be610002 type:create cxid:0x6d zxid:0xfffffffffffffffe txntype:unknown reqpath:n/a Error Path:/solr/overseer/queue-work Error:KeeperErrorCode = NoNode for /solr/overseer/queue-work
[junit4:junit4]   2> 2259 T1391 oascc.ZkStateReader$2.process A cluster state change has occurred - updating...
[junit4:junit4]   2> 2741 T1371 oasc.ShardLeaderElectionContext.waitForReplicasToComeUp Enough replicas found to continue.
[junit4:junit4]   2> 2742 T1371 oasc.ShardLeaderElectionContext.runLeaderProcess I may be the new leader - try and sync
[junit4:junit4]   2> 2742 T1371 oasc.SyncStrategy.sync Sync replicas to http://127.0.0.1:18106/solr/collection1/
[junit4:junit4]   2> 2743 T1371 oasc.SyncStrategy.syncReplicas Sync Success - now sync replicas to me
[junit4:junit4]   2> 2743 T1371 oasc.SyncStrategy.syncToMe http://127.0.0.1:18106/solr/collection1/ has no replicas
[junit4:junit4]   2> 2744 T1371 oasc.ShardLeaderElectionContext.runLeaderProcess I am the new leader: http://127.0.0.1:18106/solr/collection1/
[junit4:junit4]   2> 2744 T1371 oascc.SolrZkClient.makePath makePath: /collections/control_collection/leaders/control_shard
[junit4:junit4]   2> 2750 T1376 oazs.PrepRequestProcessor.pRequest Got user-level KeeperException when processing sessionid:0x139d466be610002 type:create cxid:0x8b zxid:0xfffffffffffffffe txntype:unknown reqpath:n/a Error Path:/solr/overseer Error:KeeperErrorCode = NodeExists for /solr/overseer
[junit4:junit4]   2> 2764 T1392 oascc.ZkStateReader.updateClusterState Updating cloud state from ZooKeeper... 
[junit4:junit4]   2> 2791 T1391 oascc.ZkStateReader$2.process A cluster state change has occurred - updating...
[junit4:junit4]   2> 2814 T1371 oasc.ZkController.register We are http://127.0.0.1:18106/solr/collection1/ and leader is http://127.0.0.1:18106/solr/collection1/
[junit4:junit4]   2> 2814 T1371 oasc.ZkController.register No LogReplay needed for core=collection1 baseURL=http://127.0.0.1:18106/solr
[junit4:junit4]   2> 2815 T1371 oasc.ZkController.checkRecovery I am the leader, no recovery necessary
[junit4:junit4]   2> 2822 T1371 oascc.ZkStateReader.updateClusterState Updating cloud state from ZooKeeper... 
[junit4:junit4]   2> 2822 T1371 oass.SolrDispatchFilter.init user.dir=/usr/home/hudson/hudson-slave/workspace/Lucene-Solr-Tests-4.x-java7/solr/build/solr-core/test/J1
[junit4:junit4]   2> 2823 T1371 oass.SolrDispatchFilter.init SolrDispatchFilter.init() done
[junit4:junit4]   2> 2823 T1371 oascsi.HttpClientUtil.createClient Creating new http client, config:maxConnections=128&maxConnectionsPerHost=32&followRedirects=false
[junit4:junit4]   2> 3008 T1371 oejs.Server.doStart jetty-8.1.2.v20120308
[junit4:junit4]   2> 3011 T1371 oejs.AbstractConnector.doStart Started SocketConnector@0.0.0.0:18108
[junit4:junit4]   2> 3012 T1371 oasc.SolrResourceLoader.locateSolrHome JNDI not configured for solr (NoInitialContextEx)
[junit4:junit4]   2> 3012 T1371 oasc.SolrResourceLoader.locateSolrHome using system property solr.solr.home: /usr/home/hudson/hudson-slave/workspace/Lucene-Solr-Tests-4.x-java7/solr/build/solr-core/test/J1/./solrtest-jetty1-1347888269674
[junit4:junit4]   2> 3013 T1371 oasc.SolrResourceLoader.<init> new SolrResourceLoader for deduced Solr Home: '/usr/home/hudson/hudson-slave/workspace/Lucene-Solr-Tests-4.x-java7/solr/build/solr-core/test/J1/./solrtest-jetty1-1347888269674/'
[junit4:junit4]   2> 3056 T1371 oass.SolrDispatchFilter.init SolrDispatchFilter.init()
[junit4:junit4]   2> 3056 T1371 oasc.SolrResourceLoader.locateSolrHome JNDI not configured for solr (NoInitialContextEx)
[junit4:junit4]   2> 3057 T1371 oasc.SolrResourceLoader.locateSolrHome using system property solr.solr.home: /usr/home/hudson/hudson-slave/workspace/Lucene-Solr-Tests-4.x-java7/solr/build/solr-core/test/J1/./solrtest-jetty1-1347888269674
[junit4:junit4]   2> 3057 T1371 oasc.CoreContainer$Initializer.initialize looking for solr.xml: /usr/home/hudson/hudson-slave/workspace/Lucene-Solr-Tests-4.x-java7/solr/build/solr-core/test/J1/./solrtest-jetty1-1347888269674/solr.xml
[junit4:junit4]   2> 3058 T1371 oasc.CoreContainer.<init> New CoreContainer 1781451676
[junit4:junit4]   2> 3058 T1371 oasc.CoreContainer.load Loading CoreContainer using Solr Home: '/usr/home/hudson/hudson-slave/workspace/Lucene-Solr-Tests-4.x-java7/solr/build/solr-core/test/J1/./solrtest-jetty1-1347888269674/'
[junit4:junit4]   2> 3059 T1371 oasc.SolrResourceLoader.<init> new SolrResourceLoader for directory: '/usr/home/hudson/hudson-slave/workspace/Lucene-Solr-Tests-4.x-java7/solr/build/solr-core/test/J1/./solrtest-jetty1-1347888269674/'
[junit4:junit4]   2> 3094 T1371 oasc.CoreContainer.load Registering Log Listener
[junit4:junit4]   2> 3111 T1371 oasc.CoreContainer.initZooKeeper Zookeeper client=127.0.0.1:18103/solr
[junit4:junit4]   2> 3112 T1371 oaz.ZooKeeper.<init> Initiating client connection, connectString=127.0.0.1:18103/solr sessionTimeout=5000 watcher=org.apache.solr.common.cloud.ConnectionManager@18e3b7a5
[junit4:junit4]   2> 3113 T1404 oaz.ClientCnxn$SendThread.startConnect Opening socket connection to server /127.0.0.1:18103
[junit4:junit4]   2> 3113 T1371 oascc.ConnectionManager.waitForConnected Waiting for client to connect to ZooKeeper
[junit4:junit4]   2> 3115 T1404 oaz.ClientCnxn$SendThread.primeConnection Socket connection established to localhost/127.0.0.1:18103, initiating session
[junit4:junit4]   2> 3115 T1373 oazs.NIOServerCnxn$Factory.run Accepted socket connection from /140.211.11.196:18109
[junit4:junit4]   2> 3115 T1373 oazs.NIOServerCnxn.readConnectRequest Client attempting to establish new session at /140.211.11.196:18109
[junit4:junit4]   2> 3117 T1375 oazs.NIOServerCnxn.finishSessionInit Established session 0x139d466be610003 with negotiated timeout 5000 for client /140.211.11.196:18109
[junit4:junit4]   2> 3117 T1404 oaz.ClientCnxn$SendThread.readConnectResult Session establishment complete on server localhost/127.0.0.1:18103, sessionid = 0x139d466be610003, negotiated timeout = 5000
[junit4:junit4]   2> 3118 T1405 oascc.ConnectionManager.process Watcher org.apache.solr.common.cloud.ConnectionManager@18e3b7a5 name:ZooKeeperConnection Watcher:127.0.0.1:18103/solr got event WatchedEvent state:SyncConnected type:None path:null path:null type:None
[junit4:junit4]   2> 3118 T1371 oascc.ConnectionManager.waitForConnected Client is connected to ZooKeeper
[junit4:junit4]   2> 3119 T1376 oazs.PrepRequestProcessor.pRequest Got user-level KeeperException when processing sessionid:0x139d466be610003 type:create cxid:0x1 zxid:0xfffffffffffffffe txntype:unknown reqpath:n/a Error Path:/solr/overseer Error:KeeperErrorCode = NodeExists for /solr/overseer
[junit4:junit4]   2> 3125 T1376 oazs.PrepRequestProcessor.pRequest Got user-level KeeperException when processing sessionid:0x139d466be610003 type:create cxid:0x2 zxid:0xfffffffffffffffe txntype:unknown reqpath:n/a Error Path:/solr/overseer Error:KeeperErrorCode = NodeExists for /solr/overseer
[junit4:junit4]   2> 3127 T1371 oasc.ZkController.createEphemeralLiveNode Register node as live in ZooKeeper:/live_nodes/127.0.0.1:18108_solr
[junit4:junit4]   2> 3127 T1376 oazs.PrepRequestProcessor.pRequest Got user-level KeeperException when processing sessionid:0x139d466be610003 type:delete cxid:0x4 zxid:0xfffffffffffffffe txntype:unknown reqpath:n/a Error Path:/solr/live_nodes/127.0.0.1:18108_solr Error:KeeperErrorCode = NoNode for /solr/live_nodes/127.0.0.1:18108_solr
[junit4:junit4]   2> 3134 T1371 oascc.SolrZkClient.makePath makePath: /live_nodes/127.0.0.1:18108_solr
[junit4:junit4]   2> 3136 T1391 oascc.ZkStateReader$3.process Updating live nodes
[junit4:junit4]   2> 3136 T1371 oashc.HttpShardHandlerFactory.getParameter Setting socketTimeout to: 0
[junit4:junit4]   2> 3137 T1371 oashc.HttpShardHandlerFactory.getParameter Setting urlScheme to: http://
[junit4:junit4]   2> 3137 T1371 oashc.HttpShardHandlerFactory.getParameter Setting connTimeout to: 0
[junit4:junit4]   2> 3138 T1371 oashc.HttpShardHandlerFactory.getParameter Setting maxConnectionsPerHost to: 20
[junit4:junit4]   2> 3138 T1371 oashc.HttpShardHandlerFactory.getParameter Setting corePoolSize to: 0
[junit4:junit4]   2> 3139 T1371 oashc.HttpShardHandlerFactory.getParameter Setting maximumPoolSize to: 2147483647
[junit4:junit4]   2> 3139 T1371 oashc.HttpShardHandlerFactory.getParameter Setting maxThreadIdleTime to: 5
[junit4:junit4]   2> 3140 T1371 oashc.HttpShardHandlerFactory.getParameter Setting sizeOfQueue to: -1
[junit4:junit4]   2> 3140 T1371 oashc.HttpShardHandlerFactory.getParameter Setting fairnessPolicy to: false
[junit4:junit4]   2> 3141 T1371 oascsi.HttpClientUtil.createClient Creating new http client, config:maxConnectionsPerHost=20&maxConnections=10000&socketTimeout=0&connTimeout=0&retry=false
[junit4:junit4]   2> 3161 T1371 oascc.ZkStateReader.createClusterStateWatchersAndUpdate Updating cluster state from ZooKeeper... 
[junit4:junit4]   2> 3168 T1371 oasc.CoreContainer.create Creating SolrCore 'collection1' using instanceDir: /usr/home/hudson/hudson-slave/workspace/Lucene-Solr-Tests-4.x-java7/solr/build/solr-core/test/J1/./solrtest-jetty1-1347888269674/collection1
[junit4:junit4]   2> 3168 T1371 oasc.ZkController.createCollectionZkNode Check for collection zkNode:collection1
[junit4:junit4]   2> 3169 T1371 oasc.ZkController.createCollectionZkNode Collection zkNode exists
[junit4:junit4]   2> 3169 T1371 oasc.ZkController.readConfigName Load collection config from:/collections/collection1
[junit4:junit4]   2> 3170 T1371 oasc.SolrResourceLoader.<init> new SolrResourceLoader for directory: '/usr/home/hudson/hudson-slave/workspace/Lucene-Solr-Tests-4.x-java7/solr/build/solr-core/test/J1/./solrtest-jetty1-1347888269674/collection1/'
[junit4:junit4]   2> 3172 T1371 oasc.SolrResourceLoader.replaceClassLoader Adding 'file:/usr/home/hudson/hudson-slave/workspace/Lucene-Solr-Tests-4.x-java7/solr/build/solr-core/test/J1/solrtest-jetty1-1347888269674/collection1/lib/README' to classloader
[junit4:junit4]   2> 3173 T1371 oasc.SolrResourceLoader.replaceClassLoader Adding 'file:/usr/home/hudson/hudson-slave/workspace/Lucene-Solr-Tests-4.x-java7/solr/build/solr-core/test/J1/solrtest-jetty1-1347888269674/collection1/lib/classes/' to classloader
[junit4:junit4]   2> 3226 T1371 oasc.SolrConfig.<init> Using Lucene MatchVersion: LUCENE_40
[junit4:junit4]   2> 3304 T1392 oascc.ZkStateReader.updateClusterState Updating cloud state from ZooKeeper... 
[junit4:junit4]   2> 3305 T1371 oasc.SolrConfig.<init> Loaded SolrConfig: solrconfig.xml
[junit4:junit4]   2> 3326 T1391 oascc.ZkStateReader$2.process A cluster state change has occurred - updating...
[junit4:junit4]   2> 3412 T1405 oascc.ZkStateReader$2.process A cluster state change has occurred - updating...
[junit4:junit4]   2> 3412 T1371 oass.IndexSchema.readSchema Reading Solr Schema
[junit4:junit4]   2> 3423 T1371 oass.IndexSchema.readSchema Schema name=test
[junit4:junit4]   2> 4065 T1371 oass.OpenExchangeRatesOrgProvider.init Initialized with rates=open-exchange-rates.json, refreshInterval=1440.
[junit4:junit4]   2> 4074 T1371 oass.IndexSchema.readSchema default search field in schema is text
[junit4:junit4]   2> 4077 T1371 oass.IndexSchema.readSchema unique key field: id
[junit4:junit4]   2> 4087 T1371 oass.FileExchangeRateProvider.reload Reloading exchange rates from file currency.xml
[junit4:junit4]   2> 4092 T1371 oass.FileExchangeRateProvider.reload Reloading exchange rates from file currency.xml
[junit4:junit4]   2> 4096 T1371 oass.OpenExchangeRatesOrgProvider.reload Reloading exchange rates from open-exchange-rates.json
[junit4:junit4]   2> 4096 T1371 oass.OpenExchangeRatesOrgProvider.reload Reloading exchange rates from open-exchange-rates.json
[junit4:junit4]   2> 4097 T1371 oasc.SolrCore.<init> [collection1] Opening new SolrCore at /usr/home/hudson/hudson-slave/workspace/Lucene-Solr-Tests-4.x-java7/solr/build/solr-core/test/J1/./solrtest-jetty1-1347888269674/collection1/, dataDir=./org.apache.solr.cloud.BasicDistributedZk2Test-1347888266841/jetty1/
[junit4:junit4]   2> 4098 T1371 oasc.JmxMonitoredMap.<init> JMX monitoring is enabled. Adding Solr mbeans to JMX Server: com.sun.jmx.mbeanserver.JmxMBeanServer@577feece
[junit4:junit4]   2> 4099 T1371 oasc.SolrCore.getNewIndexDir WARNING New index directory detected: old=null new=./org.apache.solr.cloud.BasicDistributedZk2Test-1347888266841/jetty1/index/
[junit4:junit4]   2> 4100 T1371 oasc.SolrCore.initIndex WARNING [collection1] Solr index directory './org.apache.solr.cloud.BasicDistributedZk2Test-1347888266841/jetty1/index' doesn't exist. Creating new index...
[junit4:junit4]   2> 4101 T1371 oasc.CachingDirectoryFactory.get return new directory for /usr/home/hudson/hudson-slave/workspace/Lucene-Solr-Tests-4.x-java7/solr/build/solr-core/test/J1/./org.apache.solr.cloud.BasicDistributedZk2Test-1347888266841/jetty1/index forceNew:false
[junit4:junit4]   2> 4115 T1371 oasc.SolrDeletionPolicy.onCommit SolrDeletionPolicy.onCommit: commits:num=1
[junit4:junit4]   2> 		commit{dir=NRTCachingDirectory(org.apache.lucene.store.NIOFSDirectory@/usr/home/hudson/hudson-slave/workspace/Lucene-Solr-Tests-4.x-java7/solr/build/solr-core/test/J1/org.apache.solr.cloud.BasicDistributedZk2Test-1347888266841/jetty1/index lockFactory=org.apache.lucene.store.NativeFSLockFactory@2d4e9823; maxCacheMB=48.0 maxMergeSizeMB=4.0),segFN=segments_1,generation=1,filenames=[segments_1]
[junit4:junit4]   2> 4115 T1371 oasc.SolrDeletionPolicy.updateCommits newest commit = 1
[junit4:junit4]   2> 4116 T1371 oasc.SolrCore.initWriters created xml: solr.XMLResponseWriter
[junit4:junit4]   2> 4118 T1371 oasup.UpdateRequestProcessorChain.init inserting DistributedUpdateProcessorFactory into updateRequestProcessorChain "dedupe"
[junit4:junit4]   2> 4118 T1371 oasup.UpdateRequestProcessorChain.init inserting DistributedUpdateProcessorFactory into updateRequestProcessorChain "dedupe-allfields"
[junit4:junit4]   2> 4119 T1371 oasup.UpdateRequestProcessorChain.init inserting DistributedUpdateProcessorFactory into updateRequestProcessorChain "stored_sig"
[junit4:junit4]   2> 4119 T1371 oasup.UpdateRequestProcessorChain.init inserting DistributedUpdateProcessorFactory into updateRequestProcessorChain "uniq-fields"
[junit4:junit4]   2> 4120 T1371 oasup.UpdateRequestProcessorChain.init inserting DistributedUpdateProcessorFactory into updateRequestProcessorChain "distrib-dup-test-chain-implicit"
[junit4:junit4]   2> 4120 T1371 oasc.RequestHandlers.initHandlersFromConfig adding lazy requestHandler: solr.ReplicationHandler
[junit4:junit4]   2> 4121 T1371 oasc.RequestHandlers.initHandlersFromConfig created /replication: solr.ReplicationHandler
[junit4:junit4]   2> 4121 T1371 oasc.RequestHandlers.initHandlersFromConfig created standard: solr.StandardRequestHandler
[junit4:junit4]   2> 4122 T1371 oasc.RequestHandlers.initHandlersFromConfig created /get: solr.RealTimeGetHandler
[junit4:junit4]   2> 4122 T1371 oasc.RequestHandlers.initHandlersFromConfig created dismax: solr.SearchHandler
[junit4:junit4]   2> 4123 T1371 oasc.RequestHandlers.initHandlersFromConfig created mock: org.apache.solr.core.MockQuerySenderListenerReqHandler
[junit4:junit4]   2> 4124 T1371 oasc.RequestHandlers.initHandlersFromConfig created /admin/: org.apache.solr.handler.admin.AdminHandlers
[junit4:junit4]   2> 4124 T1371 oasc.RequestHandlers.initHandlersFromConfig created defaults: solr.StandardRequestHandler
[junit4:junit4]   2> 4124 T1371 oasc.RequestHandlers.initHandlersFromConfig adding lazy requestHandler: solr.StandardRequestHandler
[junit4:junit4]   2> 4125 T1371 oasc.RequestHandlers.initHandlersFromConfig created lazy: solr.StandardRequestHandler
[junit4:junit4]   2> 4125 T1371 oasc.RequestHandlers.initHandlersFromConfig created /update: solr.UpdateRequestHandler
[junit4:junit4]   2> 4126 T1371 oasc.RequestHandlers.initHandlersFromConfig created /terms: org.apache.solr.handler.component.SearchHandler
[junit4:junit4]   2> 4126 T1371 oasc.RequestHandlers.initHandlersFromConfig created spellCheckCompRH: org.apache.solr.handler.component.SearchHandler
[junit4:junit4]   2> 4127 T1371 oasc.RequestHandlers.initHandlersFromConfig created spellCheckCompRH_Direct: org.apache.solr.handler.component.SearchHandler
[junit4:junit4]   2> 4128 T1371 oasc.RequestHandlers.initHandlersFromConfig created spellCheckWithWordbreak: org.apache.solr.handler.component.SearchHandler
[junit4:junit4]   2> 4128 T1371 oasc.RequestHandlers.initHandlersFromConfig created spellCheckWithWordbreak_Direct: org.apache.solr.handler.component.SearchHandler
[junit4:junit4]   2> 4129 T1371 oasc.RequestHandlers.initHandlersFromConfig created spellCheckCompRH1: org.apache.solr.handler.component.SearchHandler
[junit4:junit4]   2> 4129 T1371 oasc.RequestHandlers.initHandlersFromConfig created tvrh: org.apache.solr.handler.component.SearchHandler
[junit4:junit4]   2> 4130 T1371 oasc.RequestHandlers.initHandlersFromConfig created /mlt: solr.MoreLikeThisHandler
[junit4:junit4]   2> 4130 T1371 oasc.RequestHandlers.initHandlersFromConfig created /debug/dump: solr.DumpRequestHandler
[junit4:junit4]   2> 4134 T1371 oashl.XMLLoader.init xsltCacheLifetimeSeconds=60
[junit4:junit4]   2> 4138 T1371 oasc.SolrCore.initDeprecatedSupport WARNING solrconfig.xml uses deprecated <admin/gettableFiles>, Please update your config to use the ShowFileRequestHandler.
[junit4:junit4]   2> 4139 T1371 oasc.SolrCore.initDeprecatedSupport WARNING adding ShowFileRequestHandler with hidden files: [SCHEMA.XML, OLD_SYNONYMS.TXT, STOPWORDS.TXT, PROTWORDS.TXT, OPEN-EXCHANGE-RATES.JSON, SYNONYMS.TXT, CURRENCY.XML, MAPPING-ISOLATIN1ACCENT.TXT]
[junit4:junit4]   2> 4143 T1371 oass.SolrIndexSearcher.<init> Opening Searcher@2d4b2d92 main
[junit4:junit4]   2> 4144 T1371 oasu.CommitTracker.<init> Hard AutoCommit: disabled
[junit4:junit4]   2> 4145 T1371 oasu.CommitTracker.<init> Soft AutoCommit: disabled
[junit4:junit4]   2> 4145 T1371 oashc.SpellCheckComponent.inform Initializing spell checkers
[junit4:junit4]   2> 4160 T1371 oass.DirectSolrSpellChecker.init init: {name=direct,classname=DirectSolrSpellChecker,field=lowerfilt,minQueryLength=3}
[junit4:junit4]   2> 4256 T1406 oasc.SolrCore.registerSearcher [collection1] Registered new searcher Searcher@2d4b2d92 main{StandardDirectoryReader(segments_1:1)}
[junit4:junit4]   2> 4338 T1392 oascc.ZkStateReader.updateClusterState Updating cloud state from ZooKeeper... 
[junit4:junit4]   2> 4357 T1405 oascc.ZkStateReader$2.process A cluster state change has occurred - updating...
[junit4:junit4]   2> 4357 T1391 oascc.ZkStateReader$2.process A cluster state change has occurred - updating...
[junit4:junit4]   2> 4766 T1371 oasc.CoreContainer.register registering core: collection1
[junit4:junit4]   2> 4766 T1371 oasc.ZkController.register Register shard - core:collection1 address:http://127.0.0.1:18108/solr shardId:shard1
[junit4:junit4]   2> 4767 T1371 oascc.SolrZkClient.makePath makePath: /collections/collection1/leader_elect/shard1/election
[junit4:junit4]   2> 4783 T1376 oazs.PrepRequestProcessor.pRequest Got user-level KeeperException when processing sessionid:0x139d466be610003 type:delete cxid:0x43 zxid:0xfffffffffffffffe txntype:unknown reqpath:n/a Error Path:/solr/collections/collection1/leaders Error:KeeperErrorCode = NoNode for /solr/collections/collection1/leaders
[junit4:junit4]   2> 4791 T1371 oasc.ShardLeaderElectionContext.runLeaderProcess Running the leader process.
[junit4:junit4]   2> 4792 T1376 oazs.PrepRequestProcessor.pRequest Got user-level KeeperException when processing sessionid:0x139d466be610003 type:create cxid:0x44 zxid:0xfffffffffffffffe txntype:unknown reqpath:n/a Error Path:/solr/overseer Error:KeeperErrorCode = NodeExists for /solr/overseer
[junit4:junit4]   2> 4794 T1371 oasc.ShardLeaderElectionContext.waitForReplicasToComeUp Enough replicas found to continue.
[junit4:junit4]   2> 4794 T1371 oasc.ShardLeaderElectionContext.runLeaderProcess I may be the new leader - try and sync
[junit4:junit4]   2> 4795 T1371 oasc.SyncStrategy.sync Sync replicas to http://127.0.0.1:18108/solr/collection1/
[junit4:junit4]   2> 4795 T1371 oasc.SyncStrategy.syncReplicas Sync Success - now sync replicas to me
[junit4:junit4]   2> 4795 T1371 oasc.SyncStrategy.syncToMe http://127.0.0.1:18108/solr/collection1/ has no replicas
[junit4:junit4]   2> 4796 T1371 oasc.ShardLeaderElectionContext.runLeaderProcess I am the new leader: http://127.0.0.1:18108/solr/collection1/
[junit4:junit4]   2> 4796 T1371 oascc.SolrZkClient.makePath makePath: /collections/collection1/leaders/shard1
[junit4:junit4]   2> 4808 T1376 oazs.PrepRequestProcessor.pRequest Got user-level KeeperException when processing sessionid:0x139d466be610003 type:create cxid:0x4e zxid:0xfffffffffffffffe txntype:unknown reqpath:n/a Error Path:/solr/overseer Error:KeeperErrorCode = NodeExists for /solr/overseer
[junit4:junit4]   2> 4867 T1392 oascc.ZkStateReader.updateClusterState Updating cloud state from ZooKeeper... 
[junit4:junit4]   2> 4886 T1391 oascc.ZkStateReader$2.process A cluster state change has occurred - updating...
[junit4:junit4]   2> 4886 T1405 oascc.ZkStateReader$2.process A cluster state change has occurred - updating...
[junit4:junit4]   2> 4911 T1371 oasc.ZkController.register We are http://127.0.0.1:18108/solr/collection1/ and leader is http://127.0.0.1:18108/solr/collection1/
[junit4:junit4]   2> 4911 T1371 oasc.ZkController.register No LogReplay needed for core=collection1 baseURL=http://127.0.0.1:18108/solr
[junit4:junit4]   2> 4912 T1371 oasc.ZkController.checkRecovery I am the leader, no recovery necessary
[junit4:junit4]   2> 4913 T1371 oascc.ZkStateReader.updateClusterState Updating cloud state from ZooKeeper... 
[junit4:junit4]   2> 4914 T1371 oass.SolrDispatchFilter.init user.dir=/usr/home/hudson/hudson-slave/workspace/Lucene-Solr-Tests-4.x-java7/solr/build/solr-core/test/J1
[junit4:junit4]   2> 4914 T1371 oass.SolrDispatchFilter.init SolrDispatchFilter.init() done
[junit4:junit4]   2> 4914 T1371 oascsi.HttpClientUtil.createClient Creating new http client, config:maxConnections=128&maxConnectionsPerHost=32&followRedirects=false
[junit4:junit4]   2> 5078 T1371 oejs.Server.doStart jetty-8.1.2.v20120308
[junit4:junit4]   2> 5081 T1371 oejs.AbstractConnector.doStart Started SocketConnector@0.0.0.0:18112
[junit4:junit4]   2> 5082 T1371 oasc.SolrResourceLoader.locateSolrHome JNDI not configured for solr (NoInitialContextEx)
[junit4:junit4]   2> 5082 T1371 oasc.SolrResourceLoader.locateSolrHome using system property solr.solr.home: /usr/home/hudson/hudson-slave/workspace/Lucene-Solr-Tests-4.x-java7/solr/build/solr-core/test/J1/./solrtest-jetty2-1347888271762
[junit4:junit4]   2> 5083 T1371 oasc.SolrResourceLoader.<init> new SolrResourceLoader for deduced Solr Home: '/usr/home/hudson/hudson-slave/workspace/Lucene-Solr-Tests-4.x-java7/solr/build/solr-core/test/J1/./solrtest-jetty2-1347888271762/'
[junit4:junit4]   2> 5127 T1371 oass.SolrDispatchFilter.init SolrDispatchFilter.init()
[junit4:junit4]   2> 5128 T1371 oasc.SolrResourceLoader.locateSolrHome JNDI not configured for solr (NoInitialContextEx)
[junit4:junit4]   2> 5128 T1371 oasc.SolrResourceLoader.locateSolrHome using system property solr.solr.home: /usr/home/hudson/hudson-slave/workspace/Lucene-Solr-Tests-4.x-java7/solr/build/solr-core/test/J1/./solrtest-jetty2-1347888271762
[junit4:junit4]   2> 5128 T1371 oasc.CoreContainer$Initializer.initialize looking for solr.xml: /usr/home/hudson/hudson-slave/workspace/Lucene-Solr-Tests-4.x-java7/solr/build/solr-core/test/J1/./solrtest-jetty2-1347888271762/solr.xml
[junit4:junit4]   2> 5129 T1371 oasc.CoreContainer.<init> New CoreContainer 973025276
[junit4:junit4]   2> 5129 T1371 oasc.CoreContainer.load Loading CoreContainer using Solr Home: '/usr/home/hudson/hudson-slave/workspace/Lucene-Solr-Tests-4.x-java7/solr/build/solr-core/test/J1/./solrtest-jetty2-1347888271762/'
[junit4:junit4]   2> 5130 T1371 oasc.SolrResourceLoader.<init> new SolrResourceLoader for directory: '/usr/home/hudson/hudson-slave/workspace/Lucene-Solr-Tests-4.x-java7/solr/build/solr-core/test/J1/./solrtest-jetty2-1347888271762/'
[junit4:junit4]   2> 5166 T1371 oasc.CoreContainer.load Registering Log Listener
[junit4:junit4]   2> 5183 T1371 oasc.CoreContainer.initZooKeeper Zookeeper client=127.0.0.1:18103/solr
[junit4:junit4]   2> 5184 T1371 oaz.ZooKeeper.<init> Initiating client connection, connectString=127.0.0.1:18103/solr sessionTimeout=5000 watcher=org.apache.solr.common.cloud.ConnectionManager@689a01c0
[junit4:junit4]   2> 5185 T1416 oaz.ClientCnxn$SendThread.startConnect Opening socket connection to server /127.0.0.1:18103
[junit4:junit4]   2> 5185 T1371 oascc.ConnectionManager.waitForConnected Waiting for client to connect to ZooKeeper
[junit4:junit4]   2> 5186 T1416 oaz.ClientCnxn$SendThread.primeConnection Socket connection established to localhost/127.0.0.1:18103, initiating session
[junit4:junit4]   2> 5186 T1373 oazs.NIOServerCnxn$Factory.run Accepted socket connection from /140.211.11.196:18114
[junit4:junit4]   2> 5187 T1373 oazs.NIOServerCnxn.readConnectRequest Client attempting to establish new session at /140.211.11.196:18114
[junit4:junit4]   2> 5189 T1375 oazs.NIOServerCnxn.finishSessionInit Established session 0x139d466be610004 with negotiated timeout 5000 for client /140.211.11.196:18114
[junit4:junit4]   2> 5189 T1416 oaz.ClientCnxn$SendThread.readConnectResult Session establishment complete on server localhost/127.0.0.1:18103, sessionid = 0x139d466be610004, negotiated timeout = 5000
[junit4:junit4]   2> 5189 T1417 oascc.ConnectionManager.process Watcher org.apache.solr.common.cloud.ConnectionManager@689a01c0 name:ZooKeeperConnection Watcher:127.0.0.1:18103/solr got event WatchedEvent state:SyncConnected type:None path:null path:null type:None
[junit4:junit4]   2> 5189 T1371 oascc.ConnectionManager.waitForConnected Client is connected to ZooKeeper
[junit4:junit4]   2> 5190 T1376 oazs.PrepRequestProcessor.pRequest Got user-level KeeperException when processing sessionid:0x139d466be610004 type:create cxid:0x1 zxid:0xfffffffffffffffe txntype:unknown reqpath:n/a Error Path:/solr/overseer Error:KeeperErrorCode = NodeExists for /solr/overseer
[junit4:junit4]   2> 5200 T1376 oazs.PrepRequestProcessor.pRequest Got user-level KeeperException when processing sessionid:0x139d466be610004 type:create cxid:0x2 zxid:0xfffffffffffffffe txntype:unknown reqpath:n/a Error Path:/solr/overseer Error:KeeperErrorCode = NodeExists for /solr/overseer
[junit4:junit4]   2> 5201 T1371 oasc.ZkController.createEphemeralLiveNode Register node as live in ZooKeeper:/live_nodes/127.0.0.1:18112_solr
[junit4:junit4]   2> 5202 T1376 oazs.PrepRequestProcessor.pRequest Got user-level KeeperException when processing sessionid:0x139d466be610004 type:delete cxid:0x4 zxid:0xfffffffffffffffe txntype:unknown reqpath:n/a Error Path:/solr/live_nodes/127.0.0.1:18112_solr Error:KeeperErrorCode = NoNode for /solr/live_nodes/127.0.0.1:18112_solr
[junit4:junit4]   2> 5203 T1371 oascc.SolrZkClient.makePath makePath: /live_nodes/127.0.0.1:18112_solr
[junit4:junit4]   2> 5212 T1405 oascc.ZkStateReader$3.process Updating live nodes
[junit4:junit4]   2> 5212 T1391 oascc.ZkStateReader$3.process Updating live nodes
[junit4:junit4]   2> 5212 T1371 oashc.HttpShardHandlerFactory.getParameter Setting socketTimeout to: 0
[junit4:junit4]   2> 5213 T1371 oashc.HttpShardHandlerFactory.getParameter Setting urlScheme to: http://
[junit4:junit4]   2> 5213 T1371 oashc.HttpShardHandlerFactory.getParameter Setting connTimeout to: 0
[junit4:junit4]   2> 5214 T1371 oashc.HttpShardHandlerFactory.getParameter Setting maxConnectionsPerHost to: 20
[junit4:junit4]   2> 5214 T1371 oashc.HttpShardHandlerFactory.getParameter Setting corePoolSize to: 0
[junit4:junit4]   2> 5215 T1371 oashc.HttpShardHandlerFactory.getParameter Setting maximumPoolSize to: 2147483647
[junit4:junit4]   2> 5215 T1371 oashc.HttpShardHandlerFactory.getParameter Setting maxThreadIdleTime to: 5
[junit4:junit4]   2> 5216 T1371 oashc.HttpShardHandlerFactory.getParameter Setting sizeOfQueue to: -1
[junit4:junit4]   2> 5216 T1371 oashc.HttpShardHandlerFactory.getParameter Setting fairnessPolicy to: false
[junit4:junit4]   2> 5217 T1371 oascsi.HttpClientUtil.createClient Creating new http client, config:maxConnectionsPerHost=20&maxConnections=10000&socketTimeout=0&connTimeout=0&retry=false
[junit4:junit4]   2> 5239 T1371 oascc.ZkStateReader.createClusterStateWatchersAndUpdate Updating cluster state from ZooKeeper... 
[junit4:junit4]   2> 5246 T1371 oasc.CoreContainer.create Creating SolrCore 'collection1' using instanceDir: /usr/home/hudson/hudson-slave/workspace/Lucene-Solr-Tests-4.x-java7/solr/build/solr-core/test/J1/./solrtest-jetty2-1347888271762/collection1
[junit4:junit4]   2> 5246 T1371 oasc.ZkController.createCollectionZkNode Check for collection zkNode:collection1
[junit4:junit4]   2> 5247 T1371 oasc.ZkController.createCollectionZkNode Collection zkNode exists
[junit4:junit4]   2> 5248 T1371 oasc.ZkController.readConfigName Load collection config from:/collections/collection1
[junit4:junit4]   2> 5249 T1371 oasc.SolrResourceLoader.<init> new SolrResourceLoader for directory: '/usr/home/hudson/hudson-slave/workspace/Lucene-Solr-Tests-4.x-java7/solr/build/solr-core/test/J1/./solrtest-jetty2-1347888271762/collection1/'
[junit4:junit4]   2> 5250 T1371 oasc.SolrResourceLoader.replaceClassLoader Adding 'file:/usr/home/hudson/hudson-slave/workspace/Lucene-Solr-Tests-4.x-java7/solr/build/solr-core/test/J1/solrtest-jetty2-1347888271762/collection1/lib/README' to classloader
[junit4:junit4]   2> 5251 T1371 oasc.SolrResourceLoader.replaceClassLoader Adding 'file:/usr/home/hudson/hudson-slave/workspace/Lucene-Solr-Tests-4.x-java7/solr/build/solr-core/test/J1/solrtest-jetty2-1347888271762/collection1/lib/classes/' to classloader
[junit4:junit4]   2> 5307 T1371 oasc.SolrConfig.<init> Using Lucene MatchVersion: LUCENE_40
[junit4:junit4]   2> 5382 T1371 oasc.SolrConfig.<init> Loaded SolrConfig: solrconfig.xml
[junit4:junit4]   2> 5399 T1392 oascc.ZkStateReader.updateClusterState Updating cloud state from ZooKeeper... 
[junit4:junit4]   2> 5412 T1391 oascc.ZkStateReader$2.process A cluster state change has occurred - updating...
[junit4:junit4]   2> 5412 T1405 oascc.ZkStateReader$2.process A cluster state change has occurred - updating...
[junit4:junit4]   2> 5483 T1417 oascc.ZkStateReader$2.process A cluster state change has occurred - updating...
[junit4:junit4]   2> 5483 T1371 oass.IndexSchema.readSchema Reading Solr Schema
[junit4:junit4]   2> 5491 T1371 oass.IndexSchema.readSchema Schema name=test
[junit4:junit4]   2> 6099 T1371 oass.OpenExchangeRatesOrgProvider.init Initialized with rates=open-exchange-rates.json, refreshInterval=1440.
[junit4:junit4]   2> 6108 T1371 oass.IndexSchema.readSchema default search field in schema is text
[junit4:junit4]   2> 6110 T1371 oass.IndexSchema.readSchema unique key field: id
[junit4:junit4]   2> 6121 T1371 oass.FileExchangeRateProvider.reload Reloading exchange rates from file currency.xml
[junit4:junit4]   2> 6125 T1371 oass.FileExchangeRateProvider.reload Reloading exchange rates from file currency.xml
[junit4:junit4]   2> 6128 T1371 oass.OpenExchangeRatesOrgProvider.reload Reloading exchange rates from open-exchange-rates.json
[junit4:junit4]   2> 6129 T1371 oass.OpenExchangeRatesOrgProvider.reload Reloading exchange rates from open-exchange-rates.json
[junit4:junit4]   2> 6130 T1371 oasc.SolrCore.<init> [collection1] Opening new SolrCore at /usr/home/hudson/hudson-slave/workspace/Lucene-Solr-Tests-4.x-java7/solr/build/solr-core/test/J1/./solrtest-jetty2-1347888271762/collection1/, dataDir=./org.apache.solr.cloud.BasicDistributedZk2Test-1347888266841/jetty2/
[junit4:junit4]   2> 6131 T1371 oasc.JmxMonitoredMap.<init> JMX monitoring is enabled. Adding Solr mbeans to JMX Server: com.sun.jmx.mbeanserver.JmxMBeanServer@577feece
[junit4:junit4]   2> 6132 T1371 oasc.SolrCore.getNewIndexDir WARNING New index directory detected: old=null new=./org.apache.solr.cloud.BasicDistributedZk2Test-1347888266841/jetty2/index/
[junit4:junit4]   2> 6132 T1371 oasc.SolrCore.initIndex WARNING [collection1] Solr index directory './org.apache.solr.cloud.BasicDistributedZk2Test-1347888266841/jetty2/index' doesn't exist. Creating new index...
[junit4:junit4]   2> 6133 T1371 oasc.CachingDirectoryFactory.get return new directory for /usr/home/hudson/hudson-slave/workspace/Lucene-Solr-Tests-4.x-java7/solr/build/solr-core/test/J1/./org.apache.solr.cloud.BasicDistributedZk2Test-1347888266841/jetty2/index forceNew:false
[junit4:junit4]   2> 6151 T1371 oasc.SolrDeletionPolicy.onCommit SolrDeletionPolicy.onCommit: commits:num=1
[junit4:junit4]   2> 		commit{dir=NRTCachingDirectory(org.apache.lucene.store.NIOFSDirectory@/usr/home/hudson/hudson-slave/workspace/Lucene-Solr-Tests-4.x-java7/solr/build/solr-core/test/J1/org.apache.solr.cloud.BasicDistributedZk2Test-1347888266841/jetty2/index lockFactory=org.apache.lucene.store.NativeFSLockFactory@56deb5d2; maxCacheMB=48.0 maxMergeSizeMB=4.0),segFN=segments_1,generation=1,filenames=[segments_1]
[junit4:junit4]   2> 6151 T1371 oasc.SolrDeletionPolicy.updateCommits newest commit = 1
[junit4:junit4]   2> 6152 T1371 oasc.SolrCore.initWriters created xml: solr.XMLResponseWriter
[junit4:junit4]   2> 6154 T1371 oasup.UpdateRequestProcessorChain.init inserting DistributedUpdateProcessorFactory into updateRequestProcessorChain "dedupe"
[junit4:junit4]   2> 6155 T1371 oasup.UpdateRequestProcessorChain.init inserting DistributedUpdateProcessorFactory into updateRequestProcessorChain "dedupe-allfields"
[junit4:junit4]   2> 6155 T1371 oasup.UpdateRequestProcessorChain.init inserting DistributedUpdateProcessorFactory into updateRequestProcessorChain "stored_sig"
[junit4:junit4]   2> 6155 T1371 oasup.UpdateRequestProcessorChain.init inserting DistributedUpdateProcessorFactory into updateRequestProcessorChain "uniq-fields"
[junit4:junit4]   2> 6156 T1371 oasup.UpdateRequestProcessorChain.init inserting DistributedUpdateProcessorFactory into updateRequestProcessorChain "distrib-dup-test-chain-implicit"
[junit4:junit4]   2> 6156 T1371 oasc.RequestHandlers.initHandlersFromConfig adding lazy requestHandler: solr.ReplicationHandler
[junit4:junit4]   2> 6157 T1371 oasc.RequestHandlers.initHandlersFromConfig created /replication: solr.ReplicationHandler
[junit4:junit4]   2> 6157 T1371 oasc.RequestHandlers.initHandlersFromConfig created standard: solr.StandardRequestHandler
[junit4:junit4]   2> 6158 T1371 oasc.RequestHandlers.initHandlersFromConfig created /get: solr.RealTimeGetHandler
[junit4:junit4]   2> 6159 T1371 oasc.RequestHandlers.initHandlersFromConfig created dismax: solr.SearchHandler
[junit4:junit4]   2> 6159 T1371 oasc.RequestHandlers.initHandlersFromConfig created mock: org.apache.solr.core.MockQuerySenderListenerReqHandler
[junit4:junit4]   2> 6160 T1371 oasc.RequestHandlers.initHandlersFromConfig created /admin/: org.apache.solr.handler.admin.AdminHandlers
[junit4:junit4]   2> 6160 T1371 oasc.RequestHandlers.initHandlersFromConfig created defaults: solr.StandardRequestHandler
[junit4:junit4]   2> 6161 T1371 oasc.RequestHandlers.initHandlersFromConfig adding lazy requestHandler: solr.StandardRequestHandler
[junit4:junit4]   2> 6161 T1371 oasc.RequestHandlers.initHandlersFromConfig created lazy: solr.StandardRequestHandler
[junit4:junit4]   2> 6162 T1371 oasc.RequestHandlers.initHandlersFromConfig created /update: solr.UpdateRequestHandler
[junit4:junit4]   2> 6162 T1371 oasc.RequestHandlers.initHandlersFromConfig created /terms: org.apache.solr.handler.component.SearchHandler
[junit4:junit4]   2> 6163 T1371 oasc.RequestHandlers.initHandlersFromConfig created spellCheckCompRH: org.apache.solr.handler.component.SearchHandler
[junit4:junit4]   2> 6164 T1371 oasc.RequestHandlers.initHandlersFromConfig created spellCheckCompRH_Direct: org.apache.solr.handler.component.SearchHandler
[junit4:junit4]   2> 6165 T1371 oasc.RequestHandlers.initHandlersFromConfig created spellCheckWithWordbreak: org.apache.solr.handler.component.SearchHandler
[junit4:junit4]   2> 6166 T1371 oasc.RequestHandlers.initHandlersFromConfig created spellCheckWithWordbreak_Direct: org.apache.solr.handler.component.SearchHandler
[junit4:junit4]   2> 6167 T1371 oasc.RequestHandlers.initHandlersFromConfig created spellCheckCompRH1: org.apache.solr.handler.component.SearchHandler
[junit4:junit4]   2> 6168 T1371 oasc.RequestHandlers.initHandlersFromConfig created tvrh: org.apache.solr.handler.component.SearchHandler
[junit4:junit4]   2> 6169 T1371 oasc.RequestHandlers.initHandlersFromConfig created /mlt: solr.MoreLikeThisHandler
[junit4:junit4]   2> 6170 T1371 oasc.RequestHandlers.initHandlersFromConfig created /debug/dump: solr.DumpRequestHandler
[junit4:junit4]   2> 6173 T1371 oashl.XMLLoader.init xsltCacheLifetimeSeconds=60
[junit4:junit4]   2> 6176 T1371 oasc.SolrCore.initDeprecatedSupport WARNING solrconfig.xml uses deprecated <admin/gettableFiles>, Please update your config to use the ShowFileRequestHandler.
[junit4:junit4]   2> 6177 T1371 oasc.SolrCore.initDeprecatedSupport WARNING adding ShowFileRequestHandler with hidden files: [SCHEMA.XML, OLD_SYNONYMS.TXT, STOPWORDS.TXT, PROTWORDS.TXT, OPEN-EXCHANGE-RATES.JSON, SYNONYMS.TXT, CURRENCY.XML, MAPPING-ISOLATIN1ACCENT.TXT]
[junit4:junit4]   2> 6181 T1371 oass.SolrIndexSearcher.<init> Opening Searcher@7adfe55f main
[junit4:junit4]   2> 6182 T1371 oasu.CommitTracker.<init> Hard AutoCommit: disabled
[junit4:junit4]   2> 6182 T1371 oasu.CommitTracker.<init> Soft AutoCommit: disabled
[junit4:junit4]   2> 6183 T1371 oashc.SpellCheckComponent.inform Initializing spell checkers
[junit4:junit4]   2> 6201 T1371 oass.DirectSolrSpellChecker.init init: {name=direct,classname=DirectSolrSpellChecker,field=lowerfilt,minQueryLength=3}
[junit4:junit4]   2> 6275 T1418 oasc.SolrCore.registerSearcher [collection1] Registered new searcher Searcher@7adfe55f main{StandardDirectoryReader(segments_1:1)}
[junit4:junit4]   2> 6418 T1392 oascc.ZkStateReader.updateClusterState Updating cloud state from ZooKeeper... 
[junit4:junit4]   2> 6439 T1391 oascc.ZkStateReader$2.process A cluster state change has occurred - updating...
[junit4:junit4]   2> 6439 T1405 oascc.ZkStateReader$2.process A cluster state change has occurred - updating...
[junit4:junit4]   2> 6439 T1417 oascc.ZkStateReader$2.process A cluster state change has occurred - updating...
[junit4:junit4]   2> 6786 T1371 oasc.CoreContainer.register registering core: collection1
[junit4:junit4]   2> 6786 T1371 oasc.ZkController.register Register shard - core:collection1 address:http://127.0.0.1:18112/solr shardId:shard2
[junit4:junit4]   2> 6787 T1371 oascc.SolrZkClient.makePath makePath: /collections/collection1/leader_elect/shard2/election
[junit4:junit4]   2> 6834 T1376 oazs.PrepRequestProcessor.pRequest Got user-level KeeperException when processing sessionid:0x139d466be610004 type:delete cxid:0x42 zxid:0xfffffffffffffffe txntype:unknown reqpath:n/a Error Path:/solr/collections/collection1/leaders/shard2 Error:KeeperErrorCode = NoNode for /solr/collections/collection1/leaders/shard2
[junit4:junit4]   2> 6873 T1371 oasc.ShardLeaderElectionContext.runLeaderProcess Running the leader process.
[junit4:junit4]   2> 6874 T1376 oazs.PrepRequestProcessor.pRequest Got user-level KeeperException when processing sessionid:0x139d466be610004 type:create cxid:0x43 zxid:0xfffffffffffffffe txntype:unknown reqpath:n/a Error Path:/solr/overseer Error:KeeperErrorCode = NodeExists for /solr/overseer
[junit4:junit4]   2> 6941 T1371 oasc.ShardLeaderElectionContext.waitForReplicasToComeUp Enough replicas found to continue.
[junit4:junit4]   2> 6942 T1371 oasc.ShardLeaderElectionContext.runLeaderProcess I may be the new leader - try and sync
[junit4:junit4]   2> 6943 T1371 oasc.SyncStrategy.sync Sync replicas to http://127.0.0.1:18112/solr/collection1/
[junit4:junit4]   2> 6943 T1371 oasc.SyncStrategy.syncReplicas Sync Success - now sync replicas to me
[junit4:junit4]   2> 6943 T1371 oasc.SyncStrategy.syncToMe http://127.0.0.1:18112/solr/collection1/ has no replicas
[junit4:junit4]   2> 6944 T1371 oasc.ShardLeaderElectionContext.runLeaderProcess I am the new leader: http://127.0.0.1:18112/solr/collection1/
[junit4:junit4]   2> 6945 T1371 oascc.SolrZkClient.makePath makePath: /collections/collection1/leaders/shard2
[junit4:junit4]   2> 6972 T1376 oazs.PrepRequestProcessor.pRequest Got user-level KeeperException when processing sessionid:0x139d466be610004 type:create cxid:0x4c zxid:0xfffffffffffffffe txntype:unknown reqpath:n/a Error Path:/solr/overseer Error:KeeperErrorCode = NodeExists for /solr/overseer
[junit4:junit4]   2> 6991 T1392 oascc.ZkStateReader.updateClusterState Updating cloud state from ZooKeeper... 
[junit4:junit4]   2> 7023 T1391 oascc.ZkStateReader$2.process A cluster state change has occurred - updating...
[junit4:junit4]   2> 7023 T1405 oascc.ZkStateReader$2.process A cluster state change has occurred - updating...
[junit4:junit4]   2> 7023 T1417 oascc.ZkStateReader$2.process A cluster state change has occurred - updating...
[junit4:junit4]   2> 7042 T1371 oasc.ZkController.register We are http://127.0.0.1:18112/solr/collection1/ and leader is http://127.0.0.1:18112/solr/collection1/
[junit4:junit4]   2> 7042 T1371 oasc.ZkController.register No LogReplay needed for core=collection1 baseURL=http://127.0.0.1:18112/solr
[junit4:junit4]   2> 7043 T1371 oasc.ZkController.checkRecovery I am the leader, no recovery necessary
[junit4:junit4]   2> 7045 T1371 oascc.ZkStateReader.updateClusterState Updating cloud state from ZooKeeper... 
[junit4:junit4]   2> 7046 T1371 oass.SolrDispatchFilter.init user.dir=/usr/home/hudson/hudson-slave/workspace/Lucene-Solr-Tests-4.x-java7/solr/build/solr-core/test/J1
[junit4:junit4]   2> 7047 T1371 oass.SolrDispatchFilter.init SolrDispatchFilter.init() done
[junit4:junit4]   2> 7047 T1371 oascsi.HttpClientUtil.createClient Creating new http client, config:maxConnections=128&maxConnectionsPerHost=32&followRedirects=false
[junit4:junit4]   2> 7236 T1371 oejs.Server.doStart jetty-8.1.2.v20120308
[junit4:junit4]   2> 7239 T1371 oejs.AbstractConnector.doStart Started SocketConnector@0.0.0.0:18117
[junit4:junit4]   2> 7240 T1371 oasc.SolrResourceLoader.locateSolrHome JNDI not configured for solr (NoInitialContextEx)
[junit4:junit4]   2> 7241 T1371 oasc.SolrResourceLoader.locateSolrHome using system property solr.solr.home: /usr/home/hudson/hudson-slave/workspace/Lucene-Solr-Tests-4.x-java7/solr/build/solr-core/test/J1/./solrtest-jetty3-1347888273898
[junit4:junit4]   2> 7241 T1371 oasc.SolrResourceLoader.<init> new SolrResourceLoader for deduced Solr Home: '/usr/home/hudson/hudson-slave/workspace/Lucene-Solr-Tests-4.x-java7/solr/build/solr-core/test/J1/./solrtest-jetty3-1347888273898/'
[junit4:junit4]   2> 7293 T1371 oass.SolrDispatchFilter.init SolrDispatchFilter.init()
[junit4:junit4]   2> 7293 T1371 oasc.SolrResourceLoader.locateSolrHome JNDI not configured for solr (NoInitialContextEx)
[junit4:junit4]   2> 7294 T1371 oasc.SolrResourceLoader.locateSolrHome using system property solr.solr.home: /usr/home/hudson/hudson-slave/workspace/Lucene-Solr-Tests-4.x-java7/solr/build/solr-core/test/J1/./solrtest-jetty3-1347888273898
[junit4:junit4]   2> 7294 T1371 oasc.CoreContainer$Initializer.initialize looking for solr.xml: /usr/home/hudson/hudson-slave/workspace/Lucene-Solr-Tests-4.x-java7/solr/build/solr-core/test/J1/./solrtest-jetty3-1347888273898/solr.xml
[junit4:junit4]   2> 7295 T1371 oasc.CoreContainer.<init> New CoreContainer 1488851386
[junit4:junit4]   2> 7295 T1371 oasc.CoreContainer.load Loading CoreContainer using Solr Home: '/usr/home/hudson/hudson-slave/workspace/Lucene-Solr-Tests-4.x-java7/solr/build/solr-core/test/J1/./solrtest-jetty3-1347888273898/'
[junit4:junit4]   2> 7296 T1371 oasc.SolrResourceLoader.<init> new SolrResourceLoader for directory: '/usr/home/hudson/hudson-slave/workspace/Lucene-Solr-Tests-4.x-java7/solr/build/solr-core/test/J1/./solrtest-jetty3-1347888273898/'
[junit4:junit4]   2> 7332 T1371 oasc.CoreContainer.load Registering Log Listener
[junit4:junit4]   2> 7348 T1371 oasc.CoreContainer.initZooKeeper Zookeeper client=127.0.0.1:18103/solr
[junit4:junit4]   2> 7349 T1371 oaz.ZooKeeper.<init> Initiating client connection, connectString=127.0.0.1:18103/solr sessionTimeout=5000 watcher=org.apache.solr.common.cloud.ConnectionManager@179a499
[junit4:junit4]   2> 7350 T1428 oaz.ClientCnxn$SendThread.startConnect Opening socket connection to server /127.0.0.1:18103
[junit4:junit4]   2> 7350 T1371 oascc.ConnectionManager.waitForConnected Waiting for client to connect to ZooKeeper
[junit4:junit4]   2> 7351 T1428 oaz.ClientCnxn$SendThread.primeConnection Socket connection established to localhost/127.0.0.1:18103, initiating session
[junit4:junit4]   2> 7352 T1373 oazs.NIOServerCnxn$Factory.run Accepted socket connection from /140.211.11.196:18118
[junit4:junit4]   2> 7352 T1373 oazs.NIOServerCnxn.readConnectRequest Client attempting to establish new session at /140.211.11.196:18118
[junit4:junit4]   2> 7360 T1375 oazs.NIOServerCnxn.finishSessionInit Established session 0x139d466be610005 with negotiated timeout 5000 for client /140.211.11.196:18118
[junit4:junit4]   2> 7360 T1428 oaz.ClientCnxn$SendThread.readConnectResult Session establishment complete on server localhost/127.0.0.1:18103, sessionid = 0x139d466be610005, negotiated timeout = 5000
[junit4:junit4]   2> 7361 T1429 oascc.ConnectionManager.process Watcher org.apache.solr.common.cloud.ConnectionManager@179a499 name:ZooKeeperConnection Watcher:127.0.0.1:18103/solr got event WatchedEvent state:SyncConnected type:None path:null path:null type:None
[junit4:junit4]   2> 7361 T1371 oascc.ConnectionManager.waitForConnected Client is connected to ZooKeeper
[junit4:junit4]   2> 7362 T1376 oazs.PrepRequestProcessor.pRequest Got user-level KeeperException when processing sessionid:0x139d466be610005 type:create cxid:0x1 zxid:0xfffffffffffffffe txntype:unknown reqpath:n/a Error Path:/solr/overseer Error:KeeperErrorCode = NodeExists for /solr/overseer
[junit4:junit4]   2> 7368 T1376 oazs.PrepRequestProcessor.pRequest Got user-level KeeperException when processing sessionid:0x139d466be610005 type:create cxid:0x2 zxid:0xfffffffffffffffe txntype:unknown reqpath:n/a Error Path:/solr/overseer Error:KeeperErrorCode = NodeExists for /solr/overseer
[junit4:junit4]   2> 7379 T1371 oasc.ZkController.createEphemeralLiveNode Register node as live in ZooKeeper:/live_nodes/127.0.0.1:18117_solr
[junit4:junit4]   2> 7379 T1376 oazs.PrepRequestProcessor.pRequest Got user-level KeeperException when processing sessionid:0x139d466be610005 type:delete cxid:0x4 zxid:0xfffffffffffffffe txntype:unknown reqpath:n/a Error Path:/solr/live_nodes/127.0.0.1:18117_solr Error:KeeperErrorCode = NoNode for /solr/live_nodes/127.0.0.1:18117_solr
[junit4:junit4]   2> 7387 T1371 oascc.SolrZkClient.makePath makePath: /live_nodes/127.0.0.1:18117_solr
[junit4:junit4]   2> 7397 T1417 oascc.ZkStateReader$3.process Updating live nodes
[junit4:junit4]   2> 7397 T1405 oascc.ZkStateReader$3.process Updating live nodes
[junit4:junit4]   2> 7397 T1391 oascc.ZkStateReader$3.process Updating live nodes
[junit4:junit4]   2> 7398 T1371 oashc.HttpShardHandlerFactory.getParameter Setting socketTimeout to: 0
[junit4:junit4]   2> 7398 T1371 oashc.HttpShardHandlerFactory.getParameter Setting urlScheme to: http://
[junit4:junit4]   2> 7399 T1371 oashc.HttpShardHandlerFactory.getParameter Setting connTimeout to: 0
[junit4:junit4]   2> 7399 T1371 oashc.HttpShardHandlerFactory.getParameter Setting maxConnectionsPerHost to: 20
[junit4:junit4]   2> 7400 T1371 oashc.HttpShardHandlerFactory.getParameter Setting corePoolSize to: 0
[junit4:junit4]   2> 7400 T1371 oashc.HttpShardHandlerFactory.getParameter Setting maximumPoolSize to: 2147483647
[junit4:junit4]   2> 7401 T1371 oashc.HttpShardHandlerFactory.getParameter Setting maxThreadIdleTime to: 5
[junit4:junit4]   2> 7401 T1371 oashc.HttpShardHandlerFactory.getParameter Setting sizeOfQueue to: -1
[junit4:junit4]   2> 7402 T1371 oashc.HttpShardHandlerFactory.getParameter Setting fairnessPolicy to: false
[junit4:junit4]   2> 7402 T1371 oascsi.HttpClientUtil.createClient Creating new http client, config:maxConnectionsPerHost=20&maxConnections=10000&socketTimeout=0&connTimeout=0&retry=false
[junit4:junit4]   2> 7420 T1371 oascc.ZkStateReader.createClusterStateWatchersAndUpdate Updating cluster state from ZooKeeper... 
[junit4:junit4]   2> 7427 T1371 oasc.CoreContainer.create Creating SolrCore 'collection1' using instanceDir: /usr/home/hudson/hudson-slave/workspace/Lucene-Solr-Tests-4.x-java7/solr/build/solr-core/test/J1/./solrtest-jetty3-1347888273898/collection1
[junit4:junit4]   2> 7428 T1371 oasc.ZkController.createCollectionZkNode Check for collection zkNode:collection1
[junit4:junit4]   2> 7428 T1371 oasc.ZkController.createCollectionZkNode Collection zkNode exists
[junit4:junit4]   2> 7429 T1371 oasc.ZkController.readConfigName Load collection config from:/collections/collection1
[junit4:junit4]   2> 7430 T1371 oasc.SolrResourceLoader.<init> new SolrResourceLoader for directory: '/usr/home/hudson/hudson-slave/workspace/Lucene-Solr-Tests-4.x-java7/solr/build/solr-core/test/J1/./solrtest-jetty3-1347888273898/collection1/'
[junit4:junit4]   2> 7432 T1371 oasc.SolrResourceLoader.replaceClassLoader Adding 'file:/usr/home/hudson/hudson-slave/workspace/Lucene-Solr-Tests-4.x-java7/solr/build/solr-core/test/J1/solrtest-jetty3-1347888273898/collection1/lib/README' to classloader
[junit4:junit4]   2> 7432 T1371 oasc.SolrResourceLoader.replaceClassLoader Adding 'file:/usr/home/hudson/hudson-slave/workspace/Lucene-Solr-Tests-4.x-java7/solr/build/solr-core/test/J1/solrtest-jetty3-1347888273898/collection1/lib/classes/' to classloader
[junit4:junit4]   2> 7488 T1371 oasc.SolrConfig.<init> Using Lucene MatchVersion: LUCENE_40
[junit4:junit4]   2> 7527 T1392 oascc.ZkStateReader.updateClusterState Updating cloud state from ZooKeeper... 
[junit4:junit4]   2> 7545 T1429 oascc.ZkStateReader$2.process A cluster state change has occurred - updating...
[junit4:junit4]   2> 7545 T1417 oascc.ZkStateReader$2.process A cluster state change has occurred - updating...
[junit4:junit4]   2> 7546 T1405 oascc.ZkStateReader$2.process A cluster state change has occurred - updating...
[junit4:junit4]   2> 7546 T1391 oascc.ZkStateReader$2.process A cluster state change has occurred - updating...
[junit4:junit4]   2> 7561 T1371 oasc.SolrConfig.<init> Loaded SolrConfig: solrconfig.xml
[junit4:junit4]   2> 7662 T1371 oass.IndexSchema.readSchema Reading Solr Schema
[junit4:junit4]   2> 7670 T1371 oass.IndexSchema.readSchema Schema name=test
[junit4:junit4]   2> 8358 T1371 oass.OpenExchangeRatesOrgProvider.init Initialized with rates=open-exchange-rates.json, refreshInterval=1440.
[junit4:junit4]   2> 8372 T1371 oass.IndexSchema.readSchema default search field in schema is text
[junit4:junit4]   2> 8376 T1371 oass.IndexSchema.readSchema unique key field: id
[junit4:junit4]   2> 8391 T1371 oass.FileExchangeRateProvider.reload Reloading exchange rates from file currency.xml
[junit4:junit4]   2> 8397 T1371 oass.FileExchangeRateProvider.reload Reloading exchange rates from file currency.xml
[junit4:junit4]   2> 8403 T1371 oass.OpenExchangeRatesOrgProvider.reload Reloading exchange rates from open-exchange-rates.json
[junit4:junit4]   2> 8404 T1371 oass.OpenExchangeRatesOrgProvider.reload Reloading exchange rates from open-exchange-rates.json
[junit4:junit4]   2> 8406 T1371 oasc.SolrCore.<init> [collection1] Opening new SolrCore at /usr/home/hudson/hudson-slave/workspace/Lucene-Solr-Tests-4.x-java7/solr/build/solr-core/test/J1/./solrtest-jetty3-1347888273898/collection1/, dataDir=./org.apache.solr.cloud.BasicDistributedZk2Test-1347888266841/jetty3/
[junit4:junit4]   2> 8406 T1371 oasc.JmxMonitoredMap.<init> JMX monitoring is enabled. Adding Solr mbeans to JMX Server: com.sun.jmx.mbeanserver.JmxMBeanServer@577feece
[junit4:junit4]   2> 8408 T1371 oasc.SolrCore.getNewIndexDir WARNING New index directory detected: old=null new=./org.apache.solr.cloud.BasicDistributedZk2Test-1347888266841/jetty3/index/
[junit4:junit4]   2> 8409 T1371 oasc.SolrCore.initIndex WARNING [collection1] Solr index directory './org.apache.solr.cloud.BasicDistributedZk2Test-1347888266841/jetty3/index' doesn't exist. Creating new index...
[junit4:junit4]   2> 8410 T1371 oasc.CachingDirectoryFactory.get return new directory for /usr/home/hudson/hudson-slave/workspace/Lucene-Solr-Tests-4.x-java7/solr/build/solr-core/test/J1/./org.apache.solr.cloud.BasicDistributedZk2Test-1347888266841/jetty3/index forceNew:false
[junit4:junit4]   2> 8429 T1371 oasc.SolrDeletionPolicy.onCommit SolrDeletionPolicy.onCommit: commits:num=1
[junit4:junit4]   2> 		commit{dir=NRTCachingDirectory(org.apache.lucene.store.NIOFSDirectory@/usr/home/hudson/hudson-slave/workspace/Lucene-Solr-Tests-4.x-java7/solr/build/solr-core/test/J1/org.apache.solr.cloud.BasicDistributedZk2Test-1347888266841/jetty3/index lockFactory=org.apache.lucene.store.NativeFSLockFactory@7827880c; maxCacheMB=48.0 maxMergeSizeMB=4.0),segFN=segments_1,generation=1,filenames=[segments_1]
[junit4:junit4]   2> 8430 T1371 oasc.SolrDeletionPolicy.updateCommits newest commit = 1
[junit4:junit4]   2> 8431 T1371 oasc.SolrCore.initWriters created xml: solr.XMLResponseWriter
[junit4:junit4]   2> 8434 T1371 oasup.UpdateRequestProcessorChain.init inserting DistributedUpdateProcessorFactory into updateRequestProcessorChain "dedupe"
[junit4:junit4]   2> 8435 T1371 oasup.UpdateRequestProcessorChain.init inserting DistributedUpdateProcessorFactory into updateRequestProcessorChain "dedupe-allfields"
[junit4:junit4]   2> 8435 T1371 oasup.UpdateRequestProcessorChain.init inserting DistributedUpdateProcessorFactory into updateRequestProcessorChain "stored_sig"
[junit4:junit4]   2> 8436 T1371 oasup.UpdateRequestProcessorChain.init inserting DistributedUpdateProcessorFactory into updateRequestProcessorChain "uniq-fields"
[junit4:junit4]   2> 8437 T1371 oasup.UpdateRequestProcessorChain.init inserting DistributedUpdateProcessorFactory into updateRequestProcessorChain "distrib-dup-test-chain-implicit"
[junit4:junit4]   2> 8437 T1371 oasc.RequestHandlers.initHandlersFromConfig adding lazy requestHandler: solr.ReplicationHandler
[junit4:junit4]   2> 8438 T1371 oasc.RequestHandlers.initHandlersFromConfig created /replication: solr.ReplicationHandler
[junit4:junit4]   2> 8439 T1371 oasc.RequestHandlers.initHandlersFromConfig created standard: solr.StandardRequestHandler
[junit4:junit4]   2> 8440 T1371 oasc.RequestHandlers.initHandlersFromConfig created /get: solr.RealTimeGetHandler
[junit4:junit4]   2> 8441 T1371 oasc.RequestHandlers.initHandlersFromConfig created dismax: solr.SearchHandler
[junit4:junit4]   2> 8441 T1371 oasc.RequestHandlers.initHandlersFromConfig created mock: org.apache.solr.core.MockQuerySenderListenerReqHandler
[junit4:junit4]   2> 8442 T1371 oasc.RequestHandlers.initHandlersFromConfig created /admin/: org.apache.solr.handler.admin.AdminHandlers
[junit4:junit4]   2> 8443 T1371 oasc.RequestHandlers.initHandlersFromConfig created defaults: solr.StandardRequestHandler
[junit4:junit4]   2> 8443 T1371 oasc.RequestHandlers.initHandlersFromConfig adding lazy requestHandler: solr.StandardRequestHandler
[junit4:junit4]   2> 8444 T1371 oasc.RequestHandlers.initHandlersFromConfig created lazy: solr.StandardRequestHandler
[junit4:junit4]   2> 8445 T1371 oasc.RequestHandlers.initHandlersFromConfig created /update: solr.UpdateRequestHandler
[junit4:junit4]   2> 8446 T1371 oasc.RequestHandlers.initHandlersFromConfig created /terms: org.apache.solr.handler.component.SearchHandler
[junit4:junit4]   2> 8446 T1371 oasc.RequestHandlers.initHandlersFromConfig created spellCheckCompRH: org.apache.solr.handler.component.SearchHandler
[junit4:junit4]   2> 8447 T1371 oasc.RequestHandlers.initHandlersFromConfig created spellCheckCompRH_Direct: org.apache.solr.handler.component.SearchHandler
[junit4:junit4]   2> 8448 T1371 oasc.RequestHandlers.initHandlersFromConfig created spellCheckWithWordbreak: org.apache.solr.handler.component.SearchHandler
[junit4:junit4]   2> 8449 T1371 oasc.RequestHandlers.initHandlersFromConfig created spellCheckWithWordbreak_Direct: org.apache.solr.handler.component.SearchHandler
[junit4:junit4]   2> 8450 T1371 oasc.RequestHandlers.initHandlersFromConfig created spellCheckCompRH1: org.apache.solr.handler.component.SearchHandler
[junit4:junit4]   2> 8450 T1371 oasc.RequestHandlers.initHandlersFromConfig created tvrh: org.apache.solr.handler.component.SearchHandler
[junit4:junit4]   2> 8451 T1371 oasc.RequestHandlers.initHandlersFromConfig created /mlt: solr.MoreLikeThisHandler
[junit4:junit4]   2> 8452 T1371 oasc.RequestHandlers.initHandlersFromConfig created /debug/dump: solr.DumpRequestHandler
[junit4:junit4]   2> 8456 T1371 oashl.XMLLoader.init xsltCacheLifetimeSeconds=60
[junit4:junit4]   2> 8462 T1371 oasc.SolrCore.initDeprecatedSupport WARNING solrconfig.xml uses deprecated <admin/gettableFiles>, Please update your config to use the ShowFileRequestHandler.
[junit4:junit4]   2> 8463 T1371 oasc.SolrCore.initDeprecatedSupport WARNING adding ShowFileRequestHandler with hidden files: [SCHEMA.XML, OLD_SYNONYMS.TXT, STOPWORDS.TXT, PROTWORDS.TXT, OPEN-EXCHANGE-RATES.JSON, SYNONYMS.TXT, CURRENCY.XML, MAPPING-ISOLATIN1ACCENT.TXT]
[junit4:junit4]   2> 8468 T1371 oass.SolrIndexSearcher.<init> Opening Searcher@36b2108d main
[junit4:junit4]   2> 8469 T1371 oasu.CommitTracker.<init> Hard AutoCommit: disabled
[junit4:junit4]   2> 8470 T1371 oasu.CommitTracker.<init> Soft AutoCommit: disabled
[junit4:junit4]   2> 8471 T1371 oashc.SpellCheckComponent.inform Initializing spell checkers
[junit4:junit4]   2> 8480 T1371 oass.DirectSolrSpellChecker.init init: {name=direct,classname=DirectSolrSpellChecker,field=lowerfilt,minQueryLength=3}
[junit4:junit4]   2> 8559 T1430 oasc.SolrCore.registerSearcher [collection1] Registered new searcher Searcher@36b2108d main{StandardDirectoryReader(segments_1:1)}
[junit4:junit4]   2> 9061 T1392 oascc.ZkStateReader.updateClusterState Updating cloud state from ZooKeeper... 
[junit4:junit4]   2> 9065 T1429 oascc.ZkStateReader$2.process A cluster state change has occurred - updating...
[junit4:junit4]   2> 9065 T1417 oascc.ZkStateReader$2.process A cluster state change has occurred - updating...
[junit4:junit4]   2> 9065 T1391 oascc.ZkStateReader$2.process A cluster state change has occurred - updating...
[junit4:junit4]   2> 9065 T1405 oascc.ZkStateReader$2.process A cluster state change has occurred - updating...
[junit4:junit4]   2> 9067 T1371 oasc.CoreContainer.register registering core: collection1
[junit4:junit4]   2> 9067 T1371 oasc.ZkController.register Register shard - core:collection1 address:http://127.0.0.1:18117/solr shardId:shard1
[junit4:junit4]   2> 9069 T1371 oasc.ZkController.register We are http://127.0.0.1:18117/solr/collection1/ and leader is http://127.0.0.1:18108/solr/collection1/
[junit4:junit4]   2> 9070 T1371 oasc.ZkController.register No LogReplay needed for core=collection1 baseURL=http://127.0.0.1:18117/solr
[junit4:junit4]   2> 9070 T1371 oasc.ZkController.checkRecovery Core needs to recover:collection1
[junit4:junit4]   2> 9071 T1371 oasu.DefaultSolrCoreState.doRecovery Running recovery - first canceling any ongoing recovery
[junit4:junit4]   2> ASYNC  NEW_CORE C47 name=collection1 org.apache.solr.core.SolrCore@19a75ab6 url=http://127.0.0.1:18117/solr/collection1 node=127.0.0.1:18117_solr
[junit4:junit4]   2> 9072 T1431 C47 P18117 oasc.RecoveryStrategy.run Starting recovery process.  core=collection1 recoveringAfterStartup=true
[junit4:junit4]   2> 9072 T1431 C47 P18117 oasc.RecoveryStrategy.doRecovery ###### startupVersions=[]
[junit4:junit4]   2> 9072 T1371 oascc.ZkStateReader.updateClusterState Updating cloud state from ZooKeeper... 
[junit4:junit4]   2> 9073 T1431 C47 P18117 oasc.RecoveryStrategy.doRecovery Attempting to PeerSync from http://127.0.0.1:18108/solr/collection1/ core=collection1 - recoveringAfterStartup=true
[junit4:junit4]   2> 9074 T1431 C47 P18117 oasu.PeerSync.sync PeerSync: core=collection1 url=http://127.0.0.1:18117/solr START replicas=[http://127.0.0.1:18108/solr/collection1/] nUpdates=100
[junit4:junit4]   2> 9073 T1371 oass.SolrDispatchFilter.init user.dir=/usr/home/hudson/hudson-slave/workspace/Lucene-Solr-Tests-4.x-java7/solr/build/solr-core/test/J1
[junit4:junit4]   2> 9074 T1431 C47 P18117 oasu.PeerSync.sync WARNING no frame of reference to tell of we've missed updates
[junit4:junit4]   2> 9074 T1371 oass.SolrDispatchFilter.init SolrDispatchFilter.init() done
[junit4:junit4]   2> 9075 T1431 C47 P18117 oasc.RecoveryStrategy.doRecovery PeerSync Recovery was not successful - trying replication. core=collection1
[junit4:junit4]   2> 9075 T1431 C47 P18117 oasc.RecoveryStrategy.doRecovery Starting Replication Recovery. core=collection1
[junit4:junit4]   2> 9075 T1371 oascsi.HttpClientUtil.createClient Creating new http client, config:maxConnections=128&maxConnectionsPerHost=32&followRedirects=false
[junit4:junit4]   2> 9075 T1431 C47 P18117 oascsi.HttpClientUtil.createClient Creating new http client, config:maxConnections=128&maxConnectionsPerHost=32&followRedirects=false
[junit4:junit4]   2> ASYNC  NEW_CORE C48 name=collection1 org.apache.solr.core.SolrCore@784ce404 url=http://127.0.0.1:18108/solr/collection1 node=127.0.0.1:18108_solr
[junit4:junit4]   2> 9091 T1397 C48 P18108 REQ /get {distrib=false&qt=/get&wt=javabin&version=2&getVersions=100} status=0 QTime=0 
[junit4:junit4]   2> 9260 T1371 oejs.Server.doStart jetty-8.1.2.v20120308
[junit4:junit4]   2> 9263 T1371 oejs.AbstractConnector.doStart Started SocketConnector@0.0.0.0:18121
[junit4:junit4]   2> 9264 T1371 oasc.SolrResourceLoader.locateSolrHome JNDI not configured for solr (NoInitialContextEx)
[junit4:junit4]   2> 9264 T1371 oasc.SolrResourceLoader.locateSolrHome using system property solr.solr.home: /usr/home/hudson/hudson-slave/workspace/Lucene-Solr-Tests-4.x-java7/solr/build/solr-core/test/J1/./solrtest-jetty4-1347888275929
[junit4:junit4]   2> 9265 T1371 oasc.SolrResourceLoader.<init> new SolrResourceLoader for deduced Solr Home: '/usr/home/hudson/hudson-slave/workspace/Lucene-Solr-Tests-4.x-java7/solr/build/solr-core/test/J1/./solrtest-jetty4-1347888275929/'
[junit4:junit4]   2> 9311 T1371 oass.SolrDispatchFilter.init SolrDispatchFilter.init()
[junit4:junit4]   2> 9312 T1371 oasc.SolrResourceLoader.locateSolrHome JNDI not configured for solr (NoInitialContextEx)
[junit4:junit4]   2> 9312 T1371 oasc.SolrResourceLoader.locateSolrHome using system property solr.solr.home: /usr/home/hudson/hudson-slave/workspace/Lucene-Solr-Tests-4.x-java7/solr/build/solr-core/test/J1/./solrtest-jetty4-1347888275929
[junit4:junit4]   2> 9313 T1371 oasc.CoreContainer$Initializer.initialize looking for solr.xml: /usr/home/hudson/hudson-slave/workspace/Lucene-Solr-Tests-4.x-java7/solr/build/solr-core/test/J1/./solrtest-jetty4-1347888275929/solr.xml
[junit4:junit4]   2> 9313 T1371 oasc.CoreContainer.<init> New CoreContainer 24219235
[junit4:junit4]   2> 9314 T1371 oasc.CoreContainer.load Loading CoreContainer using Solr Home: '/usr/home/hudson/hudson-slave/workspace/Lucene-Solr-Tests-4.x-java7/solr/build/solr-core/test/J1/./solrtest-jetty4-1347888275929/'
[junit4:junit4]   2> 9314 T1371 oasc.SolrResourceLoader.<init> new SolrResourceLoader for directory: '/usr/home/hudson/hudson-slave/workspace/Lucene-Solr-Tests-4.x-java7/solr/build/solr-core/test/J1/./solrtest-jetty4-1347888275929/'
[junit4:junit4]   2> 9349 T1371 oasc.CoreContainer.load Registering Log Listener
[junit4:junit4]   2> 9365 T1371 oasc.CoreContainer.initZooKeeper Zookeeper client=127.0.0.1:18103/solr
[junit4:junit4]   2> 9365 T1371 oaz.ZooKeeper.<init> Initiating client connection, connectString=127.0.0.1:18103/solr sessionTimeout=5000 watcher=org.apache.solr.common.cloud.ConnectionManager@3b20837a
[junit4:junit4]   2> 9367 T1442 oaz.ClientCnxn$SendThread.startConnect Opening socket connection to server /127.0.0.1:18103
[junit4:junit4]   2> 9367 T1371 oascc.ConnectionManager.waitForConnected Waiting for client to connect to ZooKeeper
[junit4:junit4]   2> 9368 T1442 oaz.ClientCnxn$SendThread.primeConnection Socket connection established to localhost/127.0.0.1:18103, initiating session
[junit4:junit4]   2> 9368 T1373 oazs.NIOServerCnxn$Factory.run Accepted socket connection from /140.211.11.196:18122
[junit4:junit4]   2> 9369 T1373 oazs.NIOServerCnxn.readConnectRequest Client attempting to establish new session at /140.211.11.196:18122
[junit4:junit4]   2> 9381 T1375 oazs.NIOServerCnxn.finishSessionInit Established session 0x139d466be610006 with negotiated timeout 5000 for client /140.211.11.196:18122
[junit4:junit4]   2> 9381 T1442 oaz.ClientCnxn$SendThread.readConnectResult Session establishment complete on server localhost/127.0.0.1:18103, sessionid = 0x139d466be610006, negotiated timeout = 5000
[junit4:junit4]   2> 9381 T1443 oascc.ConnectionManager.process Watcher org.apache.solr.common.cloud.ConnectionManager@3b20837a name:ZooKeeperConnection Watcher:127.0.0.1:18103/solr got event WatchedEvent state:SyncConnected type:None path:null path:null type:None
[junit4:junit4]   2> 9381 T1371 oascc.ConnectionManager.waitForConnected Client is connected to ZooKeeper
[junit4:junit4]   2> 9382 T1376 oazs.PrepRequestProcessor.pRequest Got user-level KeeperException when processing sessionid:0x139d466be610006 type:create cxid:0x1 zxid:0xfffffffffffffffe txntype:unknown reqpath:n/a Error Path:/solr/overseer Error:KeeperErrorCode = NodeExists for /solr/overseer
[junit4:junit4]   2> 9389 T1376 oazs.PrepRequestProcessor.pRequest Got user-level KeeperException when processing sessionid:0x139d466be610006 type:create cxid:0x2 zxid:0xfffffffffffffffe txntype:unknown reqpath:n/a Error Path:/solr/overseer Error:KeeperErrorCode = NodeExists for /solr/overseer
[junit4:junit4]   2> 9399 T1371 oasc.ZkController.createEphemeralLiveNode Register node as live in ZooKeeper:/live_nodes/127.0.0.1:18121_solr
[junit4:junit4]   2> 9400 T1376 oazs.PrepRequestProcessor.pRequest Got user-level KeeperException when processing sessionid:0x139d466be610006 type:delete cxid:0x4 zxid:0xfffffffffffffffe txntype:unknown reqpath:n/a Error Path:/solr/live_nodes/127.0.0.1:18121_solr Error:KeeperErrorCode = NoNode for /solr/live_nodes/127.0.0.1:18121_solr
[junit4:junit4]   2> 9407 T1371 oascc.SolrZkClient.makePath makePath: /live_nodes/127.0.0.1:18121_solr
[junit4:junit4]   2> 9419 T1405 oascc.ZkStateReader$3.process Updating live nodes
[junit4:junit4]   2> 9419 T1429 oascc.ZkStateReader$3.process Updating live nodes
[junit4:junit4]   2> 9419 T1391 oascc.ZkStateReader$3.process Updating live nodes
[junit4:junit4]   2> 9419 T1417 oascc.ZkStateReader$3.process Updating live nodes
[junit4:junit4]   2> 9420 T1371 oashc.HttpShardHandlerFactory.getParameter Setting socketTimeout to: 0
[junit4:junit4]   2> 9420 T1371 oashc.HttpShardHandlerFactory.getParameter Setting urlScheme to: http://
[junit4:junit4]   2> 9420 T1371 oashc.HttpShardHandlerFactory.getParameter Setting connTimeout to: 0
[junit4:junit4]   2> 9421 T1371 oashc.HttpShardHandlerFactory.getParameter Setting maxConnectionsPerHost to: 20
[junit4:junit4]   2> 9421 T1371 oashc.HttpShardHandlerFactory.getParameter Setting corePoolSize to: 0
[junit4:junit4]   2> 9422 T1371 oashc.HttpShardHandlerFactory.getParameter Setting maximumPoolSize to: 2147483647
[junit4:junit4]   2> 9422 T1371 oashc.HttpShardHandlerFactory.getParameter Setting maxThreadIdleTime to: 5
[junit4:junit4]   2> 9423 T1371 oashc.HttpShardHandlerFactory.getParameter Setting sizeOfQueue to: -1
[junit4:junit4]   2> 9423 T1371 oashc.HttpShardHandlerFactory.getParameter Setting fairnessPolicy to: false
[junit4:junit4]   2> 9423 T1371 oascsi.HttpClientUtil.createClient Creating new http client, config:maxConnectionsPerHost=20&maxConnections=10000&socketTimeout=0&connTimeout=0&retry=false
[junit4:junit4]   2> 9445 T1371 oascc.ZkStateReader.createClusterStateWatchersAndUpdate Updating cluster state from ZooKeeper... 
[junit4:junit4]   2> 9451 T1371 oasc.CoreContainer.create Creating SolrCore 'collection1' using instanceDir: /usr/home/hudson/hudson-slave/workspace/Lucene-Solr-Tests-4.x-java7/solr/build/solr-core/test/J1/./solrtest-jetty4-1347888275929/collection1
[junit4:junit4]   2> 9451 T1371 oasc.ZkController.createCollectionZkNode Check for collection zkNode:collection1
[junit4:junit4]   2> 9452 T1371 oasc.ZkController.createCollectionZkNode Collection zkNode exists
[junit4:junit4]   2> 9452 T1371 oasc.ZkController.readConfigName Load collection config from:/collections/collection1
[junit4:junit4]   2> 9453 T1371 oasc.SolrResourceLoader.<init> new SolrResourceLoader for directory: '/usr/home/hudson/hudson-slave/workspace/Lucene-Solr-Tests-4.x-java7/solr/build/solr-core/test/J1/./solrtest-jetty4-1347888275929/collection1/'
[junit4:junit4]   2> 9455 T1371 oasc.SolrResourceLoader.replaceClassLoader Adding 'file:/usr/home/hudson/hudson-slave/workspace/Lucene-Solr-Tests-4.x-java7/solr/build/solr-core/test/J1/solrtest-jetty4-1347888275929/collection1/lib/README' to classloader
[junit4:junit4]   2> 9455 T1371 oasc.SolrResourceLoader.replaceClassLoader Adding 'file:/usr/home/hudson/hudson-slave/workspace/Lucene-Solr-Tests-4.x-java7/solr/build/solr-core/test/J1/solrtest-jetty4-1347888275929/collection1/lib/classes/' to classloader
[junit4:junit4]   2> 9507 T1371 oasc.SolrConfig.<init> Using Lucene MatchVersion: LUCENE_40
[junit4:junit4]   2> 9568 T1392 oascc.ZkStateReader.updateClusterState Updating cloud state from ZooKeeper... 
[junit4:junit4]   2> 9580 T1371 oasc.SolrConfig.<init> Loaded SolrConfig: solrconfig.xml
[junit4:junit4]   2> 9593 T1405 oascc.ZkStateReader$2.process A cluster state change has occurred - updating...
[junit4:junit4]   2> 9593 T1429 oascc.ZkStateReader$2.process A cluster state change has occurred - updating...
[junit4:junit4]   2> 9593 T1417 oascc.ZkStateReader$2.process A cluster state change has occurred - updating...
[junit4:junit4]   2> 9593 T1391 oascc.ZkStateReader$2.process A cluster state change has occurred - updating...
[junit4:junit4]   2> 9687 T1443 oascc.ZkStateReader$2.process A cluster state change has occurred - updating...
[junit4:junit4]   2> 9687 T1371 oass.IndexSchema.readSchema Reading Solr Schema
[junit4:junit4]   2> 9695 T1371 oass.IndexSchema.readSchema Schema name=test
[junit4:junit4]   2> 10366 T1371 oass.OpenExchangeRatesOrgProvider.init Initialized with rates=open-exchange-rates.json, refreshInterval=1440.
[junit4:junit4]   2> 10381 T1371 oass.IndexSchema.readSchema default search field in schema is text
[junit4:junit4]   2> 10386 T1371 oass.IndexSchema.readSchema unique key field: id
[junit4:junit4]   2> 10401 T1371 oass.FileExchangeRateProvider.reload Reloading exchange rates from file currency.xml
[junit4:junit4]   2> 10407 T1371 oass.FileExchangeRateProvider.reload Reloading exchange rates from file currency.xml
[junit4:junit4]   2> 10413 T1371 oass.OpenExchangeRatesOrgProvider.reload Reloading exchange rates from open-exchange-rates.json
[junit4:junit4]   2> 10414 T1371 oass.OpenExchangeRatesOrgProvider.reload Reloading exchange rates from open-exchange-rates.json
[junit4:junit4]   2> 10415 T1371 oasc.SolrCore.<init> [collection1] Opening new SolrCore at /usr/home/hudson/hudson-slave/workspace/Lucene-Solr-Tests-4.x-java7/solr/build/solr-core/test/J1/./solrtest-jetty4-1347888275929/collection1/, dataDir=./org.apache.solr.cloud.BasicDistributedZk2Test-1347888266841/jetty4/
[junit4:junit4]   2> 10416 T1371 oasc.JmxMonitoredMap.<init> JMX monitoring is enabled. Adding Solr mbeans to JMX Server: com.sun.jmx.mbeanserver.JmxMBeanServer@577feece
[junit4:junit4]   2> 10417 T1371 oasc.SolrCore.getNewIndexDir WARNING New index directory detected: old=null new=./org.apache.solr.cloud.BasicDistributedZk2Test-1347888266841/jetty4/index/
[junit4:junit4]   2> 10419 T1371 oasc.SolrCore.initIndex WARNING [collection1] Solr index directory './org.apache.solr.cloud.BasicDistributedZk2Test-1347888266841/jetty4/index' doesn't exist. Creating new index...
[junit4:junit4]   2> 10420 T1371 oasc.CachingDirectoryFactory.get return new directory for /usr/home/hudson/hudson-slave/workspace/Lucene-Solr-Tests-4.x-java7/solr/build/solr-core/test/J1/./org.apache.solr.cloud.BasicDistributedZk2Test-1347888266841/jetty4/index forceNew:false
[junit4:junit4]   2> 10440 T1371 oasc.SolrDeletionPolicy.onCommit SolrDeletionPolicy.onCommit: commits:num=1
[junit4:junit4]   2> 		commit{dir=NRTCachingDirectory(org.apache.lucene.store.NIOFSDirectory@/usr/home/hudson/hudson-slave/workspace/Lucene-Solr-Tests-4.x-java7/solr/build/solr-core/test/J1/org.apache.solr.cloud.BasicDistributedZk2Test-1347888266841/jetty4/index lockFactory=org.apache.lucene.store.NativeFSLockFactory@622b937e; maxCacheMB=48.0 maxMergeSizeMB=4.0),segFN=segments_1,generation=1,filenames=[segments_1]
[junit4:junit4]   2> 10441 T1371 oasc.SolrDeletionPolicy.updateCommits newest commit = 1
[junit4:junit4]   2> 10442 T1371 oasc.SolrCore.initWriters created xml: solr.XMLResponseWriter
[junit4:junit4]   2> 10445 T1371 oasup.UpdateRequestProcessorChain.init inserting DistributedUpdateProcessorFactory into updateRequestProcessorChain "dedupe"
[junit4:junit4]   2> 10446 T1371 oasup.UpdateRequestProcessorChain.init inserting DistributedUpdateProcessorFactory into updateRequestProcessorChain "dedupe-allfields"
[junit4:junit4]   2> 10446 T1371 oasup.UpdateRequestProcessorChain.init inserting DistributedUpdateProcessorFactory into updateRequestProcessorChain "stored_sig"
[junit4:junit4]   2> 10447 T1371 oasup.UpdateRequestProcessorChain.init inserting DistributedUpdateProcessorFactory into updateRequestProcessorChain "uniq-fields"
[junit4:junit4]   2> 10448 T1371 oasup.UpdateRequestProcessorChain.init inserting DistributedUpdateProcessorFactory into updateRequestProcessorChain "distrib-dup-test-chain-implicit"
[junit4:junit4]   2> 10449 T1371 oasc.RequestHandlers.initHandlersFromConfig adding lazy requestHandler: solr.ReplicationHandler
[junit4:junit4]   2> 10449 T1371 oasc.RequestHandlers.initHandlersFromConfig created /replication: solr.ReplicationHandler
[junit4:junit4]   2> 10450 T1371 oasc.RequestHandlers.initHandlersFromConfig created standard: solr.StandardRequestHandler
[junit4:junit4]   2> 10451 T1371 oasc.RequestHandlers.initHandlersFromConfig created /get: solr.RealTimeGetHandler
[junit4:junit4]   2> 10452 T1371 oasc.RequestHandlers.initHandlersFromConfig created dismax: solr.SearchHandler
[junit4:junit4]   2> 10453 T1371 oasc.RequestHandlers.initHandlersFromConfig created mock: org.apache.solr.core.MockQuerySenderListenerReqHandler
[junit4:junit4]   2> 10453 T1371 oasc.RequestHandlers.initHandlersFromConfig created /admin/: org.apache.solr.handler.admin.AdminHandlers
[junit4:junit4]   2> 10454 T1371 oasc.RequestHandlers.initHandlersFromConfig created defaults: solr.StandardRequestHandler
[junit4:junit4]   2> 10454 T1371 oasc.RequestHandlers.initHandlersFromConfig adding lazy requestHandler: solr.StandardRequestHandler
[junit4:junit4]   2> 10455 T1371 oasc.RequestHandlers.initHandlersFromConfig created lazy: solr.StandardRequestHandler
[junit4:junit4]   2> 10456 T1371 oasc.RequestHandlers.initHandlersFromConfig created /update: solr.UpdateRequestHandler
[junit4:junit4]   2> 10457 T1371 oasc.RequestHandlers.initHandlersFromConfig created /terms: org.apache.solr.handler.component.SearchHandler
[junit4:junit4]   2> 10458 T1371 oasc.RequestHandlers.initHandlersFromConfig created spellCheckCompRH: org.apache.solr.handler.component.SearchHandler
[junit4:junit4]   2> 10458 T1371 oasc.RequestHandlers.initHandlersFromConfig created spellCheckCompRH_Direct: org.apache.solr.handler.component.SearchHandler
[junit4:junit4]   2> 10459 T1371 oasc.RequestHandlers.initHandlersFromConfig created spellCheckWithWordbreak: org.apache.solr.handler.component.SearchHandler
[junit4:junit4]   2> 10460 T1371 oasc.RequestHandlers.initHandlersFromConfig created spellCheckWithWordbreak_Direct: org.apache.solr.handler.component.SearchHandler
[junit4:junit4]   2> 10461 T1371 oasc.RequestHandlers.initHandlersFromConfig created spellCheckCompRH1: org.apache.solr.handler.component.SearchHandler
[junit4:junit4]   2> 10461 T1371 oasc.RequestHandlers.initHandlersFromConfig created tvrh: org.apache.solr.handler.component.SearchHandler
[junit4:junit4]   2> 10462 T1371 oasc.RequestHandlers.initHandlersFromConfig created /mlt: solr.MoreLikeThisHandler
[junit4:junit4]   2> 10463 T1371 oasc.RequestHandlers.initHandlersFromConfig created /debug/dump: solr.DumpRequestHandler
[junit4:junit4]   2> 10467 T1371 oashl.XMLLoader.init xsltCacheLifetimeSeconds=60
[junit4:junit4]   2> 10472 T1371 oasc.SolrCore.initDeprecatedSupport WARNING solrconfig.xml uses deprecated <admin/gettableFiles>, Please update your config to use the ShowFileRequestHandler.
[junit4:junit4]   2> 10473 T1371 oasc.SolrCore.initDeprecatedSupport WARNING adding ShowFileRequestHandler with hidden files: [SCHEMA.XML, OLD_SYNONYMS.TXT, STOPWORDS.TXT, PROTWORDS.TXT, OPEN-EXCHANGE-RATES.JSON, SYNONYMS.TXT, CURRENCY.XML, MAPPING-ISOLATIN1ACCENT.TXT]
[junit4:junit4]   2> 10477 T1371 oass.SolrIndexSearcher.<init> Opening Searcher@2c4ee890 main
[junit4:junit4]   2> 10479 T1371 oasu.CommitTracker.<init> Hard AutoCommit: disabled
[junit4:junit4]   2> 10479 T1371 oasu.CommitTracker.<init> Soft AutoCommit: disabled
[junit4:junit4]   2> 10480 T1371 oashc.SpellCheckComponent.inform Initializing spell checkers
[junit4:junit4]   2> 10503 T1371 oass.DirectSolrSpellChecker.init init: {name=direct,classname=DirectSolrSpellChecker,field=lowerfilt,minQueryLength=3}
[junit4:junit4]   2> 10586 T1444 oasc.SolrCore.registerSearcher [collection1] Registered new searcher Searcher@2c4ee890 main{StandardDirectoryReader(segments_1:1)}
[junit4:junit4]   2> 10604 T1392 oascc.ZkStateReader.updateClusterState Updating cloud state from ZooKeeper... 
[junit4:junit4]   2> 10617 T1391 oascc.ZkStateReader$2.process A cluster state change has occurred - updating...
[junit4:junit4]   2> 10617 T1405 oascc.ZkStateReader$2.process A cluster state change has occurred - updating...
[junit4:junit4]   2> 10617 T1443 oascc.ZkStateReader$2.process A cluster state change has occurred - updating...
[junit4:junit4]   2> 10617 T1417 oascc.ZkStateReader$2.process A cluster state change has occurred - updating...
[junit4:junit4]   2> 10617 T1429 oascc.ZkStateReader$2.process A cluster state change has occurred - updating...
[junit4:junit4]   2> 11094 T1371 oasc.CoreContainer.register registering core: collection1
[junit4:junit4]   2> 11094 T1371 oasc.ZkController.register Register shard - core:collection1 address:http://127.0.0.1:18121/solr shardId:shard2
[junit4:junit4]   2> 11098 T1371 oasc.ZkController.register We are http://127.0.0.1:18121/solr/collection1/ and leader is http://127.0.0.1:18112/solr/collection1/
[junit4:junit4]   2> 11098 T1371 oasc.ZkController.register No LogReplay needed for core=collection1 baseURL=http://127.0.0.1:18121/solr
[junit4:junit4]   2> 11099 T1371 oasc.ZkController.checkRecovery Core needs to recover:collection1
[junit4:junit4]   2> 11099 T1371 oasu.DefaultSolrCoreState.doRecovery Running recovery - first canceling any ongoing recovery
[junit4:junit4]   2> ASYNC  NEW_CORE C49 name=collection1 org.apache.solr.core.SolrCore@47e1bb7d url=http://127.0.0.1:18121/solr/collection1 node=127.0.0.1:18121_solr
[junit4:junit4]   2> 11101 T1445 C49 P18121 oasc.RecoveryStrategy.run Starting recovery process.  core=collection1 recoveringAfterStartup=true
[junit4:junit4]   2> 11101 T1371 oascc.ZkStateReader.updateClusterState Updating cloud state from ZooKeeper... 
[junit4:junit4]   2> 11122 T1445 C49 P18121 oasc.RecoveryStrategy.doRecovery ###### startupVersions=[]
[junit4:junit4]   2> 11123 T1371 oass.SolrDispatchFilter.init user.dir=/usr/home/hudson/hudson-slave/workspace/Lucene-Solr-Tests-4.x-java7/solr/build/solr-core/test/J1
[junit4:junit4]   2> 11123 T1371 oass.SolrDispatchFilter.init SolrDispatchFilter.init() done
[junit4:junit4]   2> 11124 T1445 C49 P18121 oasc.RecoveryStrategy.doRecovery Attempting to PeerSync from http://127.0.0.1:18112/solr/collection1/ core=collection1 - recoveringAfterStartup=true
[junit4:junit4]   2> 11124 T1445 C49 P18121 oasu.PeerSync.sync PeerSync: core=collection1 url=http://127.0.0.1:18121/solr START replicas=[http://127.0.0.1:18112/solr/collection1/] nUpdates=100
[junit4:junit4]   2> 11124 T1371 oascsi.HttpClientUtil.createClient Creating new http client, config:maxConnections=128&maxConnectionsPerHost=32&followRedirects=false
[junit4:junit4]   2> 11124 T1445 C49 P18121 oasu.PeerSync.sync WARNING no frame of reference to tell of we've missed updates
[junit4:junit4]   2> 11125 T1445 C49 P18121 oasc.RecoveryStrategy.doRecovery PeerSync Recovery was not successful - trying replication. core=collection1
[junit4:junit4]   2> 11125 T1445 C49 P18121 oasc.RecoveryStrategy.doRecovery Starting Replication Recovery. core=collection1
[junit4:junit4]   2> 11125 T1445 C49 P18121 oascsi.HttpClientUtil.createClient Creating new http client, config:maxConnections=128&maxConnectionsPerHost=32&followRedirects=false
[junit4:junit4]   2> ASYNC  NEW_CORE C50 name=collection1 org.apache.solr.core.SolrCore@264d035 url=http://127.0.0.1:18112/solr/collection1 node=127.0.0.1:18112_solr
[junit4:junit4]   2> 11136 T1409 C50 P18112 REQ /get {distrib=false&qt=/get&wt=javabin&version=2&getVersions=100} status=0 QTime=0 
[junit4:junit4]   2> 11150 T1371 oaz.ZooKeeper.<init> Initiating client connection, connectString=127.0.0.1:18103/solr sessionTimeout=10000 watcher=org.apache.solr.common.cloud.ConnectionManager@209618af
[junit4:junit4]   2> 11151 T1447 oaz.ClientCnxn$SendThread.startConnect Opening socket connection to server /127.0.0.1:18103
[junit4:junit4]   2> 11151 T1371 oascc.ConnectionManager.waitForConnected Waiting for client to connect to ZooKeeper
[junit4:junit4]   2> 11152 T1447 oaz.ClientCnxn$SendThread.primeConnection Socket connection established to localhost/127.0.0.1:18103, initiating session
[junit4:junit4]   2> 11152 T1373 oazs.NIOServerCnxn$Factory.run Accepted socket connection from /140.211.11.196:18125
[junit4:junit4]   2> 11152 T1373 oazs.NIOServerCnxn.readConnectRequest Client attempting to establish new session at /140.211.11.196:18125
[junit4:junit4]   2> 11154 T1375 oazs.NIOServerCnxn.finishSessionInit Established session 0x139d466be610007 with negotiated timeout 10000 for client /140.211.11.196:18125
[junit4:junit4]   2> 11154 T1447 oaz.ClientCnxn$SendThread.readConnectResult Session establishment complete on server localhost/127.0.0.1:18103, sessionid = 0x139d466be610007, negotiated timeout = 10000
[junit4:junit4]   2> 11155 T1448 oascc.ConnectionManager.process Watcher org.apache.solr.common.cloud.ConnectionManager@209618af name:ZooKeeperConnection Watcher:127.0.0.1:18103/solr got event WatchedEvent state:SyncConnected type:None path:null path:null type:None
[junit4:junit4]   2> 11155 T1371 oascc.ConnectionManager.waitForConnected Client is connected to ZooKeeper
[junit4:junit4]   2> 11156 T1371 oascc.ZkStateReader.createClusterStateWatchersAndUpdate Updating cluster state from ZooKeeper... 
[junit4:junit4]   2> 11157 T1371 oasc.ChaosMonkey.monkeyLog monkey: init - expire sessions:true cause connection loss:true
[junit4:junit4]   2> 11157 T1371 oascsi.HttpClientUtil.createClient Creating new http client, config:
[junit4:junit4]   2> 11170 T1371 oascc.ZkStateReader.updateClusterState Updating cloud state from ZooKeeper... 
[junit4:junit4]   2> ASYNC  NEW_CORE C51 name=collection1 org.apache.solr.core.SolrCore@4cf1c0d1 url=http://127.0.0.1:18106/solr/collection1 node=127.0.0.1:18106_solr
[junit4:junit4]   2> 11185 T1383 C51 P18106 oasc.SolrDeletionPolicy.onInit SolrDeletionPolicy.onInit: commits:num=1
[junit4:junit4]   2> 		commit{dir=NRTCachingDirectory(org.apache.lucene.store.NIOFSDirectory@/usr/home/hudson/hudson-slave/workspace/Lucene-Solr-Tests-4.x-java7/solr/build/solr-core/test/J1/org.apache.solr.cloud.BasicDistributedZk2Test-1347888266841/control/data/index lockFactory=org.apache.lucene.store.NativeFSLockFactory@7898a26c; maxCacheMB=48.0 maxMergeSizeMB=4.0),segFN=segments_1,generation=1,filenames=[segments_1]
[junit4:junit4]   2> 11186 T1383 C51 P18106 oasc.SolrDeletionPolicy.updateCommits newest commit = 1
[junit4:junit4]   2> 11191 T1383 C51 P18106 /update {wt=javabin&version=2} {add=[1 (1413363299006808064)]} 0 12
[junit4:junit4]   2> 11192 T1371 oaz.ZooKeeper.<init> Initiating client connection, connectString=127.0.0.1:18103/solr sessionTimeout=10000 watcher=org.apache.solr.common.cloud.ConnectionManager@4e162869
[junit4:junit4]   2> 11192 T1449 oaz.ClientCnxn$SendThread.startConnect Opening socket connection to server /127.0.0.1:18103
[junit4:junit4]   2> 11192 T1371 oascc.ConnectionManager.waitForConnected Waiting for client to connect to ZooKeeper
[junit4:junit4]   2> 11193 T1449 oaz.ClientCnxn$SendThread.primeConnection Socket connection established to localhost/127.0.0.1:18103, initiating session
[junit4:junit4]   2> 11193 T1373 oazs.NIOServerCnxn$Factory.run Accepted socket connection from /140.211.11.196:18127
[junit4:junit4]   2> 11194 T1373 oazs.NIOServerCnxn.readConnectRequest Client attempting to establish new session at /140.211.11.196:18127
[junit4:junit4]   2> 11200 T1375 oazs.NIOServerCnxn.finishSessionInit Established session 0x139d466be610008 with negotiated timeout 10000 for client /140.211.11.196:18127
[junit4:junit4]   2> 11200 T1449 oaz.ClientCnxn$SendThread.readConnectResult Session establishment complete on server localhost/127.0.0.1:18103, sessionid = 0x139d466be610008, negotiated timeout = 10000
[junit4:junit4]   2> 11200 T1450 oascc.ConnectionManager.process Watcher org.apache.solr.common.cloud.ConnectionManager@4e162869 name:ZooKeeperConnection Watcher:127.0.0.1:18103/solr got event WatchedEvent state:SyncConnected type:None path:null path:null type:None
[junit4:junit4]   2> 11200 T1371 oascc.ConnectionManager.waitForConnected Client is connected to ZooKeeper
[junit4:junit4]   2> 11201 T1371 oascc.ZkStateReader.createClusterStateWatchersAndUpdate Updating cluster state from ZooKeeper... 
[junit4:junit4]   2> 11209 T1399 C48 P18108 oasc.SolrDeletionPolicy.onInit SolrDeletionPolicy.onInit: commits:num=1
[junit4:junit4]   2> 		commit{dir=NRTCachingDirectory(org.apache.lucene.store.NIOFSDirectory@/usr/home/hudson/hudson-slave/workspace/Lucene-Solr-Tests-4.x-java7/solr/build/solr-core/test/J1/org.apache.solr.cloud.BasicDistributedZk2Test-1347888266841/jetty1/index lockFactory=org.apache.lucene.store.NativeFSLockFactory@2d4e9823; maxCacheMB=48.0 maxMergeSizeMB=4.0),segFN=segments_1,generation=1,filenames=[segments_1]
[junit4:junit4]   2> 11210 T1399 C48 P18108 oasc.SolrDeletionPolicy.updateCommits newest commit = 1
[junit4:junit4]   2>  C47_STATE=coll:collection1 core:collection1 props:{shard=shard1, roles=null, state=recovering, core=collection1, collection=collection1, node_name=127.0.0.1:18117_solr, base_url=http://127.0.0.1:18117/solr}
[junit4:junit4]   2> 11228 T1421 C47 P18117 oasc.SolrDeletionPolicy.onInit SolrDeletionPolicy.onInit: commits:num=1
[junit4:junit4]   2> 		commit{dir=NRTCachingDirectory(org.apache.lucene.store.NIOFSDirectory@/usr/home/hudson/hudson-slave/workspace/Lucene-Solr-Tests-4.x-java7/solr/build/solr-core/test/J1/org.apache.solr.cloud.BasicDistributedZk2Test-1347888266841/jetty3/index lockFactory=org.apache.lucene.store.NativeFSLockFactory@7827880c; maxCacheMB=48.0 maxMergeSizeMB=4.0),segFN=segments_1,generation=1,filenames=[segments_1]
[junit4:junit4]   2> 11229 T1421 C47 P18117 oasc.SolrDeletionPolicy.updateCommits newest commit = 1
[junit4:junit4]   2> 11233 T1421 C47 P18117 REQ /update {distrib.from=http://127.0.0.1:18108/solr/collection1/&update.distrib=FROMLEADER&wt=javabin&version=2} status=0 QTime=9 
[junit4:junit4]   2> 11234 T1399 C48 P18108 /update {wt=javabin&version=2} {add=[1 (1413363299033022464)]} 0 31
[junit4:junit4]   2> 11234 T1371 oasc.AbstractDistribZkTestBase.waitForRecoveriesToFinish Wait for recoveries to finish - collection: collection1 failOnTimeout:true timeout (sec):1800
[junit4:junit4]   2> 11235 T1371 oascc.ZkStateReader.updateClusterState Updating cloud state from ZooKeeper... 
[junit4:junit4]   2> 11626 T1392 oascc.ZkStateReader.updateClusterState Updating cloud state from ZooKeeper... 
[junit4:junit4]   2> 11642 T1429 oascc.ZkStateReader$2.process A cluster state change has occurred - updating...
[junit4:junit4]   2> 11642 T1405 oascc.ZkStateReader$2.process A cluster state change has occurred - updating...
[junit4:junit4]   2> 11642 T1391 oascc.ZkStateReader$2.process A cluster state change has occurred - updating...
[junit4:junit4]   2> 11642 T1443 oascc.ZkStateReader$2.process A cluster state change has occurred - updating...
[junit4:junit4]   2> 11642 T1450 oascc.ZkStateReader$2.process A cluster state change has occurred - updating...
[junit4:junit4]   2> 11642 T1448 oascc.ZkStateReader$2.process A cluster state change has occurred - updating...
[junit4:junit4]   2> 11642 T1417 oascc.ZkStateReader$2.process A cluster state change has occurred - updating...
[junit4:junit4]   2> 12098 T1431 C47 P18117 oasc.RecoveryStrategy.doRecovery Begin buffering updates. core=collection1
[junit4:junit4]   2> 12098 T1431 C47 P18117 oasu.UpdateLog.bufferUpdates Starting to buffer updates. FSUpdateLog{state=ACTIVE, tlog=tlog{file=./org.apache.solr.cloud.BasicDistributedZk2Test-1347888266841/jetty3/tlog/tlog.0000000000000000000 refcount=1}}
[junit4:junit4]   2> 12099 T1431 C47 P18117 oasc.RecoveryStrategy.replicate Attempting to replicate from http://127.0.0.1:18108/solr/collection1/. core=collection1
[junit4:junit4]   2> 12099 T1431 C47 P18117 oascsi.HttpClientUtil.createClient Creating new http client, config:maxConnections=128&maxConnectionsPerHost=32&followRedirects=false
[junit4:junit4]   2> 12118 T1400 C48 P18108 oasu.DirectUpdateHandler2.commit start commit{flags=0,_version_=0,optimize=false,openSearcher=true,waitSearcher=true,expungeDeletes=false,softCommit=false}
[junit4:junit4]   2> 12237 T1371 oascc.ZkStateReader.updateClusterState Updating cloud state from ZooKeeper... 
[junit4:junit4]   2> 12273 T1400 C48 P18108 oasc.SolrDeletionPolicy.onCommit SolrDeletionPolicy.onCommit: commits:num=2
[junit4:junit4]   2> 		commit{dir=NRTCachingDirectory(org.apache.lucene.store.NIOFSDirectory@/usr/home/hudson/hudson-slave/workspace/Lucene-Solr-Tests-4.x-java7/solr/build/solr-core/test/J1/org.apache.solr.cloud.BasicDistributedZk2Test-1347888266841/jetty1/index lockFactory=org.apache.lucene.store.NativeFSLockFactory@2d4e9823; maxCacheMB=48.0 maxMergeSizeMB=4.0),segFN=segments_1,generation=1,filenames=[segments_1]
[junit4:junit4]   2> 		commit{dir=NRTCachingDirectory(org.apache.lucene.store.NIOFSDirectory@/usr/home/hudson/hudson-slave/workspace/Lucene-Solr-Tests-4.x-java7/solr/build/solr-core/test/J1/org.apache.solr.cloud.BasicDistributedZk2Test-1347888266841/jetty1/index lockFactory=org.apache.lucene.store.NativeFSLockFactory@2d4e9823; maxCacheMB=48.0 maxMergeSizeMB=4.0),segFN=segments_2,generation=2,filenames=[_0.fnm, _0.frq, _0.tim, _0_nrm.cfe, segments_2, _0.fdx, _0_nrm.cfs, _0.si, _0.prx, _0.tip, _0.fdt]
[junit4:junit4]   2> 12273 T1400 C48 P18108 oasc.SolrDeletionPolicy.updateCommits newest commit = 2
[junit4:junit4]   2> 12283 T1400 C48 P18108 oass.SolrIndexSearcher.<init> Opening Searcher@fbb0990 main
[junit4:junit4]   2> 12285 T1400 C48 P18108 oasu.DirectUpdateHandler2.commit end_commit_flush
[junit4:junit4]   2> 12286 T1406 oasc.SolrCore.registerSearcher [collection1] Registered new searcher Searcher@fbb0990 main{StandardDirectoryReader(segments_2:3 _0(4.0.0.2):C1)}
[junit4:junit4]   2> 12287 T1400 C48 P18108 /update {waitSearcher=true&commit=true&commit_end_point=true&wt=javabin&softCommit=false&version=2} {commit=} 0 169
[junit4:junit4]   2> 12288 T1431 C47 P18117 oash.ReplicationHandler.inform Commits will be reserved for  10000
[junit4:junit4]   2> 12288 T1431 C47 P18117 oash.SnapPuller.<init>  No value set for 'pollInterval'. Timer Task not started.
[junit4:junit4]   2> 12290 T1401 C48 P18108 oash.ReplicationHandler.inform Commits will be reserved for  10000
[junit4:junit4]   2> 12291 T1401 C48 P18108 REQ /replication {command=indexversion&wt=javabin&qt=/replication&version=2} status=0 QTime=2 
[junit4:junit4]   2> 12291 T1431 C47 P18117 oash.SnapPuller.fetchLatestIndex Master's generation: 2
[junit4:junit4]   2> 12292 T1431 C47 P18117 oash.SnapPuller.fetchLatestIndex Slave's generation: 1
[junit4:junit4]   2> 12292 T1431 C47 P18117 oash.SnapPuller.fetchLatestIndex Starting replication process
[junit4:junit4]   2> 12295 T1401 C48 P18108 REQ /replication {command=filelist&generation=2&wt=javabin&qt=/replication&version=2} status=0 QTime=1 
[junit4:junit4]   2> 12296 T1431 C47 P18117 oash.SnapPuller.fetchLatestIndex Number of files in latest index in master: 11
[junit4:junit4]   2> 12300 T1431 C47 P18117 oash.SnapPuller.fetchLatestIndex Starting download to ./org.apache.solr.cloud.BasicDistributedZk2Test-1347888266841/jetty3/index.20120917092439131 fullCopy=true
[junit4:junit4]   2> 12303 T1401 C48 P18108 REQ /replication {file=_0.fnm&command=filecontent&checksum=true&generation=2&qt=/replication&wt=filestream} status=0 QTime=0 
[junit4:junit4]   2> 12309 T1401 C48 P18108 REQ /replication {file=_0_nrm.cfe&command=filecontent&checksum=true&generation=2&qt=/replication&wt=filestream} status=0 QTime=0 
[junit4:junit4]   2> 12317 T1401 C48 P18108 REQ /replication {file=_0.tim&command=filecontent&checksum=true&generation=2&qt=/replication&wt=filestream} status=0 QTime=1 
[junit4:junit4]   2> 12323 T1401 C48 P18108 REQ /replication {file=_0.frq&command=filecontent&checksum=true&generation=2&qt=/replication&wt=filestream} status=0 QTime=0 
[junit4:junit4]   2> 12328 T1401 C48 P18108 REQ /replication {file=segments_2&command=filecontent&checksum=true&generation=2&qt=/replication&wt=filestream} status=0 QTime=0 
[junit4:junit4]   2> 12332 T1401 C48 P18108 REQ /replication {file=_0.fdx&command=filecontent&checksum=true&generation=2&qt=/replication&wt=filestream} status=0 QTime=0 
[junit4:junit4]   2> 12337 T1401 C48 P18108 REQ /replication {file=_0_nrm.cfs&command=filecontent&checksum=true&generation=2&qt=/replication&wt=filestream} status=0 QTime=0 
[junit4:junit4]   2> 12342 T1401 C48 P18108 REQ /replication {file=_0.si&command=filecontent&checksum=true&generation=2&qt=/replication&wt=filestream} status=0 QTime=0 
[junit4:junit4]   2> 12347 T1401 C48 P18108 REQ /replication {file=_0.tip&command=filecontent&checksum=true&generation=2&qt=/replication&wt=filestream} status=0 QTime=0 
[junit4:junit4]   2> 12352 T1401 C48 P18108 REQ /replication {file=_0.prx&command=filecontent&checksum=true&generation=2&qt=/replication&wt=filestream} status=0 QTime=0 
[junit4:junit4]   2> 12357 T1401 C48 P18108 REQ /replication {file=_0.fdt&command=filecontent&checksum=true&generation=2&qt=/replication&wt=filestream} status=0 QTime=0 
[junit4:junit4]   2> 12359 T1431 C47 P18117 oash.SnapPuller.fetchLatestIndex Total time taken for download : 0 secs
[junit4:junit4]   2> 12359 T1431 C47 P18117 oash.SnapPuller.modifyIndexProps New index installed. Updating index properties... index=index.20120917092439131
[junit4:junit4]   2> 12361 T1431 C47 P18117 oasu.DefaultSolrCoreState.newIndexWriter Creating new IndexWriter...
[junit4:junit4]   2> 12361 T1431 C47 P18117 oasu.DefaultSolrCoreState.newIndexWriter Waiting until IndexWriter is unused... core=collection1
[junit4:junit4]   2> 12362 T1431 C47 P18117 oasu.DefaultSolrCoreState.newIndexWriter Rollback old IndexWriter... core=collection1
[junit4:junit4]   2> 12366 T1431 C47 P18117 oasc.SolrCore.getNewIndexDir WARNING New index directory detected: old=./org.apache.solr.cloud.BasicDistributedZk2Test-1347888266841/jetty3/index/ new=./org.apache.solr.cloud.BasicDistributedZk2Test-1347888266841/jetty3/index.20120917092439131
[junit4:junit4]   2> 12367 T1431 C47 P18117 oasc.CachingDirectoryFactory.get return new directory for /usr/home/hudson/hudson-slave/workspace/Lucene-Solr-Tests-4.x-java7/solr/build/solr-core/test/J1/./org.apache.solr.cloud.BasicDistributedZk2Test-1347888266841/jetty3/index.20120917092439131 forceNew:true
[junit4:junit4]   2> 12375 T1431 C47 P18117 oasc.SolrDeletionPolicy.onInit SolrDeletionPolicy.onInit: commits:num=1
[junit4:junit4]   2> 		commit{dir=NRTCachingDirectory(org.apache.lucene.store.NIOFSDirectory@/usr/home/hudson/hudson-slave/workspace/Lucene-Solr-Tests-4.x-java7/solr/build/solr-core/test/J1/org.apache.solr.cloud.BasicDistributedZk2Test-1347888266841/jetty3/index.20120917092439131 lockFactory=org.apache.lucene.store.NativeFSLockFactory@1b0e64f6; maxCacheMB=48.0 maxMergeSizeMB=4.0),segFN=segments_2,generation=2,filenames=[_0.fnm, _0_nrm.cfe, _0.tim, _0.frq, segments_2, _0.fdx, _0_nrm.cfs, _0.si, _0.tip, _0.prx, _0.fdt]
[junit4:junit4]   2> 12375 T1431 C47 P18117 oasc.SolrDeletionPolicy.updateCommits newest commit = 2
[junit4:junit4]   2> 12375 T1431 C47 P18117 oasu.DefaultSolrCoreState.newIndexWriter New IndexWriter is ready to be used.
[junit4:junit4]   2> 12378 T1431 C47 P18117 oass.SolrIndexSearcher.<init> Opening Searcher@476ee308 main
[junit4:junit4]   2> 12380 T1430 oasc.SolrCore.registerSearcher [collection1] Registered new searcher Searcher@476ee308 main{StandardDirectoryReader(segments_2:3:nrt _0(4.0.0.2):C1)}
[junit4:junit4]   2> 12381 T1430 oasc.CachingDirectoryFactory.close Closing directory:/usr/home/hudson/hudson-slave/workspace/Lucene-Solr-Tests-4.x-java7/solr/build/solr-core/test/J1/./org.apache.solr.cloud.BasicDistributedZk2Test-1347888266841/jetty3/index
[junit4:junit4]   2> 12381 T1430 oash.SnapPuller$2.onClose removing old index directory ./org.apache.solr.cloud.BasicDistributedZk2Test-1347888266841/jetty3/index
[junit4:junit4]   2> 12383 T1431 C47 P18117 oasu.DirectUpdateHandler2.commit start commit{flags=0,_version_=0,optimize=false,openSearcher=false,waitSearcher=false,expungeDeletes=false,softCommit=false}
[junit4:junit4]   2> 12384 T1431 C47 P18117 oasu.DirectUpdateHandler2.commit end_commit_flush
[junit4:junit4]   2> 12384 T1431 C47 P18117 oasc.RecoveryStrategy.replay Replaying buffered documents. core=collection1
[junit4:junit4]   2> 12384 T1453 C47 P18117 oasu.UpdateLog$LogReplayer.doReplay WARNING Starting log replay tlog{file=./org.apache.solr.cloud.BasicDistributedZk2Test-1347888266841/jetty3/tlog/tlog.0000000000000000000 refcount=2} active=true starting pos=433
[junit4:junit4]   2> 12385 T1453 C47 P18117 oasu.DirectUpdateHandler2.commit start commit{flags=2,_version_=0,optimize=false,openSearcher=true,waitSearcher=true,expungeDeletes=false,softCommit=false}
[junit4:junit4]   2> 12387 T1453 C47 P18117 oass.SolrIndexSearcher.<init> Opening Searcher@3ca6dc6f main
[junit4:junit4]   2> 12388 T1453 C47 P18117 oasu.DirectUpdateHandler2.commit end_commit_flush
[junit4:junit4]   2> 12390 T1430 oasc.SolrCore.registerSearcher [collection1] Registered new searcher Searcher@3ca6dc6f main{StandardDirectoryReader(segments_2:3:nrt _0(4.0.0.2):C1)}
[junit4:junit4]   2> 12390 T1453 C47 P18117 oasu.UpdateLog$LogReplayer.run WARNING Log replay finished. recoveryInfo=RecoveryInfo{adds=0 deletes=0 deleteByQuery=0 errors=0 positionOfStart=433}
[junit4:junit4]   2> 12391 T1431 C47 P18117 oasc.RecoveryStrategy.doRecovery Replication Recovery was successful - registering as Active. core=collection1
[junit4:junit4]   2> 12400 T1431 C47 P18117 oasc.RecoveryStrategy.doRecovery Finished recovery process. core=collection1
[junit4:junit4]   2> 12653 T1392 oascc.ZkStateReader.updateClusterState Updating cloud state from ZooKeeper... 
[junit4:junit4]   2> 12667 T1405 oascc.ZkStateReader$2.process A cluster state change has occurred - updating...
[junit4:junit4]   2> 12667 T1443 oascc.ZkStateReader$2.process A cluster state change has occurred - updating...
[junit4:junit4]   2> 12667 T1417 oascc.ZkStateReader$2.process A cluster state change has occurred - updating...
[junit4:junit4]   2> 12667 T1448 oascc.ZkStateReader$2.process A cluster state change has occurred - updating...
[junit4:junit4]   2> 12667 T1450 oascc.ZkStateReader$2.process A cluster state change has occurred - updating...
[junit4:junit4]   2> 12667 T1429 oascc.ZkStateReader$2.process A cluster state change has occurred - updating...
[junit4:junit4]   2> 12668 T1391 oascc.ZkStateReader$2.process A cluster state change has occurred - updating...
[junit4:junit4]   2> 13239 T1371 oascc.ZkStateReader.updateClusterState Updating cloud state from ZooKeeper... 
[junit4:junit4]   2>  C49_STATE=coll:collection1 core:collection1 props:{shard=shard2, roles=null, state=recovering, core=collection1, collection=collection1, node_name=127.0.0.1:18121_solr, base_url=http://127.0.0.1:18121/solr}
[junit4:junit4]   2> 14153 T1445 C49 P18121 oasc.RecoveryStrategy.doRecovery Begin buffering updates. core=collection1
[junit4:junit4]   2> 14153 T1445 C49 P18121 oasu.UpdateLog.bufferUpdates Starting to buffer updates. FSUpdateLog{state=ACTIVE, tlog=null}
[junit4:junit4]   2> 14153 T1445 C49 P18121 oasc.RecoveryStrategy.replicate Attempting to replicate from http://127.0.0.1:18112/solr/collection1/. core=collection1
[junit4:junit4]   2> 14153 T1445 C49 P18121 oascsi.HttpClientUtil.createClient Creating new http client, config:maxConnections=128&maxConnectionsPerHost=32&followRedirects=false
[junit4:junit4]   2> 14170 T1411 C50 P18112 oasu.DirectUpdateHandler2.commit start commit{flags=0,_version_=0,optimize=false,openSearcher=true,waitSearcher=true,expungeDeletes=false,softCommit=false}
[junit4:junit4]   2> 14175 T1411 C50 P18112 oasc.SolrDeletionPolicy.onInit SolrDeletionPolicy.onInit: commits:num=1
[junit4:junit4]   2> 		commit{dir=NRTCachingDirectory(org.apache.lucene.store.NIOFSDirectory@/usr/home/hudson/hudson-slave/workspace/Lucene-Solr-Tests-4.x-java7/solr/build/solr-core/test/J1/org.apache.solr.cloud.BasicDistributedZk2Test-1347888266841/jetty2/index lockFactory=org.apache.lucene.store.NativeFSLockFactory@56deb5d2; maxCacheMB=48.0 maxMergeSizeMB=4.0),segFN=segments_1,generation=1,filenames=[segments_1]
[junit4:junit4]   2> 14175 T1411 C50 P18112 oasc.SolrDeletionPolicy.updateCommits newest commit = 1
[junit4:junit4]   2> 14177 T1411 C50 P18112 oass.SolrIndexSearcher.<init> Opening Searcher@5dc15f46 main
[junit4:junit4]   2> 14177 T1411 C50 P18112 oasu.DirectUpdateHandler2.commit end_commit_flush
[junit4:junit4]   2> 14179 T1418 oasc.SolrCore.registerSearcher [collection1] Registered new searcher Searcher@5dc15f46 main{StandardDirectoryReader(segments_1:1)}
[junit4:junit4]   2> 14180 T1411 C50 P18112 /update {waitSearcher=true&commit=true&commit_end_point=true&wt=javabin&softCommit=false&version=2} {commit=} 0 11
[junit4:junit4]   2> 14181 T1445 C49 P18121 oash.ReplicationHandler.inform Commits will be reserved for  10000
[junit4:junit4]   2> 14181 T1445 C49 P18121 oash.SnapPuller.<init>  No value set for 'pollInterval'. Timer Task not started.
[junit4:junit4]   2> 14182 T1412 C50 P18112 oash.ReplicationHandler.inform Commits will be reserved for  10000
[junit4:junit4]   2> 14183 T1412 C50 P18112 REQ /replication {command=indexversion&wt=javabin&qt=/replication&version=2} status=0 QTime=1 
[junit4:junit4]   2> 14187 T1445 C49 P18121 oasc.SolrDeletionPolicy.onInit SolrDeletionPolicy.onInit: commits:num=1
[junit4:junit4]   2> 		commit{dir=NRTCachingDirectory(org.apache.lucene.store.NIOFSDirectory@/usr/home/hudson/hudson-slave/workspace/Lucene-Solr-Tests-4.x-java7/solr/build/solr-core/test/J1/org.apache.solr.cloud.BasicDistributedZk2Test-1347888266841/jetty4/index lockFactory=org.apache.lucene.store.NativeFSLockFactory@622b937e; maxCacheMB=48.0 maxMergeSizeMB=4.0),segFN=segments_1,generation=1,filenames=[segments_1]
[junit4:junit4]   2> 14187 T1445 C49 P18121 oasc.SolrDeletionPolicy.updateCommits newest commit = 1
[junit4:junit4]   2> 14188 T1445 C49 P18121 oasu.DirectUpdateHandler2.commit start commit{flags=0,_version_=0,optimize=false,openSearcher=true,waitSearcher=true,expungeDeletes=false,softCommit=false}
[junit4:junit4]   2> 14202 T1445 C49 P18121 oasc.SolrDeletionPolicy.onCommit SolrDeletionPolicy.onCommit: commits:num=2
[junit4:junit4]   2> 		commit{dir=NRTCachingDirectory(org.apache.lucene.store.NIOFSDirectory@/usr/home/hudson/hudson-slave/workspace/Lucene-Solr-Tests-4.x-java7/solr/build/solr-core/test/J1/org.apache.solr.cloud.BasicDistributedZk2Test-1347888266841/jetty4/index lockFactory=org.apache.lucene.store.NativeFSLockFactory@622b937e; maxCacheMB=48.0 maxMergeSizeMB=4.0),segFN=segments_1,generation=1,filenames=[segments_1]
[junit4:junit4]   2> 		commit{dir=NRTCachingDirectory(org.apache.lucene.store.NIOFSDirectory@/usr/home/hudson/hudson-slave/workspace/Lucene-Solr-Tests-4.x-java7/solr/build/solr-core/test/J1/org.apache.solr.cloud.BasicDistributedZk2Test-1347888266841/jetty4/index lockFactory=org.apache.lucene.store.NativeFSLockFactory@622b937e; maxCacheMB=48.0 maxMergeSizeMB=4.0),segFN=segments_2,generation=2,filenames=[segments_2]
[junit4:junit4]   2> 14202 T1445 C49 P18121 oasc.SolrDeletionPolicy.updateCommits newest commit = 2
[junit4:junit4]   2> 14206 T1445 C49 P18121 oass.SolrIndexSearcher.<init> Opening Searcher@62c859b5 main
[junit4:junit4]   2> 14206 T1445 C49 P18121 oasu.DirectUpdateHandler2.commit end_commit_flush
[junit4:junit4]   2> 14208 T1444 oasc.SolrCore.registerSearcher [collection1] Registered new searcher Searcher@62c859b5 main{StandardDirectoryReader(segments_2:2)}
[junit4:junit4]   2> 14208 T1445 C49 P18121 oasc.RecoveryStrategy.replay No replay needed. core=collection1
[junit4:junit4]   2> 14208 T1445 C49 P18121 oasc.RecoveryStrategy.doRecovery Replication Recovery was successful - registering as Active. core=collection1
[junit4:junit4]   2> 14210 T1445 C49 P18121 oasc.RecoveryStrategy.doRecovery Finished recovery process. core=collection1
[junit4:junit4]   2> 14241 T1371 oascc.ZkStateReader.updateClusterState Updating cloud state from ZooKeeper... 
[junit4:junit4]   2> 14675 T1392 oascc.ZkStateReader.updateClusterState Updating cloud state from ZooKeeper... 
[junit4:junit4]   2> 14693 T1405 oascc.ZkStateReader$2.process A cluster state change has occurred - updating...
[junit4:junit4]   2> 14693 T1429 oascc.ZkStateReader$2.process A cluster state change has occurred - updating...
[junit4:junit4]   2> 14693 T1391 oascc.ZkStateReader$2.process A cluster state change has occurred - updating...
[junit4:junit4]   2> 14693 T1443 oascc.ZkStateReader$2.process A cluster state change has occurred - updating...
[junit4:junit4]   2> 14693 T1448 oascc.ZkStateReader$2.process A cluster state change has occurred - updating...
[junit4:junit4]   2> 14693 T1450 oascc.ZkStateReader$2.process A cluster state change has occurred - updating...
[junit4:junit4]   2> 14693 T1417 oascc.ZkStateReader$2.process A cluster state change has occurred - updating...
[junit4:junit4]   2> 15243 T1371 oascc.ZkStateReader.updateClusterState Updating cloud state from ZooKeeper... 
[junit4:junit4]   2> 15246 T1383 C51 P18106 oasu.DirectUpdateHandler2.commit start commit{flags=0,_version_=0,optimize=false,openSearcher=true,waitSearcher=true,expungeDeletes=false,softCommit=false}
[junit4:junit4]   2> 15287 T1383 C51 P18106 oasc.SolrDeletionPolicy.onCommit SolrDeletionPolicy.onCommit: commits:num=2
[junit4:junit4]   2> 		commit{dir=NRTCachingDirectory(org.apache.lucene.store.NIOFSDirectory@/usr/home/hudson/hudson-slave/workspace/Lucene-Solr-Tests-4.x-java7/solr/build/solr-core/test/J1/org.apache.solr.cloud.BasicDistributedZk2Test-1347888266841/control/data/index lockFactory=org.apache.lucene.store.NativeFSLockFactory@7898a26c; maxCacheMB=48.0 maxMergeSizeMB=4.0),segFN=segments_1,generation=1,filenames=[segments_1]
[junit4:junit4]   2> 		commit{dir=NRTCachingDirectory(org.apache.lucene.store.NIOFSDirectory@/usr/home/hudson/hudson-slave/workspace/Lucene-Solr-Tests-4.x-java7/solr/build/solr-core/test/J1/org.apache.solr.cloud.BasicDistributedZk2Test-1347888266841/control/data/index lockFactory=org.apache.lucene.store.NativeFSLockFactory@7898a26c; maxCacheMB=48.0 maxMergeSizeMB=4.0),segFN=segments_2,generation=2,filenames=[_0.fnm, _0.frq, _0.tim, _0_nrm.cfe, segments_2, _0.fdx, _0_nrm.cfs, _0.si, _0.prx, _0.tip, _0.fdt]
[junit4:junit4]   2> 15287 T1383 C51 P18106 oasc.SolrDeletionPolicy.updateCommits newest commit = 2
[junit4:junit4]   2> 15300 T1383 C51 P18106 oass.SolrIndexSearcher.<init> Opening Searcher@31bc2864 main
[junit4:junit4]   2> 15301 T1383 C51 P18106 oasu.DirectUpdateHandler2.commit end_commit_flush
[junit4:junit4]   2> 15303 T1394 oasc.SolrCore.registerSearcher [collection1] Registered new searcher Searcher@31bc2864 main{StandardDirectoryReader(segments_2:3 _0(4.0.0.2):C1)}
[junit4:junit4]   2> 15304 T1383 C51 P18106 /update {waitSearcher=true&wt=javabin&commit=true&softCommit=false&version=2} {commit=} 0 58
[junit4:junit4]   2> 15306 T1413 C50 P18112 oasu.DirectUpdateHandler2.commit start commit{flags=0,_version_=0,optimize=false,openSearcher=true,waitSearcher=true,expungeDeletes=false,softCommit=false}
[junit4:junit4]   2> 15310 T1413 C50 P18112 oass.SolrIndexSearcher.<init> Opening Searcher@70c65e60 main
[junit4:junit4]   2> 15311 T1413 C50 P18112 oasu.DirectUpdateHandler2.commit end_commit_flush
[junit4:junit4]   2> 15313 T1418 oasc.SolrCore.registerSearcher [collection1] Registered new searcher Searcher@70c65e60 main{StandardDirectoryReader(segments_1:1)}
[junit4:junit4]   2> 15313 T1413 C50 P18112 oasu.SolrCmdDistributor.distribCommit Distrib commit to:[StdNode: http://127.0.0.1:18108/solr/collection1/, StdNode: http://127.0.0.1:18117/solr/collection1/, StdNode: http://127.0.0.1:18121/solr/collection1/]
[junit4:junit4]   2> 15315 T1402 C48 P18108 oasu.DirectUpdateHandler2.commit start commit{flags=0,_version_=0,optimize=false,openSearcher=true,waitSearcher=true,expungeDeletes=false,softCommit=false}
[junit4:junit4]   2>  C47_STATE=coll:collection1 core:collection1 props:{shard=shard1, roles=null, state=active, core=collection1, collection=collection1, node_name=127.0.0.1:18117_solr, base_url=http://127.0.0.1:18117/solr}
[junit4:junit4]   2> 15317 T1421 C47 P18117 oasu.DirectUpdateHandler2.commit start commit{flags=0,_version_=0,optimize=false,openSearcher=true,waitSearcher=true,expungeDeletes=false,softCommit=false}
[junit4:junit4]   2> 15321 T1421 C47 P18117 oass.SolrIndexSearcher.<init> Opening Searcher@7620847a main
[junit4:junit4]   2> 15321 T1421 C47 P18117 oasu.DirectUpdateHandler2.commit end_commit_flush
[junit4:junit4]   2> 15323 T1430 oasc.SolrCore.registerSearcher [collection1] Registered new searcher Searcher@7620847a main{StandardDirectoryReader(segments_2:3:nrt _0(4.0.0.2):C1)}
[junit4:junit4]   2> 15324 T1421 C47 P18117 /update {waitSearcher=true&commit=true&wt=javabin&commit_end_point=true&expungeDeletes=false&softCommit=false&version=2} {commit=} 0 7
[junit4:junit4]   2> 15325 T1402 C48 P18108 oass.SolrIndexSearcher.<init> Opening Searcher@26202c main
[junit4:junit4]   2> 15325 T1402 C48 P18108 oasu.DirectUpdateHandler2.commit end_commit_flush
[junit4:junit4]   2>  C49_STATE=coll:collection1 core:collection1 props:{shard=shard2, roles=null, state=active, core=collection1, collection=collection1, node_name=127.0.0.1:18121_solr, base_url=http://127.0.0.1:18121/solr}
[junit4:junit4]   2> 15326 T1435 C49 P18121 oasu.DirectUpdateHandler2.commit start commit{flags=0,_version_=0,optimize=false,openSearcher=true,waitSearcher=true,expungeDeletes=false,softCommit=false}
[junit4:junit4]   2> 15328 T1406 oasc.SolrCore.registerSearcher [collection1] Registered new searcher Searcher@26202c main{StandardDirectoryReader(segments_2:3 _0(4.0.0.2):C1)}
[junit4:junit4]   2> 15329 T1402 C48 P18108 /update {waitSearcher=true&commit=true&wt=javabin&commit_end_point=true&expungeDeletes=false&softCommit=false&version=2} {commit=} 0 14
[junit4:junit4]   2> 15331 T1435 C49 P18121 oass.SolrIndexSearcher.<init> Opening Searcher@2419a6d4 main
[junit4:junit4]   2> 15331 T1435 C49 P18121 oasu.DirectUpdateHandler2.commit end_commit_flush
[junit4:junit4]   2> 15333 T1444 oasc.SolrCore.registerSearcher [collection1] Registered new searcher Searcher@2419a6d4 main{StandardDirectoryReader(segments_2:2)}
[junit4:junit4]   2> 15333 T1435 C49 P18121 /update {waitSearcher=true&commit=true&wt=javabin&commit_end_point=true&expungeDeletes=false&softCommit=false&version=2} {commit=} 0 7
[junit4:junit4]   2> 15334 T1413 C50 P18112 /update {waitSearcher=true&wt=javabin&commit=true&softCommit=false&version=2} {commit=} 0 28
[junit4:junit4]   2> 15340 T1384 C51 P18106 REQ /select {fl=id,score&shard.url=127.0.0.1:18106/solr/collection1/&NOW=1347888282172&start=0&q=*:*&distrib=false&isShard=true&wt=javabin&fsv=true&rows=10&version=2} hits=1 status=0 QTime=0 
[junit4:junit4]   2> 15344 T1384 C51 P18106 REQ /select {shard.url=127.0.0.1:18106/solr/collection1/&NOW=1347888282172&q=*:*&ids=1&distrib=false&isShard=true&wt=javabin&version=2} status=0 QTime=0 
[junit4:junit4]   2> 15345 T1383 C51 P18106 REQ /select {wt=javabin&q=*:*&version=2} hits=1 status=0 QTime=8 
[junit4:junit4]   2> 15346 T1371 oaz.ZooKeeper.<init> Initiating client connection, connectString=127.0.0.1:18103/solr sessionTimeout=10000 watcher=org.apache.solr.common.cloud.ConnectionManager@4fe098f1
[junit4:junit4]   2> 15347 T1458 oaz.ClientCnxn$SendThread.startConnect Opening socket connection to server /127.0.0.1:18103
[junit4:junit4]   2> 15347 T1371 oascc.ConnectionManager.waitForConnected Waiting for client to connect to ZooKeeper
[junit4:junit4]   2> 15348 T1458 oaz.ClientCnxn$SendThread.primeConnection Socket connection established to localhost/127.0.0.1:18103, initiating session
[junit4:junit4]   2> 15348 T1373 oazs.NIOServerCnxn$Factory.run Accepted socket connection from /140.211.11.196:30806
[junit4:junit4]   2> 15348 T1373 oazs.NIOServerCnxn.readConnectRequest Client attempting to establish new session at /140.211.11.196:30806
[junit4:junit4]   2> 15350 T1458 oaz.ClientCnxn$SendThread.readConnectResult Session establishment complete on server localhost/127.0.0.1:18103, sessionid = 0x139d466be610009, negotiated timeout = 10000
[junit4:junit4]   2> 15350 T1375 oazs.NIOServerCnxn.finishSessionInit Established session 0x139d466be610009 with negotiated timeout 10000 for client /140.211.11.196:30806
[junit4:junit4]   2> 15350 T1459 oascc.ConnectionManager.process Watcher org.apache.solr.common.cloud.ConnectionManager@4fe098f1 name:ZooKeeperConnection Watcher:127.0.0.1:18103/solr got event WatchedEvent state:SyncConnected type:None path:null path:null type:None
[junit4:junit4]   2> 15351 T1371 oascc.ConnectionManager.waitForConnected Client is connected to ZooKeeper
[junit4:junit4]   2> 15351 T1371 oascc.ZkStateReader.createClusterStateWatchersAndUpdate Updating cluster state from ZooKeeper... 
[junit4:junit4]   2> 15353 T1376 oazs.PrepRequestProcessor.pRequest Processed session termination for sessionid: 0x139d466be610009
[junit4:junit4]   2> 15353 T1459 oaz.ClientCnxn$EventThread.run EventThread shut down
[junit4:junit4]   2> 15353 T1371 oaz.ZooKeeper.close Session: 0x139d466be610009 closed
[junit4:junit4]   2> 15354 T1373 oazs.NIOServerCnxn.closeSock Closed socket connection for client /140.211.11.196:30806 which had sessionid 0x139d466be610009
[junit4:junit4]   2> 15355 T1403 C48 P18108 REQ /select {distrib=false&wt=javabin&q=*:*&version=2} hits=1 status=0 QTime=0 
[junit4:junit4]   2> 15357 T1414 C50 P18112 REQ /select {distrib=false&wt=javabin&q=*:*&version=2} hits=0 status=0 QTime=0 
[junit4:junit4]   2> 15363 T1398 C48 P18108 REQ /select {fl=id,score&shard.url=127.0.0.1:18108/solr/collection1/|127.0.0.1:18117/solr/collection1/&NOW=1347888282194&start=0&q=*:*&distrib=false&isShard=true&wt=javabin&fsv=true&rows=10&version=2} hits=1 status=0 QTime=1 
[junit4:junit4]   2> 15363 T1415 C50 P18112 REQ /select {fl=id,score&shard.url=127.0.0.1:18112/solr/collection1/|127.0.0.1:18121/solr/collection1/&NOW=1347888282194&start=0&q=*:*&distrib=false&isShard=true&wt=javabin&fsv=true&rows=10&version=2} hits=0 status=0 QTime=1 
[junit4:junit4]   2> 15366 T1398 C48 P18108 REQ /select {shard.url=127.0.0.1:18108/solr/collection1/|127.0.0.1:18117/solr/collection1/&NOW=1347888282194&q=*:*&ids=1&distrib=false&isShard=true&wt=javabin&version=2} status=0 QTime=0 
[junit4:junit4]   2> 15367 T1436 C49 P18121 REQ /select {wt=javabin&q=*:*&version=2} hits=1 status=0 QTime=8 
[junit4:junit4]   2> 15375 T1383 C51 P18106 /update {wt=javabin&version=2} {add=[2 (1413363303401390080)]} 0 5
[junit4:junit4]   2> 15388 T1435 C49 P18121 REQ /update {distrib.from=http://127.0.0.1:18112/solr/collection1/&update.distrib=FROMLEADER&wt=javabin&version=2} status=0 QTime=4 
[junit4:junit4]   2> 15389 T1413 C50 P18112 /update {wt=javabin&version=2} {add=[2 (1413363303409778688)]} 0 11
[junit4:junit4]   2> 15393 T1383 C51 P18106 /update {wt=javabin&version=2} {add=[3 (1413363303423410176)]} 0 2
[junit4:junit4]   2> 15400 T1435 C49 P18121 REQ /update {distrib.from=http://127.0.0.1:18112/solr/collection1/&update.distrib=FROMLEADER&wt=javabin&version=2} status=0 QTime=1 
[junit4:junit4]   2> 15401 T1413 C50 P18112 /update {wt=javabin&version=2} {add=[3 (1413363303428653056)]} 0 5
[junit4:junit4]   2> 15404 T1383 C51 P18106 /update {wt=javabin&version=2} {add=[4 (1413363303434944512)]} 0 2
[junit4:junit4]   2> 15418 T1421 C47 P18117 REQ /update {distrib.from=http://127.0.0.1:18108/solr/collection1/&update.distrib=FROMLEADER&wt=javabin&version=2} status=0 QTime=5 
[junit4:junit4]   2> 15419 T1399 C48 P18108 /update {wt=javabin&version=2} {add=[4 (1413363303440187392)]} 0 12
[junit4:junit4]   2> 15424 T1383 C51 P18106 /update {wt=javabin&version=2} {add=[5 (1413363303455916032)]} 0 2
[junit4:junit4]   2> 15432 T1435 C49 P18121 REQ /update {distrib.from=http://127.0.0.1:18112/solr/collection1/&update.distrib=FROMLEADER&wt=javabin&version=2} status=0 QTime=1 
[junit4:junit4]   2> 15433 T1413 C50 P18112 /update {wt=javabin&version=2} {add=[5 (1413363303461158912)]} 0 6
[junit4:junit4]   2> 15438 T1383 C51 P18106 /update {wt=javabin&version=2} {add=[6 (1413363303470596096)]} 0 2
[junit4:junit4]   2> 15447 T1435 C49 P18121 REQ /update {update.distrib=FROMLEADER&distrib.from=http://127.0.0.1:18112/solr/collection1/&wt=javabin&version=2} status=0 QTime=1 
[junit4:junit4]   2> 15448 T1410 C50 P18112 REQ /update {distrib.from=http://127.0.0.1:18108/solr/collection1/&update.distrib=TOLEADER&wt=javabin&version=2} status=0 QTime=6 
[junit4:junit4]   2> 15448 T1399 C48 P18108 /update {wt=javabin&version=2} {add=[6]} 0 8
[junit4:junit4]   2> 15453 T1383 C51 P18106 /update {wt=javabin&version=2} {add=[7 (1413363303486324736)]} 0 2
[junit4:junit4]   2> 15464 T1435 C49 P18121 REQ /update {update.distrib=FROMLEADER&distrib.from=http://127.0.0.1:18112/solr/collection1/&wt=javabin&version=2} status=0 QTime=2 
[junit4:junit4]   2> 15464 T1410 C50 P18112 REQ /update {distrib.from=http://127.0.0.1:18108/solr/collection1/&update.distrib=TOLEADER&wt=javabin&version=2} status=0 QTime=6 
[junit4:junit4]   2> 15465 T1399 C48 P18108 /update {wt=javabin&version=2} {add=[7]} 0 9
[junit4:junit4]   2> 15470 T1383 C51 P18106 /update {wt=javabin&version=2} {add=[8 (1413363303504150528)]} 0 2
[junit4:junit4]   2> 15479 T1421 C47 P18117 REQ /update {distrib.from=http://127.0.0.1:18108/solr/collection1/&update.distrib=FROMLEADER&wt=javabin&version=2} status=0 QTime=2 
[junit4:junit4]   2> 15480 T1399 C48 P18108 /update {wt=javabin&version=2} {add=[8 (1413363303509393408)]} 0 7
[junit4:junit4]   2> 15485 T1383 C51 P18106 /update {wt=javabin&version=2} {add=[9 (1413363303519879168)]} 0 2
[junit4:junit4]   2> 15495 T1435 C49 P18121 REQ /update {update.distrib=FROMLEADER&distrib.from=http://127.0.0.1:18112/solr/collection1/&wt=javabin&version=2} status=0 QTime=1 
[junit4:junit4]   2> 15496 T1410 C50 P18112 REQ /update {distrib.from=http://127.0.0.1:18108/solr/collection1/&update.distrib=TOLEADER&wt=javabin&version=2} status=0 QTime=6 
[junit4:junit4]   2> 15497 T1399 C48 P18108 /update {wt=javabin&version=2} {add=[9]} 0 9
[junit4:junit4]   2> 15500 T1383 C51 P18106 /update {wt=javabin&version=2} {add=[10 (1413363303536656384)]} 0 1
[junit4:junit4]   2> 15511 T1421 C47 P18117 REQ /update {update.distrib=FROMLEADER&distrib.from=http://127.0.0.1:18108/solr/collection1/&wt=javabin&version=2} status=0 QTime=1 
[junit4:junit4]   2> 15512 T1402 C48 P18108 REQ /update {distrib.from=http://127.0.0.1:18112/solr/collection1/&update.distrib=TOLEADER&wt=javabin&version=2} status=0 QTime=6 
[junit4:junit4]   2> 15512 T1413 C50 P18112 /update {wt=javabin&version=2} {add=[10]} 0 9
[junit4:junit4]   2> 15524 T1383 C51 P18106 /update {wt=javabin&version=2} {add=[11 (1413363303553433600)]} 0 9
[junit4:junit4]   2> 15531 T1421 C47 P18117 REQ /update {distrib.from=http://127.0.0.1:18108/solr/collection1/&update.distrib=FROMLEADER&wt=javabin&version=2} status=0 QTime=1 
[junit4:junit4]   2> 15532 T1399 C48 P18108 /update {wt=javabin&version=2} {add=[11 (1413363303566016512)]} 0 5
[junit4:junit4]   2> 15537 T1383 C51 P18106 /update {wt=javabin&version=2} {add=[12 (1413363303573356544)]} 0 3
[junit4:junit4]   2> 15548 T1421 C47 P18117 REQ /update {update.distrib=FROMLEADER&distrib.from=http://127.0.0.1:18108/solr/collection1/&wt=javabin&version=2} status=0 QTime=1 
[junit4:junit4]   2> 15549 T1402 C48 P18108 REQ /update {distrib.from=http://127.0.0.1:18112/solr/collection1/&update.distrib=TOLEADER&wt=javabin&version=2} status=0 QTime=5 
[junit4:junit4]   2> 15549 T1413 C50 P18112 /update {wt=javabin&version=2} {add=[12]} 0 10
[junit4:junit4]   2> 15554 T1383 C51 P18106 /update {wt=javabin&version=2} {add=[13 (1413363303592230912)]} 0 2
[junit4:junit4]   2> 15565 T1421 C47 P18117 REQ /update {update.distrib=FROMLEADER&distrib.from=http://127.0.0.1:18108/solr/collection1/&wt=javabin&version=2} status=0 QTime=1 
[junit4:junit4]   2> 15566 T1402 C48 P18108 REQ /update {distrib.from=http://127.0.0.1:18112/solr/collection1/&update.distrib=TOLEADER&wt=javabin&version=2} status=0 QTime=6 
[junit4:junit4]   2> 15566 T1413 C50 P18112 /update {wt=javabin&version=2} {add=[13]} 0 9
[junit4:junit4]   2> 15571 T1383 C51 P18106 /update {wt=javabin&version=2} {add=[14 (1413363303610056704)]} 0 2
[junit4:junit4]   2> 15578 T1421 C47 P18117 REQ /update {distrib.from=http://127.0.0.1:18108/solr/collection1/&update.distrib=FROMLEADER&wt=javabin&version=2} status=0 QTime=1 
[junit4:junit4]   2> 15579 T1399 C48 P18108 /update {wt=javabin&version=2} {add=[14 (1413363303615299584)]} 0 5
[junit4:junit4]   2> 15584 T1383 C51 P18106 /update {wt=javabin&version=2} {add=[15 (1413363303623688192)]} 0 2
[junit4:junit4]   2> 15593 T1421 C47 P18117 REQ /update {update.distrib=FROMLEADER&distrib.from=http://127.0.0.1:18108/solr/collection1/&wt=javabin&version=2} status=0 QTime=1 
[junit4:junit4]   2> 15594 T1402 C48 P18108 REQ /update {distrib.from=http://127.0.0.1:18112/solr/collection1/&update.distrib=TOLEADER&wt=javabin&version=2} status=0 QTime=5 
[junit4:junit4]   2> 15594 T1413 C50 P18112 /update {wt=javabin&version=2} {add=[15]} 0 7
[junit4:junit4]   2> 15598 T1383 C51 P18106 /update {wt=javabin&version=2} {add=[16 (1413363303639416832)]} 0 1
[junit4:junit4]   2> 15607 T1421 C47 P18117 REQ /update {update.distrib=FROMLEADER&distrib.from=http://127.0.0.1:18108/solr/collection1/&wt=javabin&version=2} status=0 QTime=1 
[junit4:junit4]   2> 15608 T1402 C48 P18108 REQ /update {distrib.from=http://127.0.0.1:18112/solr/collection1/&update.distrib=TOLEADER&wt=javabin&version=2} status=0 QTime=5 
[junit4:junit4]   2> 15608 T1413 C50 P18112 /update {wt=javabin&version=2} {add=[16]} 0 7
[junit4:junit4]   2> 15614 T1383 C51 P18106 /update {wt=javabin&version=2} {add=[17 (1413363303655145472)]} 0 3
[junit4:junit4]   2> 15627 T1435 C49 P18121 REQ /update {update.distrib=FROMLEADER&distrib.from=http://127.0.0.1:18112/solr/collection1/&wt=javabin&version=2} status=0 QTime=2 
[junit4:junit4]   2> 15628 T1410 C50 P18112 REQ /update {distrib.from=http://127.0.0.1:18108/solr/collection1/&update.distrib=TOLEADER&wt=javabin&version=2} status=0 QTime=8 
[junit4:junit4]   2> 15628 T1399 C48 P18108 /update {wt=javabin&version=2} {add=[17]} 0 11
[junit4:junit4]   2> 15632 T1383 C51 P18106 /update {wt=javabin&version=2} {add=[100 (1413363303675068416)]} 0 1
[junit4:junit4]   2> 15656 T1421 C47 P18117 REQ /update {update.distrib=FROMLEADER&distrib.from=http://127.0.0.1:18108/solr/collection1/&wt=javabin&version=2} status=0 QTime=8 
[junit4:junit4]   2> 15657 T1402 C48 P18108 REQ /update {distrib.from=http://127.0.0.1:18112/solr/collection1/&update.distrib=TOLEADER&wt=javabin&version=2} status=0 QTime=20 
[junit4:junit4]   2> 15657 T1413 C50 P18112 /update {wt=javabin&version=2} {add=[100]} 0 22
[junit4:junit4]   2> 15661 T1383 C51 P18106 /update {wt=javabin&version=2} {add=[101 (1413363303705477120)]} 0 1
[junit4:junit4]   2> 15670 T1421 C47 P18117 REQ /update {distrib.from=http://127.0.0.1:18108/solr/collection1/&update.distrib=FROMLEADER&wt=javabin&version=2} status=0 QTime=2 
[junit4:junit4]   2> 15671 T1399 C48 P18108 /update {wt=javabin&version=2} {add=[101 (1413363303709671424)]} 0 7
[junit4:junit4]   2> 15674 T1383 C51 P18106 /update {wt=javabin&version=2} {add=[102 (1413363303719108608)]} 0 1
[junit4:junit4]   2> 15681 T1421 C47 P18117 REQ /update {distrib.from=http://127.0.0.1:18108/solr/collection1/&update.distrib=FROMLEADER&wt=javabin&version=2} status=0 QTime=1 
[junit4:junit4]   2> 15681 T1399 C48 P18108 /update {wt=javabin&version=2} {add=[102 (1413363303723302912)]} 0 4
[junit4:junit4]   2> 15693 T1383 C51 P18106 /update {wt=javabin&version=2} {add=[103 (1413363303730642944)]} 0 9
[junit4:junit4]   2> 15702 T1435 C49 P18121 REQ /update {update.distrib=FROMLEADER&distrib.from=http://127.0.0.1:18112/solr/collection1/&wt=javabin&version=2} status=0 QTime=2 
[junit4:junit4]   2> 15703 T1410 C50 P18112 REQ /update {distrib.from=http://127.0.0.1:18108/solr/collection1/&update.distrib=TOLEADER&wt=javabin&version=2} status=0 QTime=6 
[junit4:junit4]   2> 15703 T1399 C48 P18108 /update {wt=javabin&version=2} {add=[103]} 0 8
[junit4:junit4]   2> 15709 T1383 C51 P18106 /update {wt=javabin&version=2} {add=[104 (1413363303753711616)]} 0 3
[junit4:junit4]   2> 15716 T1435 C49 P18121 REQ /update {distrib.from=http://127.0.0.1:18112/solr/collection1/&update.distrib=FROMLEADER&wt=javabin&version=2} status=0 QTime=1 
[junit4:junit4]   2> 15717 T1413 C50 P18112 /update {wt=javabin&version=2} {add=[104 (1413363303758954496)]} 0 6
[junit4:junit4]   2> 15721 T1383 C51 P18106 /update {wt=javabin&version=2} {add=[105 (1413363303768391680)]} 0 1
[junit4:junit4]   2> 15750 T1435 C49 P18121 REQ /update {update.distrib=FROMLEADER&distrib.from=http://127.0.0.1:18112/solr/collection1/&wt=javabin&version=2} status=0 QTime=13 
[junit4:junit4]   2> 15751 T1410 C50 P18112 REQ /update {distrib.from=http://127.0.0.1:18108/solr/collection1/&update.distrib=TOLEADER&wt=javabin&version=2} status=0 QTime=26 
[junit4:junit4]   2> 15751 T1399 C48 P18108 /update {wt=javabin&version=2} {add=[105]} 0 28
[junit4:junit4]   2> 15755 T1383 C51 P18106 /update {wt=javabin&version=2} {add=[106 (1413363303804043264)]} 0 1
[junit4:junit4]   2> 15764 T1435 C49 P18121 REQ /update {distrib.from=http://127.0.0.1:18112/solr/collection1/&update.distrib=FROMLEADER&wt=javabin&version=2} status=0 QTime=2 
[junit4:junit4]   2> 15765 T1413 C50 P18112 /update {wt=javabin&version=2} {add=[106 (1413363303808237568)]} 0 7
[junit4:junit4]   2> 15769 T1383 C51 P18106 /update {wt=javabin&version=2} {add=[107 (1413363303818723328)]} 0 1
[junit4:junit4]   2> 15775 T1421 C47 P18117 REQ /update {distrib.from=http://127.0.0.1:18108/solr/collection1/&update.distrib=FROMLEADER&wt=javabin&version=2} status=0 QTime=1 
[junit4:junit4]   2> 15776 T1399 C48 P18108 /update {wt=javabin&version=2} {add=[107 (1413363303821869056)]} 0 5
[junit4:junit4]   2> 15779 T1383 C51 P18106 /update {wt=javabin&version=2} {add=[108 (1413363303829209088)]} 0 1
[junit4:junit4]   2> 15785 T1421 C47 P18117 REQ /update {distrib.from=http://127.0.0.1:18108/solr/collection1/&update.distrib=FROMLEADER&wt=javabin&version=2} status=0 QTime=1 
[junit4:junit4]   2> 15785 T1399 C48 P18108 /update {wt=javabin&version=2} {add=[108 (1413363303832354816)]} 0 4
[junit4:junit4]   2> 15789 T1383 C51 P18106 /update {wt=javabin&version=2} {add=[109 (1413363303839694848)]} 0 1
[junit4:junit4]   2> 15797 T1421 C47 P18117 REQ /update {update.distrib=FROMLEADER&distrib.from=http://127.0.0.1:18108/solr/collection1/&wt=javabin&version=2} status=0 QTime=1 
[junit4:junit4]   2> 15797 T1402 C48 P18108 REQ /update {distrib.from=http://127.0.0.1:18112/solr/collection1/&update.distrib=TOLEADER&wt=javabin&version=2} status=0 QTime=4 
[junit4:junit4]   2> 15798 T1413 C50 P18112 /update {wt=javabin&version=2} {add=[109]} 0 7
[junit4:junit4]   2> 15801 T1383 C51 P18106 /update {wt=javabin&version=2} {add=[110 (1413363303852277760)]} 0 1
[junit4:junit4]   2> 15808 T1421 C47 P18117 REQ /update {distrib.from=http://127.0.0.1:18108/solr/collection1/&update.distrib=FROMLEADER&wt=javabin&version=2} status=0 QTime=1 
[junit4:junit4]   2> 15808 T1399 C48 P18108 /update {wt=javabin&version=2} {add=[110 (1413363303856472064)]} 0 4
[junit4:junit4]   2> 15812 T1383 C51 P18106 /update {wt=javabin&version=2} {add=[111 (1413363303863812096)]} 0 1
[junit4:junit4]   2> 15822 T1421 C47 P18117 REQ /update {update.distrib=FROMLEADER&distrib.from=http://127.0.0.1:18108/solr/collection1/&wt=javabin&version=2} status=0 QTime=1 
[junit4:junit4]   2> 15822 T1402 C48 P18108 REQ /update {distrib.from=http://127.0.0.1:18112/solr/collection1/&update.distrib=TOLEADER&wt=javabin&version=2} status=0 QTime=4 
[junit4:junit4]   2> 15823 T1413 C50 P18112 /update {wt=javabin&version=2} {add=[111]} 0 8
[junit4:junit4]   2> 15827 T1383 C51 P18106 /update {wt=javabin&version=2} {add=[112 (1413363303879540736)]} 0 1
[junit4:junit4]   2> 15833 T1435 C49 P18121 REQ /update {distrib.from=http://127.0.0.1:18112/solr/collection1/&update.distrib=FROMLEADER&wt=javabin&version=2} status=0 QTime=1 
[junit4:junit4]   2> 15833 T1413 C50 P18112 /update {wt=javabin&version=2} {add=[112 (1413363303882686464)]} 0 4
[junit4:junit4]   2> 15844 T1383 C51 P18106 /update {wt=javabin&version=2} {add=[113 (1413363303890026496)]} 0 8
[junit4:junit4]   2> 15851 T1421 C47 P18117 REQ /update {distrib.from=http://127.0.0.1:18108/solr/collection1/&update.distrib=FROMLEADER&wt=javabin&version=2} status=0 QTime=1 
[junit4:junit4]   2> 15851 T1399 C48 P18108 /update {wt=javabin&version=2} {add=[113 (1413363303901560832)]} 0 4
[junit4:junit4]   2> 15856 T1383 C51 P18106 /update {wt=javabin&version=2} {add=[114 (1413363303908900864)]} 0 2
[junit4:junit4]   2> 15865 T1421 C47 P18117 REQ /update {update.distrib=FROMLEADER&distrib.from=http://127.0.0.1:18108/solr/collection1/&wt=javabin&version=2} status=0 QTime=1 
[junit4:junit4]   2> 15865 T1402 C48 P18108 REQ /update {distrib.from=http://127.0.0.1:18112/solr/collection1/&update.distrib=TOLEADER&wt=javabin&version=2} status=0 QTime=4 
[junit4:junit4]   2> 15866 T1413 C50 P18112 /update {wt=javabin&version=2} {add=[114]} 0 7
[junit4:junit4]   2> 15870 T1383 C51 P18106 /update {wt=javabin&version=2} {add=[115 (1413363303924629504)]} 0 1
[junit4:junit4]   2> 15878 T1435 C49 P18121 REQ /update {update.distrib=FROMLEADER&distrib.from=http://127.0.0.1:18112/solr/collection1/&wt=javabin&version=2} status=0 QTime=1 
[junit4:junit4]   2> 15878 T1410 C50 P18112 REQ /update {distrib.from=http://127.0.0.1:18108/solr/collection1/&update.distrib=TOLEADER&wt=javabin&version=2} status=0 QTime=4 
[junit4:junit4]   2> 15879 T1399 C48 P18108 /update {wt=javabin&version=2} {add=[115]} 0 7
[junit4:junit4]   2> 15882 T1383 C51 P18106 /update {wt=javabin&version=2} {add=[116 (1413363303937212416)]} 0 1
[junit4:junit4]   2> 15891 T1435 C49 P18121 REQ /update {update.distrib=FROMLEADER&distrib.from=http://127.0.0.1:18112/solr/collection1/&wt=javabin&version=2} status=0 QTime=1 
[junit4:junit4]   2> 15891 T1410 C50 P18112 REQ /update {distrib.from=http://127.0.0.1:18108/solr/collection1/&update.distrib=TOLEADER&wt=javabin&version=2} status=0 QTime=4 
[junit4:junit4]   2> 15892 T1399 C48 P18108 /update {wt=javabin&version=2} {add=[116]} 0 7
[junit4:junit4]   2> 15895 T1383 C51 P18106 /update {wt=javabin&version=2} {add=[117 (1413363303950843904)]} 0 1
[junit4:junit4]   2> 15904 T1435 C49 P18121 REQ /update {update.distrib=FROMLEADER&distrib.from=http://127.0.0.1:18112/solr/collection1/&wt=javabin&version=2} status=0 QTime=1 
[junit4:junit4]   2> 15904 T1410 C50 P18112 REQ /update {distrib.from=http://127.0.0.1:18108/solr/collection1/&update.distrib=TOLEADER&wt=javabin&version=2} status=0 QTime=4 
[junit4:junit4]   2> 15905 T1399 C48 P18108 /update {wt=javabin&version=2} {add=[117]} 0 7
[junit4:junit4]   2> 15908 T1383 C51 P18106 /update {wt=javabin&version=2} {add=[118 (1413363303964475392)]} 0 1
[junit4:junit4]   2> 15928 T1421 C47 P18117 REQ /update {update.distrib=FROMLEADER&distrib.from=http://127.0.0.1:18108/solr/collection1/&wt=javabin&version=2} status=0 QTime=7 
[junit4:junit4]   2> 15929 T1402 C48 P18108 REQ /update {distrib.from=http://127.0.0.1:18112/solr/collection1/&update.distrib=TOLEADER&wt=javabin&version=2} status=0 QTime=17 
[junit4:junit4]   2> 15929 T1413 C50 P18112 /update {wt=javabin&version=2} {add=[118]} 0 19
[junit4:junit4]   2> 15933 T1383 C51 P18106 /update {wt=javabin&version=2} {add=[119 (1413363303990689792)]} 0 1
[junit4:junit4]   2> 15942 T1435 C49 P18121 REQ /update {update.distrib=FROMLEADER&distrib.from=http://127.0.0.1:18112/solr/collection1/&wt=javabin&version=2} status=0 QTime=1 
[junit4:junit4]   2> 15942 T1410 C50 P18112 REQ /update {distrib.from=http://127.0.0.1:18108/solr/collection1/&update.distrib=TOLEADER&wt=javabin&version=2} status=0 QTime=4 
[junit4:junit4]   2> 15943 T1399 C48 P18108 /update {wt=javabin&version=2} {add=[119]} 0 7
[junit4:junit4]   2> 15947 T1383 C51 P18106 /update {wt=javabin&version=2} {add=[120 (1413363304005369856)]} 0 1
[junit4:junit4]   2> 15954 T1435 C49 P18121 REQ /update {distrib.from=http://127.0.0.1:18112/solr/collection1/&update.distrib=FROMLEADER&wt=javabin&version=2} status=0 QTime=1 
[junit4:junit4]   2> 15954 T1413 C50 P18112 /update {wt=javabin&version=2} {add=[120 (1413363304009564160)]} 0 4
[junit4:junit4]   2> 15958 T1383 C51 P18106 /update {wt=javabin&version=2} {add=[121 (1413363304016904192)]} 0 1
[junit4:junit4]   2> 15967 T1435 C49 P18121 REQ /update {update.distrib=FROMLEADER&distrib.from=http://127.0.0.1:18112/solr/collection1/&wt=javabin&version=2} status=0 QTime=1 
[junit4:junit4]   2> 15968 T1410 C50 P18112 REQ /update {distrib.from=http://127.0.0.1:18108/solr/collection1/&update.distrib=TOLEADER&wt=javabin&version=2} status=0 QTime=5 
[junit4:junit4]   2> 15968 T1399 C48 P18108 /update {wt=javabin&version=2} {add=[121]} 0 8
[junit4:junit4]   2> 15972 T1383 C51 P18106 /update {wt=javabin&version=2} {add=[122 (1413363304031584256)]} 0 1
[junit4:junit4]   2> 15980 T1421 C47 P18117 REQ /update {distrib.from=http://127.0.0.1:18108/solr/collection1/&update.distrib=FROMLEADER&wt=javabin&version=2} status=0 QTime=2 
[junit4:junit4]   2> 15981 T1399 C48 P18108 /update {wt=javabin&version=2} {add=[122 (1413363304034729984)]} 0 7
[junit4:junit4]   2> 15993 T1383 C51 P18106 /update {wt=javabin&version=2} {add=[123 (1413363304045215744)]} 0 9
[junit4:junit4]   2> 16003 T1421 C47 P18117 REQ /update {update.distrib=FROMLEADER&distrib.from=http://127.0.0.1:18108/solr/collection1/&wt=javabin&version=2} status=0 QTime=1 
[junit4:junit4]   2> 16004 T1402 C48 P18108 REQ /update {distrib.from=http://127.0.0.1:18112/solr/collection1/&update.distrib=TOLEADER&wt=javabin&version=2} status=0 QTime=5 
[junit4:junit4]   2> 16004 T1413 C50 P18112 /update {wt=javabin&version=2} {add=[123]} 0 8
[junit4:junit4]   2> 16009 T1383 C51 P18106 /update {wt=javabin&version=2} {add=[124 (1413363304069332992)]} 0 2
[junit4:junit4]   2> 16018 T1421 C47 P18117 REQ /update {update.distrib=FROMLEADER&distrib.from=http://127.0.0.1:18108/solr/collection1/&wt=javabin&version=2} status=0 QTime=1 
[junit4:junit4]   2> 16018 T1402 C48 P18108 REQ /update {distrib.from=http://127.0.0.1:18112/solr/collection1/&update.distrib=TOLEADER&wt=javabin&version=2} status=0 QTime=4 
[junit4:junit4]   2> 16019 T1413 C50 P18112 /update {wt=javabin&version=2} {add=[124]} 0 7
[junit4:junit4]   2> 16023 T1383 C51 P18106 /update {wt=javabin&version=2} {add=[125 (1413363304085061632)]} 0 1
[junit4:junit4]   2> 16029 T1421 C47 P18117 REQ /update {distrib.from=http://127.0.0.1:18108/solr/collection1/&update.distrib=FROMLEADER&wt=javabin&version=2} status=0 QTime=1 
[junit4:junit4]   2> 16030 T1399 C48 P18108 /update {wt=javabin&version=2} {add=[125 (1413363304088207360)]} 0 5
[junit4:junit4]   2> 16034 T1383 C51 P18106 /update {wt=javabin&version=2} {add=[126 (1413363304096595968)]} 0 1
[junit4:junit4]   2> 16041 T1435 C49 P18121 REQ /update {distrib.from=http://127.0.0.1:18112/solr/collection1/&update.distrib=FROMLEADER&wt=javabin&version=2} status=0 QTime=1 
[junit4:junit4]   2> 16041 T1413 C50 P18112 /update {wt=javabin&version=2} {add=[126 (1413363304100790272)]} 0 4
[junit4:junit4]   2> 16045 T1383 C51 P18106 /update {wt=javabin&version=2} {add=[127 (1413363304108130304)]} 0 1
[junit4:junit4]   2> 16070 T1435 C49 P18121 REQ /update {update.distrib=FROMLEADER&distrib.from=http://127.0.0.1:18112/solr/collection1/&wt=javabin&version=2} status=0 QTime=9 
[junit4:junit4]   2> 16070 T1410 C50 P18112 REQ /update {distrib.from=http://127.0.0.1:18108/solr/collection1/&update.distrib=TOLEADER&wt=javabin&version=2} status=0 QTime=20 
[junit4:junit4]   2> 16071 T1399 C48 P18108 /update {wt=javabin&version=2} {add=[127]} 0 23
[junit4:junit4]   2> 16075 T1383 C51 P18106 /update {wt=javabin&version=2} {add=[128 (1413363304139587584)]} 0 1
[junit4:junit4]   2> 16089 T1435 C49 P18121 REQ /update {update.distrib=FROMLEADER&distrib.from=http://127.0.0.1:18112/solr/collection1/&wt=javabin&version=2} status=0 QTime=2 
[junit4:junit4]   2> 16090 T1410 C50 P18112 REQ /update {distrib.from=http://127.0.0.1:18108/solr/collection1/&update.distrib=TOLEADER&wt=javabin&version=2} status=0 QTime=8 
[junit4:junit4]   2> 16091 T1399 C48 P18108 /update {wt=javabin&version=2} {add=[128]} 0 12
[junit4:junit4]   2> 16095 T1383 C51 P18106 /update {wt=javabin&version=2} {add=[129 (1413363304160559104)]} 0 1
[junit4:junit4]   2> 16104 T1421 C47 P18117 REQ /update {update.distrib=FROMLEADER&distrib.from=http://127.0.0.1:18108/solr/collection1/&wt=javabin&version=2} status=0 QTime=1 
[junit4:junit4]   2> 16105 T1402 C48 P18108 REQ /update {distrib.from=http://127.0.0.1:18112/solr/collection1/&update.distrib=TOLEADER&wt=javabin&version=2} status=0 QTime=5 
[junit4:junit4]   2> 16106 T1413 C50 P18112 /update {wt=javabin&version=2} {add=[129]} 0 8
[junit4:junit4]   2> 16109 T1383 C51 P18106 /update {wt=javabin&version=2} {add=[130 (1413363304175239168)]} 0 1
[junit4:junit4]   2> 16118 T1435 C49 P18121 REQ /update {update.distrib=FROMLEADER&distrib.from=http://127.0.0.1:18112/solr/collection1/&wt=javabin&version=2} status=0 QTime=1 
[junit4:junit4]   2> 16119 T1410 C50 P18112 REQ /update {distrib.from=http://127.0.0.1:18108/solr/collection1/&update.distrib=TOLEADER&wt=javabin&version=2} status=0 QTime=5 
[junit4:junit4]   2> 16120 T1399 C48 P18108 /update {wt=javabin&version=2} {add=[130]} 0 8
[junit4:junit4]   2> 16124 T1383 C51 P18106 /update {wt=javabin&version=2} {add=[131 (1413363304190967808)]} 0 1
[junit4:junit4]   2> 16132 T1435 C49 P18121 REQ /update {distrib.from=http://127.0.0.1:18112/solr/collection1/&update.distrib=FROMLEADER&wt=javabin&version=2} status=0 QTime=1 
[junit4:junit4]   2> 16132 T1413 C50 P18112 /update {wt=javabin&version=2} {add=[131 (1413363304196210688)]} 0 4
[junit4:junit4]   2> 16136 T1383 C51 P18106 /update {wt=javabin&version=2} {add=[132 (1413363304203550720)]} 0 1
[junit4:junit4]   2> 16142 T1421 C47 P18117 REQ /update {distrib.from=http://127.0.0.1:18108/solr/collection1/&update.distrib=FROMLEADER&wt=javabin&version=2} status=0 QTime=1 
[junit4:junit4]   2> 16142 T1399 C48 P18108 /update {wt=javabin&version=2} {add=[132 (1413363304206696448)]} 0 4
[junit4:junit4]   2> 16153 T1383 C51 P18106 /update {wt=javabin&version=2} {add=[133 (1413363304214036480)]} 0 8
[junit4:junit4]   2> 16163 T1421 C47 P18117 REQ /update {update.distrib=FROMLEADER&distrib.from=http://127.0.0.1:18108/solr/collection1/&wt=javabin&version=2} status=0 QTime=1 
[junit4:junit4]   2> 16164 T1402 C48 P18108 REQ /update {distrib.from=http://127.0.0.1:18112/solr/collection1/&update.distrib=TOLEADER&wt=javabin&version=2} status=0 QTime=5 
[junit4:junit4]   2> 16164 T1413 C50 P18112 /update {wt=javabin&version=2} {add=[133]} 0 8
[junit4:junit4]   2> 16169 T1383 C51 P18106 /update {wt=javabin&version=2} {add=[134 (1413363304237105152)]} 0 2
[junit4:junit4]   2> 16176 T1435 C49 P18121 REQ /update {distrib.from=http://127.0.0.1:18112/solr/collection1/&update.distrib=FROMLEADER&wt=javabin&version=2} status=0 QTime=1 
[junit4:junit4]   2> 16177 T1413 C50 P18112 /update {wt=javabin&version=2} {add=[134 (1413363304242348032)]} 0 5
[junit4:junit4]   2> 16180 T1383 C51 P18106 /update {wt=javabin&version=2} {add=[135 (1413363304249688064)]} 0 1
[junit4:junit4]   2> 16187 T1421 C47 P18117 REQ /update {distrib.from=http://127.0.0.1:18108/solr/collection1/&update.distrib=FROMLEADER&wt=javabin&version=2} status=0 QTime=1 
[junit4:junit4]   2> 16188 T1399 C48 P18108 /update {wt=javabin&version=2} {add=[135 (1413363304253882368)]} 0 5
[junit4:junit4]   2> 16192 T1383 C51 P18106 /update {wt=javabin&version=2} {add=[136 (1413363304262270976)]} 0 1
[junit4:junit4]   2> 16199 T1435 C49 P18121 REQ /update {distrib.from=http://127.0.0.1:18112/solr/collection1/&update.distrib=FROMLEADER&wt=javabin&version=2} status=0 QTime=1 
[junit4:junit4]   2> 16199 T1413 C50 P18112 /update {wt=javabin&version=2} {add=[136 (1413363304266465280)]} 0 4
[junit4:junit4]   2> 16203 T1383 C51 P18106 /update {wt=javabin&version=2} {add=[137 (1413363304273805312)]} 0 1
[junit4:junit4]   2> 16209 T1435 C49 P18121 REQ /update {distrib.from=http://127.0.0.1:18112/solr/collection1/&update.distrib=FROMLEADER&wt=javabin&version=2} status=0 QTime=1 
[junit4:junit4]   2> 16210 T1413 C50 P18112 /update {wt=javabin&version=2} {add=[137 (1413363304276951040)]} 0 5
[junit4:junit4]   2> 16213 T1383 C51 P18106 /update {wt=javabin&version=2} {add=[138 (1413363304284291072)]} 0 1
[junit4:junit4]   2> 16220 T1421 C47 P18117 REQ /update {distrib.from=http://127.0.0.1:18108/solr/collection1/&update.distrib=FROMLEADER&wt=javabin&version=2} status=0 QTime=1 
[junit4:junit4]   2> 16220 T1399 C48 P18108 /update {wt=javabin&version=2} {add=[138 (1413363304288485376)]} 0 4
[junit4:junit4]   2> 16224 T1383 C51 P18106 /update {wt=javabin&version=2} {add=[139 (1413363304295825408)]} 0 1
[junit4:junit4]   2> 16233 T1435 C49 P18121 REQ /update {update.distrib=FROMLEADER&distrib.from=http://127.0.0.1:18112/solr/collection1/&wt=javabin&version=2} status=0 QTime=1 
[junit4:junit4]   2> 16234 T1410 C50 P18112 REQ /update {distrib.from=http://127.0.0.1:18108/solr/collection1/&update.distrib=TOLEADER&wt=javabin&version=2} status=0 QTime=5 
[junit4:junit4]   2> 16234 T1399 C48 P18108 /update {wt=javabin&version=2} {add=[139]} 0 7
[junit4:junit4]   2> 16238 T1383 C51 P18106 /update {wt=javabin&version=2} {add=[140 (1413363304310505472)]} 0 1
[junit4:junit4]   2> 16246 T1435 C49 P18121 REQ /update {update.distrib=FROMLEADER&distrib.from=http://127.0.0.1:18112/solr/collection1/&wt=javabin&version=2} status=0 QTime=1 
[junit4:junit4]   2> 16246 T1410 C50 P18112 REQ /update {distrib.from=http://127.0.0.1:18108/solr/collection1/&update.distrib=TOLEADER&wt=javabin&version=2} status=0 QTime=4 
[junit4:junit4]   2> 16247 T1399 C48 P18108 /update {wt=javabin&version=2} {add=[140]} 0 7
[junit4:junit4]   2> 16251 T1383 C51 P18106 /update {wt=javabin&version=2} {add=[141 (1413363304324136960)]} 0 1
[junit4:junit4]   2> 16258 T1435 C49 P18121 REQ /update {distrib.from=http://127.0.0.1:18112/solr/collection1/&update.distrib=FROMLEADER&wt=javabin&version=2} status=0 QTime=1 
[junit4:junit4]   2> 16258 T1413 C50 P18112 /update {wt=javabin&version=2} {add=[141 (1413363304328331264)]} 0 4
[junit4:junit4]   2> 16262 T1383 C51 P18106 /update {wt=javabin&version=2} {add=[142 (1413363304335671296)]} 0 1
[junit4:junit4]   2> 16285 T1435 C49 P18121 REQ /update {update.distrib=FROMLEADER&distrib.from=http://127.0.0.1:18112/solr/collection1/&wt=javabin&version=2} status=0 QTime=8 
[junit4:junit4]   2> 16285 T1410 C50 P18112 REQ /update {distrib.from=http://127.0.0.1:18108/solr/collection1/&update.distrib=TOLEADER&wt=javabin&version=2} status=0 QTime=18 
[junit4:junit4]   2> 16286 T1399 C48 P18108 /update {wt=javabin&version=2} {add=[142]} 0 21
[junit4:junit4]   2> 16297 T1383 C51 P18106 /update {wt=javabin&version=2} {add=[143 (1413363304365031424)]} 0 8
[junit4:junit4]   2> 16309 T1435 C49 P18121 REQ /update {update.distrib=FROMLEADER&distrib.from=http://127.0.0.1:18112/solr/collection1/&wt=javabin&version=2} status=0 QTime=2 
[junit4:junit4]   2> 16310 T1410 C50 P18112 REQ /update {distrib.from=http://127.0.0.1:18108/solr/collection1/&update.distrib=TOLEADER&wt=javabin&version=2} status=0 QTime=7 
[junit4:junit4]   2> 16311 T1399 C48 P18108 /update {wt=javabin&version=2} {add=[143]} 0 11
[junit4:junit4]   2> 16316 T1383 C51 P18106 /update {wt=javabin&version=2} {add=[144 (1413363304391245824)]} 0 2
[junit4:junit4]   2> 16323 T1435 C49 P18121 REQ /update {distrib.from=http://127.0.0.1:18112/solr/collection1/&update.distrib=FROMLEADER&wt=javabin&version=2} status=0 QTime=1 
[junit4:junit4]   2> 16323 T1413 C50 P18112 /update {wt=javabin&version=2} {add=[144 (1413363304396488704)]} 0 4
[junit4:junit4]   2> 16327 T1383 C51 P18106 /update {wt=javabin&version=2} {add=[145 (1413363304403828736)]} 0 1
[junit4:junit4]   2> 16334 T1435 C49 P18121 REQ /update {distrib.from=http://127.0.0.1:18112/solr/collection1/&update.distrib=FROMLEADER&wt=javabin&version=2} status=0 QTime=1 
[junit4:junit4]   2> 16335 T1413 C50 P18112 /update {wt=javabin&version=2} {add=[145 (1413363304408023040)]} 0 5
[junit4:junit4]   2> 16339 T1383 C51 P18106 /update {wt=javabin&version=2} {add=[146 (1413363304416411648)]} 0 1
[junit4:junit4]   2> 16359 T1421 C47 P18117 REQ /update {distrib.from=http://127.0.0.1:18108/solr/collection1/&update.distrib=FROMLEADER&wt=javabin&version=2} status=0 QTime=7 
[junit4:junit4]   2> 16359 T1399 C48 P18108 /update {wt=javabin&version=2} {add=[146 (1413363304420605952)]} 0 17
[junit4:junit4]   2> 16363 T1383 C51 P18106 /update {wt=javabin&version=2} {add=[147 (1413363304441577472)]} 0 1
[junit4:junit4]   2> 16370 T1435 C49 P18121 REQ /update {distrib.from=http://127.0.0.1:18112/solr/collection1/&update.distrib=FROMLEADER&wt=javabin&version=2} status=0 QTime=1 
[junit4:junit4]   2> 16370 T1413 C50 P18112 /update {wt=javabin&version=2} {add=[147 (1413363304445771776)]} 0 4
[junit4:junit4]   2> 16374 T1383 C51 P18106 /update {wt=javabin&version=2} {add=[148 (1413363304453111808)]} 0 1
[junit4:junit4]   2> 16383 T1421 C47 P18117 REQ /update {distrib.from=http://127.0.0.1:18108/solr/collection1/&update.distrib=FROMLEADER&wt=javabin&version=2} status=0 QTime=2 
[junit4:junit4]   2> 16384 T1399 C48 P18108 /update {wt=javabin&version=2} {add=[148 (1413363304457306112)]} 0 7
[junit4:junit4]   2> 16387 T1383 C51 P18106 /update {wt=javabin&version=2} {add=[149 (1413363304466743296)]} 0 1
[junit4:junit4]   2> 16393 T1435 C49 P18121 REQ /update {distrib.from=http://127.0.0.1:18112/solr/collection1/&update.distrib=FROMLEADER&wt=javabin&version=2} status=0 QTime=1 
[junit4:junit4]   2> 16393 T1413 C50 P18112 /update {wt=javabin&version=2} {add=[149 (1413363304469889024)]} 0 4
[junit4:junit4]   2> 16394 T1371 oasc.AbstractDistribZkTestBase.waitForRecoveriesToFinish Wait for recoveries to finish - collection: collection1 failOnTimeout:true timeout (sec):1800
[junit4:junit4]   2> 16395 T1371 oascc.ZkStateReader.updateClusterState Updating cloud state from ZooKeeper... 
[junit4:junit4]   2> 16398 T1383 C51 P18106 oasu.DirectUpdateHandler2.commit start commit{flags=0,_version_=0,optimize=false,openSearcher=true,waitSearcher=true,expungeDeletes=false,softCommit=false}
[junit4:junit4]   2> 16994 T1383 C51 P18106 oasc.SolrDeletionPolicy.onCommit SolrDeletionPolicy.onCommit: commits:num=2
[junit4:junit4]   2> 		commit{dir=NRTCachingDirectory(org.apache.lucene.store.NIOFSDirectory@/usr/home/hudson/hudson-slave/workspace/Lucene-Solr-Tests-4.x-java7/solr/build/solr-core/test/J1/org.apache.solr.cloud.BasicDistributedZk2Test-1347888266841/control/data/index lockFactory=org.apache.lucene.store.NativeFSLockFactory@7898a26c; maxCacheMB=48.0 maxMergeSizeMB=4.0),segFN=segments_2,generation=2,filenames=[_0.fnm, _0.frq, _0.tim, _0_nrm.cfe, segments_2, _0.fdx, _0_nrm.cfs, _0.si, _0.prx, _0.tip, _0.fdt]
[junit4:junit4]   2> 		commit{dir=NRTCachingDirectory(org.apache.lucene.store.NIOFSDirectory@/usr/home/hudson/hudson-slave/workspace/Lucene-Solr-Tests-4.x-java7/solr/build/solr-core/test/J1/org.apache.solr.cloud.BasicDistributedZk2Test-1347888266841/control/data/index lockFactory=org.apache.lucene.store.NativeFSLockFactory@7898a26c; maxCacheMB=48.0 maxMergeSizeMB=4.0),segFN=segments_3,generation=3,filenames=[_5_nrm.cfe, _3_nrm.cfe, _5.fdt, _5.prx, _1.frq, _4.prx, _7.si, _4.fnm, _4_nrm.cfe, _3.fdt, _1.fnm, _2.tim, _4.fdx, _7.fnm, _5.tip, _5.tim, _4.frq, _7.frq, _7.tim, _0.prx, _7.tip, _0.fnm, _2.prx, _2.frq, _2.fdt, _7.fdx, _3.prx, _2.fdx, _7.fdt, _5.si, _2.tip, _1.fdx, _1.prx, _3_nrm.cfs, _5_nrm.cfs, _1.fdt, _0.tim, _0.frq, _4_nrm.cfs, _3.si, _6.fdt, _0.tip, _2.si, _3.frq, _6.frq, _3.tim, _6.fdx, _3.fnm, _2_nrm.cfe, _6.tip, _6_nrm.cfs, _7_nrm.cfs, _6.tim, _4.tip, _0.si, _2_nrm.cfs, _1.tip, _1.tim, _1_nrm.cfs, _5.fnm, _7_nrm.cfe, _4.tim, _6_nrm.cfe, _5.frq, _4.si, _4.fdt, _0_nrm.cfs, _1_nrm.cfe, _2.fnm, _7.prx, _3.fdx, _6.prx, _1.si, _0_nrm.cfe, _5.fdx, _6.si, _6.fnm, _0.fdx, _3.tip, segments_3, _0.fdt]
[junit4:junit4]   2> 16995 T1383 C51 P18106 oasc.SolrDeletionPolicy.updateCommits newest commit = 3
[junit4:junit4]   2> 17044 T1383 C51 P18106 oass.SolrIndexSearcher.<init> Opening Searcher@69bfa556 main
[junit4:junit4]   2> 17045 T1383 C51 P18106 oasu.DirectUpdateHandler2.commit end_commit_flush
[junit4:junit4]   2> 17047 T1394 oasc.SolrCore.registerSearcher [collection1] Registered new searcher Searcher@69bfa556 main{StandardDirectoryReader(segments_3:17 _0(4.0.0.2):C1 _1(4.0.0.2):C10 _2(4.0.0.2):C10 _3(4.0.0.2):C10 _4(4.0.0.2):C10 _5(4.0.0.2):C10 _6(4.0.0.2):C10 _7(4.0.0.2):C6)}
[junit4:junit4]   2> 17048 T1383 C51 P18106 /update {waitSearcher=true&wt=javabin&commit=true&softCommit=false&version=2} {commit=} 0 650
[junit4:junit4]   2> 17051 T1399 C48 P18108 oasu.DirectUpdateHandler2.commit start commit{flags=0,_version_=0,optimize=false,openSearcher=true,waitSearcher=true,expungeDeletes=false,softCommit=false}
[junit4:junit4]   2> 17313 T1399 C48 P18108 oasc.SolrDeletionPolicy.onCommit SolrDeletionPolicy.onCommit: commits:num=2
[junit4:junit4]   2> 		commit{dir=NRTCachingDirectory(org.apache.lucene.store.NIOFSDirectory@/usr/home/hudson/hudson-slave/workspace/Lucene-Solr-Tests-4.x-java7/solr/build/solr-core/test/J1/org.apache.solr.cloud.BasicDistributedZk2Test-1347888266841/jetty1/index lockFactory=org.apache.lucene.store.NativeFSLockFactory@2d4e9823; maxCacheMB=48.0 maxMergeSizeMB=4.0),segFN=segments_2,generation=2,filenames=[_0.fnm, _0.frq, _0.tim, _0_nrm.cfe, segments_2, _0.fdx, _0_nrm.cfs, _0.si, _0.prx, _0.tip, _0.fdt]
[junit4:junit4]   2> 		commit{dir=NRTCachingDirectory(org.apache.lucene.store.NIOFSDirectory@/usr/home/hudson/hudson-slave/workspace/Lucene-Solr-Tests-4.x-java7/solr/build/solr-core/test/J1/org.apache.solr.cloud.BasicDistributedZk2Test-1347888266841/jetty1/index lockFactory=org.apache.lucene.store.NativeFSLockFactory@2d4e9823; maxCacheMB=48.0 maxMergeSizeMB=4.0),segFN=segments_3,generation=3,filenames=[_3_nrm.cfe, _1.frq, _4.prx, _4.fnm, _4_nrm.cfe, _3.fdt, _1.fnm, _2.tim, _4.fdx, _4.frq, _0.prx, _0.fnm, _2.prx, _2.frq, _2.fdt, _3.prx, _2.fdx, _2.tip, _1.fdx, _1.prx, _3_nrm.cfs, _1.fdt, _0.tim, _0.frq, _4_nrm.cfs, _3.si, _0.tip, _2.si, _3.frq, _3.tim, _3.fnm, _2_nrm.cfe, _4.tip, _0.si, _2_nrm.cfs, _1.tip, _1.tim, _1_nrm.cfs, _4.tim, _4.si, _4.fdt, _0_nrm.cfs, _1_nrm.cfe, _2.fnm, _3.fdx, _1.si, _0_nrm.cfe, _0.fdx, _3.tip, segments_3, _0.fdt]
[junit4:junit4]   2> 17314 T1399 C48 P18108 oasc.SolrDeletionPolicy.updateCommits newest commit = 3
[junit4:junit4]   2> 17343 T1399 C48 P18108 oass.SolrIndexSearcher.<init> Opening Searcher@421b054a main
[junit4:junit4]   2> 17344 T1399 C48 P18108 oasu.DirectUpdateHandler2.commit end_commit_flush
[junit4:junit4]   2> 17346 T1406 

[...truncated too long message...]

g recovery
[junit4:junit4]   2> 134751 T1552 oaz.ClientCnxn$EventThread.run EventThread shut down
[junit4:junit4]   2> 134751 T1492 oaz.ZooKeeper.close Session: 0x139d46b7df90005 closed
[junit4:junit4]   2> 134753 T1492 oejsh.ContextHandler.doStop stopped o.e.j.s.ServletContextHandler{/solr,null}
[junit4:junit4]   2> 134805 T1492 oasc.ChaosMonkey.monkeyLog monkey: stop shard! 40605
[junit4:junit4]   2> 134805 T1492 oasc.CoreContainer.shutdown Shutting down CoreContainer instance=893817521
[junit4:junit4]   2> 134806 T1492 oasc.RecoveryStrategy.close WARNING Stopping recovery for zkNodeName=127.0.0.1:40605_solr_collection1core=collection1
[junit4:junit4]   2> 134806 T1492 oasc.SolrCore.close [collection1]  CLOSING SolrCore org.apache.solr.core.SolrCore@3b94e498
[junit4:junit4]   2> 134849 T1492 oasc.SolrCore.closeSearcher [collection1] Closing main searcher on request.
[junit4:junit4]   2> 134849 T1492 oasu.DirectUpdateHandler2.close closing DirectUpdateHandler2{commits=6,autocommits=0,soft autocommits=0,optimizes=0,rollbacks=0,expungeDeletes=0,docsPending=0,adds=0,deletesById=0,deletesByQuery=0,errors=0,cumulative_adds=5,cumulative_deletesById=0,cumulative_deletesByQuery=1,cumulative_errors=0}
[junit4:junit4]   2> 134850 T1492 oasu.DefaultSolrCoreState.decref SolrCoreState ref count has reached 0 - closing IndexWriter
[junit4:junit4]   2> 134852 T1492 oasu.DefaultSolrCoreState.decref Closing SolrCoreState - canceling any ongoing recovery
[junit4:junit4]   2> 135528 T1566 oaz.ClientCnxn$EventThread.run EventThread shut down
[junit4:junit4]   2> 135528 T1492 oaz.ZooKeeper.close Session: 0x139d46b7df90006 closed
[junit4:junit4]   2> 135530 T1492 oejsh.ContextHandler.doStop stopped o.e.j.s.ServletContextHandler{/solr,null}
[junit4:junit4]   2> 135662 T1492 oas.SolrTestCaseJ4.tearDown ###Ending testDistribSearch
[junit4:junit4]   2> NOTE: reproduce with: ant test  -Dtestcase=SyncSliceTest -Dtests.method=testDistribSearch -Dtests.seed=28AA5C2F778B5C8D -Dtests.multiplier=3 -Dtests.slow=true -Dtests.locale=es_BO -Dtests.timezone=SystemV/AST4 -Dtests.file.encoding=ISO-8859-1
[junit4:junit4] FAILURE  136s J1 | SyncSliceTest.testDistribSearch <<<
[junit4:junit4]    > Throwable #1: java.lang.AssertionError: There are still nodes recoverying
[junit4:junit4]    > 	at __randomizedtesting.SeedInfo.seed([28AA5C2F778B5C8D:A94CD23700D43CB1]:0)
[junit4:junit4]    > 	at org.junit.Assert.fail(Assert.java:93)
[junit4:junit4]    > 	at org.apache.solr.cloud.AbstractDistribZkTestBase.waitForRecoveriesToFinish(AbstractDistribZkTestBase.java:154)
[junit4:junit4]    > 	at org.apache.solr.cloud.AbstractFullDistribZkTestBase.waitForRecoveriesToFinish(AbstractFullDistribZkTestBase.java:560)
[junit4:junit4]    > 	at org.apache.solr.cloud.AbstractFullDistribZkTestBase.waitForThingsToLevelOut(AbstractFullDistribZkTestBase.java:1135)
[junit4:junit4]    > 	at org.apache.solr.cloud.SyncSliceTest.doTest(SyncSliceTest.java:162)
[junit4:junit4]    > 	at org.apache.solr.BaseDistributedSearchTestCase.testDistribSearch(BaseDistributedSearchTestCase.java:695)
[junit4:junit4]    > 	at sun.reflect.NativeMethodAccessorImpl.invoke0(Native Method)
[junit4:junit4]    > 	at sun.reflect.NativeMethodAccessorImpl.invoke(NativeMethodAccessorImpl.java:57)
[junit4:junit4]    > 	at sun.reflect.DelegatingMethodAccessorImpl.invoke(DelegatingMethodAccessorImpl.java:43)
[junit4:junit4]    > 	at java.lang.reflect.Method.invoke(Method.java:601)
[junit4:junit4]    > 	at com.carrotsearch.randomizedtesting.RandomizedRunner.invoke(RandomizedRunner.java:1559)
[junit4:junit4]    > 	at com.carrotsearch.randomizedtesting.RandomizedRunner.access$600(RandomizedRunner.java:79)
[junit4:junit4]    > 	at com.carrotsearch.randomizedtesting.RandomizedRunner$6.evaluate(RandomizedRunner.java:737)
[junit4:junit4]    > 	at com.carrotsearch.randomizedtesting.RandomizedRunner$7.evaluate(RandomizedRunner.java:773)
[junit4:junit4]    > 	at com.carrotsearch.randomizedtesting.RandomizedRunner$8.evaluate(RandomizedRunner.java:787)
[junit4:junit4]    > 	at com.carrotsearch.randomizedtesting.rules.SystemPropertiesRestoreRule$1.evaluate(SystemPropertiesRestoreRule.java:53)
[junit4:junit4]    > 	at org.apache.lucene.util.TestRuleSetupTeardownChained$1.evaluate(TestRuleSetupTeardownChained.java:50)
[junit4:junit4]    > 	at org.apache.lucene.util.TestRuleFieldCacheSanity$1.evaluate(TestRuleFieldCacheSanity.java:51)
[junit4:junit4]    > 	at org.apache.lucene.util.AbstractBeforeAfterRule$1.evaluate(AbstractBeforeAfterRule.java:45)
[junit4:junit4]    > 	at com.carrotsearch.randomizedtesting.rules.SystemPropertiesInvariantRule$1.evaluate(SystemPropertiesInvariantRule.java:55)
[junit4:junit4]    > 	at org.apache.lucene.util.TestRuleThreadAndTestName$1.evaluate(TestRuleThreadAndTestName.java:48)
[junit4:junit4]    > 	at org.apache.lucene.util.TestRuleIgnoreAfterMaxFailures$1.evaluate(TestRuleIgnoreAfterMaxFailures.java:70)
[junit4:junit4]    > 	at org.apache.lucene.util.TestRuleMarkFailure$1.evaluate(TestRuleMarkFailure.java:48)
[junit4:junit4]    > 	at com.carrotsearch.randomizedtesting.rules.StatementAdapter.evaluate(StatementAdapter.java:36)
[junit4:junit4]    > 	at com.carrotsearch.randomizedtesting.ThreadLeakControl$StatementRunner.run(ThreadLeakControl.java:358)
[junit4:junit4]    > 	at com.carrotsearch.randomizedtesting.ThreadLeakControl.forkTimeoutingTask(ThreadLeakControl.java:782)
[junit4:junit4]    > 	at com.carrotsearch.randomizedtesting.ThreadLeakControl$3.evaluate(ThreadLeakControl.java:442)
[junit4:junit4]    > 	at com.carrotsearch.randomizedtesting.RandomizedRunner.runSingleTest(RandomizedRunner.java:746)
[junit4:junit4]    > 	at com.carrotsearch.randomizedtesting.RandomizedRunner$3.evaluate(RandomizedRunner.java:648)
[junit4:junit4]    > 	at com.carrotsearch.randomizedtesting.RandomizedRunner$4.evaluate(RandomizedRunner.java:682)
[junit4:junit4]    > 	at com.carrotsearch.randomizedtesting.RandomizedRunner$5.evaluate(RandomizedRunner.java:693)
[junit4:junit4]    > 	at com.carrotsearch.randomizedtesting.rules.StatementAdapter.evaluate(StatementAdapter.java:36)
[junit4:junit4]    > 	at com.carrotsearch.randomizedtesting.rules.SystemPropertiesRestoreRule$1.evaluate(SystemPropertiesRestoreRule.java:53)
[junit4:junit4]    > 	at org.apache.lucene.util.AbstractBeforeAfterRule$1.evaluate(AbstractBeforeAfterRule.java:45)
[junit4:junit4]    > 	at org.apache.lucene.util.TestRuleStoreClassName$1.evaluate(TestRuleStoreClassName.java:42)
[junit4:junit4]    > 	at com.carrotsearch.randomizedtesting.rules.SystemPropertiesInvariantRule$1.evaluate(SystemPropertiesInvariantRule.java:55)
[junit4:junit4]    > 	at com.carrotsearch.randomizedtesting.rules.NoShadowingOrOverridesOnMethodsRule$1.evaluate(NoShadowingOrOverridesOnMethodsRule.java:39)
[junit4:junit4]    > 	at com.carrotsearch.randomizedtesting.rules.NoShadowingOrOverridesOnMethodsRule$1.evaluate(NoShadowingOrOverridesOnMethodsRule.java:39)
[junit4:junit4]    > 	at com.carrotsearch.randomizedtesting.rules.StatementAdapter.evaluate(StatementAdapter.java:36)
[junit4:junit4]    > 	at org.apache.lucene.util.TestRuleAssertionsRequired$1.evaluate(TestRuleAssertionsRequired.java:43)
[junit4:junit4]    > 	at org.apache.lucene.util.TestRuleMarkFailure$1.evaluate(TestRuleMarkFailure.java:48)
[junit4:junit4]    > 	at org.apache.lucene.util.TestRuleIgnoreAfterMaxFailures$1.evaluate(TestRuleIgnoreAfterMaxFailures.java:70)
[junit4:junit4]    > 	at org.apache.lucene.util.TestRuleIgnoreTestSuites$1.evaluate(TestRuleIgnoreTestSuites.java:55)
[junit4:junit4]    > 	at com.carrotsearch.randomizedtesting.rules.StatementAdapter.evaluate(StatementAdapter.java:36)
[junit4:junit4]    > 	at com.carrotsearch.randomizedtesting.ThreadLeakControl$StatementRunner.run(ThreadLeakControl.java:358)
[junit4:junit4]    > 	at java.lang.Thread.run(Thread.java:722)
[junit4:junit4]   2> 135668 T1492 oas.SolrTestCaseJ4.deleteCore ###deleteCore
[junit4:junit4]   2> NOTE: test params are: codec=Appending, sim=DefaultSimilarity, locale=es_BO, timezone=SystemV/AST4
[junit4:junit4]   2> NOTE: FreeBSD 9.0-RELEASE amd64/Oracle Corporation 1.7.0_06 (64-bit)/cpus=16,threads=1,free=393856032,total=467664896
[junit4:junit4]   2> NOTE: All tests run in this JVM: [DOMUtilTest, ZkSolrClientTest, TestDocumentBuilder, TestLRUCache, TestRTGBase, UUIDFieldTest, IndexSchemaTest, RecoveryZkTest, SignatureUpdateProcessorFactoryTest, XmlUpdateRequestHandlerTest, DistributedQueryElevationComponentTest, DisMaxRequestHandlerTest, SolrInfoMBeanTest, DirectSolrSpellCheckerTest, TestValueSourceCache, TestDFRSimilarityFactory, DocumentAnalysisRequestHandlerTest, RequiredFieldsTest, TestReplicationHandler, MultiTermTest, TestDistributedSearch, TestStressLucene, UpdateParamsTest, OverseerTest, ShowFileRequestHandlerTest, TestQueryUtils, TestBinaryField, LeaderElectionTest, SoftAutoCommitTest, BasicZkTest, PrimUtilsTest, BasicDistributedZk2Test, TestFoldingMultitermQuery, SyncSliceTest]
[junit4:junit4] Completed on J1 in 135.70s, 1 test, 1 failure <<< FAILURES!

[...truncated 375 lines...]
BUILD FAILED
/usr/home/hudson/hudson-slave/workspace/Lucene-Solr-Tests-4.x-java7/build.xml:32: The following error occurred while executing this line:
/usr/home/hudson/hudson-slave/workspace/Lucene-Solr-Tests-4.x-java7/solr/build.xml:146: The following error occurred while executing this line:
/usr/home/hudson/hudson-slave/workspace/Lucene-Solr-Tests-4.x-java7/lucene/module-build.xml:63: The following error occurred while executing this line:
/usr/home/hudson/hudson-slave/workspace/Lucene-Solr-Tests-4.x-java7/lucene/common-build.xml:1133: The following error occurred while executing this line:
/usr/home/hudson/hudson-slave/workspace/Lucene-Solr-Tests-4.x-java7/lucene/common-build.xml:810: There were test failures: 230 suites, 951 tests, 2 failures, 8 ignored (3 assumptions)

Total time: 30 minutes 14 seconds
Build step 'Invoke Ant' marked build as failure
Recording test results
Email was triggered for: Failure
Sending email for trigger: Failure



Mime
View raw message