lucene-dev mailing list archives

Site index · List index
Message view « Date » · « Thread »
Top « Date » · « Thread »
From Policeman Jenkins Server <jenk...@sd-datasolutions.de>
Subject [JENKINS] Lucene-Solr-trunk-Linux (64bit/jdk1.8.0-ea-b51) - Build # 1263 - Still Failing!
Date Fri, 21 Sep 2012 09:53:48 GMT
Build: http://jenkins.sd-datasolutions.de/job/Lucene-Solr-trunk-Linux/1263/
Java: 64bit/jdk1.8.0-ea-b51 -XX:+UseG1GC

1 tests failed.
FAILED:  org.apache.lucene.search.TestFilteredQuery.testBooleanSHOULD

Error Message:
java.util.concurrent.ExecutionException: java.lang.IllegalStateException: This Random was
created for/by another thread (Thread[TEST-TestFilteredQuery.testBooleanSHOULD-seed#[296C76A0A3CD476E],5,TGRP-TestFilteredQuery]).
Random instances must not be shared (acquire per-thread). Current thread: Thread[LuceneTestCase-111-thread-2,5,TGRP-TestFilteredQuery]

Stack Trace:
java.lang.RuntimeException: java.util.concurrent.ExecutionException: java.lang.IllegalStateException:
This Random was created for/by another thread (Thread[TEST-TestFilteredQuery.testBooleanSHOULD-seed#[296C76A0A3CD476E],5,TGRP-TestFilteredQuery]).
Random instances must not be shared (acquire per-thread). Current thread: Thread[LuceneTestCase-111-thread-2,5,TGRP-TestFilteredQuery]
	at __randomizedtesting.SeedInfo.seed([296C76A0A3CD476E:EF01D98E4AC693AF]:0)
	at org.apache.lucene.search.IndexSearcher$ExecutionHelper.next(IndexSearcher.java:820)
	at org.apache.lucene.search.IndexSearcher.search(IndexSearcher.java:423)
	at org.apache.lucene.search.IndexSearcher.search(IndexSearcher.java:261)
	at org.apache.lucene.search.TestFilteredQuery.tBooleanSHOULD(TestFilteredQuery.java:256)
	at org.apache.lucene.search.TestFilteredQuery.testBooleanSHOULD(TestFilteredQuery.java:247)
	at sun.reflect.NativeMethodAccessorImpl.invoke0(Native Method)
	at sun.reflect.NativeMethodAccessorImpl.invoke(NativeMethodAccessorImpl.java:57)
	at sun.reflect.DelegatingMethodAccessorImpl.invoke(DelegatingMethodAccessorImpl.java:43)
	at java.lang.reflect.Method.invoke(Method.java:474)
	at com.carrotsearch.randomizedtesting.RandomizedRunner.invoke(RandomizedRunner.java:1559)
	at com.carrotsearch.randomizedtesting.RandomizedRunner.access$600(RandomizedRunner.java:79)
	at com.carrotsearch.randomizedtesting.RandomizedRunner$6.evaluate(RandomizedRunner.java:737)
	at com.carrotsearch.randomizedtesting.RandomizedRunner$7.evaluate(RandomizedRunner.java:773)
	at com.carrotsearch.randomizedtesting.RandomizedRunner$8.evaluate(RandomizedRunner.java:787)
	at org.apache.lucene.util.TestRuleSetupTeardownChained$1.evaluate(TestRuleSetupTeardownChained.java:50)
	at org.apache.lucene.util.TestRuleFieldCacheSanity$1.evaluate(TestRuleFieldCacheSanity.java:51)
	at org.apache.lucene.util.AbstractBeforeAfterRule$1.evaluate(AbstractBeforeAfterRule.java:45)
	at com.carrotsearch.randomizedtesting.rules.SystemPropertiesInvariantRule$1.evaluate(SystemPropertiesInvariantRule.java:55)
	at org.apache.lucene.util.TestRuleThreadAndTestName$1.evaluate(TestRuleThreadAndTestName.java:48)
	at org.apache.lucene.util.TestRuleIgnoreAfterMaxFailures$1.evaluate(TestRuleIgnoreAfterMaxFailures.java:70)
	at org.apache.lucene.util.TestRuleMarkFailure$1.evaluate(TestRuleMarkFailure.java:48)
	at com.carrotsearch.randomizedtesting.rules.StatementAdapter.evaluate(StatementAdapter.java:36)
	at com.carrotsearch.randomizedtesting.ThreadLeakControl$StatementRunner.run(ThreadLeakControl.java:358)
	at com.carrotsearch.randomizedtesting.ThreadLeakControl.forkTimeoutingTask(ThreadLeakControl.java:782)
	at com.carrotsearch.randomizedtesting.ThreadLeakControl$3.evaluate(ThreadLeakControl.java:442)
	at com.carrotsearch.randomizedtesting.RandomizedRunner.runSingleTest(RandomizedRunner.java:746)
	at com.carrotsearch.randomizedtesting.RandomizedRunner$3.evaluate(RandomizedRunner.java:648)
	at com.carrotsearch.randomizedtesting.RandomizedRunner$4.evaluate(RandomizedRunner.java:682)
	at com.carrotsearch.randomizedtesting.RandomizedRunner$5.evaluate(RandomizedRunner.java:693)
	at org.apache.lucene.util.AbstractBeforeAfterRule$1.evaluate(AbstractBeforeAfterRule.java:45)
	at org.apache.lucene.util.TestRuleStoreClassName$1.evaluate(TestRuleStoreClassName.java:42)
	at com.carrotsearch.randomizedtesting.rules.SystemPropertiesInvariantRule$1.evaluate(SystemPropertiesInvariantRule.java:55)
	at com.carrotsearch.randomizedtesting.rules.NoShadowingOrOverridesOnMethodsRule$1.evaluate(NoShadowingOrOverridesOnMethodsRule.java:39)
	at com.carrotsearch.randomizedtesting.rules.NoShadowingOrOverridesOnMethodsRule$1.evaluate(NoShadowingOrOverridesOnMethodsRule.java:39)
	at com.carrotsearch.randomizedtesting.rules.StatementAdapter.evaluate(StatementAdapter.java:36)
	at org.apache.lucene.util.TestRuleAssertionsRequired$1.evaluate(TestRuleAssertionsRequired.java:43)
	at org.apache.lucene.util.TestRuleMarkFailure$1.evaluate(TestRuleMarkFailure.java:48)
	at org.apache.lucene.util.TestRuleIgnoreAfterMaxFailures$1.evaluate(TestRuleIgnoreAfterMaxFailures.java:70)
	at org.apache.lucene.util.TestRuleIgnoreTestSuites$1.evaluate(TestRuleIgnoreTestSuites.java:55)
	at com.carrotsearch.randomizedtesting.rules.StatementAdapter.evaluate(StatementAdapter.java:36)
	at com.carrotsearch.randomizedtesting.ThreadLeakControl$StatementRunner.run(ThreadLeakControl.java:358)
	at java.lang.Thread.run(Thread.java:722)
Caused by: java.util.concurrent.ExecutionException: java.lang.IllegalStateException: This
Random was created for/by another thread (Thread[TEST-TestFilteredQuery.testBooleanSHOULD-seed#[296C76A0A3CD476E],5,TGRP-TestFilteredQuery]).
Random instances must not be shared (acquire per-thread). Current thread: Thread[LuceneTestCase-111-thread-2,5,TGRP-TestFilteredQuery]
	at java.util.concurrent.FutureTask.report(FutureTask.java:122)
	at java.util.concurrent.FutureTask.get(FutureTask.java:188)
	at org.apache.lucene.search.IndexSearcher$ExecutionHelper.next(IndexSearcher.java:816)
	... 41 more
Caused by: java.lang.IllegalStateException: This Random was created for/by another thread
(Thread[TEST-TestFilteredQuery.testBooleanSHOULD-seed#[296C76A0A3CD476E],5,TGRP-TestFilteredQuery]).
Random instances must not be shared (acquire per-thread). Current thread: Thread[LuceneTestCase-111-thread-2,5,TGRP-TestFilteredQuery]
	at com.carrotsearch.randomizedtesting.AssertingRandom.checkValid(AssertingRandom.java:139)
	at com.carrotsearch.randomizedtesting.AssertingRandom.nextBoolean(AssertingRandom.java:43)
	at org.apache.lucene.util._TestUtil$3.useRandomAccess(_TestUtil.java:994)
	at org.apache.lucene.search.FilteredQuery$RandomAccessFilterStrategy.filteredScorer(FilteredQuery.java:515)
	at org.apache.lucene.search.FilteredQuery$1.scorer(FilteredQuery.java:133)
	at org.apache.lucene.search.BooleanQuery$BooleanWeight.scorer(BooleanQuery.java:322)
	at org.apache.lucene.search.AssertingIndexSearcher$1.scorer(AssertingIndexSearcher.java:80)
	at org.apache.lucene.search.IndexSearcher.search(IndexSearcher.java:572)
	at org.apache.lucene.search.IndexSearcher.search(IndexSearcher.java:453)
	at org.apache.lucene.search.IndexSearcher$SearcherCallableNoSort.call(IndexSearcher.java:675)
	at org.apache.lucene.search.IndexSearcher$SearcherCallableNoSort.call(IndexSearcher.java:653)
	at java.util.concurrent.FutureTask.run(FutureTask.java:262)
	at java.util.concurrent.Executors$RunnableAdapter.call(Executors.java:471)
	at java.util.concurrent.FutureTask.run(FutureTask.java:262)
	at java.util.concurrent.ThreadPoolExecutor.runWorker(ThreadPoolExecutor.java:1110)
	at java.util.concurrent.ThreadPoolExecutor$Worker.run(ThreadPoolExecutor.java:603)
	... 1 more
Caused by: com.carrotsearch.randomizedtesting.StackTraceHolder: Original allocation stack
for this Random (allocated by Thread[TEST-TestFilteredQuery.testBooleanSHOULD-seed#[296C76A0A3CD476E],5,TGRP-TestFilteredQuery])
	at java.lang.Thread.getStackTrace(Thread.java:1570)
	at com.carrotsearch.randomizedtesting.AssertingRandom.<init>(AssertingRandom.java:33)
	at com.carrotsearch.randomizedtesting.Randomness.<init>(Randomness.java:22)
	at com.carrotsearch.randomizedtesting.Randomness.<init>(Randomness.java:26)
	at com.carrotsearch.randomizedtesting.RandomizedRunner$3.evaluate(RandomizedRunner.java:647)
	at com.carrotsearch.randomizedtesting.RandomizedRunner$4.evaluate(RandomizedRunner.java:682)
	at com.carrotsearch.randomizedtesting.RandomizedRunner$5.evaluate(RandomizedRunner.java:693)
	at org.apache.lucene.util.AbstractBeforeAfterRule$1.evaluate(AbstractBeforeAfterRule.java:45)
	at org.apache.lucene.util.TestRuleStoreClassName$1.evaluate(TestRuleStoreClassName.java:42)
	at com.carrotsearch.randomizedtesting.rules.SystemPropertiesInvariantRule$1.evaluate(SystemPropertiesInvariantRule.java:55)
	at com.carrotsearch.randomizedtesting.rules.NoShadowingOrOverridesOnMethodsRule$1.evaluate(NoShadowingOrOverridesOnMethodsRule.java:39)
	at com.carrotsearch.randomizedtesting.rules.NoShadowingOrOverridesOnMethodsRule$1.evaluate(NoShadowingOrOverridesOnMethodsRule.java:39)
	at com.carrotsearch.randomizedtesting.rules.StatementAdapter.evaluate(StatementAdapter.java:36)
	at org.apache.lucene.util.TestRuleAssertionsRequired$1.evaluate(TestRuleAssertionsRequired.java:43)
	at org.apache.lucene.util.TestRuleMarkFailure$1.evaluate(TestRuleMarkFailure.java:48)
	at org.apache.lucene.util.TestRuleIgnoreAfterMaxFailures$1.evaluate(TestRuleIgnoreAfterMaxFailures.java:70)
	at org.apache.lucene.util.TestRuleIgnoreTestSuites$1.evaluate(TestRuleIgnoreTestSuites.java:55)
	at com.carrotsearch.randomizedtesting.rules.StatementAdapter.evaluate(StatementAdapter.java:36)
	at com.carrotsearch.randomizedtesting.ThreadLeakControl$StatementRunner.run(ThreadLeakControl.java:358)
	... 1 more




Build Log:
[...truncated 159 lines...]
[junit4:junit4] Suite: org.apache.lucene.search.TestFilteredQuery
[junit4:junit4]   2> NOTE: reproduce with: ant test  -Dtestcase=TestFilteredQuery -Dtests.method=testBooleanSHOULD
-Dtests.seed=296C76A0A3CD476E -Dtests.multiplier=3 -Dtests.slow=true -Dtests.locale=mt -Dtests.timezone=Canada/Central
-Dtests.file.encoding=US-ASCII
[junit4:junit4] ERROR   0.16s J0 | TestFilteredQuery.testBooleanSHOULD <<<
[junit4:junit4]    > Throwable #1: java.lang.RuntimeException: java.util.concurrent.ExecutionException:
java.lang.IllegalStateException: This Random was created for/by another thread (Thread[TEST-TestFilteredQuery.testBooleanSHOULD-seed#[296C76A0A3CD476E],5,TGRP-TestFilteredQuery]).
Random instances must not be shared (acquire per-thread). Current thread: Thread[LuceneTestCase-111-thread-2,5,TGRP-TestFilteredQuery]
[junit4:junit4]    > 	at __randomizedtesting.SeedInfo.seed([296C76A0A3CD476E:EF01D98E4AC693AF]:0)
[junit4:junit4]    > 	at org.apache.lucene.search.IndexSearcher$ExecutionHelper.next(IndexSearcher.java:820)
[junit4:junit4]    > 	at org.apache.lucene.search.IndexSearcher.search(IndexSearcher.java:423)
[junit4:junit4]    > 	at org.apache.lucene.search.IndexSearcher.search(IndexSearcher.java:261)
[junit4:junit4]    > 	at org.apache.lucene.search.TestFilteredQuery.tBooleanSHOULD(TestFilteredQuery.java:256)
[junit4:junit4]    > 	at org.apache.lucene.search.TestFilteredQuery.testBooleanSHOULD(TestFilteredQuery.java:247)
[junit4:junit4]    > 	at sun.reflect.NativeMethodAccessorImpl.invoke0(Native Method)
[junit4:junit4]    > 	at sun.reflect.NativeMethodAccessorImpl.invoke(NativeMethodAccessorImpl.java:57)
[junit4:junit4]    > 	at sun.reflect.DelegatingMethodAccessorImpl.invoke(DelegatingMethodAccessorImpl.java:43)
[junit4:junit4]    > 	at java.lang.reflect.Method.invoke(Method.java:474)
[junit4:junit4]    > 	at com.carrotsearch.randomizedtesting.RandomizedRunner.invoke(RandomizedRunner.java:1559)
[junit4:junit4]    > 	at com.carrotsearch.randomizedtesting.RandomizedRunner.access$600(RandomizedRunner.java:79)
[junit4:junit4]    > 	at com.carrotsearch.randomizedtesting.RandomizedRunner$6.evaluate(RandomizedRunner.java:737)
[junit4:junit4]    > 	at com.carrotsearch.randomizedtesting.RandomizedRunner$7.evaluate(RandomizedRunner.java:773)
[junit4:junit4]    > 	at com.carrotsearch.randomizedtesting.RandomizedRunner$8.evaluate(RandomizedRunner.java:787)
[junit4:junit4]    > 	at org.apache.lucene.util.TestRuleSetupTeardownChained$1.evaluate(TestRuleSetupTeardownChained.java:50)
[junit4:junit4]    > 	at org.apache.lucene.util.TestRuleFieldCacheSanity$1.evaluate(TestRuleFieldCacheSanity.java:51)
[junit4:junit4]    > 	at org.apache.lucene.util.AbstractBeforeAfterRule$1.evaluate(AbstractBeforeAfterRule.java:45)
[junit4:junit4]    > 	at com.carrotsearch.randomizedtesting.rules.SystemPropertiesInvariantRule$1.evaluate(SystemPropertiesInvariantRule.java:55)
[junit4:junit4]    > 	at org.apache.lucene.util.TestRuleThreadAndTestName$1.evaluate(TestRuleThreadAndTestName.java:48)
[junit4:junit4]    > 	at org.apache.lucene.util.TestRuleIgnoreAfterMaxFailures$1.evaluate(TestRuleIgnoreAfterMaxFailures.java:70)
[junit4:junit4]    > 	at org.apache.lucene.util.TestRuleMarkFailure$1.evaluate(TestRuleMarkFailure.java:48)
[junit4:junit4]    > 	at com.carrotsearch.randomizedtesting.rules.StatementAdapter.evaluate(StatementAdapter.java:36)
[junit4:junit4]    > 	at com.carrotsearch.randomizedtesting.ThreadLeakControl$StatementRunner.run(ThreadLeakControl.java:358)
[junit4:junit4]    > 	at com.carrotsearch.randomizedtesting.ThreadLeakControl.forkTimeoutingTask(ThreadLeakControl.java:782)
[junit4:junit4]    > 	at com.carrotsearch.randomizedtesting.ThreadLeakControl$3.evaluate(ThreadLeakControl.java:442)
[junit4:junit4]    > 	at com.carrotsearch.randomizedtesting.RandomizedRunner.runSingleTest(RandomizedRunner.java:746)
[junit4:junit4]    > 	at com.carrotsearch.randomizedtesting.RandomizedRunner$3.evaluate(RandomizedRunner.java:648)
[junit4:junit4]    > 	at com.carrotsearch.randomizedtesting.RandomizedRunner$4.evaluate(RandomizedRunner.java:682)
[junit4:junit4]    > 	at com.carrotsearch.randomizedtesting.RandomizedRunner$5.evaluate(RandomizedRunner.java:693)
[junit4:junit4]    > 	at org.apache.lucene.util.AbstractBeforeAfterRule$1.evaluate(AbstractBeforeAfterRule.java:45)
[junit4:junit4]    > 	at org.apache.lucene.util.TestRuleStoreClassName$1.evaluate(TestRuleStoreClassName.java:42)
[junit4:junit4]    > 	at com.carrotsearch.randomizedtesting.rules.SystemPropertiesInvariantRule$1.evaluate(SystemPropertiesInvariantRule.java:55)
[junit4:junit4]    > 	at com.carrotsearch.randomizedtesting.rules.NoShadowingOrOverridesOnMethodsRule$1.evaluate(NoShadowingOrOverridesOnMethodsRule.java:39)
[junit4:junit4]    > 	at com.carrotsearch.randomizedtesting.rules.NoShadowingOrOverridesOnMethodsRule$1.evaluate(NoShadowingOrOverridesOnMethodsRule.java:39)
[junit4:junit4]    > 	at com.carrotsearch.randomizedtesting.rules.StatementAdapter.evaluate(StatementAdapter.java:36)
[junit4:junit4]    > 	at org.apache.lucene.util.TestRuleAssertionsRequired$1.evaluate(TestRuleAssertionsRequired.java:43)
[junit4:junit4]    > 	at org.apache.lucene.util.TestRuleMarkFailure$1.evaluate(TestRuleMarkFailure.java:48)
[junit4:junit4]    > 	at org.apache.lucene.util.TestRuleIgnoreAfterMaxFailures$1.evaluate(TestRuleIgnoreAfterMaxFailures.java:70)
[junit4:junit4]    > 	at org.apache.lucene.util.TestRuleIgnoreTestSuites$1.evaluate(TestRuleIgnoreTestSuites.java:55)
[junit4:junit4]    > 	at com.carrotsearch.randomizedtesting.rules.StatementAdapter.evaluate(StatementAdapter.java:36)
[junit4:junit4]    > 	at com.carrotsearch.randomizedtesting.ThreadLeakControl$StatementRunner.run(ThreadLeakControl.java:358)
[junit4:junit4]    > 	at java.lang.Thread.run(Thread.java:722)
[junit4:junit4]    > Caused by: java.util.concurrent.ExecutionException: java.lang.IllegalStateException:
This Random was created for/by another thread (Thread[TEST-TestFilteredQuery.testBooleanSHOULD-seed#[296C76A0A3CD476E],5,TGRP-TestFilteredQuery]).
Random instances must not be shared (acquire per-thread). Current thread: Thread[LuceneTestCase-111-thread-2,5,TGRP-TestFilteredQuery]
[junit4:junit4]    > 	at java.util.concurrent.FutureTask.report(FutureTask.java:122)
[junit4:junit4]    > 	at java.util.concurrent.FutureTask.get(FutureTask.java:188)
[junit4:junit4]    > 	at org.apache.lucene.search.IndexSearcher$ExecutionHelper.next(IndexSearcher.java:816)
[junit4:junit4]    > 	... 41 more
[junit4:junit4]    > Caused by: java.lang.IllegalStateException: This Random was created
for/by another thread (Thread[TEST-TestFilteredQuery.testBooleanSHOULD-seed#[296C76A0A3CD476E],5,TGRP-TestFilteredQuery]).
Random instances must not be shared (acquire per-thread). Current thread: Thread[LuceneTestCase-111-thread-2,5,TGRP-TestFilteredQuery]
[junit4:junit4]    > 	at com.carrotsearch.randomizedtesting.AssertingRandom.checkValid(AssertingRandom.java:139)
[junit4:junit4]    > 	at com.carrotsearch.randomizedtesting.AssertingRandom.nextBoolean(AssertingRandom.java:43)
[junit4:junit4]    > 	at org.apache.lucene.util._TestUtil$3.useRandomAccess(_TestUtil.java:994)
[junit4:junit4]    > 	at org.apache.lucene.search.FilteredQuery$RandomAccessFilterStrategy.filteredScorer(FilteredQuery.java:515)
[junit4:junit4]    > 	at org.apache.lucene.search.FilteredQuery$1.scorer(FilteredQuery.java:133)
[junit4:junit4]    > 	at org.apache.lucene.search.BooleanQuery$BooleanWeight.scorer(BooleanQuery.java:322)
[junit4:junit4]    > 	at org.apache.lucene.search.AssertingIndexSearcher$1.scorer(AssertingIndexSearcher.java:80)
[junit4:junit4]    > 	at org.apache.lucene.search.IndexSearcher.search(IndexSearcher.java:572)
[junit4:junit4]    > 	at org.apache.lucene.search.IndexSearcher.search(IndexSearcher.java:453)
[junit4:junit4]    > 	at org.apache.lucene.search.IndexSearcher$SearcherCallableNoSort.call(IndexSearcher.java:675)
[junit4:junit4]    > 	at org.apache.lucene.search.IndexSearcher$SearcherCallableNoSort.call(IndexSearcher.java:653)
[junit4:junit4]    > 	at java.util.concurrent.FutureTask.run(FutureTask.java:262)
[junit4:junit4]    > 	at java.util.concurrent.Executors$RunnableAdapter.call(Executors.java:471)
[junit4:junit4]    > 	at java.util.concurrent.FutureTask.run(FutureTask.java:262)
[junit4:junit4]    > 	at java.util.concurrent.ThreadPoolExecutor.runWorker(ThreadPoolExecutor.java:1110)
[junit4:junit4]    > 	at java.util.concurrent.ThreadPoolExecutor$Worker.run(ThreadPoolExecutor.java:603)
[junit4:junit4]    > 	... 1 more
[junit4:junit4]    > Caused by: com.carrotsearch.randomizedtesting.StackTraceHolder: Original
allocation stack for this Random (allocated by Thread[TEST-TestFilteredQuery.testBooleanSHOULD-seed#[296C76A0A3CD476E],5,TGRP-TestFilteredQuery])
[junit4:junit4]    > 	at java.lang.Thread.getStackTrace(Thread.java:1570)
[junit4:junit4]    > 	at com.carrotsearch.randomizedtesting.AssertingRandom.<init>(AssertingRandom.java:33)
[junit4:junit4]    > 	at com.carrotsearch.randomizedtesting.Randomness.<init>(Randomness.java:22)
[junit4:junit4]    > 	at com.carrotsearch.randomizedtesting.Randomness.<init>(Randomness.java:26)
[junit4:junit4]    > 	at com.carrotsearch.randomizedtesting.RandomizedRunner$3.evaluate(RandomizedRunner.java:647)
[junit4:junit4]    > 	at com.carrotsearch.randomizedtesting.RandomizedRunner$4.evaluate(RandomizedRunner.java:682)
[junit4:junit4]    > 	at com.carrotsearch.randomizedtesting.RandomizedRunner$5.evaluate(RandomizedRunner.java:693)
[junit4:junit4]    > 	at org.apache.lucene.util.AbstractBeforeAfterRule$1.evaluate(AbstractBeforeAfterRule.java:45)
[junit4:junit4]    > 	at org.apache.lucene.util.TestRuleStoreClassName$1.evaluate(TestRuleStoreClassName.java:42)
[junit4:junit4]    > 	at com.carrotsearch.randomizedtesting.rules.SystemPropertiesInvariantRule$1.evaluate(SystemPropertiesInvariantRule.java:55)
[junit4:junit4]    > 	at com.carrotsearch.randomizedtesting.rules.NoShadowingOrOverridesOnMethodsRule$1.evaluate(NoShadowingOrOverridesOnMethodsRule.java:39)
[junit4:junit4]    > 	at com.carrotsearch.randomizedtesting.rules.NoShadowingOrOverridesOnMethodsRule$1.evaluate(NoShadowingOrOverridesOnMethodsRule.java:39)
[junit4:junit4]    > 	at com.carrotsearch.randomizedtesting.rules.StatementAdapter.evaluate(StatementAdapter.java:36)
[junit4:junit4]    > 	at org.apache.lucene.util.TestRuleAssertionsRequired$1.evaluate(TestRuleAssertionsRequired.java:43)
[junit4:junit4]    > 	at org.apache.lucene.util.TestRuleMarkFailure$1.evaluate(TestRuleMarkFailure.java:48)
[junit4:junit4]    > 	at org.apache.lucene.util.TestRuleIgnoreAfterMaxFailures$1.evaluate(TestRuleIgnoreAfterMaxFailures.java:70)
[junit4:junit4]    > 	at org.apache.lucene.util.TestRuleIgnoreTestSuites$1.evaluate(TestRuleIgnoreTestSuites.java:55)
[junit4:junit4]    > 	at com.carrotsearch.randomizedtesting.rules.StatementAdapter.evaluate(StatementAdapter.java:36)
[junit4:junit4]    > 	at com.carrotsearch.randomizedtesting.ThreadLeakControl$StatementRunner.run(ThreadLeakControl.java:358)
[junit4:junit4]    > 	... 1 more
[junit4:junit4]   2> NOTE: test params are: codec=Lucene40: {field=PostingsFormat(name=MockRandom),
sorter=PostingsFormat(name=MockSep)}, sim=DefaultSimilarity, locale=mt, timezone=Canada/Central
[junit4:junit4]   2> NOTE: Linux 3.2.0-30-generic amd64/Oracle Corporation 1.8.0-ea (64-bit)/cpus=8,threads=1,free=26454256,total=138412032
[junit4:junit4]   2> NOTE: All tests run in this JVM: [TestNumericTokenStream, TestFieldValueFilter,
Nested, Nested, Nested, Nested, Nested, Nested, Nested, Nested, Nested, Nested, Nested, Nested,
Nested, Nested, Nested, Nested, Nested, Nested, Nested, Nested, Nested, TestPhraseQuery, TestConcurrentMergeScheduler,
TestIndexableField, TestCachingCollector, TestByteArrayDataInput, TestSizeBoundedForceMerge,
TestNGramPhraseQuery, TestRollingBuffer, TestFilterAtomicReader, TestDocValuesTypeCompatibility,
TestBackwardsCompatibility, TestConsistentFieldNumbers, TestFilteredQuery]
[junit4:junit4] Completed on J0 in 0.92s, 11 tests, 1 error <<< FAILURES!

[...truncated 879 lines...]
BUILD FAILED
/mnt/ssd/jenkins/workspace/Lucene-Solr-trunk-Linux/build.xml:32: The following error occurred
while executing this line:
/mnt/ssd/jenkins/workspace/Lucene-Solr-trunk-Linux/lucene/build.xml:49: The following error
occurred while executing this line:
/mnt/ssd/jenkins/workspace/Lucene-Solr-trunk-Linux/lucene/common-build.xml:1140: The following
error occurred while executing this line:
/mnt/ssd/jenkins/workspace/Lucene-Solr-trunk-Linux/lucene/common-build.xml:813: There were
test failures: 305 suites, 1763 tests, 1 error, 15 ignored (7 assumptions)

Total time: 5 minutes 56 seconds
Build step 'Invoke Ant' marked build as failure
Recording test results
Description set: Java: 64bit/jdk1.8.0-ea-b51 -XX:+UseG1GC
Email was triggered for: Failure
Sending email for trigger: Failure



Mime
View raw message