lucene-dev mailing list archives

Site index · List index
Message view « Date » · « Thread »
Top « Date » · « Thread »
From hudsonsevilt...@gmail.com
Subject Build failed in Jenkins: Lucene-Solr-40-ReleaseSmoke #2
Date Sat, 22 Sep 2012 14:19:21 GMT
See <http://sierranevada.servebeer.com/job/Lucene-Solr-40-ReleaseSmoke/2/>

------------------------------------------
[...truncated 50337 lines...]
     [exec] 
     [exec] <http://sierranevada.servebeer.com/job/Lucene-Solr-40-ReleaseSmoke/ws/lucene/build/fakeReleaseTmp/unpack/apache-solr-4.0/solr/build/docs/solr-solrj/org/apache/solr/common/cloud/package-summary.html>
     [exec]   no package description (missing package.html in src?)
     [exec]   missing: ClosableThread
     [exec]   missing: OnReconnect
     [exec]   missing: ZkClientConnectionStrategy.ConnectedListener
     [exec]   missing: ZkClientConnectionStrategy.DisconnectedListener
     [exec]   missing: HashPartitioner.Range
     [exec]   missing: Replica
     [exec]   missing: SolrZooKeeper
     [exec]   missing: ZkClientConnectionStrategy
     [exec]   missing: ZkClientConnectionStrategy.ZkUpdate
     [exec]   missing: ZkCmdExecutor
     [exec]   missing: ZkCoreNodeProps
     [exec]   missing: ZkStateReader
     [exec]   missing: ZooKeeperException
     [exec] 
     [exec] <http://sierranevada.servebeer.com/job/Lucene-Solr-40-ReleaseSmoke/ws/lucene/build/fakeReleaseTmp/unpack/apache-solr-4.0/solr/build/docs/solr-solrj/org/apache/solr/client/solrj/package-summary.html>
     [exec]   no package description (missing package.html in src?)
     [exec]   missing: ResponseParser
     [exec]   missing: SolrRequest
     [exec]   missing: SolrResponse
     [exec]   missing: SolrServer
     [exec]   missing: SolrQuery.ORDER
     [exec]   missing: SolrRequest.METHOD
     [exec] 
     [exec] <http://sierranevada.servebeer.com/job/Lucene-Solr-40-ReleaseSmoke/ws/lucene/build/fakeReleaseTmp/unpack/apache-solr-4.0/solr/build/docs/solr-solrj/org/apache/solr/client/solrj/request/package-summary.html>
     [exec]   no package description (missing package.html in src?)
     [exec]   missing: JavaBinUpdateRequestCodec.StreamingUpdateHandler
     [exec]   missing: AbstractUpdateRequest
     [exec]   missing: CoreAdminRequest.Create
     [exec]   missing: CoreAdminRequest.MergeIndexes
     [exec]   missing: CoreAdminRequest.Persist
     [exec]   missing: CoreAdminRequest.RequestRecovery
     [exec]   missing: CoreAdminRequest.RequestSyncShard
     [exec]   missing: CoreAdminRequest.Unload
     [exec]   missing: CoreAdminRequest.WaitForState
     [exec]   missing: LukeRequest
     [exec]   missing: QueryRequest
     [exec]   missing: SolrPing
     [exec]   missing: UpdateRequest
     [exec]   missing: UpdateRequestExt
     [exec]   missing: AbstractUpdateRequest.ACTION
     [exec] 
     [exec] <http://sierranevada.servebeer.com/job/Lucene-Solr-40-ReleaseSmoke/ws/lucene/build/fakeReleaseTmp/unpack/apache-solr-4.0/solr/build/docs/solr-solrj/org/apache/solr/client/solrj/util/package-summary.html>
     [exec]   no package description (missing package.html in src?)
     [exec]   missing: ClientUtils
     [exec] 
     [exec] <http://sierranevada.servebeer.com/job/Lucene-Solr-40-ReleaseSmoke/ws/lucene/build/fakeReleaseTmp/unpack/apache-solr-4.0/solr/build/docs/solr-solrj/org/apache/solr/client/solrj/beans/package-summary.html>
     [exec]   no package description (missing package.html in src?)
     [exec]   missing: BindingException
     [exec]   missing: Field
     [exec] 
     [exec] <http://sierranevada.servebeer.com/job/Lucene-Solr-40-ReleaseSmoke/ws/lucene/build/fakeReleaseTmp/unpack/apache-solr-4.0/solr/build/docs/solr-solrj/org/apache/solr/client/solrj/response/package-summary.html>
     [exec]   no package description (missing package.html in src?)
     [exec]   missing: CoreAdminResponse
     [exec]   missing: FacetField.Count
     [exec]   missing: LukeResponse.FieldInfo
     [exec]   missing: LukeResponse.FieldTypeInfo
     [exec]   missing: PivotField
     [exec]   missing: QueryResponse
     [exec]   missing: RangeFacet.Count
     [exec]   missing: RangeFacet.Date
     [exec]   missing: RangeFacet.Numeric
     [exec]   missing: SolrPingResponse
     [exec]   missing: SolrResponseBase
     [exec]   missing: SpellCheckResponse.Suggestion
     [exec]   missing: TermsResponse.Term
     [exec] 
     [exec] <http://sierranevada.servebeer.com/job/Lucene-Solr-40-ReleaseSmoke/ws/lucene/build/fakeReleaseTmp/unpack/apache-solr-4.0/solr/build/docs/solr-solrj/org/apache/solr/client/solrj/impl/package-summary.html>
     [exec]   no package description (missing package.html in src?)
     [exec]   missing: BinaryResponseParser
     [exec]   missing: HttpSolrServer
     [exec]   missing: LBHttpSolrServer.Req
     [exec]   missing: LBHttpSolrServer.Rsp
     [exec]   missing: XMLResponseParser
     [exec]   missing: XMLResponseParser.KnownType
     [exec] 
     [exec] <http://sierranevada.servebeer.com/job/Lucene-Solr-40-ReleaseSmoke/ws/lucene/build/fakeReleaseTmp/unpack/apache-solr-4.0/solr/build/docs/solr-solrj/org/apache/noggit/package-summary.html>
     [exec]   no package description (missing package.html in src?)
     [exec]   missing: CharArr
     [exec]   missing: CharUtil
     [exec]   missing: JSONParser
     [exec]   missing: JSONUtil
     [exec]   missing: JSONWriter
     [exec]   missing: ObjectBuilder
     [exec]   missing: JSONParser.ParseException
     [exec] 
     [exec] <http://sierranevada.servebeer.com/job/Lucene-Solr-40-ReleaseSmoke/ws/lucene/build/fakeReleaseTmp/unpack/apache-solr-4.0/solr/build/docs/solr-uima/overview-summary.html>
     [exec]   missing: org.apache.solr.uima.processor
     [exec]   missing: org.apache.solr.uima.processor.exception
     [exec] 
     [exec] <http://sierranevada.servebeer.com/job/Lucene-Solr-40-ReleaseSmoke/ws/lucene/build/fakeReleaseTmp/unpack/apache-solr-4.0/solr/build/docs/solr-uima/org/apache/solr/uima/processor/package-summary.html>
     [exec]   no package description (missing package.html in src?)
     [exec] 
     [exec] <http://sierranevada.servebeer.com/job/Lucene-Solr-40-ReleaseSmoke/ws/lucene/build/fakeReleaseTmp/unpack/apache-solr-4.0/solr/build/docs/solr-uima/org/apache/solr/uima/processor/exception/package-summary.html>
     [exec]   no package description (missing package.html in src?)
     [exec] 
     [exec] <http://sierranevada.servebeer.com/job/Lucene-Solr-40-ReleaseSmoke/ws/lucene/build/fakeReleaseTmp/unpack/apache-solr-4.0/solr/build/docs/solr-dataimporthandler/overview-summary.html>
     [exec]   missing: org.apache.solr.handler.dataimport
     [exec]   missing: org.apache.solr.handler.dataimport.config
     [exec] 
     [exec] <http://sierranevada.servebeer.com/job/Lucene-Solr-40-ReleaseSmoke/ws/lucene/build/fakeReleaseTmp/unpack/apache-solr-4.0/solr/build/docs/solr-dataimporthandler/org/apache/solr/handler/dataimport/package-summary.html>
     [exec]   no package description (missing package.html in src?)
     [exec]   missing: DIHPropertiesWriter
     [exec]   missing: DIHWriter
     [exec]   missing: CachePropertyUtil
     [exec]   missing: ConfigParseUtil
     [exec]   missing: DebugInfo
     [exec]   missing: DIHCacheSupport
     [exec]   missing: DIHWriterBase
     [exec]   missing: DocBuilder.Statistics
     [exec]   missing: EvaluatorBag.VariableWrapper
     [exec]   missing: RequestInfo
     [exec]   missing: SimplePropertiesWriter
     [exec]   missing: SortedMapBackedCache
     [exec]   missing: ZKPropertiesWriter
     [exec]   missing: DataImporter.Status
     [exec]   missing: DIHLogLevels
     [exec] 
     [exec] <http://sierranevada.servebeer.com/job/Lucene-Solr-40-ReleaseSmoke/ws/lucene/build/fakeReleaseTmp/unpack/apache-solr-4.0/solr/build/docs/solr-dataimporthandler/org/apache/solr/handler/dataimport/config/package-summary.html>
     [exec]   no package description (missing package.html in src?)
     [exec]   missing: ConfigNameConstants
     [exec]   missing: ConfigParseUtil
     [exec]   missing: Entity
     [exec]   missing: EntityField
     [exec]   missing: EntityField.Builder
     [exec]   missing: Field
     [exec]   missing: Field.Builder
     [exec]   missing: Script
     [exec] 
     [exec] <http://sierranevada.servebeer.com/job/Lucene-Solr-40-ReleaseSmoke/ws/lucene/build/fakeReleaseTmp/unpack/apache-solr-4.0/solr/build/docs/solr-cell/overview-summary.html>
     [exec]   missing: org.apache.solr.handler.extraction
     [exec] 
     [exec] <http://sierranevada.servebeer.com/job/Lucene-Solr-40-ReleaseSmoke/ws/lucene/build/fakeReleaseTmp/unpack/apache-solr-4.0/solr/build/docs/solr-cell/org/apache/solr/handler/extraction/package-summary.html>
     [exec]   no package description (missing package.html in src?)
     [exec]   missing: SolrContentHandlerFactory
     [exec] 
     [exec] <http://sierranevada.servebeer.com/job/Lucene-Solr-40-ReleaseSmoke/ws/lucene/build/fakeReleaseTmp/unpack/apache-solr-4.0/solr/build/docs/solr-test-framework/overview-summary.html>
     [exec]   missing: org.apache.solr
     [exec]   missing: org.apache.solr.analysis
     [exec]   missing: org.apache.solr.cloud
     [exec]   missing: org.apache.solr.core
     [exec]   missing: org.apache.solr.update.processor
     [exec]   missing: org.apache.solr.util
     [exec] 
     [exec] <http://sierranevada.servebeer.com/job/Lucene-Solr-40-ReleaseSmoke/ws/lucene/build/fakeReleaseTmp/unpack/apache-solr-4.0/solr/build/docs/solr-test-framework/org/apache/solr/package-summary.html>
     [exec]   no package description (missing package.html in src?)
     [exec]   missing: BaseDistributedSearchTestCase.RandDate
     [exec]   missing: BaseDistributedSearchTestCase.RandVal
     [exec]   missing: JSONTestUtil
     [exec]   missing: SolrJettyTestBase
     [exec]   missing: SolrTestCaseJ4.Doc
     [exec]   missing: SolrTestCaseJ4.Fld
     [exec]   missing: SolrTestCaseJ4.FVal
     [exec]   missing: SolrTestCaseJ4.IRange
     [exec]   missing: SolrTestCaseJ4.IVals
     [exec]   missing: SolrTestCaseJ4.SVal
     [exec]   missing: SolrTestCaseJ4.Vals
     [exec] 
     [exec] <http://sierranevada.servebeer.com/job/Lucene-Solr-40-ReleaseSmoke/ws/lucene/build/fakeReleaseTmp/unpack/apache-solr-4.0/solr/build/docs/solr-test-framework/org/apache/solr/util/package-summary.html>
     [exec]   no package description (missing package.html in src?)
     [exec]   missing: DOMUtilTestBase
     [exec]   missing: RevertDefaultThreadHandlerRule
     [exec] 
     [exec] <http://sierranevada.servebeer.com/job/Lucene-Solr-40-ReleaseSmoke/ws/lucene/build/fakeReleaseTmp/unpack/apache-solr-4.0/solr/build/docs/solr-test-framework/org/apache/solr/core/package-summary.html>
     [exec]   no package description (missing package.html in src?)
     [exec] 
     [exec] <http://sierranevada.servebeer.com/job/Lucene-Solr-40-ReleaseSmoke/ws/lucene/build/fakeReleaseTmp/unpack/apache-solr-4.0/solr/build/docs/solr-test-framework/org/apache/solr/update/processor/package-summary.html>
     [exec]   no package description (missing package.html in src?)
     [exec]   missing: BufferingRequestProcessor
     [exec] 
     [exec] <http://sierranevada.servebeer.com/job/Lucene-Solr-40-ReleaseSmoke/ws/lucene/build/fakeReleaseTmp/unpack/apache-solr-4.0/solr/build/docs/solr-test-framework/org/apache/solr/cloud/package-summary.html>
     [exec]   no package description (missing package.html in src?)
     [exec]   missing: AbstractDistribZkTestBase
     [exec]   missing: AbstractFullDistribZkTestBase.CloudJettyRunner
     [exec]   missing: ZkTestServer
     [exec]   missing: ZkTestServer.HostPort
     [exec] 
     [exec] <http://sierranevada.servebeer.com/job/Lucene-Solr-40-ReleaseSmoke/ws/lucene/build/fakeReleaseTmp/unpack/apache-solr-4.0/solr/build/docs/solr-test-framework/org/apache/solr/analysis/package-summary.html>
     [exec]   no package description (missing package.html in src?)
     [exec] 
     [exec] <http://sierranevada.servebeer.com/job/Lucene-Solr-40-ReleaseSmoke/ws/lucene/build/fakeReleaseTmp/unpack/apache-solr-4.0/solr/build/docs/solr-dataimporthandler-extras/overview-summary.html>
     [exec]   missing: org.apache.solr.handler.dataimport
     [exec] 
     [exec] <http://sierranevada.servebeer.com/job/Lucene-Solr-40-ReleaseSmoke/ws/lucene/build/fakeReleaseTmp/unpack/apache-solr-4.0/solr/build/docs/solr-dataimporthandler-extras/org/apache/solr/handler/dataimport/package-summary.html>
     [exec]   no package description (missing package.html in src?)
     [exec]   missing: MailEntityProcessor.CustomFilter
     [exec] 
     [exec] ***WARNING***: javadocs want to fail!
     [exec] 
     [exec] 
     [exec] Crawl/parse...
     [exec] 
     [exec] Verify...
     [exec]     test solr example w/ Java 6...
     [exec]       start Solr instance (log=<http://sierranevada.servebeer.com/job/Lucene-Solr-40-ReleaseSmoke/ws/lucene/build/fakeReleaseTmp/unpack/apache-solr-4.0/solr-example.log)...>
     [exec]       startup done
     [exec]       test utf8...
     [exec]       index example docs...
     [exec]       run query...
     [exec]       stop server (SIGINT)...
     [exec]     test solr example w/ Java 7...
     [exec]       start Solr instance (log=<http://sierranevada.servebeer.com/job/Lucene-Solr-40-ReleaseSmoke/ws/lucene/build/fakeReleaseTmp/unpack/apache-solr-4.0/solr-example.log)...>
     [exec]       startup done
     [exec]       test utf8...
     [exec]       index example docs...
     [exec]       run query...
     [exec]       stop server (SIGINT)...
     [exec]     check NOTICE
     [exec] Test Maven artifacts for Lucene and Solr...
     [exec]     get POM templates ...................................................
     [exec]     download artifacts ........................................................................................................................................................................................................................................................................................................................................................................................................................................................................................................................................................................
     [exec]     verify that each binary artifact has a deployed POM...
     [exec]     verify that there is an artifact for each POM template...
     [exec] Traceback (most recent call last):
     [exec]   File "/usr/lib/python3.2/xml/etree/ElementTree.py", line 1668, in feed
     [exec]     self._parser.Parse(data, 0)
     [exec] xml.parsers.expat.ExpatError: not well-formed (invalid token): line 1, column
8
     [exec] 
     [exec] During handling of the above exception, another exception occurred:
     [exec] 
     [exec] Traceback (most recent call last):
     [exec]   File "dev-tools/scripts/smokeTestRelease.py", line 1107, in <module>
     [exec]     main()
     [exec]   File "dev-tools/scripts/smokeTestRelease.py", line 1057, in main
     [exec]     smokeTest(baseURL, version, tmpDir, isSigned)
     [exec]   File "dev-tools/scripts/smokeTestRelease.py", line 1103, in smokeTest
     [exec]     checkMaven(baseURL, tmpDir, version, isSigned)
     [exec]   File "dev-tools/scripts/smokeTestRelease.py", line 688, in checkMaven
     [exec]     verifyArtifactPerPOMtemplate(POMtemplates, artifacts, tmpDir, version)
     [exec]   File "dev-tools/scripts/smokeTestRelease.py", line 985, in verifyArtifactPerPOMtemplate
     [exec]     treeRoot = ET.parse(POMtemplate).getroot()
     [exec]   File "/usr/lib/python3.2/xml/etree/ElementTree.py", line 1223, in parse
     [exec]     tree.parse(source, parser)
     [exec]   File "/usr/lib/python3.2/xml/etree/ElementTree.py", line 678, in parse
     [exec]     parser.feed(data)
     [exec]   File "/usr/lib/python3.2/xml/etree/ElementTree.py", line 1670, in feed
     [exec]     self._raiseerror(v)
     [exec]   File "/usr/lib/python3.2/xml/etree/ElementTree.py", line 1543, in _raiseerror
     [exec]     raise err
     [exec]   File "<string>", line None
     [exec] xml.etree.ElementTree.ParseError: not well-formed (invalid token): line 1, column
8

BUILD FAILED
<http://sierranevada.servebeer.com/job/Lucene-Solr-40-ReleaseSmoke/ws/build.xml>:279:
exec returned: 1

Total time: 21 minutes 57 seconds
Build step 'Invoke Ant' marked build as failure

---------------------------------------------------------------------
To unsubscribe, e-mail: dev-unsubscribe@lucene.apache.org
For additional commands, e-mail: dev-help@lucene.apache.org


Mime
View raw message