lucene-dev mailing list archives

Site index · List index
Message view « Date » · « Thread »
Top « Date » · « Thread »
From buil...@flonkings.com
Subject [JENKINS] Lucene-trunk-Linux-Java7-64-test-only - Build # 6691 - Failure!
Date Sun, 16 Sep 2012 19:40:44 GMT
Build: builds.flonkings.com/job/Lucene-trunk-Linux-Java7-64-test-only/6691/

1 tests failed.
REGRESSION:  org.apache.lucene.index.TestIndexWriterWithThreads.testOpenTwoIndexWritersOnDifferentThreads

Error Message:
Failed due to: org.apache.lucene.store.LockObtainFailedException: Lock obtain timed out: org.apache.lucene.store.MockLockFactoryWrapper$MockLock@66b2b3b9

Stack Trace:
java.lang.AssertionError: Failed due to: org.apache.lucene.store.LockObtainFailedException: Lock obtain timed out: org.apache.lucene.store.MockLockFactoryWrapper$MockLock@66b2b3b9
	at __randomizedtesting.SeedInfo.seed([172E3CAB05B08D19:1A9B21F3968653F8]:0)
	at org.junit.Assert.fail(Assert.java:93)
	at org.junit.Assert.assertTrue(Assert.java:43)
	at org.junit.Assert.assertFalse(Assert.java:68)
	at org.apache.lucene.index.TestIndexWriterWithThreads.testOpenTwoIndexWritersOnDifferentThreads(TestIndexWriterWithThreads.java:457)
	at sun.reflect.NativeMethodAccessorImpl.invoke0(Native Method)
	at sun.reflect.NativeMethodAccessorImpl.invoke(NativeMethodAccessorImpl.java:57)
	at sun.reflect.DelegatingMethodAccessorImpl.invoke(DelegatingMethodAccessorImpl.java:43)
	at java.lang.reflect.Method.invoke(Method.java:601)
	at com.carrotsearch.randomizedtesting.RandomizedRunner.invoke(RandomizedRunner.java:1559)
	at com.carrotsearch.randomizedtesting.RandomizedRunner.access$600(RandomizedRunner.java:79)
	at com.carrotsearch.randomizedtesting.RandomizedRunner$6.evaluate(RandomizedRunner.java:737)
	at com.carrotsearch.randomizedtesting.RandomizedRunner$7.evaluate(RandomizedRunner.java:773)
	at com.carrotsearch.randomizedtesting.RandomizedRunner$8.evaluate(RandomizedRunner.java:787)
	at org.apache.lucene.util.TestRuleSetupTeardownChained$1.evaluate(TestRuleSetupTeardownChained.java:50)
	at org.apache.lucene.util.TestRuleFieldCacheSanity$1.evaluate(TestRuleFieldCacheSanity.java:51)
	at org.apache.lucene.util.AbstractBeforeAfterRule$1.evaluate(AbstractBeforeAfterRule.java:45)
	at com.carrotsearch.randomizedtesting.rules.SystemPropertiesInvariantRule$1.evaluate(SystemPropertiesInvariantRule.java:55)
	at org.apache.lucene.util.TestRuleThreadAndTestName$1.evaluate(TestRuleThreadAndTestName.java:48)
	at org.apache.lucene.util.TestRuleIgnoreAfterMaxFailures$1.evaluate(TestRuleIgnoreAfterMaxFailures.java:70)
	at org.apache.lucene.util.TestRuleMarkFailure$1.evaluate(TestRuleMarkFailure.java:48)
	at com.carrotsearch.randomizedtesting.rules.StatementAdapter.evaluate(StatementAdapter.java:36)
	at com.carrotsearch.randomizedtesting.ThreadLeakControl$StatementRunner.run(ThreadLeakControl.java:358)
	at com.carrotsearch.randomizedtesting.ThreadLeakControl.forkTimeoutingTask(ThreadLeakControl.java:782)
	at com.carrotsearch.randomizedtesting.ThreadLeakControl$3.evaluate(ThreadLeakControl.java:442)
	at com.carrotsearch.randomizedtesting.RandomizedRunner.runSingleTest(RandomizedRunner.java:746)
	at com.carrotsearch.randomizedtesting.RandomizedRunner$3.evaluate(RandomizedRunner.java:648)
	at com.carrotsearch.randomizedtesting.RandomizedRunner$4.evaluate(RandomizedRunner.java:682)
	at com.carrotsearch.randomizedtesting.RandomizedRunner$5.evaluate(RandomizedRunner.java:693)
	at org.apache.lucene.util.AbstractBeforeAfterRule$1.evaluate(AbstractBeforeAfterRule.java:45)
	at org.apache.lucene.util.TestRuleStoreClassName$1.evaluate(TestRuleStoreClassName.java:42)
	at com.carrotsearch.randomizedtesting.rules.SystemPropertiesInvariantRule$1.evaluate(SystemPropertiesInvariantRule.java:55)
	at com.carrotsearch.randomizedtesting.rules.NoShadowingOrOverridesOnMethodsRule$1.evaluate(NoShadowingOrOverridesOnMethodsRule.java:39)
	at com.carrotsearch.randomizedtesting.rules.NoShadowingOrOverridesOnMethodsRule$1.evaluate(NoShadowingOrOverridesOnMethodsRule.java:39)
	at com.carrotsearch.randomizedtesting.rules.StatementAdapter.evaluate(StatementAdapter.java:36)
	at org.apache.lucene.util.TestRuleAssertionsRequired$1.evaluate(TestRuleAssertionsRequired.java:43)
	at org.apache.lucene.util.TestRuleMarkFailure$1.evaluate(TestRuleMarkFailure.java:48)
	at org.apache.lucene.util.TestRuleIgnoreAfterMaxFailures$1.evaluate(TestRuleIgnoreAfterMaxFailures.java:70)
	at org.apache.lucene.util.TestRuleIgnoreTestSuites$1.evaluate(TestRuleIgnoreTestSuites.java:55)
	at com.carrotsearch.randomizedtesting.rules.StatementAdapter.evaluate(StatementAdapter.java:36)
	at com.carrotsearch.randomizedtesting.ThreadLeakControl$StatementRunner.run(ThreadLeakControl.java:358)
	at java.lang.Thread.run(Thread.java:722)




Build Log:
[...truncated 15 lines...]
ERROR: Failed to update http://svn.apache.org/repos/asf/lucene/dev/nightly
org.tmatesoft.svn.core.SVNException: svn: Target path '/lucene/dev/nightly' does not exist
svn: REPORT of /repos/asf/!svn/vcc/default: 500 Internal Server Error (http://svn.apache.org)
	at org.tmatesoft.svn.core.internal.wc.SVNErrorManager.error(SVNErrorManager.java:64)
	at org.tmatesoft.svn.core.internal.wc.SVNErrorManager.error(SVNErrorManager.java:51)
	at org.tmatesoft.svn.core.internal.io.dav.DAVRepository.runReport(DAVRepository.java:1284)
	at org.tmatesoft.svn.core.internal.io.dav.DAVRepository.update(DAVRepository.java:830)
	at org.tmatesoft.svn.core.wc.SVNUpdateClient.update(SVNUpdateClient.java:564)
	at org.tmatesoft.svn.core.wc.SVNUpdateClient.doUpdate(SVNUpdateClient.java:401)
	at hudson.scm.subversion.UpdateUpdater$TaskImpl.perform(UpdateUpdater.java:136)
	at hudson.scm.subversion.WorkspaceUpdater$UpdateTask.delegateTo(WorkspaceUpdater.java:136)
	at hudson.scm.SubversionSCM$CheckOutTask.perform(SubversionSCM.java:788)
	at hudson.scm.SubversionSCM$CheckOutTask.invoke(SubversionSCM.java:769)
	at hudson.scm.SubversionSCM$CheckOutTask.invoke(SubversionSCM.java:753)
	at hudson.FilePath.act(FilePath.java:842)
	at hudson.FilePath.act(FilePath.java:824)
	at hudson.scm.SubversionSCM.checkout(SubversionSCM.java:743)
	at hudson.scm.SubversionSCM.checkout(SubversionSCM.java:685)
	at hudson.model.AbstractProject.checkout(AbstractProject.java:1249)
	at hudson.model.AbstractBuild$AbstractBuildExecution.defaultCheckout(AbstractBuild.java:589)
	at jenkins.scm.SCMCheckoutStrategy.checkout(SCMCheckoutStrategy.java:88)
	at hudson.model.AbstractBuild$AbstractBuildExecution.run(AbstractBuild.java:494)
	at hudson.model.Run.execute(Run.java:1488)
	at hudson.model.FreeStyleBuild.run(FreeStyleBuild.java:46)
	at hudson.model.ResourceController.execute(ResourceController.java:88)
	at hudson.model.Executor.run(Executor.java:236)
Caused by: org.tmatesoft.svn.core.SVNErrorMessage: svn: Target path '/lucene/dev/nightly' does not exist
	at org.tmatesoft.svn.core.SVNErrorMessage.create(SVNErrorMessage.java:200)
	at org.tmatesoft.svn.core.SVNErrorMessage.create(SVNErrorMessage.java:146)
	at org.tmatesoft.svn.core.SVNErrorMessage.create(SVNErrorMessage.java:89)
	at org.tmatesoft.svn.core.internal.io.dav.handlers.DAVErrorHandler.endElement(DAVErrorHandler.java:72)
	at org.tmatesoft.svn.core.internal.io.dav.handlers.BasicDAVHandler.endElement(BasicDAVHandler.java:99)
	at com.sun.org.apache.xerces.internal.parsers.AbstractSAXParser.endElement(AbstractSAXParser.java:606)
	at com.sun.org.apache.xerces.internal.impl.XMLDocumentFragmentScannerImpl.scanEndElement(XMLDocumentFragmentScannerImpl.java:1741)
	at com.sun.org.apache.xerces.internal.impl.XMLDocumentFragmentScannerImpl$FragmentContentDriver.next(XMLDocumentFragmentScannerImpl.java:2898)
	at com.sun.org.apache.xerces.internal.impl.XMLDocumentScannerImpl.next(XMLDocumentScannerImpl.java:607)
	at com.sun.org.apache.xerces.internal.impl.XMLNSDocumentScannerImpl.next(XMLNSDocumentScannerImpl.java:116)
	at com.sun.org.apache.xerces.internal.impl.XMLDocumentFragmentScannerImpl.scanDocument(XMLDocumentFragmentScannerImpl.java:488)
	at com.sun.org.apache.xerces.internal.parsers.XML11Configuration.parse(XML11Configuration.java:835)
	at com.sun.org.apache.xerces.internal.parsers.XML11Configuration.parse(XML11Configuration.java:764)
	at com.sun.org.apache.xerces.internal.parsers.XMLParser.parse(XMLParser.java:123)
	at com.sun.org.apache.xerces.internal.parsers.AbstractSAXParser.parse(AbstractSAXParser.java:1210)
	at com.sun.org.apache.xerces.internal.jaxp.SAXParserImpl$JAXPSAXParser.parse(SAXParserImpl.java:568)
	at org.tmatesoft.svn.core.internal.io.dav.http.HTTPConnection.readData(HTTPConnection.java:776)
	at org.tmatesoft.svn.core.internal.io.dav.http.HTTPConnection.readData(HTTPConnection.java:741)
	at org.tmatesoft.svn.core.internal.io.dav.http.HTTPConnection.readError(HTTPConnection.java:222)
	at org.tmatesoft.svn.core.internal.io.dav.http.HTTPRequest.readError(HTTPRequest.java:290)
	at org.tmatesoft.svn.core.internal.io.dav.http.HTTPRequest.dispatch(HTTPRequest.java:213)
	at org.tmatesoft.svn.core.internal.io.dav.http.HTTPConnection._request(HTTPConnection.java:379)
	at org.tmatesoft.svn.core.internal.io.dav.http.HTTPConnection.request(HTTPConnection.java:292)
	at org.tmatesoft.svn.core.internal.io.dav.http.HTTPConnection.request(HTTPConnection.java:283)
	at org.tmatesoft.svn.core.internal.io.dav.http.HTTPConnection.request(HTTPConnection.java:271)
	at org.tmatesoft.svn.core.internal.io.dav.DAVConnection.doReport(DAVConnection.java:283)
	at org.tmatesoft.svn.core.internal.io.dav.DAVRepository.runReport(DAVRepository.java:1282)
	... 20 more
Caused by: org.tmatesoft.svn.core.SVNErrorMessage: svn: REPORT of /repos/asf/!svn/vcc/default: 500 Internal Server Error (http://svn.apache.org)
	at org.tmatesoft.svn.core.SVNErrorMessage.create(SVNErrorMessage.java:200)
	at org.tmatesoft.svn.core.SVNErrorMessage.create(SVNErrorMessage.java:181)
	at org.tmatesoft.svn.core.SVNErrorMessage.create(SVNErrorMessage.java:133)
	at org.tmatesoft.svn.core.internal.io.dav.http.HTTPRequest.createDefaultErrorMessage(HTTPRequest.java:444)
	at org.tmatesoft.svn.core.internal.io.dav.http.HTTPRequest.readError(HTTPRequest.java:288)
	... 27 more
no change for http://svn.apache.org/repos/asf/lucene/dev/trunk since the previous build
no change for http://svn.apache.org/repos/asf/lucene/dev/nightly since the previous build
No emails were triggered.
[EnvInject] - Executing scripts and injecting environment variables after the SCM step.
[EnvInject] - Injecting as environment variables the properties content 
NO_JAVADOCS=yes
TEST_JVM_ARGS=-XX:+UseG1GC

[EnvInject] - Variables injected successfully.
[lucene] $ /var/lib/jenkins/tools/Ant/Ant_1.8.3/bin/ant -file build.xml -Dtests.jvms=8 clean-jars clean test-core
Buildfile: /var/lib/jenkins/workspace/Lucene-trunk-Linux-Java7-64-test-only/checkout/lucene/build.xml

clean-jars:

clean:

test-core:

ivy-availability-check:

ivy-fail:

ivy-configure:
[ivy:configure] :: Ivy 2.2.0 - 20100923230623 :: http://ant.apache.org/ivy/ ::
[ivy:configure] :: loading settings :: file = /var/lib/jenkins/workspace/Lucene-trunk-Linux-Java7-64-test-only/checkout/lucene/ivy-settings.xml

resolve:

init:

-clover.disable:

-clover.setup:

clover:

compile-core:
    [mkdir] Created dir: /var/lib/jenkins/workspace/Lucene-trunk-Linux-Java7-64-test-only/checkout/lucene/build/core/classes/java
    [javac] Compiling 604 source files to /var/lib/jenkins/workspace/Lucene-trunk-Linux-Java7-64-test-only/checkout/lucene/build/core/classes/java
     [copy] Copying 2 files to /var/lib/jenkins/workspace/Lucene-trunk-Linux-Java7-64-test-only/checkout/lucene/build/core/classes/java

compile-test-framework:

ivy-availability-check:

ivy-fail:

ivy-configure:
[ivy:configure] :: loading settings :: file = /var/lib/jenkins/workspace/Lucene-trunk-Linux-Java7-64-test-only/checkout/lucene/ivy-settings.xml

resolve:

init:

compile-lucene-core:

ivy-availability-check:

ivy-fail:

ivy-configure:
[ivy:configure] :: loading settings :: file = /var/lib/jenkins/workspace/Lucene-trunk-Linux-Java7-64-test-only/checkout/lucene/ivy-settings.xml

resolve:

init:

-clover.disable:

-clover.setup:

clover:

compile-core:

compile-codecs:
     [echo] Building codecs...

ivy-availability-check:

ivy-fail:

ivy-configure:
[ivy:configure] :: loading settings :: file = /var/lib/jenkins/workspace/Lucene-trunk-Linux-Java7-64-test-only/checkout/lucene/ivy-settings.xml

resolve:

common.init:

compile-lucene-core:

init:

-clover.disable:

-clover.setup:

clover:

compile-core:
    [mkdir] Created dir: /var/lib/jenkins/workspace/Lucene-trunk-Linux-Java7-64-test-only/checkout/lucene/build/codecs/classes/java
    [javac] Compiling 66 source files to /var/lib/jenkins/workspace/Lucene-trunk-Linux-Java7-64-test-only/checkout/lucene/build/codecs/classes/java
     [copy] Copying 2 files to /var/lib/jenkins/workspace/Lucene-trunk-Linux-Java7-64-test-only/checkout/lucene/build/codecs/classes/java

compile-core:
    [mkdir] Created dir: /var/lib/jenkins/workspace/Lucene-trunk-Linux-Java7-64-test-only/checkout/lucene/build/test-framework/classes/java
    [javac] Compiling 88 source files to /var/lib/jenkins/workspace/Lucene-trunk-Linux-Java7-64-test-only/checkout/lucene/build/test-framework/classes/java
     [copy] Copying 3 files to /var/lib/jenkins/workspace/Lucene-trunk-Linux-Java7-64-test-only/checkout/lucene/build/test-framework/classes/java

compile-test:
    [mkdir] Created dir: /var/lib/jenkins/workspace/Lucene-trunk-Linux-Java7-64-test-only/checkout/lucene/build/core/classes/test
    [javac] Compiling 320 source files to /var/lib/jenkins/workspace/Lucene-trunk-Linux-Java7-64-test-only/checkout/lucene/build/core/classes/test
    [javac] Note: Some input files use or override a deprecated API.
    [javac] Note: Recompile with -Xlint:deprecation for details.
     [copy] Copying 29 files to /var/lib/jenkins/workspace/Lucene-trunk-Linux-Java7-64-test-only/checkout/lucene/build/core/classes/test

install-junit4-taskdef:

validate:

test:
    [mkdir] Created dir: /var/lib/jenkins/workspace/Lucene-trunk-Linux-Java7-64-test-only/checkout/lucene/build/core/test
[junit4:junit4] <JUnit4> says aloha! Master seed: 172E3CAB05B08D19
[junit4:junit4] Executing 307 suites with 8 JVMs.
[junit4:junit4] 
[junit4:junit4] Suite: org.apache.lucene.index.TestNoMergePolicy
[junit4:junit4] Completed on J3 in 1.28s, 4 tests
[junit4:junit4] 
[junit4:junit4] Suite: org.apache.lucene.util.TestSortedVIntList
[junit4:junit4] Completed on J2 in 1.86s, 19 tests
[junit4:junit4] 
[junit4:junit4] Suite: org.apache.lucene.index.TestPrefixCodedTerms
[junit4:junit4] Completed on J0 in 3.40s, 6 tests
[junit4:junit4] 
[junit4:junit4] Suite: org.apache.lucene.util.automaton.TestSpecialOperations
[junit4:junit4] Completed on J5 in 3.26s, 1 test
[junit4:junit4] 
[junit4:junit4] Suite: org.apache.lucene.util.TestNamedSPILoader
[junit4:junit4] Completed on J0 in 0.50s, 3 tests
[junit4:junit4] 
[junit4:junit4] Suite: org.apache.lucene.index.TestIndexWriterOnJRECrash
[junit4:junit4] IGNOR/A 0.33s J5 | TestIndexWriterOnJRECrash.testNRTThreads
[junit4:junit4]    > Assumption #1: 'nightly' test group is disabled (@Nightly)
[junit4:junit4] Completed on J5 in 0.62s, 1 test, 1 skipped
[junit4:junit4] 
[junit4:junit4] Suite: org.apache.lucene.index.TestSizeBoundedForceMerge
[junit4:junit4] Completed on J2 in 2.74s, 11 tests
[junit4:junit4] 
[junit4:junit4] Suite: org.apache.lucene.util.junitcompat.TestReproduceMessage
[junit4:junit4] Completed on J7 in 5.69s, 21 tests
[junit4:junit4] 
[junit4:junit4] Suite: org.apache.lucene.util.automaton.TestBasicOperations
[junit4:junit4] Completed on J1 in 5.36s, 8 tests
[junit4:junit4] 
[junit4:junit4] Suite: org.apache.lucene.index.TestNeverDelete
[junit4:junit4] Completed on J0 in 3.09s, 1 test
[junit4:junit4] 
[junit4:junit4] Suite: org.apache.lucene.util.automaton.TestLevenshteinAutomata
[junit4:junit4] Completed on J6 in 7.12s, 4 tests
[junit4:junit4] 
[junit4:junit4] Suite: org.apache.lucene.index.TestOmitTf
[junit4:junit4] Completed on J4 in 7.19s, 6 tests
[junit4:junit4] 
[junit4:junit4] Suite: org.apache.lucene.search.TestCachingCollector
[junit4:junit4] Completed on J0 in 0.34s, 5 tests
[junit4:junit4] 
[junit4:junit4] Suite: org.apache.lucene.index.TestPayloads
[junit4:junit4] Completed on J5 in 3.26s, 7 tests
[junit4:junit4] 
[junit4:junit4] Suite: org.apache.lucene.search.TestPrefixRandom
[junit4:junit4] Completed on J3 in 6.69s, 1 test
[junit4:junit4] 
[junit4:junit4] Suite: org.apache.lucene.search.similarities.TestSimilarity2
[junit4:junit4] Completed on J0 in 1.49s, 7 tests
[junit4:junit4] 
[junit4:junit4] Suite: org.apache.lucene.analysis.tokenattributes.TestCharTermAttributeImpl
[junit4:junit4] Completed on J3 in 2.41s, 12 tests
[junit4:junit4] 
[junit4:junit4] Suite: org.apache.lucene.util.TestFixedBitSet
[junit4:junit4] Completed on J2 in 5.65s, 5 tests
[junit4:junit4] 
[junit4:junit4] Suite: org.apache.lucene.index.Test2BPostings
[junit4:junit4] IGNOR/A 0.25s J3 | Test2BPostings.test
[junit4:junit4]    > Assumption #1: 'nightly' test group is disabled (@Nightly)
[junit4:junit4] Completed on J3 in 0.31s, 1 test, 1 skipped
[junit4:junit4] 
[junit4:junit4] Suite: org.apache.lucene.analysis.tokenattributes.TestSimpleAttributeImpl
[junit4:junit4] Completed on J3 in 0.18s, 1 test
[junit4:junit4] 
[junit4:junit4] Suite: org.apache.lucene.index.TestIndexableField
[junit4:junit4] Completed on J1 in 5.51s, 1 test
[junit4:junit4] 
[junit4:junit4] Suite: org.apache.lucene.index.TestMultiFields
[junit4:junit4] Completed on J5 in 4.15s, 3 tests
[junit4:junit4] 
[junit4:junit4] Suite: org.apache.lucene.index.TestSumDocFreq
[junit4:junit4] Completed on J1 in 1.62s, 1 test
[junit4:junit4] 
[junit4:junit4] Suite: org.apache.lucene.index.TestForceMergeForever
[junit4:junit4] Completed on J6 in 5.39s, 1 test
[junit4:junit4] 
[junit4:junit4] Suite: org.apache.lucene.index.TestNoDeletionPolicy
[junit4:junit4] Completed on J3 in 1.93s, 4 tests
[junit4:junit4] 
[junit4:junit4] Suite: org.apache.lucene.index.TestReaderClosed
[junit4:junit4] Completed on J1 in 0.29s, 2 tests
[junit4:junit4] 
[junit4:junit4] Suite: org.apache.lucene.search.TestPositionIncrement
[junit4:junit4] Completed on J3 in 0.39s, 2 tests
[junit4:junit4] 
[junit4:junit4] Suite: org.apache.lucene.search.TestDisjunctionMaxQuery
[junit4:junit4] Completed on J2 in 5.74s, 10 tests
[junit4:junit4] 
[junit4:junit4] Suite: org.apache.lucene.index.TestFlushByRamOrCountsPolicy
[junit4:junit4] Completed on J7 in 15.54s, 5 tests
[junit4:junit4] 
[junit4:junit4] Suite: org.apache.lucene.search.TestSearchWithThreads
[junit4:junit4] Completed on J1 in 8.32s, 1 test
[junit4:junit4] 
[junit4:junit4] Suite: org.apache.lucene.search.TestMultiThreadTermVectors
[junit4:junit4] Completed on J1 in 2.88s, 1 test
[junit4:junit4] 
[junit4:junit4] Suite: org.apache.lucene.index.TestStressIndexing
[junit4:junit4] Completed on J7 in 3.42s, 1 test
[junit4:junit4] 
[junit4:junit4] Suite: org.apache.lucene.index.TestParallelTermEnum
[junit4:junit4] Completed on J7 in 0.99s, 1 test
[junit4:junit4] 
[junit4:junit4] Suite: org.apache.lucene.index.TestTypePromotion
[junit4:junit4] Completed on J6 in 15.10s, 5 tests
[junit4:junit4] 
[junit4:junit4] Suite: org.apache.lucene.index.TestTermdocPerf
[junit4:junit4] Completed on J6 in 0.20s, 1 test
[junit4:junit4] 
[junit4:junit4] Suite: org.apache.lucene.search.TestRegexpRandom
[junit4:junit4] Completed on J6 in 2.47s, 1 test
[junit4:junit4] 
[junit4:junit4] Suite: org.apache.lucene.index.TestPostingsOffsets
[junit4:junit4] Completed on J1 in 6.72s, 11 tests
[junit4:junit4] 
[junit4:junit4] Suite: org.apache.lucene.search.TestMultiTermQueryRewrites
[junit4:junit4] Completed on J6 in 0.52s, 3 tests
[junit4:junit4] 
[junit4:junit4] Suite: org.apache.lucene.search.TestScoreCachingWrappingScorer
[junit4:junit4] Completed on J1 in 0.12s, 1 test
[junit4:junit4] 
[junit4:junit4] Suite: org.apache.lucene.index.TestIndexWriterDelete
[junit4:junit4] IGNOR/A 0.03s J3 | TestIndexWriterDelete.testApplyDeletesOnFlush
[junit4:junit4]    > Assumption #1: 'nightly' test group is disabled (@Nightly)
[junit4:junit4] Completed on J3 in 20.86s, 19 tests, 1 skipped
[junit4:junit4] 
[junit4:junit4] Suite: org.apache.lucene.util.junitcompat.TestFailIfDirectoryNotClosed
[junit4:junit4] Completed on J3 in 0.30s, 1 test
[junit4:junit4] 
[junit4:junit4] Suite: org.apache.lucene.search.TestElevationComparator
[junit4:junit4] Completed on J3 in 0.38s, 1 test
[junit4:junit4] 
[junit4:junit4] Suite: org.apache.lucene.store.TestMultiMMap
[junit4:junit4] Completed on J4 in 28.48s, 11 tests
[junit4:junit4] 
[junit4:junit4] Suite: org.apache.lucene.analysis.TestCharFilter
[junit4:junit4] Completed on J4 in 0.31s, 4 tests
[junit4:junit4] 
[junit4:junit4] Suite: org.apache.lucene.index.TestTermVectorsReader
[junit4:junit4] Completed on J3 in 1.44s, 6 tests
[junit4:junit4] 
[junit4:junit4] Suite: org.apache.lucene.index.TestCheckIndex
[junit4:junit4] Completed on J4 in 0.96s, 3 tests
[junit4:junit4] 
[junit4:junit4] Suite: org.apache.lucene.index.TestPersistentSnapshotDeletionPolicy
[junit4:junit4] Completed on J1 in 6.73s, 14 tests
[junit4:junit4] 
[junit4:junit4] Suite: org.apache.lucene.codecs.lucene40.TestAllFilesHaveCodecHeader
[junit4:junit4] Completed on J4 in 1.42s, 1 test
[junit4:junit4] 
[junit4:junit4] Suite: org.apache.lucene.index.TestTermVectorsWriter
[junit4:junit4] Completed on J1 in 1.61s, 13 tests
[junit4:junit4] 
[junit4:junit4] Suite: org.apache.lucene.analysis.TestMockCharFilter
[junit4:junit4] Completed on J1 in 0.18s, 1 test
[junit4:junit4] 
[junit4:junit4] Suite: org.apache.lucene.index.TestStressAdvance
[junit4:junit4] Completed on J6 in 8.91s, 1 test
[junit4:junit4] 
[junit4:junit4] Suite: org.apache.lucene.search.TestPrefixFilter
[junit4:junit4] Completed on J6 in 0.21s, 1 test
[junit4:junit4] 
[junit4:junit4] Suite: org.apache.lucene.document.TestDocument
[junit4:junit4] Completed on J1 in 0.58s, 11 tests
[junit4:junit4] 
[junit4:junit4] Suite: org.apache.lucene.search.TestFieldCache
[junit4:junit4] Completed on J7 in 15.24s, 5 tests
[junit4:junit4] 
[junit4:junit4] Suite: org.apache.lucene.index.TestParallelReaderEmptyIndex
[junit4:junit4] Completed on J6 in 1.02s, 2 tests
[junit4:junit4] 
[junit4:junit4] Suite: org.apache.lucene.search.TestDocBoost
[junit4:junit4] Completed on J6 in 0.22s, 1 test
[junit4:junit4] 
[junit4:junit4] Suite: org.apache.lucene.TestSearch
[junit4:junit4] Completed on J6 in 0.63s, 2 tests
[junit4:junit4] 
[junit4:junit4] Suite: org.apache.lucene.search.TestSimpleExplanationsOfNonMatches
[junit4:junit4] Completed on J1 in 2.21s, 69 tests
[junit4:junit4] 
[junit4:junit4] Suite: org.apache.lucene.index.TestIndexWriterWithThreads
[junit4:junit4]   1> org.apache.lucene.store.LockObtainFailedException: Lock obtain timed out: org.apache.lucene.store.MockLockFactoryWrapper$MockLock@66b2b3b9
[junit4:junit4]   1> 	at org.apache.lucene.store.Lock.obtain(Lock.java:84)
[junit4:junit4]   1> 	at org.apache.lucene.index.IndexWriter.<init>(IndexWriter.java:600)
[junit4:junit4]   1> 	at org.apache.lucene.index.TestIndexWriterWithThreads$DelayedIndexAndCloseRunnable.run(TestIndexWriterWithThreads.java:490)
[junit4:junit4]   2> NOTE: reproduce with: ant test  -Dtestcase=TestIndexWriterWithThreads -Dtests.method=testOpenTwoIndexWritersOnDifferentThreads -Dtests.seed=172E3CAB05B08D19 -Dtests.slow=true -Dtests.locale=pt -Dtests.timezone=CST6CDT -Dtests.file.encoding=UTF-8
[junit4:junit4] FAILURE 1.59s J0 | TestIndexWriterWithThreads.testOpenTwoIndexWritersOnDifferentThreads <<<
[junit4:junit4]    > Throwable #1: java.lang.AssertionError: Failed due to: org.apache.lucene.store.LockObtainFailedException: Lock obtain timed out: org.apache.lucene.store.MockLockFactoryWrapper$MockLock@66b2b3b9
[junit4:junit4]    > 	at __randomizedtesting.SeedInfo.seed([172E3CAB05B08D19:1A9B21F3968653F8]:0)
[junit4:junit4]    > 	at org.junit.Assert.fail(Assert.java:93)
[junit4:junit4]    > 	at org.junit.Assert.assertTrue(Assert.java:43)
[junit4:junit4]    > 	at org.junit.Assert.assertFalse(Assert.java:68)
[junit4:junit4]    > 	at org.apache.lucene.index.TestIndexWriterWithThreads.testOpenTwoIndexWritersOnDifferentThreads(TestIndexWriterWithThreads.java:457)
[junit4:junit4]    > 	at sun.reflect.NativeMethodAccessorImpl.invoke0(Native Method)
[junit4:junit4]    > 	at sun.reflect.NativeMethodAccessorImpl.invoke(NativeMethodAccessorImpl.java:57)
[junit4:junit4]    > 	at sun.reflect.DelegatingMethodAccessorImpl.invoke(DelegatingMethodAccessorImpl.java:43)
[junit4:junit4]    > 	at java.lang.reflect.Method.invoke(Method.java:601)
[junit4:junit4]    > 	at com.carrotsearch.randomizedtesting.RandomizedRunner.invoke(RandomizedRunner.java:1559)
[junit4:junit4]    > 	at com.carrotsearch.randomizedtesting.RandomizedRunner.access$600(RandomizedRunner.java:79)
[junit4:junit4]    > 	at com.carrotsearch.randomizedtesting.RandomizedRunner$6.evaluate(RandomizedRunner.java:737)
[junit4:junit4]    > 	at com.carrotsearch.randomizedtesting.RandomizedRunner$7.evaluate(RandomizedRunner.java:773)
[junit4:junit4]    > 	at com.carrotsearch.randomizedtesting.RandomizedRunner$8.evaluate(RandomizedRunner.java:787)
[junit4:junit4]    > 	at org.apache.lucene.util.TestRuleSetupTeardownChained$1.evaluate(TestRuleSetupTeardownChained.java:50)
[junit4:junit4]    > 	at org.apache.lucene.util.TestRuleFieldCacheSanity$1.evaluate(TestRuleFieldCacheSanity.java:51)
[junit4:junit4]    > 	at org.apache.lucene.util.AbstractBeforeAfterRule$1.evaluate(AbstractBeforeAfterRule.java:45)
[junit4:junit4]    > 	at com.carrotsearch.randomizedtesting.rules.SystemPropertiesInvariantRule$1.evaluate(SystemPropertiesInvariantRule.java:55)
[junit4:junit4]    > 	at org.apache.lucene.util.TestRuleThreadAndTestName$1.evaluate(TestRuleThreadAndTestName.java:48)
[junit4:junit4]    > 	at org.apache.lucene.util.TestRuleIgnoreAfterMaxFailures$1.evaluate(TestRuleIgnoreAfterMaxFailures.java:70)
[junit4:junit4]    > 	at org.apache.lucene.util.TestRuleMarkFailure$1.evaluate(TestRuleMarkFailure.java:48)
[junit4:junit4]    > 	at com.carrotsearch.randomizedtesting.rules.StatementAdapter.evaluate(StatementAdapter.java:36)
[junit4:junit4]    > 	at com.carrotsearch.randomizedtesting.ThreadLeakControl$StatementRunner.run(ThreadLeakControl.java:358)
[junit4:junit4]    > 	at com.carrotsearch.randomizedtesting.ThreadLeakControl.forkTimeoutingTask(ThreadLeakControl.java:782)
[junit4:junit4]    > 	at com.carrotsearch.randomizedtesting.ThreadLeakControl$3.evaluate(ThreadLeakControl.java:442)
[junit4:junit4]    > 	at com.carrotsearch.randomizedtesting.RandomizedRunner.runSingleTest(RandomizedRunner.java:746)
[junit4:junit4]    > 	at com.carrotsearch.randomizedtesting.RandomizedRunner$3.evaluate(RandomizedRunner.java:648)
[junit4:junit4]    > 	at com.carrotsearch.randomizedtesting.RandomizedRunner$4.evaluate(RandomizedRunner.java:682)
[junit4:junit4]    > 	at com.carrotsearch.randomizedtesting.RandomizedRunner$5.evaluate(RandomizedRunner.java:693)
[junit4:junit4]    > 	at org.apache.lucene.util.AbstractBeforeAfterRule$1.evaluate(AbstractBeforeAfterRule.java:45)
[junit4:junit4]    > 	at org.apache.lucene.util.TestRuleStoreClassName$1.evaluate(TestRuleStoreClassName.java:42)
[junit4:junit4]    > 	at com.carrotsearch.randomizedtesting.rules.SystemPropertiesInvariantRule$1.evaluate(SystemPropertiesInvariantRule.java:55)
[junit4:junit4]    > 	at com.carrotsearch.randomizedtesting.rules.NoShadowingOrOverridesOnMethodsRule$1.evaluate(NoShadowingOrOverridesOnMethodsRule.java:39)
[junit4:junit4]    > 	at com.carrotsearch.randomizedtesting.rules.NoShadowingOrOverridesOnMethodsRule$1.evaluate(NoShadowingOrOverridesOnMethodsRule.java:39)
[junit4:junit4]    > 	at com.carrotsearch.randomizedtesting.rules.StatementAdapter.evaluate(StatementAdapter.java:36)
[junit4:junit4]    > 	at org.apache.lucene.util.TestRuleAssertionsRequired$1.evaluate(TestRuleAssertionsRequired.java:43)
[junit4:junit4]    > 	at org.apache.lucene.util.TestRuleMarkFailure$1.evaluate(TestRuleMarkFailure.java:48)
[junit4:junit4]    > 	at org.apache.lucene.util.TestRuleIgnoreAfterMaxFailures$1.evaluate(TestRuleIgnoreAfterMaxFailures.java:70)
[junit4:junit4]    > 	at org.apache.lucene.util.TestRuleIgnoreTestSuites$1.evaluate(TestRuleIgnoreTestSuites.java:55)
[junit4:junit4]    > 	at com.carrotsearch.randomizedtesting.rules.StatementAdapter.evaluate(StatementAdapter.java:36)
[junit4:junit4]    > 	at com.carrotsearch.randomizedtesting.ThreadLeakControl$StatementRunner.run(ThreadLeakControl.java:358)
[junit4:junit4]    > 	at java.lang.Thread.run(Thread.java:722)
[junit4:junit4]   2> NOTE: test params are: codec=Lucene40: {field=PostingsFormat(name=Memory doPackFST= false), docid=PostingsFormat(name=Lucene40WithOrds), body=PostingsFormat(name=Memory doPackFST= false), title=Block(blocksize=128), titleTokenized=PostingsFormat(name=SimpleText), date=PostingsFormat(name=Memory doPackFST= false)}, sim=RandomSimilarityProvider(queryNorm=false,coord=crazy): {field=DFR I(n)B2, body=DFR I(F)B1, titleTokenized=DFR I(n)1}, locale=pt, timezone=CST6CDT
[junit4:junit4]   2> NOTE: Linux 3.2.0-26-generic amd64/Oracle Corporation 1.7.0_05 (64-bit)/cpus=8,threads=1,free=108785240,total=240844800
[junit4:junit4]   2> NOTE: All tests run in this JVM: [TestPrefixCodedTerms, TestNamedSPILoader, TestNeverDelete, TestCachingCollector, TestSimilarity2, TestIndexWriterWithThreads]
[junit4:junit4] Completed on J0 in 35.34s, 12 tests, 1 failure <<< FAILURES!
[junit4:junit4] 
[junit4:junit4] Suite: org.apache.lucene.util.fst.TestFSTs
[junit4:junit4] IGNOR/A 0.20s J2 | TestFSTs.testBigSet
[junit4:junit4]    > Assumption #1: 'nightly' test group is disabled (@Nightly)
[junit4:junit4] Completed on J2 in 32.96s, 17 tests, 1 skipped
[junit4:junit4] 
[junit4:junit4] Suite: org.apache.lucene.search.TestBooleanOr
[junit4:junit4] Completed on J7 in 8.88s, 6 tests
[junit4:junit4] 
[junit4:junit4] Suite: org.apache.lucene.codecs.perfield.TestPerFieldPostingsFormat
[junit4:junit4] Completed on J1 in 6.90s, 5 tests
[junit4:junit4] 
[junit4:junit4] Suite: org.apache.lucene.index.TestDirectoryReaderReopen
[junit4:junit4] Completed on J6 in 9.32s, 5 tests
[junit4:junit4] 
[junit4:junit4] Suite: org.apache.lucene.index.TestParallelCompositeReader
[junit4:junit4] Completed on J2 in 4.12s, 8 tests
[junit4:junit4] 
[junit4:junit4] Suite: org.apache.lucene.index.TestRollingUpdates
[junit4:junit4] Completed on J0 in 11.05s, 2 tests
[junit4:junit4] 
[junit4:junit4] Suite: org.apache.lucene.search.TestNumericRangeQuery64
[junit4:junit4] Completed on J5 in 44.62s, 34 tests
[junit4:junit4] 
[junit4:junit4] Suite: org.apache.lucene.index.TestTwoPhaseCommitTool
[junit4:junit4] Completed on J5 in 0.20s, 4 tests
[junit4:junit4] 
[junit4:junit4] Suite: org.apache.lucene.index.TestOmitNorms
[junit4:junit4] Completed on J7 in 7.58s, 5 tests
[junit4:junit4] 
[junit4:junit4] Suite: org.apache.lucene.search.TestSimpleExplanations
[junit4:junit4] Completed on J1 in 8.32s, 69 tests
[junit4:junit4] 
[junit4:junit4] Suite: org.apache.lucene.search.TestComplexExplanationsOfNonMatches
[junit4:junit4] Completed on J7 in 1.06s, 22 tests
[junit4:junit4] 
[junit4:junit4] Suite: org.apache.lucene.index.TestAddIndexes
[junit4:junit4] Completed on J3 in 22.15s, 20 tests
[junit4:junit4] 
[junit4:junit4] Suite: org.apache.lucene.store.TestWindowsMMap
[junit4:junit4] Completed on J3 in 1.20s, 1 test
[junit4:junit4] 
[junit4:junit4] Suite: org.apache.lucene.util.TestAttributeSource
[junit4:junit4] Completed on J3 in 0.24s, 5 tests
[junit4:junit4] 
[junit4:junit4] Suite: org.apache.lucene.search.TestPositiveScoresOnlyCollector
[junit4:junit4] Completed on J3 in 0.13s, 1 test
[junit4:junit4] 
[junit4:junit4] Suite: org.apache.lucene.index.TestMixedCodecs
[junit4:junit4] Completed on J5 in 4.54s, 1 test
[junit4:junit4] 
[junit4:junit4] Suite: org.apache.lucene.search.TestFieldCacheTermsFilter
[junit4:junit4] Completed on J5 in 0.21s, 1 test
[junit4:junit4] 
[junit4:junit4] Suite: org.apache.lucene.search.TestSimpleSearchEquivalence
[junit4:junit4] Completed on J1 in 4.21s, 12 tests
[junit4:junit4] 
[junit4:junit4] Suite: org.apache.lucene.index.TestDocValuesIndexing
[junit4:junit4] Completed on J0 in 7.20s, 16 tests
[junit4:junit4] 
[junit4:junit4] Suite: org.apache.lucene.search.TestFieldValueFilter
[junit4:junit4] Completed on J0 in 0.31s, 2 tests
[junit4:junit4] 
[junit4:junit4] Suite: org.apache.lucene.index.TestLazyProxSkipping
[junit4:junit4] Completed on J5 in 2.66s, 2 tests
[junit4:junit4] 
[junit4:junit4] Suite: org.apache.lucene.index.TestIndexWriterNRTIsCurrent
[junit4:junit4] Completed on J1 in 3.29s, 1 test
[junit4:junit4] 
[junit4:junit4] Suite: org.apache.lucene.index.TestForTooMuchCloning
[junit4:junit4] Completed on J0 in 4.66s, 1 test
[junit4:junit4] 
[junit4:junit4] Suite: org.apache.lucene.store.TestByteArrayDataInput
[junit4:junit4] Completed on J0 in 0.13s, 1 test
[junit4:junit4] 
[junit4:junit4] Suite: org.apache.lucene.search.TestCachingWrapperFilter
[junit4:junit4] Completed on J0 in 0.44s, 5 tests
[junit4:junit4] 
[junit4:junit4] Suite: org.apache.lucene.index.TestTermsEnum
[junit4:junit4] Completed on J2 in 15.42s, 7 tests
[junit4:junit4] 
[junit4:junit4] Suite: org.apache.lucene.search.TestAutomatonQueryUnicode
[junit4:junit4] Completed on J2 in 0.25s, 1 test
[junit4:junit4] 
[junit4:junit4] Suite: org.apache.lucene.store.TestLockFactory
[junit4:junit4] IGNOR/A 0.06s J0 | TestLockFactory.testStressLocksNativeFSLockFactory
[junit4:junit4]    > Assumption #1: 'nightly' test group is disabled (@Nightly)
[junit4:junit4] IGNOR/A 0.01s J0 | TestLockFactory.testStressLocks
[junit4:junit4]    > Assumption #1: 'nightly' test group is disabled (@Nightly)
[junit4:junit4] Completed on J0 in 1.52s, 11 tests, 2 skipped
[junit4:junit4] 
[junit4:junit4] Suite: org.apache.lucene.util.TestFilterIterator
[junit4:junit4] Completed on J0 in 0.31s, 8 tests
[junit4:junit4] 
[junit4:junit4] Suite: org.apache.lucene.index.TestSegmentMerger
[junit4:junit4] Completed on J5 in 6.50s, 3 tests
[junit4:junit4] 
[junit4:junit4] Suite: org.apache.lucene.TestDemo
[junit4:junit4] Completed on J5 in 0.13s, 1 test
[junit4:junit4] 
[junit4:junit4] Suite: org.apache.lucene.index.TestMultiLevelSkipList
[junit4:junit4] Completed on J2 in 2.09s, 1 test
[junit4:junit4] 
[junit4:junit4] Suite: org.apache.lucene.search.TestTopDocsMerge
[junit4:junit4] Completed on J6 in 20.01s, 1 test
[junit4:junit4] 
[junit4:junit4] Suite: org.apache.lucene.document.TestField
[junit4:junit4] Completed on J2 in 0.98s, 24 tests
[junit4:junit4] 
[junit4:junit4] Suite: org.apache.lucene.index.TestIndexWriter
[junit4:junit4] Completed on J7 in 14.69s, 50 tests
[junit4:junit4] 
[junit4:junit4] Suite: org.apache.lucene.util.automaton.TestMinimize
[junit4:junit4] Completed on J3 in 13.03s, 3 tests
[junit4:junit4] 
[junit4:junit4] Suite: org.apache.lucene.index.TestStressIndexing2
[junit4:junit4] Completed on J7 in 0.92s, 3 tests
[junit4:junit4] 
[junit4:junit4] Suite: org.apache.lucene.TestExternalCodecs
[junit4:junit4] Completed on J7 in 0.85s, 1 test
[junit4:junit4] 
[junit4:junit4] Suite: org.apache.lucene.search.TestFieldCacheRangeFilter
[junit4:junit4] Completed on J0 in 5.18s, 9 tests
[junit4:junit4] 
[junit4:junit4] Suite: org.apache.lucene.util.junitcompat.TestCodecReported
[junit4:junit4] Completed on J0 in 0.23s, 1 test
[junit4:junit4] 
[junit4:junit4] Suite: org.apache.lucene.index.TestNRTThreads
[junit4:junit4] Completed on J2 in 3.51s, 1 test
[junit4:junit4] 
[junit4:junit4] Suite: org.apache.lucene.index.TestIndexWriterMergePolicy
[junit4:junit4] Completed on J1 in 11.83s, 7 tests
[junit4:junit4] 
[junit4:junit4] Suite: org.apache.lucene.index.TestSnapshotDeletionPolicy
[junit4:junit4] Completed on J2 in 3.05s, 8 tests
[junit4:junit4] 
[junit4:junit4] Suite: org.apache.lucene.index.TestConcurrentMergeScheduler
[junit4:junit4] Completed on J5 in 8.58s, 4 tests
[junit4:junit4] 
[junit4:junit4] Suite: org.apache.lucene.search.spans.TestSpanMultiTermQueryWrapper
[junit4:junit4] Completed on J5 in 0.52s, 4 tests
[junit4:junit4] 
[junit4:junit4] Suite: org.apache.lucene.index.TestNorms
[junit4:junit4] Completed on J4 in 41.72s, 3 tests
[junit4:junit4] 
[junit4:junit4] Suite: org.apache.lucene.util.TestNumericUtils
[junit4:junit4] Completed on J0 in 5.08s, 12 tests
[junit4:junit4] 
[junit4:junit4] Suite: org.apache.lucene.util.TestIOUtils
[junit4:junit4] Completed on J0 in 0.08s, 1 test
[junit4:junit4] 
[junit4:junit4] Suite: org.apache.lucene.search.TestSubScorerFreqs
[junit4:junit4] Completed on J4 in 0.46s, 3 tests
[junit4:junit4] 
[junit4:junit4] Suite: org.apache.lucene.index.TestNewestSegment
[junit4:junit4] Completed on J0 in 0.13s, 1 test
[junit4:junit4] 
[junit4:junit4] Suite: org.apache.lucene.TestMergeSchedulerExternal
[junit4:junit4] Completed on J2 in 2.23s, 2 tests
[junit4:junit4] 
[junit4:junit4] Suite: org.apache.lucene.index.TestMaxTermFrequency
[junit4:junit4] Completed on J4 in 1.45s, 1 test
[junit4:junit4] 
[junit4:junit4] Suite: org.apache.lucene.util.junitcompat.TestLeaveFilesIfTestFails
[junit4:junit4] Completed on J4 in 0.31s, 1 test
[junit4:junit4] 
[junit4:junit4] Suite: org.apache.lucene.index.TestDirectoryReader
[junit4:junit4] Completed on J7 in 7.78s, 23 tests
[junit4:junit4] 
[junit4:junit4] Suite: org.apache.lucene.search.TestComplexExplanations
[junit4:junit4] Completed on J3 in 9.46s, 22 tests
[junit4:junit4] 
[junit4:junit4] Suite: org.apache.lucene.util.automaton.TestDeterminism
[junit4:junit4] Completed on J1 in 6.08s, 2 tests
[junit4:junit4] 
[junit4:junit4] Suite: org.apache.lucene.index.TestDocumentsWriterStallControl
[junit4:junit4] Completed on J3 in 1.68s, 3 tests
[junit4:junit4] 
[junit4:junit4] Suite: org.apache.lucene.codecs.lucene40.TestLucene40PostingsReader
[junit4:junit4] Completed on J6 in 15.19s, 1 test
[junit4:junit4] 
[junit4:junit4] Suite: org.apache.lucene.index.TestCompoundFile
[junit4:junit4] Completed on J5 in 7.46s, 18 tests
[junit4:junit4] 
[junit4:junit4] Suite: org.apache.lucene.search.TestTermVectors
[junit4:junit4] Completed on J6 in 1.72s, 11 tests
[junit4:junit4] 
[junit4:junit4] Suite: org.apache.lucene.search.spans.TestSpanExplanationsOfNonMatches
[junit4:junit4] Completed on J6 in 1.13s, 31 tests
[junit4:junit4] 
[junit4:junit4] Suite: org.apache.lucene.index.TestSegmentReader
[junit4:junit4] Completed on J2 in 10.36s, 6 tests
[junit4:junit4] 
[junit4:junit4] Suite: org.apache.lucene.util.junitcompat.TestSeedFromUncaught
[junit4:junit4] Completed on J2 in 0.29s, 1 test
[junit4:junit4] 
[junit4:junit4] Suite: org.apache.lucene.search.TestPhraseQuery
[junit4:junit4] Completed on J7 in 9.42s, 17 tests
[junit4:junit4] 
[junit4:junit4] Suite: org.apache.lucene.analysis.TestNumericTokenStream
[junit4:junit4] Completed on J7 in 0.13s, 4 tests
[junit4:junit4] 
[junit4:junit4] Suite: org.apache.lucene.document.TestDateTools
[junit4:junit4] Completed on J2 in 0.35s, 5 tests
[junit4:junit4] 
[junit4:junit4] Suite: org.apache.lucene.search.TestPhrasePrefixQuery
[junit4:junit4] Completed on J7 in 0.12s, 1 test
[junit4:junit4] 
[junit4:junit4] Suite: org.apache.lucene.index.TestIndexWriterForceMerge
[junit4:junit4] Completed on J3 in 9.22s, 4 tests
[junit4:junit4] 
[junit4:junit4] Suite: org.apache.lucene.search.payloads.TestPayloadNearQuery
[junit4:junit4] Completed on J5 in 6.65s, 7 tests
[junit4:junit4] 
[junit4:junit4] Suite: org.apache.lucene.search.TestSearchAfter
[junit4:junit4] Completed on J4 in 11.86s, 1 test
[junit4:junit4] 
[junit4:junit4] Suite: org.apache.lucene.search.spans.TestSpansAdvanced
[junit4:junit4] Completed on J5 in 0.63s, 1 test
[junit4:junit4] 
[junit4:junit4] Suite: org.apache.lucene.search.TestDateSort
[junit4:junit4] Completed on J4 in 0.31s, 1 test
[junit4:junit4] 
[junit4:junit4] Suite: org.apache.lucene.search.TestPrefixInBooleanQuery
[junit4:junit4] Completed on J7 in 2.76s, 4 tests
[junit4:junit4] 
[junit4:junit4] Suite: org.apache.lucene.index.TestFilterAtomicReader
[junit4:junit4] Completed on J7 in 0.38s, 2 tests
[junit4:junit4] 
[junit4:junit4] Suite: org.apache.lucene.store.TestBufferedIndexInput
[junit4:junit4] Completed on J2 in 4.33s, 4 tests
[junit4:junit4] 
[junit4:junit4] Suite: org.apache.lucene.index.TestCrashCausesCorruptIndex
[junit4:junit4] Completed on J4 in 1.58s, 1 test
[junit4:junit4] 
[junit4:junit4] Suite: org.apache.lucene.util.TestSmallFloat
[junit4:junit4] Completed on J4 in 0.45s, 2 tests
[junit4:junit4] 
[junit4:junit4] Suite: org.apache.lucene.codecs.lucene40.TestBitVector
[junit4:junit4] Completed on J3 in 3.35s, 9 tests
[junit4:junit4] 
[junit4:junit4] Suite: org.apache.lucene.index.TestDocumentsWriterDeleteQueue
[junit4:junit4] Completed on J7 in 1.53s, 5 tests
[junit4:junit4] 
[junit4:junit4] Suite: org.apache.lucene.util.TestVersion
[junit4:junit4] Completed on J4 in 0.14s, 2 tests
[junit4:junit4] 
[junit4:junit4] Suite: org.apache.lucene.util.junitcompat.TestSetupTeardownChaining
[junit4:junit4] Completed on J7 in 0.21s, 2 tests
[junit4:junit4] 
[junit4:junit4] Suite: org.apache.lucene.search.TestWildcard
[junit4:junit4] Completed on J4 in 1.46s, 8 tests
[junit4:junit4] 
[junit4:junit4] Suite: org.apache.lucene.util.junitcompat.TestJUnitRuleOrder
[junit4:junit4] Completed on J4 in 0.13s, 1 test
[junit4:junit4] 
[junit4:junit4] Suite: org.apache.lucene.index.TestDuelingCodecs
[junit4:junit4] Completed on J6 in 13.12s, 1 test
[junit4:junit4] 
[junit4:junit4] Suite: org.apache.lucene.search.TestQueryWrapperFilter
[junit4:junit4] Completed on J4 in 4.70s, 3 tests
[junit4:junit4] 
[junit4:junit4] Suite: org.apache.lucene.util.packed.TestPackedInts
[junit4:junit4] Completed on J0 in 25.66s, 16 tests
[junit4:junit4] 
[junit4:junit4] Suite: org.apache.lucene.index.TestDocumentWriter
[junit4:junit4] Completed on J6 in 4.22s, 7 tests
[junit4:junit4] 
[junit4:junit4] Suite: org.apache.lucene.util.junitcompat.TestBeforeAfterOverrides
[junit4:junit4] Completed on J6 in 0.10s, 2 tests
[junit4:junit4] 
[junit4:junit4] Suite: org.apache.lucene.search.TestShardSearching
[junit4:junit4] Completed on J0 in 9.64s, 1 test
[junit4:junit4] 
[junit4:junit4] Suite: org.apache.lucene.index.TestIndexWriterMerging
[junit4:junit4] Completed on J5 in 24.82s, 6 tests
[junit4:junit4] 
[junit4:junit4] Suite: org.apache.lucene.index.TestFieldInfos
[junit4:junit4] Completed on J5 in 0.11s, 2 tests
[junit4:junit4] 
[junit4:junit4] Suite: org.apache.lucene.index.TestLongPostings
[junit4:junit4] Completed on J4 in 17.85s, 2 tests
[junit4:junit4] 
[junit4:junit4] Suite: org.apache.lucene.search.TestTimeLimitingCollector
[junit4:junit4] Completed on J2 in 25.72s, 6 tests
[junit4:junit4] 
[junit4:junit4] Suite: org.apache.lucene.index.TestNRTReaderWithThreads
[junit4:junit4] Completed on J4 in 1.64s, 1 test
[junit4:junit4] 
[junit4:junit4] Suite: org.apache.lucene.document.TestBinaryDocument
[junit4:junit4] Completed on J4 in 0.26s, 2 tests
[junit4:junit4] 
[junit4:junit4] Suite: org.apache.lucene.analysis.TestLookaheadTokenFilter
[junit4:junit4] Completed on J7 in 26.01s, 2 tests
[junit4:junit4] 
[junit4:junit4] Suite: org.apache.lucene.search.TestBoolean2
[junit4:junit4] Completed on J6 in 17.54s, 11 tests
[junit4:junit4] 
[junit4:junit4] Suite: org.apache.lucene.index.TestFieldsReader
[junit4:junit4] Completed on J2 in 2.95s, 4 tests
[junit4:junit4] 
[junit4:junit4] Suite: org.apache.lucene.util.automaton.TestUTF32ToUTF8
[junit4:junit4] Completed on J5 in 6.16s, 5 tests
[junit4:junit4] 
[junit4:junit4] Suite: org.apache.lucene.search.payloads.TestPayloadExplanations
[junit4:junit4] Completed on J2 in 1.89s, 5 tests
[junit4:junit4] 
[junit4:junit4] Suite: org.apache.lucene.index.TestIndexWriterReader
[junit4:junit4] Completed on J3 in 31.16s, 20 tests
[junit4:junit4] 
[junit4:junit4] Suite: org.apache.lucene.search.TestSearcherManager
[junit4:junit4] Completed on J4 in 7.12s, 6 tests
[junit4:junit4] 
[junit4:junit4] Suite: org.apache.lucene.index.TestDeletionPolicy
[junit4:junit4] Completed on J2 in 5.39s, 6 tests
[junit4:junit4] 
[junit4:junit4] Suite: org.apache.lucene.index.TestByteSlices
[junit4:junit4] Completed on J5 in 7.25s, 1 test
[junit4:junit4] 
[junit4:junit4] Suite: org.apache.lucene.search.spans.TestBasics
[junit4:junit4] Completed on J6 in 10.15s, 24 tests
[junit4:junit4] 
[junit4:junit4] Suite: org.apache.lucene.index.TestIndexWriterExceptions
[junit4:junit4] Completed on J0 in 21.37s, 25 tests
[junit4:junit4] 
[junit4:junit4] Suite: org.apache.lucene.search.TestNRTManager
[junit4:junit4] Completed on J6 in 2.67s, 3 tests
[junit4:junit4] 
[junit4:junit4] Suite: org.apache.lucene.index.TestAtomicUpdate
[junit4:junit4] Completed on J3 in 10.64s, 1 test
[junit4:junit4] 
[junit4:junit4] Suite: org.apache.lucene.util.TestOpenBitSet
[junit4:junit4] Completed on J4 in 12.35s, 4 tests
[junit4:junit4] 
[junit4:junit4] Suite: org.apache.lucene.util.TestArrayUtil
[junit4:junit4] Completed on J3 in 5.44s, 11 tests
[junit4:junit4] 
[junit4:junit4] Suite: org.apache.lucene.store.TestNRTCachingDirectory
[junit4:junit4] Completed on J4 in 3.38s, 5 tests
[junit4:junit4] 
[junit4:junit4] Suite: org.apache.lucene.analysis.TestGraphTokenizers
[junit4:junit4] Completed on J1 in 63.62s, 8 tests
[junit4:junit4] 
[junit4:junit4] Suite: org.apache.lucene.index.TestBackwardsCompatibility
[junit4:junit4] Completed on J5 in 14.08s, 12 tests
[junit4:junit4] 
[junit4:junit4] Suite: org.apache.lucene.search.TestSloppyPhraseQuery
[junit4:junit4] Completed on J2 in 14.59s, 9 tests
[junit4:junit4] 
[junit4:junit4] Suite: org.apache.lucene.search.TestNumericRangeQuery32
[junit4:junit4] Completed on J7 in 24.15s, 27 tests
[junit4:junit4] 
[junit4:junit4] Suite: org.apache.lucene.index.TestIndexWriterUnicode
[junit4:junit4] Completed on J6 in 11.71s, 5 tests
[junit4:junit4] 
[junit4:junit4] Suite: org.apache.lucene.util.TestPagedBytes
[junit4:junit4] Completed on J4 in 3.75s, 3 tests
[junit4:junit4] 
[junit4:junit4] Suite: org.apache.lucene.util.TestCollectionUtil
[junit4:junit4] Completed on J3 in 6.16s, 5 tests
[junit4:junit4] 
[junit4:junit4] Suite: org.apache.lucene.analysis.TestToken
[junit4:junit4] Completed on J5 in 5.84s, 10 tests
[junit4:junit4] 
[junit4:junit4] Suite: org.apache.lucene.util.TestWeakIdentityMap
[junit4:junit4] Completed on J2 in 5.54s, 2 tests
[junit4:junit4] 
[junit4:junit4] Suite: org.apache.lucene.search.TestSort
[junit4:junit4] Completed on J0 in 15.31s, 25 tests
[junit4:junit4] 
[junit4:junit4] Suite: org.apache.lucene.index.TestCustomNorms
[junit4:junit4] Completed on J7 in 5.95s, 3 tests
[junit4:junit4] 
[junit4:junit4] Suite: org.apache.lucene.util.automaton.TestDeterminizeLexicon
[junit4:junit4] Completed on J4 in 4.02s, 1 test
[junit4:junit4] 
[junit4:junit4] Suite: org.apache.lucene.util.TestRollingCharBuffer
[junit4:junit4] Completed on J3 in 4.07s, 1 test
[junit4:junit4] 
[junit4:junit4] Suite: org.apache.lucene.index.TestIndexWriterCommit
[junit4:junit4] Completed on J1 in 8.99s, 12 tests
[junit4:junit4] 
[junit4:junit4] Suite: org.apache.lucene.search.TestSloppyPhraseQuery2
[junit4:junit4] Completed on J7 in 2.51s, 9 tests
[junit4:junit4] 
[junit4:junit4] Suite: org.apache.lucene.analysis.TestMockAnalyzer
[junit4:junit4] Completed on J6 in 7.41s, 9 tests
[junit4:junit4] 
[junit4:junit4] Suite: org.apache.lucene.index.TestStressNRT
[junit4:junit4] Completed on J4 in 3.52s, 1 test
[junit4:junit4] 
[junit4:junit4] Suite: org.apache.lucene.index.TestTieredMergePolicy
[junit4:junit4] Completed on J2 in 5.01s, 4 tests
[junit4:junit4] 
[junit4:junit4] Suite: org.apache.lucene.util.TestDoubleBarrelLRUCache
[junit4:junit4] Completed on J6 in 1.15s, 2 tests
[junit4:junit4] 
[junit4:junit4] Suite: org.apache.lucene.index.TestConsistentFieldNumbers
[junit4:junit4] Completed on J1 in 3.72s, 4 tests
[junit4:junit4] 
[junit4:junit4] Suite: org.apache.lucene.index.Test2BDocs
[junit4:junit4] Completed on J3 in 5.41s, 2 tests
[junit4:junit4] 
[junit4:junit4] Suite: org.apache.lucene.store.TestRAMDirectory
[junit4:junit4] Completed on J4 in 2.43s, 4 tests
[junit4:junit4] 
[junit4:junit4] Suite: org.apache.lucene.index.TestTransactions
[junit4:junit4] Completed on J1 in 1.09s, 1 test
[junit4:junit4] 
[junit4:junit4] Suite: org.apache.lucene.search.TestMultiValuedNumericRangeQuery
[junit4:junit4] Completed on J6 in 3.14s, 1 test
[junit4:junit4] 
[junit4:junit4] Suite: org.apache.lucene.codecs.lucene40.values.TestDocValues
[junit4:junit4] Completed on J2 in 3.83s, 14 tests
[junit4:junit4] 
[junit4:junit4] Suite: org.apache.lucene.index.TestThreadedForceMerge
[junit4:junit4] Completed on J3 in 1.77s, 1 test
[junit4:junit4] 
[junit4:junit4] Suite: org.apache.lucene.index.TestRandomStoredFields
[junit4:junit4] Completed on J4 in 2.78s, 1 test
[junit4:junit4] 
[junit4:junit4] Suite: org.apache.lucene.search.TestRegexpRandom2
[junit4:junit4] Completed on J5 in 10.46s, 1 test
[junit4:junit4] 
[junit4:junit4] Suite: org.apache.lucene.util.TestBytesRefHash
[junit4:junit4] Completed on J1 in 2.72s, 7 tests
[junit4:junit4] 
[junit4:junit4] Suite: org.apache.lucene.store.TestHugeRamFile
[junit4:junit4] Completed on J0 in 10.50s, 1 test
[junit4:junit4] 
[junit4:junit4] Suite: org.apache.lucene.search.spans.TestSpanExplanations
[junit4:junit4] Completed on J3 in 2.68s, 31 tests
[junit4:junit4] 
[junit4:junit4] Suite: org.apache.lucene.util.TestRamUsageEstimatorOnWildAnimals
[junit4:junit4] Completed on J6 in 3.51s, 1 test
[junit4:junit4] 
[junit4:junit4] Suite: org.apache.lucene.index.TestCodecs
[junit4:junit4] Completed on J5 in 1.78s, 3 tests
[junit4:junit4] 
[junit4:junit4] Suite: org.apache.lucene.index.TestIndexWriterOnDiskFull
[junit4:junit4] Completed on J1 in 2.15s, 4 tests
[junit4:junit4] 
[junit4:junit4] Suite: org.apache.lucene.search.TestBooleanMinShouldMatch
[junit4:junit4] Completed on J2 in 4.21s, 17 tests
[junit4:junit4] 
[junit4:junit4] Suite: org.apache.lucene.search.TestFieldCacheRewriteMethod
[junit4:junit4] Completed on J7 in 11.01s, 1 test
[junit4:junit4] 
[junit4:junit4] Suite: org.apache.lucene.search.spans.TestSpanSearchEquivalence
[junit4:junit4] Completed on J5 in 1.42s, 8 tests
[junit4:junit4] 
[junit4:junit4] Suite: org.apache.lucene.codecs.lucene40.TestReuseDocsEnum
[junit4:junit4] Completed on J0 in 3.32s, 3 tests
[junit4:junit4] 
[junit4:junit4] Suite: org.apache.lucene.search.TestCustomSearcherSort
[junit4:junit4] Completed on J6 in 2.70s, 2 tests
[junit4:junit4] 
[junit4:junit4] Suite: org.apache.lucene.index.TestIndexInput
[junit4:junit4] Completed on J3 in 2.81s, 3 tests
[junit4:junit4] 
[junit4:junit4] Suite: org.apache.lucene.index.TestCrash
[junit4:junit4] Completed on J2 in 2.03s, 5 tests
[junit4:junit4] 
[junit4:junit4] Suite: org.apache.lucene.search.spans.TestSpans
[junit4:junit4] Completed on J1 in 2.45s, 25 tests
[junit4:junit4] 
[junit4:junit4] Suite: org.apache.lucene.search.payloads.TestPayloadTermQuery
[junit4:junit4] Completed on J3 in 1.20s, 6 tests
[junit4:junit4] 
[junit4:junit4] Suite: org.apache.lucene.search.spans.TestPayloadSpans
[junit4:junit4] Completed on J4 in 5.78s, 10 tests
[junit4:junit4] 
[junit4:junit4] Suite: org.apache.lucene.index.TestDoc
[junit4:junit4] Completed on J2 in 0.75s, 1 test
[junit4:junit4] 
[junit4:junit4] Suite: org.apache.lucene.search.TestScorerPerf
[junit4:junit4] Completed on J6 in 1.34s, 1 test
[junit4:junit4] 
[junit4:junit4] Suite: org.apache.lucene.util.TestFieldCacheSanityChecker
[junit4:junit4] Completed on J0 in 2.37s, 3 tests
[junit4:junit4] 
[junit4:junit4] Suite: org.apache.lucene.search.similarities.TestSimilarityBase
[junit4:junit4] Completed on J5 in 2.59s, 29 tests
[junit4:junit4] 
[junit4:junit4] Suite: org.apache.lucene.search.TestTermRangeFilter
[junit4:junit4] Completed on J6 in 1.06s, 3 tests
[junit4:junit4] 
[junit4:junit4] Suite: org.apache.lucene.index.TestDocValuesTypeCompatibility
[junit4:junit4] Completed on J3 in 1.39s, 5 tests
[junit4:junit4] 
[junit4:junit4] Suite: org.apache.lucene.search.TestFilteredQuery
[junit4:junit4] Completed on J0 in 1.27s, 9 tests
[junit4:junit4] 
[junit4:junit4] Suite: org.apache.lucene.search.TestMultiTermConstantScore
[junit4:junit4] Completed on J5 in 1.46s, 7 tests
[junit4:junit4] 
[junit4:junit4] Suite: org.apache.lucene.index.TestFlex
[junit4:junit4] Completed on J3 in 0.37s, 2 tests
[junit4:junit4] 
[junit4:junit4] Suite: org.apache.lucene.index.TestTermsEnum2
[junit4:junit4] Completed on J1 in 2.96s, 4 tests
[junit4:junit4] 
[junit4:junit4] Suite: org.apache.lucene.store.TestCopyBytes
[junit4:junit4] Completed on J2 in 1.76s, 2 tests
[junit4:junit4] 
[junit4:junit4] Suite: org.apache.lucene.search.spans.TestFieldMaskingSpanQuery
[junit4:junit4] IGNOR/A 0.17s J4 | TestFieldMaskingSpanQuery.testSpans2
[junit4:junit4]    > Assumption #1: Broken scoring: LUCENE-3723
[junit4:junit4] IGNOR/A 0.04s J4 | TestFieldMaskingSpanQuery.testSimple2
[junit4:junit4]    > Assumption #1: Broken scoring: LUCENE-3723
[junit4:junit4] Completed on J4 in 2.32s, 11 tests, 2 skipped
[junit4:junit4] 
[junit4:junit4] Suite: org.apache.lucene.index.TestTransactionRollback
[junit4:junit4] Completed on J1 in 0.58s, 2 tests
[junit4:junit4] 
[junit4:junit4] Suite: org.apache.lucene.util.automaton.TestCompiledAutomaton
[junit4:junit4] Completed on J5 in 0.75s, 2 tests
[junit4:junit4] 
[junit4:junit4] Suite: org.apache.lucene.index.TestDocsAndPositions
[junit4:junit4] Completed on J6 in 1.57s, 6 tests
[junit4:junit4] 
[junit4:junit4] Suite: org.apache.lucene.util.TestSentinelIntSet
[junit4:junit4] Completed on J2 in 0.80s, 2 tests
[junit4:junit4] 
[junit4:junit4] Suite: org.apache.lucene.util.junitcompat.TestExceptionInBeforeClassHooks
[junit4:junit4] Completed on J5 in 0.43s, 3 tests
[junit4:junit4] 
[junit4:junit4] Suite: org.apache.lucene.index.TestDocTermOrds
[junit4:junit4] Completed on J4 in 0.77s, 3 tests
[junit4:junit4] 
[junit4:junit4] Suite: org.apache.lucene.index.TestParallelAtomicReader
[junit4:junit4] Completed on J1 in 0.65s, 6 tests
[junit4:junit4] 
[junit4:junit4] Suite: org.apache.lucene.search.TestTermRangeQuery
[junit4:junit4] Completed on J6 in 0.52s, 7 tests
[junit4:junit4] 
[junit4:junit4] Suite: org.apache.lucene.search.TestBooleanQuery
[junit4:junit4] Completed on J2 in 0.51s, 5 tests
[junit4:junit4] 
[junit4:junit4] Suite: org.apache.lucene.search.TestMultiPhraseQuery
[junit4:junit4] Completed on J3 in 1.87s, 16 tests, 1 skipped
[junit4:junit4] 
[junit4:junit4] Suite: org.apache.lucene.index.TestOmitPositions
[junit4:junit4] Completed on J5 in 0.62s, 4 tests
[junit4:junit4] 
[junit4:junit4] Suite: org.apache.lucene.search.TestFuzzyQuery
[junit4:junit4] Completed on J4 in 0.66s, 6 tests
[junit4:junit4] 
[junit4:junit4] Suite: org.apache.lucene.util.junitcompat.TestSystemPropertiesInvariantRule
[junit4:junit4] Completed on J6 in 0.49s, 5 tests
[junit4:junit4] 
[junit4:junit4] Suite: org.apache.lucene.search.TestAutomatonQuery
[junit4:junit4] Completed on J5 in 0.52s, 6 tests
[junit4:junit4] 
[junit4:junit4] Suite: org.apache.lucene.search.TestWildcardRandom
[junit4:junit4] Completed on J4 in 0.68s, 1 test
[junit4:junit4] 
[junit4:junit4] Suite: org.apache.lucene.search.spans.TestSpansAdvanced2
[junit4:junit4] Completed on J2 in 1.07s, 4 tests
[junit4:junit4] 
[junit4:junit4] Suite: org.apache.lucene.search.TestRegexpQuery
[junit4:junit4] Completed on J6 in 0.54s, 7 tests
[junit4:junit4] 
[junit4:junit4] Suite: org.apache.lucene.index.TestDocCount
[junit4:junit4] Completed on J4 in 0.21s, 1 test
[junit4:junit4] 
[junit4:junit4] Suite: org.apache.lucene.index.TestUniqueTermCount
[junit4:junit4] Completed on J2 in 0.27s, 1 test
[junit4:junit4] 
[junit4:junit4] Suite: org.apache.lucene.TestSearchForDuplicates
[junit4:junit4] Completed on J6 in 0.16s, 1 test
[junit4:junit4] 
[junit4:junit4] Suite: org.apache.lucene.search.spans.TestNearSpansOrdered
[junit4:junit4] Completed on J5 in 0.59s, 10 tests
[junit4:junit4] 
[junit4:junit4] Suite: org.apache.lucene.index.TestBinaryTerms
[junit4:junit4] Completed on J2 in 0.19s, 1 test
[junit4:junit4] 
[junit4:junit4] Suite: org.apache.lucene.index.TestIndexFileDeleter
[junit4:junit4] Completed on J6 in 0.12s, 1 test
[junit4:junit4] 
[junit4:junit4] Suite: org.apache.lucene.index.TestPerSegmentDeletes
[junit4:junit4] Completed on J4 in 0.31s, 1 test
[junit4:junit4] 
[junit4:junit4] Suite: org.apache.lucene.index.TestIndexWriterConfig
[junit4:junit4] Completed on J5 in 0.25s, 9 tests
[junit4:junit4] 
[junit4:junit4] Suite: org.apache.lucene.util.TestSetOnce
[junit4:junit4] Completed on J6 in 0.26s, 4 tests
[junit4:junit4] 
[junit4:junit4] Suite: org.apache.lucene.util.TestRollingBuffer
[junit4:junit4] Completed on J1 in 2.31s, 1 test
[junit4:junit4] 
[junit4:junit4] Suite: org.apache.lucene.search.TestFilteredSearch
[junit4:junit4] Completed on J4 in 0.25s, 1 test
[junit4:junit4] 
[junit4:junit4] Suite: org.apache.lucene.search.TestTopDocsCollector
[junit4:junit4] Completed on J2 in 0.33s, 8 tests
[junit4:junit4] 
[junit4:junit4] Suite: org.apache.lucene.util.TestUnicodeUtil
[junit4:junit4] Completed on J0 in 4.22s, 4 tests
[junit4:junit4] 
[junit4:junit4] Suite: org.apache.lucene.search.TestDocIdSet
[junit4:junit4] Completed on J5 in 0.15s, 3 tests
[junit4:junit4] 
[junit4:junit4] Suite: org.apache.lucene.util.junitcompat.TestSameRandomnessLocalePassedOrNot
[junit4:junit4] Completed on J4 in 0.14s, 1 test
[junit4:junit4] 
[junit4:junit4] Suite: org.apache.lucene.search.TestDocValuesScoring
[junit4:junit4] Completed on J6 in 0.26s, 1 test
[junit4:junit4] 
[junit4:junit4] Suite: org.apache.lucene.search.TestDateFilter
[junit4:junit4] Completed on J0 in 0.18s, 2 tests
[junit4:junit4] 
[junit4:junit4] Suite: org.apache.lucene.index.TestSegmentTermEnum
[junit4:junit4] Completed on J5 in 0.19s, 2 tests
[junit4:junit4] 
[junit4:junit4] Suite: org.apache.lucene.search.TestTermScorer
[junit4:junit4] Completed on J1 in 0.27s, 3 tests
[junit4:junit4] 
[junit4:junit4] Suite: org.apache.lucene.store.TestFileSwitchDirectory
[junit4:junit4] Completed on J2 in 0.30s, 4 tests
[junit4:junit4] 
[junit4:junit4] Suite: org.apache.lucene.search.TestConstantScoreQuery
[junit4:junit4] Completed on J6 in 0.21s, 3 tests
[junit4:junit4] 
[junit4:junit4] Suite: org.apache.lucene.index.TestSameTokenSamePosition
[junit4:junit4] Completed on J2 in 0.21s, 2 tests
[junit4:junit4] 
[junit4:junit4] Suite: org.apache.lucene.util.TestRecyclingByteBlockAllocator
[junit4:junit4] Completed on J0 in 0.44s, 3 tests
[junit4:junit4] 
[junit4:junit4] Suite: org.apache.lucene.store.TestDirectory
[junit4:junit4] IGNOR/A 0.06s J5 | TestDirectory.testThreadSafety
[junit4:junit4]    > Assumption #1: 'nightly' test group is disabled (@Nightly)
[junit4:junit4] Completed on J5 in 0.32s, 8 tests, 1 skipped
[junit4:junit4] 
[junit4:junit4] Suite: org.apache.lucene.search.TestExplanations
[junit4:junit4] Completed on J6 in 0.18s, 1 test
[junit4:junit4] 
[junit4:junit4] Suite: org.apache.lucene.util.TestCharsRef
[junit4:junit4] Completed on J1 in 0.35s, 8 tests
[junit4:junit4] 
[junit4:junit4] Suite: org.apache.lucene.search.TestMatchAllDocsQuery
[junit4:junit4] Completed on J2 in 0.14s, 2 tests
[junit4:junit4] 
[junit4:junit4] Suite: org.apache.lucene.search.TestNot
[junit4:junit4] Completed on J0 in 0.15s, 1 test
[junit4:junit4] 
[junit4:junit4] Suite: org.apache.lucene.search.TestSimilarity
[junit4:junit4] Completed on J5 in 0.14s, 1 test
[junit4:junit4] 
[junit4:junit4] Suite: org.apache.lucene.search.TestSimilarityProvider
[junit4:junit4] Completed on J6 in 0.14s, 1 test
[junit4:junit4] 
[junit4:junit4] Suite: org.apache.lucene.search.TestPrefixQuery
[junit4:junit4] Completed on J1 in 0.10s, 1 test
[junit4:junit4] 
[junit4:junit4] Suite: org.apache.lucene.search.TestTopScoreDocCollector
[junit4:junit4] Completed on J2 in 0.09s, 1 test
[junit4:junit4] 
[junit4:junit4] Suite: org.apache.lucene.store.TestLock
[junit4:junit4] Completed on J5 in 0.09s, 1 test
[junit4:junit4] 
[junit4:junit4] Suite: org.apache.lucene.search.spans.TestSpanFirstQuery
[junit4:junit4] Completed on J0 in 0.14s, 1 test
[junit4:junit4] 
[junit4:junit4] Suite: org.apache.lucene.util.TestBytesRef
[junit4:junit4] Completed on J6 in 0.11s, 5 tests
[junit4:junit4] 
[junit4:junit4] Suite: org.apache.lucene.search.TestBooleanScorer
[junit4:junit4] Completed on J4 in 1.05s, 3 tests
[junit4:junit4] 
[junit4:junit4] Suite: org.apache.lucene.util.TestIntsRef
[junit4:junit4] Completed on J1 in 0.09s, 2 tests
[junit4:junit4] 
[junit4:junit4] Suite: org.apache.lucene.util.TestIdentityHashSet
[junit4:junit4] Completed on J3 in 3.62s, 1 test
[junit4:junit4] 
[junit4:junit4] Suite: org.apache.lucene.util.TestPriorityQueue
[junit4:junit4] Completed on J2 in 0.16s, 4 tests
[junit4:junit4] 
[junit4:junit4] Suite: org.apache.lucene.util.TestVirtualMethod
[junit4:junit4] Completed on J0 in 0.07s, 2 tests
[junit4:junit4] 
[junit4:junit4] Suite: org.apache.lucene.index.Test2BTerms
[junit4:junit4] Completed on J5 in 0.03s, 1 test, 1 skipped
[junit4:junit4] 
[junit4:junit4] Suite: org.apache.lucene.util.TestRamUsageEstimator
[junit4:junit4] Completed on J6 in 0.09s, 3 tests
[junit4:junit4] 
[junit4:junit4] Suite: org.apache.lucene.search.TestNGramPhraseQuery
[junit4:junit4] Completed on J4 in 0.09s, 1 test
[junit4:junit4] 
[junit4:junit4] Suite: org.apache.lucene.index.TestIsCurrent
[junit4:junit4] Completed on J1 in 0.13s, 2 tests
[junit4:junit4] 
[junit4:junit4] Suite: org.apache.lucene.index.TestRollback
[junit4:junit4] Completed on J3 in 0.13s, 1 test
[junit4:junit4] 
[junit4:junit4] Suite: org.apache.lucene.util.TestBitUtil
[junit4:junit4] Completed on J0 in 0.10s, 2 tests
[junit4:junit4] 
[junit4:junit4] Suite: org.apache.lucene.search.MultiCollectorTest
[junit4:junit4] Completed on J2 in 0.22s, 3 tests
[junit4:junit4] 
[junit4:junit4] Suite: org.apache.lucene.index.TestIndexWriterLockRelease
[junit4:junit4] Completed on J5 in 0.10s, 1 test
[junit4:junit4] 
[junit4:junit4] Suite: org.apache.lucene.util.TestCloseableThreadLocal
[junit4:junit4] Completed on J6 in 0.13s, 3 tests
[junit4:junit4] 
[junit4:junit4] Suite: org.apache.lucene.util.TestVersionComparator
[junit4:junit4] Completed on J4 in 0.08s, 1 test
[junit4:junit4] 
[junit4:junit4] Suite: org.apache.lucene.index.TestNoMergeScheduler
[junit4:junit4] Completed on J1 in 0.14s, 3 tests
[junit4:junit4] 
[junit4:junit4] Suite: org.apache.lucene.util.TestByteBlockPool
[junit4:junit4] Completed on J3 in 0.17s, 1 test
[junit4:junit4] 
[junit4:junit4] Suite: org.apache.lucene.analysis.TestCachingTokenFilter
[junit4:junit4] Completed on J0 in 0.15s, 1 test
[junit4:junit4] 
[junit4:junit4] Suite: org.apache.lucene.TestAssertions
[junit4:junit4] Completed on J2 in 0.13s, 1 test
[junit4:junit4] 
[junit4:junit4] Suite: org.apache.lucene.index.TestIndexCommit
[junit4:junit4] Completed on J5 in 0.08s, 1 test
[junit4:junit4] 
[junit4:junit4] Suite: org.apache.lucene.index.TestTerm
[junit4:junit4] Completed on J6 in 0.09s, 1 test
[junit4:junit4] 
[junit4:junit4] Suite: org.apache.lucene.TestWorstCaseTestBehavior
[junit4:junit4] Completed on J4 in 0.07s, 6 tests, 6 skipped
[junit4:junit4] 
[junit4:junit4] Suite: org.apache.lucene.index.TestPayloadsOnVectors
[junit4:junit4] Completed on J1 in 0.21s, 3 tests
[junit4:junit4] 
[junit4:junit4] Suite: org.apache.lucene.index.TestPostingsFormat
[junit4:junit4] Completed on J3 in 0.18s, 1 test
[junit4:junit4] 
[junit4:junit4] Suite: org.apache.lucene.search.TestBooleanQueryVisitSubscorers
[junit4:junit4] Completed on J0 in 0.23s, 3 tests
[junit4:junit4] 
[junit4:junit4] Suite: org.apache.lucene.search.TestConjunctions
[junit4:junit4] Completed on J2 in 0.21s, 1 test
[junit4:junit4] 
[junit4:junit4] Suite: org.apache.lucene.store.TestMockDirectoryWrapper
[junit4:junit4] Completed on J6 in 0.11s, 2 tests
[junit4:junit4] 
[junit4:junit4] Suite: org.apache.lucene.util.TestMaxFailuresRule
[junit4:junit4] Completed on J5 in 1.48s, 1 test
[junit4:junit4] 
[junit4:junit4] Suite: org.apache.lucene.index.TestSegmentTermDocs
[junit4:junit4] Completed on J7 in 15.62s, 5 tests
[junit4:junit4] 
[junit4:junit4] JVM J0:     1.91 ..   181.24 =   179.33s
[junit4:junit4] JVM J1:     1.91 ..   181.34 =   179.42s
[junit4:junit4] JVM J2:     1.90 ..   181.26 =   179.36s
[junit4:junit4] JVM J3:     1.92 ..   181.35 =   179.43s
[junit4:junit4] JVM J4:     1.92 ..   181.32 =   179.40s
[junit4:junit4] JVM J5:     1.91 ..   182.78 =   180.87s
[junit4:junit4] JVM J6:     1.91 ..   181.27 =   179.36s
[junit4:junit4] JVM J7:     1.91 ..   186.02 =   184.11s
[junit4:junit4] Execution time total: 3 minutes 6 seconds
[junit4:junit4] Tests summary: 307 suites, 1780 tests, 1 failure, 17 ignored (9 assumptions)

BUILD FAILED
/var/lib/jenkins/workspace/Lucene-trunk-Linux-Java7-64-test-only/checkout/lucene/build.xml:49: The following error occurred while executing this line:
/var/lib/jenkins/workspace/Lucene-trunk-Linux-Java7-64-test-only/checkout/lucene/common-build.xml:1133: The following error occurred while executing this line:
/var/lib/jenkins/workspace/Lucene-trunk-Linux-Java7-64-test-only/checkout/lucene/common-build.xml:810: There were test failures: 307 suites, 1780 tests, 1 failure, 17 ignored (9 assumptions)

Total time: 3 minutes 40 seconds
Build step 'Invoke Ant' marked build as failure
Archiving artifacts
Recording test results
Email was triggered for: Failure
Sending email for trigger: Failure




Mime
View raw message