lucene-dev mailing list archives

Site index · List index
Message view « Date » · « Thread »
Top « Date » · « Thread »
From Apache Jenkins Server <jenk...@builds.apache.org>
Subject [JENKINS] Lucene-Solr-NightlyTests-trunk - Build # 40 - Still Failing
Date Fri, 21 Sep 2012 03:41:14 GMT
Build: https://builds.apache.org/job/Lucene-Solr-NightlyTests-trunk/40/

1 tests failed.
FAILED:  org.apache.solr.cloud.BasicDistributedZk2Test.testDistribSearch

Error Message:
Shard still reported as live in zk

Stack Trace:
java.lang.AssertionError: Shard still reported as live in zk
	at __randomizedtesting.SeedInfo.seed([D95567432077FF9C:58B3E95B57289FA0]:0)
	at org.junit.Assert.fail(Assert.java:93)
	at org.apache.solr.cloud.AbstractFullDistribZkTestBase.waitToSeeNotLive(AbstractFullDistribZkTestBase.java:1220)
	at org.apache.solr.cloud.BasicDistributedZk2Test.brindDownShardIndexSomeDocsAndRecover(BasicDistributedZk2Test.java:190)
	at org.apache.solr.cloud.BasicDistributedZk2Test.doTest(BasicDistributedZk2Test.java:83)
	at org.apache.solr.BaseDistributedSearchTestCase.testDistribSearch(BaseDistributedSearchTestCase.java:695)
	at sun.reflect.NativeMethodAccessorImpl.invoke0(Native Method)
	at sun.reflect.NativeMethodAccessorImpl.invoke(NativeMethodAccessorImpl.java:57)
	at sun.reflect.DelegatingMethodAccessorImpl.invoke(DelegatingMethodAccessorImpl.java:43)
	at java.lang.reflect.Method.invoke(Method.java:616)
	at com.carrotsearch.randomizedtesting.RandomizedRunner.invoke(RandomizedRunner.java:1559)
	at com.carrotsearch.randomizedtesting.RandomizedRunner.access$600(RandomizedRunner.java:79)
	at com.carrotsearch.randomizedtesting.RandomizedRunner$6.evaluate(RandomizedRunner.java:737)
	at com.carrotsearch.randomizedtesting.RandomizedRunner$7.evaluate(RandomizedRunner.java:773)
	at com.carrotsearch.randomizedtesting.RandomizedRunner$8.evaluate(RandomizedRunner.java:787)
	at com.carrotsearch.randomizedtesting.rules.SystemPropertiesRestoreRule$1.evaluate(SystemPropertiesRestoreRule.java:53)
	at org.apache.lucene.util.TestRuleSetupTeardownChained$1.evaluate(TestRuleSetupTeardownChained.java:50)
	at org.apache.lucene.util.TestRuleFieldCacheSanity$1.evaluate(TestRuleFieldCacheSanity.java:51)
	at org.apache.lucene.util.AbstractBeforeAfterRule$1.evaluate(AbstractBeforeAfterRule.java:45)
	at com.carrotsearch.randomizedtesting.rules.SystemPropertiesInvariantRule$1.evaluate(SystemPropertiesInvariantRule.java:55)
	at org.apache.lucene.util.TestRuleThreadAndTestName$1.evaluate(TestRuleThreadAndTestName.java:48)
	at org.apache.lucene.util.TestRuleIgnoreAfterMaxFailures$1.evaluate(TestRuleIgnoreAfterMaxFailures.java:70)
	at org.apache.lucene.util.TestRuleMarkFailure$1.evaluate(TestRuleMarkFailure.java:48)
	at com.carrotsearch.randomizedtesting.rules.StatementAdapter.evaluate(StatementAdapter.java:36)
	at com.carrotsearch.randomizedtesting.ThreadLeakControl$StatementRunner.run(ThreadLeakControl.java:358)
	at com.carrotsearch.randomizedtesting.ThreadLeakControl.forkTimeoutingTask(ThreadLeakControl.java:782)
	at com.carrotsearch.randomizedtesting.ThreadLeakControl$3.evaluate(ThreadLeakControl.java:442)
	at com.carrotsearch.randomizedtesting.RandomizedRunner.runSingleTest(RandomizedRunner.java:746)
	at com.carrotsearch.randomizedtesting.RandomizedRunner$3.evaluate(RandomizedRunner.java:648)
	at com.carrotsearch.randomizedtesting.RandomizedRunner$4.evaluate(RandomizedRunner.java:682)
	at com.carrotsearch.randomizedtesting.RandomizedRunner$5.evaluate(RandomizedRunner.java:693)
	at com.carrotsearch.randomizedtesting.rules.StatementAdapter.evaluate(StatementAdapter.java:36)
	at com.carrotsearch.randomizedtesting.rules.SystemPropertiesRestoreRule$1.evaluate(SystemPropertiesRestoreRule.java:53)
	at org.apache.lucene.util.AbstractBeforeAfterRule$1.evaluate(AbstractBeforeAfterRule.java:45)
	at org.apache.lucene.util.TestRuleStoreClassName$1.evaluate(TestRuleStoreClassName.java:42)
	at com.carrotsearch.randomizedtesting.rules.SystemPropertiesInvariantRule$1.evaluate(SystemPropertiesInvariantRule.java:55)
	at com.carrotsearch.randomizedtesting.rules.NoShadowingOrOverridesOnMethodsRule$1.evaluate(NoShadowingOrOverridesOnMethodsRule.java:39)
	at com.carrotsearch.randomizedtesting.rules.NoShadowingOrOverridesOnMethodsRule$1.evaluate(NoShadowingOrOverridesOnMethodsRule.java:39)
	at com.carrotsearch.randomizedtesting.rules.StatementAdapter.evaluate(StatementAdapter.java:36)
	at org.apache.lucene.util.TestRuleAssertionsRequired$1.evaluate(TestRuleAssertionsRequired.java:43)
	at org.apache.lucene.util.TestRuleMarkFailure$1.evaluate(TestRuleMarkFailure.java:48)
	at org.apache.lucene.util.TestRuleIgnoreAfterMaxFailures$1.evaluate(TestRuleIgnoreAfterMaxFailures.java:70)
	at org.apache.lucene.util.TestRuleIgnoreTestSuites$1.evaluate(TestRuleIgnoreTestSuites.java:55)
	at com.carrotsearch.randomizedtesting.rules.StatementAdapter.evaluate(StatementAdapter.java:36)
	at com.carrotsearch.randomizedtesting.ThreadLeakControl$StatementRunner.run(ThreadLeakControl.java:358)
	at java.lang.Thread.run(Thread.java:679)




Build Log:
[...truncated 7714 lines...]
[junit4:junit4] Suite: org.apache.solr.cloud.BasicDistributedZk2Test
[junit4:junit4]   2> 3 T3429 oas.SolrTestCaseJ4.setUp ###Starting testDistribSearch
[junit4:junit4]   2> Creating dataDir: /usr/home/hudson/hudson-slave/workspace/Lucene-Solr-NightlyTests-trunk/solr/build/solr-core/test/J1/./solrtest-BasicDistributedZk2Test-1348198443029
[junit4:junit4]   2> 18 T3429 oasc.ZkTestServer.run STARTING ZK TEST SERVER
[junit4:junit4]   2> 21 T3430 oazs.ZooKeeperServer.setTickTime tickTime set to 1000
[junit4:junit4]   2> 21 T3430 oazs.NIOServerCnxn$Factory.<init> binding to port 0.0.0.0/0.0.0.0:0
[junit4:junit4]   2> 22 T3430 oazsp.FileTxnSnapLog.save Snapshotting: 0
[junit4:junit4]   2> 119 T3429 oasc.ZkTestServer.run start zk server on port:25019
[junit4:junit4]   2> 119 T3429 oaz.ZooKeeper.<init> Initiating client connection, connectString=127.0.0.1:25019 sessionTimeout=10000 watcher=org.apache.solr.common.cloud.ConnectionManager@59e4c5fc
[junit4:junit4]   2> 120 T3435 oaz.ClientCnxn$SendThread.startConnect Opening socket connection to server /127.0.0.1:25019
[junit4:junit4]   2> 120 T3429 oascc.ConnectionManager.waitForConnected Waiting for client to connect to ZooKeeper
[junit4:junit4]   2> 121 T3435 oaz.ClientCnxn$SendThread.primeConnection Socket connection established to localhost/127.0.0.1:25019, initiating session
[junit4:junit4]   2> 121 T3431 oazs.NIOServerCnxn$Factory.run Accepted socket connection from /140.211.11.196:47763
[junit4:junit4]   2> 122 T3431 oazs.NIOServerCnxn.readConnectRequest Client attempting to establish new session at /140.211.11.196:47763
[junit4:junit4]   2> 122 T3433 oazsp.FileTxnLog.append Creating new log file: log.1
[junit4:junit4]   2> 143 T3433 oazs.NIOServerCnxn.finishSessionInit Established session 0x139e6e3a81b0000 with negotiated timeout 10000 for client /140.211.11.196:47763
[junit4:junit4]   2> 143 T3435 oaz.ClientCnxn$SendThread.readConnectResult Session establishment complete on server localhost/127.0.0.1:25019, sessionid = 0x139e6e3a81b0000, negotiated timeout = 10000
[junit4:junit4]   2> 143 T3436 oascc.ConnectionManager.process Watcher org.apache.solr.common.cloud.ConnectionManager@59e4c5fc name:ZooKeeperConnection Watcher:127.0.0.1:25019 got event WatchedEvent state:SyncConnected type:None path:null path:null type:None
[junit4:junit4]   2> 143 T3429 oascc.ConnectionManager.waitForConnected Client is connected to ZooKeeper
[junit4:junit4]   2> 144 T3429 oascc.SolrZkClient.makePath makePath: /solr
[junit4:junit4]   2> 146 T3434 oazs.PrepRequestProcessor.pRequest Processed session termination for sessionid: 0x139e6e3a81b0000
[junit4:junit4]   2> 147 T3436 oaz.ClientCnxn$EventThread.run EventThread shut down
[junit4:junit4]   2> 148 T3431 oazs.NIOServerCnxn.closeSock Closed socket connection for client /140.211.11.196:47763 which had sessionid 0x139e6e3a81b0000
[junit4:junit4]   2> 147 T3429 oaz.ZooKeeper.close Session: 0x139e6e3a81b0000 closed
[junit4:junit4]   2> 148 T3429 oaz.ZooKeeper.<init> Initiating client connection, connectString=127.0.0.1:25019/solr sessionTimeout=10000 watcher=org.apache.solr.common.cloud.ConnectionManager@4e46cf03
[junit4:junit4]   2> 149 T3437 oaz.ClientCnxn$SendThread.startConnect Opening socket connection to server /127.0.0.1:25019
[junit4:junit4]   2> 149 T3429 oascc.ConnectionManager.waitForConnected Waiting for client to connect to ZooKeeper
[junit4:junit4]   2> 149 T3437 oaz.ClientCnxn$SendThread.primeConnection Socket connection established to localhost/127.0.0.1:25019, initiating session
[junit4:junit4]   2> 150 T3431 oazs.NIOServerCnxn$Factory.run Accepted socket connection from /140.211.11.196:39895
[junit4:junit4]   2> 150 T3431 oazs.NIOServerCnxn.readConnectRequest Client attempting to establish new session at /140.211.11.196:39895
[junit4:junit4]   2> 163 T3433 oazs.NIOServerCnxn.finishSessionInit Established session 0x139e6e3a81b0001 with negotiated timeout 10000 for client /140.211.11.196:39895
[junit4:junit4]   2> 163 T3437 oaz.ClientCnxn$SendThread.readConnectResult Session establishment complete on server localhost/127.0.0.1:25019, sessionid = 0x139e6e3a81b0001, negotiated timeout = 10000
[junit4:junit4]   2> 163 T3438 oascc.ConnectionManager.process Watcher org.apache.solr.common.cloud.ConnectionManager@4e46cf03 name:ZooKeeperConnection Watcher:127.0.0.1:25019/solr got event WatchedEvent state:SyncConnected type:None path:null path:null type:None
[junit4:junit4]   2> 164 T3429 oascc.ConnectionManager.waitForConnected Client is connected to ZooKeeper
[junit4:junit4]   2> 164 T3429 oascc.SolrZkClient.makePath makePath: /collections/collection1
[junit4:junit4]   2> 190 T3429 oascc.SolrZkClient.makePath makePath: /collections/collection1/shards
[junit4:junit4]   2> 194 T3429 oascc.SolrZkClient.makePath makePath: /collections/control_collection
[junit4:junit4]   2> 229 T3429 oascc.SolrZkClient.makePath makePath: /collections/control_collection/shards
[junit4:junit4]   2> 232 T3429 oasc.AbstractZkTestCase.putConfig put /usr/home/hudson/hudson-slave/workspace/Lucene-Solr-NightlyTests-trunk/solr/build/solr-core/test-files/solr/collection1/conf/solrconfig.xml to /configs/conf1/solrconfig.xml
[junit4:junit4]   2> 233 T3429 oascc.SolrZkClient.makePath makePath: /configs/conf1/solrconfig.xml
[junit4:junit4]   2> 252 T3429 oasc.AbstractZkTestCase.putConfig put /usr/home/hudson/hudson-slave/workspace/Lucene-Solr-NightlyTests-trunk/solr/build/solr-core/test-files/solr/collection1/conf/schema.xml to /configs/conf1/schema.xml
[junit4:junit4]   2> 253 T3429 oascc.SolrZkClient.makePath makePath: /configs/conf1/schema.xml
[junit4:junit4]   2> 363 T3429 oasc.AbstractZkTestCase.putConfig put /usr/home/hudson/hudson-slave/workspace/Lucene-Solr-NightlyTests-trunk/solr/build/solr-core/test-files/solr/collection1/conf/solrconfig.xml to /configs/conf1/solrconfig.xml
[junit4:junit4]   2> 364 T3429 oascc.SolrZkClient.makePath makePath: /configs/conf1/solrconfig.xml
[junit4:junit4]   2> 414 T3429 oasc.AbstractZkTestCase.putConfig put /usr/home/hudson/hudson-slave/workspace/Lucene-Solr-NightlyTests-trunk/solr/build/solr-core/test-files/solr/collection1/conf/stopwords.txt to /configs/conf1/stopwords.txt
[junit4:junit4]   2> 415 T3429 oascc.SolrZkClient.makePath makePath: /configs/conf1/stopwords.txt
[junit4:junit4]   2> 439 T3429 oasc.AbstractZkTestCase.putConfig put /usr/home/hudson/hudson-slave/workspace/Lucene-Solr-NightlyTests-trunk/solr/build/solr-core/test-files/solr/collection1/conf/protwords.txt to /configs/conf1/protwords.txt
[junit4:junit4]   2> 439 T3429 oascc.SolrZkClient.makePath makePath: /configs/conf1/protwords.txt
[junit4:junit4]   2> 469 T3429 oasc.AbstractZkTestCase.putConfig put /usr/home/hudson/hudson-slave/workspace/Lucene-Solr-NightlyTests-trunk/solr/build/solr-core/test-files/solr/collection1/conf/currency.xml to /configs/conf1/currency.xml
[junit4:junit4]   2> 470 T3429 oascc.SolrZkClient.makePath makePath: /configs/conf1/currency.xml
[junit4:junit4]   2> 480 T3429 oasc.AbstractZkTestCase.putConfig put /usr/home/hudson/hudson-slave/workspace/Lucene-Solr-NightlyTests-trunk/solr/build/solr-core/test-files/solr/collection1/conf/open-exchange-rates.json to /configs/conf1/open-exchange-rates.json
[junit4:junit4]   2> 481 T3429 oascc.SolrZkClient.makePath makePath: /configs/conf1/open-exchange-rates.json
[junit4:junit4]   2> 492 T3429 oasc.AbstractZkTestCase.putConfig put /usr/home/hudson/hudson-slave/workspace/Lucene-Solr-NightlyTests-trunk/solr/build/solr-core/test-files/solr/collection1/conf/mapping-ISOLatin1Accent.txt to /configs/conf1/mapping-ISOLatin1Accent.txt
[junit4:junit4]   2> 492 T3429 oascc.SolrZkClient.makePath makePath: /configs/conf1/mapping-ISOLatin1Accent.txt
[junit4:junit4]   2> 502 T3429 oasc.AbstractZkTestCase.putConfig put /usr/home/hudson/hudson-slave/workspace/Lucene-Solr-NightlyTests-trunk/solr/build/solr-core/test-files/solr/collection1/conf/old_synonyms.txt to /configs/conf1/old_synonyms.txt
[junit4:junit4]   2> 503 T3429 oascc.SolrZkClient.makePath makePath: /configs/conf1/old_synonyms.txt
[junit4:junit4]   2> 510 T3429 oasc.AbstractZkTestCase.putConfig put /usr/home/hudson/hudson-slave/workspace/Lucene-Solr-NightlyTests-trunk/solr/build/solr-core/test-files/solr/collection1/conf/synonyms.txt to /configs/conf1/synonyms.txt
[junit4:junit4]   2> 510 T3429 oascc.SolrZkClient.makePath makePath: /configs/conf1/synonyms.txt
[junit4:junit4]   2> 518 T3434 oazs.PrepRequestProcessor.pRequest Processed session termination for sessionid: 0x139e6e3a81b0001
[junit4:junit4]   2> 524 T3438 oaz.ClientCnxn$EventThread.run EventThread shut down
[junit4:junit4]   2> 524 T3431 oazs.NIOServerCnxn.closeSock Closed socket connection for client /140.211.11.196:39895 which had sessionid 0x139e6e3a81b0001
[junit4:junit4]   2> 524 T3429 oaz.ZooKeeper.close Session: 0x139e6e3a81b0001 closed
[junit4:junit4]   2> 526 T3429 oejs.Server.doStart jetty-8.1.2.v20120308
[junit4:junit4]   2> 528 T3429 oejs.AbstractConnector.doStart Started SocketConnector@0.0.0.0:17806
[junit4:junit4]   2> 528 T3429 oasc.SolrResourceLoader.locateSolrHome JNDI not configured for solr (NoInitialContextEx)
[junit4:junit4]   2> 529 T3429 oasc.SolrResourceLoader.locateSolrHome using system property solr.solr.home: /usr/home/hudson/hudson-slave/workspace/Lucene-Solr-NightlyTests-trunk/solr/build/solr-core/test-files/solr
[junit4:junit4]   2> 529 T3429 oasc.SolrResourceLoader.<init> new SolrResourceLoader for deduced Solr Home: '/usr/home/hudson/hudson-slave/workspace/Lucene-Solr-NightlyTests-trunk/solr/build/solr-core/test-files/solr/'
[junit4:junit4]   2> 552 T3429 oass.SolrDispatchFilter.init SolrDispatchFilter.init()
[junit4:junit4]   2> 552 T3429 oasc.SolrResourceLoader.locateSolrHome JNDI not configured for solr (NoInitialContextEx)
[junit4:junit4]   2> 553 T3429 oasc.SolrResourceLoader.locateSolrHome using system property solr.solr.home: /usr/home/hudson/hudson-slave/workspace/Lucene-Solr-NightlyTests-trunk/solr/build/solr-core/test-files/solr
[junit4:junit4]   2> 553 T3429 oasc.CoreContainer$Initializer.initialize looking for solr.xml: /usr/home/hudson/hudson-slave/workspace/Lucene-Solr-NightlyTests-trunk/solr/build/solr-core/test-files/solr/solr.xml
[junit4:junit4]   2> 553 T3429 oasc.CoreContainer.<init> New CoreContainer 1827888020
[junit4:junit4]   2> 554 T3429 oasc.CoreContainer.load Loading CoreContainer using Solr Home: '/usr/home/hudson/hudson-slave/workspace/Lucene-Solr-NightlyTests-trunk/solr/build/solr-core/test-files/solr/'
[junit4:junit4]   2> 554 T3429 oasc.SolrResourceLoader.<init> new SolrResourceLoader for directory: '/usr/home/hudson/hudson-slave/workspace/Lucene-Solr-NightlyTests-trunk/solr/build/solr-core/test-files/solr/'
[junit4:junit4]   2> 571 T3429 oasc.CoreContainer.load Registering Log Listener
[junit4:junit4]   2> 582 T3429 oasc.CoreContainer.initZooKeeper Zookeeper client=127.0.0.1:25019/solr
[junit4:junit4]   2> 583 T3429 oaz.ZooKeeper.<init> Initiating client connection, connectString=127.0.0.1:25019/solr sessionTimeout=5000 watcher=org.apache.solr.common.cloud.ConnectionManager@fe582cf
[junit4:junit4]   2> 584 T3448 oaz.ClientCnxn$SendThread.startConnect Opening socket connection to server /127.0.0.1:25019
[junit4:junit4]   2> 584 T3429 oascc.ConnectionManager.waitForConnected Waiting for client to connect to ZooKeeper
[junit4:junit4]   2> 585 T3448 oaz.ClientCnxn$SendThread.primeConnection Socket connection established to localhost/127.0.0.1:25019, initiating session
[junit4:junit4]   2> 585 T3431 oazs.NIOServerCnxn$Factory.run Accepted socket connection from /140.211.11.196:56413
[junit4:junit4]   2> 585 T3431 oazs.NIOServerCnxn.readConnectRequest Client attempting to establish new session at /140.211.11.196:56413
[junit4:junit4]   2> 589 T3433 oazs.NIOServerCnxn.finishSessionInit Established session 0x139e6e3a81b0002 with negotiated timeout 5000 for client /140.211.11.196:56413
[junit4:junit4]   2> 589 T3448 oaz.ClientCnxn$SendThread.readConnectResult Session establishment complete on server localhost/127.0.0.1:25019, sessionid = 0x139e6e3a81b0002, negotiated timeout = 5000
[junit4:junit4]   2> 590 T3449 oascc.ConnectionManager.process Watcher org.apache.solr.common.cloud.ConnectionManager@fe582cf name:ZooKeeperConnection Watcher:127.0.0.1:25019/solr got event WatchedEvent state:SyncConnected type:None path:null path:null type:None
[junit4:junit4]   2> 590 T3429 oascc.ConnectionManager.waitForConnected Client is connected to ZooKeeper
[junit4:junit4]   2> 597 T3434 oazs.PrepRequestProcessor.pRequest Got user-level KeeperException when processing sessionid:0x139e6e3a81b0002 type:create cxid:0x2 zxid:0xfffffffffffffffe txntype:unknown reqpath:n/a Error Path:/solr/overseer Error:KeeperErrorCode = NodeExists for /solr/overseer
[junit4:junit4]   2> 605 T3429 oascc.SolrZkClient.makePath makePath: /live_nodes
[junit4:junit4]   2> 612 T3429 oasc.ZkController.createEphemeralLiveNode Register node as live in ZooKeeper:/live_nodes/127.0.0.1:17806_solr
[junit4:junit4]   2> 613 T3434 oazs.PrepRequestProcessor.pRequest Got user-level KeeperException when processing sessionid:0x139e6e3a81b0002 type:delete cxid:0x7 zxid:0xfffffffffffffffe txntype:unknown reqpath:n/a Error Path:/solr/live_nodes/127.0.0.1:17806_solr Error:KeeperErrorCode = NoNode for /solr/live_nodes/127.0.0.1:17806_solr
[junit4:junit4]   2> 624 T3429 oascc.SolrZkClient.makePath makePath: /live_nodes/127.0.0.1:17806_solr
[junit4:junit4]   2> 635 T3429 oashc.HttpShardHandlerFactory.getParameter Setting socketTimeout to: 0
[junit4:junit4]   2> 636 T3429 oashc.HttpShardHandlerFactory.getParameter Setting urlScheme to: http://
[junit4:junit4]   2> 636 T3429 oashc.HttpShardHandlerFactory.getParameter Setting connTimeout to: 0
[junit4:junit4]   2> 636 T3429 oashc.HttpShardHandlerFactory.getParameter Setting maxConnectionsPerHost to: 20
[junit4:junit4]   2> 637 T3429 oashc.HttpShardHandlerFactory.getParameter Setting corePoolSize to: 0
[junit4:junit4]   2> 637 T3429 oashc.HttpShardHandlerFactory.getParameter Setting maximumPoolSize to: 2147483647
[junit4:junit4]   2> 637 T3429 oashc.HttpShardHandlerFactory.getParameter Setting maxThreadIdleTime to: 5
[junit4:junit4]   2> 637 T3429 oashc.HttpShardHandlerFactory.getParameter Setting sizeOfQueue to: -1
[junit4:junit4]   2> 638 T3429 oashc.HttpShardHandlerFactory.getParameter Setting fairnessPolicy to: false
[junit4:junit4]   2> 638 T3429 oascsi.HttpClientUtil.createClient Creating new http client, config:maxConnectionsPerHost=20&maxConnections=10000&socketTimeout=0&connTimeout=0&retry=false
[junit4:junit4]   2> 649 T3429 oascc.SolrZkClient.makePath makePath: /overseer_elect/election
[junit4:junit4]   2> 676 T3434 oazs.PrepRequestProcessor.pRequest Got user-level KeeperException when processing sessionid:0x139e6e3a81b0002 type:delete cxid:0x15 zxid:0xfffffffffffffffe txntype:unknown reqpath:n/a Error Path:/solr/overseer_elect/leader Error:KeeperErrorCode = NoNode for /solr/overseer_elect/leader
[junit4:junit4]   2> 677 T3429 oascc.SolrZkClient.makePath makePath: /overseer_elect/leader
[junit4:junit4]   2> 690 T3429 oasc.Overseer.start Overseer (id=88355533162741762-127.0.0.1:17806_solr-n_0000000000) starting
[junit4:junit4]   2> 690 T3434 oazs.PrepRequestProcessor.pRequest Got user-level KeeperException when processing sessionid:0x139e6e3a81b0002 type:create cxid:0x1a zxid:0xfffffffffffffffe txntype:unknown reqpath:n/a Error Path:/solr/overseer Error:KeeperErrorCode = NodeExists for /solr/overseer
[junit4:junit4]   2> 692 T3434 oazs.PrepRequestProcessor.pRequest Got user-level KeeperException when processing sessionid:0x139e6e3a81b0002 type:create cxid:0x1b zxid:0xfffffffffffffffe txntype:unknown reqpath:n/a Error Path:/solr/overseer Error:KeeperErrorCode = NodeExists for /solr/overseer
[junit4:junit4]   2> 702 T3434 oazs.PrepRequestProcessor.pRequest Got user-level KeeperException when processing sessionid:0x139e6e3a81b0002 type:create cxid:0x1c zxid:0xfffffffffffffffe txntype:unknown reqpath:n/a Error Path:/solr/overseer Error:KeeperErrorCode = NodeExists for /solr/overseer
[junit4:junit4]   2> 703 T3434 oazs.PrepRequestProcessor.pRequest Got user-level KeeperException when processing sessionid:0x139e6e3a81b0002 type:create cxid:0x1d zxid:0xfffffffffffffffe txntype:unknown reqpath:n/a Error Path:/solr/overseer Error:KeeperErrorCode = NodeExists for /solr/overseer
[junit4:junit4]   2> 704 T3451 oasc.OverseerCollectionProcessor.run Process current queue of collection creations
[junit4:junit4]   2> 705 T3429 oascc.SolrZkClient.makePath makePath: /clusterstate.json
[junit4:junit4]   2> 719 T3429 oascc.ZkStateReader.createClusterStateWatchersAndUpdate Updating cluster state from ZooKeeper... 
[junit4:junit4]   2> 721 T3450 oasc.Overseer$ClusterStateUpdater.run Starting to work on the main queue
[junit4:junit4]   2> 726 T3429 oasc.CoreContainer.create Creating SolrCore 'collection1' using instanceDir: /usr/home/hudson/hudson-slave/workspace/Lucene-Solr-NightlyTests-trunk/solr/build/solr-core/test-files/solr/collection1
[junit4:junit4]   2> 727 T3429 oasc.ZkController.createCollectionZkNode Check for collection zkNode:control_collection
[junit4:junit4]   2> 728 T3429 oasc.ZkController.createCollectionZkNode Collection zkNode exists
[junit4:junit4]   2> 728 T3429 oasc.ZkController.readConfigName Load collection config from:/collections/control_collection
[junit4:junit4]   2> 730 T3429 oasc.SolrResourceLoader.<init> new SolrResourceLoader for directory: '/usr/home/hudson/hudson-slave/workspace/Lucene-Solr-NightlyTests-trunk/solr/build/solr-core/test-files/solr/collection1/'
[junit4:junit4]   2> 731 T3429 oasc.SolrResourceLoader.replaceClassLoader Adding 'file:/usr/home/hudson/hudson-slave/workspace/Lucene-Solr-NightlyTests-trunk/solr/build/solr-core/test-files/solr/collection1/lib/classes/' to classloader
[junit4:junit4]   2> 732 T3429 oasc.SolrResourceLoader.replaceClassLoader Adding 'file:/usr/home/hudson/hudson-slave/workspace/Lucene-Solr-NightlyTests-trunk/solr/build/solr-core/test-files/solr/collection1/lib/README' to classloader
[junit4:junit4]   2> 782 T3429 oasc.SolrConfig.<init> Using Lucene MatchVersion: LUCENE_50
[junit4:junit4]   2> 854 T3429 oasc.SolrConfig.<init> Loaded SolrConfig: solrconfig.xml
[junit4:junit4]   2> 955 T3429 oass.IndexSchema.readSchema Reading Solr Schema
[junit4:junit4]   2> 960 T3429 oass.IndexSchema.readSchema Schema name=test
[junit4:junit4]   2> 1608 T3429 oass.OpenExchangeRatesOrgProvider.init Initialized with rates=open-exchange-rates.json, refreshInterval=1440.
[junit4:junit4]   2> 1621 T3429 oass.IndexSchema.readSchema default search field in schema is text
[junit4:junit4]   2> 1626 T3429 oass.IndexSchema.readSchema unique key field: id
[junit4:junit4]   2> 1639 T3429 oass.FileExchangeRateProvider.reload Reloading exchange rates from file currency.xml
[junit4:junit4]   2> 1644 T3429 oass.FileExchangeRateProvider.reload Reloading exchange rates from file currency.xml
[junit4:junit4]   2> 1649 T3429 oass.OpenExchangeRatesOrgProvider.reload Reloading exchange rates from open-exchange-rates.json
[junit4:junit4]   2> 1651 T3429 oass.OpenExchangeRatesOrgProvider.reload Reloading exchange rates from open-exchange-rates.json
[junit4:junit4]   2> 1652 T3429 oasc.SolrCore.<init> [collection1] Opening new SolrCore at /usr/home/hudson/hudson-slave/workspace/Lucene-Solr-NightlyTests-trunk/solr/build/solr-core/test-files/solr/collection1/, dataDir=./org.apache.solr.cloud.BasicDistributedZk2Test-1348198443016/control/data/
[junit4:junit4]   2> 1652 T3429 oasc.JmxMonitoredMap.<init> JMX monitoring is enabled. Adding Solr mbeans to JMX Server: com.sun.jmx.mbeanserver.JmxMBeanServer@3c3228a1
[junit4:junit4]   2> 1654 T3429 oasc.SolrCore.getNewIndexDir WARNING New index directory detected: old=null new=./org.apache.solr.cloud.BasicDistributedZk2Test-1348198443016/control/data/index/
[junit4:junit4]   2> 1655 T3429 oasc.SolrCore.initIndex WARNING [collection1] Solr index directory './org.apache.solr.cloud.BasicDistributedZk2Test-1348198443016/control/data/index' doesn't exist. Creating new index...
[junit4:junit4]   2> 1656 T3429 oasc.CachingDirectoryFactory.get return new directory for /usr/home/hudson/hudson-slave/workspace/Lucene-Solr-NightlyTests-trunk/solr/build/solr-core/test/J1/./org.apache.solr.cloud.BasicDistributedZk2Test-1348198443016/control/data/index forceNew:false
[junit4:junit4]   2> 1671 T3429 oasc.SolrDeletionPolicy.onCommit SolrDeletionPolicy.onCommit: commits:num=1
[junit4:junit4]   2> 		commit{dir=NRTCachingDirectory(org.apache.lucene.store.NIOFSDirectory@/usr/home/hudson/hudson-slave/workspace/Lucene-Solr-NightlyTests-trunk/solr/build/solr-core/test/J1/org.apache.solr.cloud.BasicDistributedZk2Test-1348198443016/control/data/index lockFactory=org.apache.lucene.store.NativeFSLockFactory@5e60770d; maxCacheMB=48.0 maxMergeSizeMB=4.0),segFN=segments_1,generation=1,filenames=[segments_1]
[junit4:junit4]   2> 1671 T3429 oasc.SolrDeletionPolicy.updateCommits newest commit = 1
[junit4:junit4]   2> 1680 T3429 oasc.SolrCore.initWriters created xml: solr.XMLResponseWriter
[junit4:junit4]   2> 1682 T3429 oasup.UpdateRequestProcessorChain.init inserting DistributedUpdateProcessorFactory into updateRequestProcessorChain "dedupe"
[junit4:junit4]   2> 1683 T3429 oasup.UpdateRequestProcessorChain.init inserting DistributedUpdateProcessorFactory into updateRequestProcessorChain "dedupe-allfields"
[junit4:junit4]   2> 1683 T3429 oasup.UpdateRequestProcessorChain.init inserting DistributedUpdateProcessorFactory into updateRequestProcessorChain "stored_sig"
[junit4:junit4]   2> 1684 T3429 oasup.UpdateRequestProcessorChain.init inserting DistributedUpdateProcessorFactory into updateRequestProcessorChain "uniq-fields"
[junit4:junit4]   2> 1685 T3429 oasup.UpdateRequestProcessorChain.init inserting DistributedUpdateProcessorFactory into updateRequestProcessorChain "distrib-dup-test-chain-implicit"
[junit4:junit4]   2> 1685 T3429 oasc.RequestHandlers.initHandlersFromConfig adding lazy requestHandler: solr.ReplicationHandler
[junit4:junit4]   2> 1686 T3429 oasc.RequestHandlers.initHandlersFromConfig created /replication: solr.ReplicationHandler
[junit4:junit4]   2> 1687 T3429 oasc.RequestHandlers.initHandlersFromConfig created standard: solr.StandardRequestHandler
[junit4:junit4]   2> 1687 T3429 oasc.RequestHandlers.initHandlersFromConfig created /get: solr.RealTimeGetHandler
[junit4:junit4]   2> 1688 T3429 oasc.RequestHandlers.initHandlersFromConfig created dismax: solr.SearchHandler
[junit4:junit4]   2> 1689 T3429 oasc.RequestHandlers.initHandlersFromConfig created mock: org.apache.solr.core.MockQuerySenderListenerReqHandler
[junit4:junit4]   2> 1690 T3429 oasc.RequestHandlers.initHandlersFromConfig created /admin/: org.apache.solr.handler.admin.AdminHandlers
[junit4:junit4]   2> 1690 T3429 oasc.RequestHandlers.initHandlersFromConfig created defaults: solr.StandardRequestHandler
[junit4:junit4]   2> 1691 T3429 oasc.RequestHandlers.initHandlersFromConfig adding lazy requestHandler: solr.StandardRequestHandler
[junit4:junit4]   2> 1691 T3429 oasc.RequestHandlers.initHandlersFromConfig created lazy: solr.StandardRequestHandler
[junit4:junit4]   2> 1692 T3429 oasc.RequestHandlers.initHandlersFromConfig created /update: solr.UpdateRequestHandler
[junit4:junit4]   2> 1693 T3429 oasc.RequestHandlers.initHandlersFromConfig created /terms: org.apache.solr.handler.component.SearchHandler
[junit4:junit4]   2> 1694 T3429 oasc.RequestHandlers.initHandlersFromConfig created spellCheckCompRH: org.apache.solr.handler.component.SearchHandler
[junit4:junit4]   2> 1694 T3429 oasc.RequestHandlers.initHandlersFromConfig created spellCheckCompRH_Direct: org.apache.solr.handler.component.SearchHandler
[junit4:junit4]   2> 1695 T3429 oasc.RequestHandlers.initHandlersFromConfig created spellCheckWithWordbreak: org.apache.solr.handler.component.SearchHandler
[junit4:junit4]   2> 1696 T3429 oasc.RequestHandlers.initHandlersFromConfig created spellCheckWithWordbreak_Direct: org.apache.solr.handler.component.SearchHandler
[junit4:junit4]   2> 1696 T3429 oasc.RequestHandlers.initHandlersFromConfig created spellCheckCompRH1: org.apache.solr.handler.component.SearchHandler
[junit4:junit4]   2> 1697 T3429 oasc.RequestHandlers.initHandlersFromConfig created tvrh: org.apache.solr.handler.component.SearchHandler
[junit4:junit4]   2> 1698 T3429 oasc.RequestHandlers.initHandlersFromConfig created /mlt: solr.MoreLikeThisHandler
[junit4:junit4]   2> 1698 T3429 oasc.RequestHandlers.initHandlersFromConfig created /debug/dump: solr.DumpRequestHandler
[junit4:junit4]   2> 1704 T3429 oashl.XMLLoader.init xsltCacheLifetimeSeconds=60
[junit4:junit4]   2> 1711 T3429 oasc.SolrCore.initDeprecatedSupport WARNING solrconfig.xml uses deprecated <admin/gettableFiles>, Please update your config to use the ShowFileRequestHandler.
[junit4:junit4]   2> 1712 T3429 oasc.SolrCore.initDeprecatedSupport WARNING adding ShowFileRequestHandler with hidden files: [SCHEMA.XML, OLD_SYNONYMS.TXT, STOPWORDS.TXT, PROTWORDS.TXT, OPEN-EXCHANGE-RATES.JSON, SYNONYMS.TXT, CURRENCY.XML, MAPPING-ISOLATIN1ACCENT.TXT]
[junit4:junit4]   2> 1717 T3429 oass.SolrIndexSearcher.<init> Opening Searcher@448e2986 main
[junit4:junit4]   2> 1718 T3429 oasu.CommitTracker.<init> Hard AutoCommit: disabled
[junit4:junit4]   2> 1719 T3429 oasu.CommitTracker.<init> Soft AutoCommit: disabled
[junit4:junit4]   2> 1720 T3429 oashc.SpellCheckComponent.inform Initializing spell checkers
[junit4:junit4]   2> 1754 T3429 oass.DirectSolrSpellChecker.init init: {name=direct,classname=DirectSolrSpellChecker,field=lowerfilt,minQueryLength=3}
[junit4:junit4]   2> 1812 T3452 oasc.SolrCore.registerSearcher [collection1] Registered new searcher Searcher@448e2986 main{StandardDirectoryReader(segments_1:1)}
[junit4:junit4]   2> 1816 T3434 oazs.PrepRequestProcessor.pRequest Got user-level KeeperException when processing sessionid:0x139e6e3a81b0002 type:create cxid:0x56 zxid:0xfffffffffffffffe txntype:unknown reqpath:n/a Error Path:/solr/overseer/queue Error:KeeperErrorCode = NoNode for /solr/overseer/queue
[junit4:junit4]   2> 1827 T3429 oasc.CoreContainer.register registering core: collection1
[junit4:junit4]   2> 1827 T3429 oasc.ZkController.register Register shard - core:collection1 address:http://127.0.0.1:17806/solr shardId:control_shard
[junit4:junit4]   2> 1828 T3429 oascc.SolrZkClient.makePath makePath: /collections/control_collection/leader_elect/control_shard/election
[junit4:junit4]   2> 1862 T3434 oazs.PrepRequestProcessor.pRequest Got user-level KeeperException when processing sessionid:0x139e6e3a81b0002 type:delete cxid:0x65 zxid:0xfffffffffffffffe txntype:unknown reqpath:n/a Error Path:/solr/collections/control_collection/leaders Error:KeeperErrorCode = NoNode for /solr/collections/control_collection/leaders
[junit4:junit4]   2> 1863 T3429 oasc.ShardLeaderElectionContext.runLeaderProcess Running the leader process.
[junit4:junit4]   2> 1864 T3434 oazs.PrepRequestProcessor.pRequest Got user-level KeeperException when processing sessionid:0x139e6e3a81b0002 type:create cxid:0x66 zxid:0xfffffffffffffffe txntype:unknown reqpath:n/a Error Path:/solr/overseer Error:KeeperErrorCode = NodeExists for /solr/overseer
[junit4:junit4]   2> 2229 T3450 oascc.ZkStateReader.updateClusterState Updating cloud state from ZooKeeper... 
[junit4:junit4]   2> 2231 T3434 oazs.PrepRequestProcessor.pRequest Got user-level KeeperException when processing sessionid:0x139e6e3a81b0002 type:create cxid:0x6d zxid:0xfffffffffffffffe txntype:unknown reqpath:n/a Error Path:/solr/overseer/queue-work Error:KeeperErrorCode = NoNode for /solr/overseer/queue-work
[junit4:junit4]   2> 2257 T3449 oascc.ZkStateReader$2.process A cluster state change has occurred - updating...
[junit4:junit4]   2> 2367 T3429 oasc.ShardLeaderElectionContext.waitForReplicasToComeUp Enough replicas found to continue.
[junit4:junit4]   2> 2368 T3429 oasc.ShardLeaderElectionContext.runLeaderProcess I may be the new leader - try and sync
[junit4:junit4]   2> 2368 T3429 oasc.SyncStrategy.sync Sync replicas to http://127.0.0.1:17806/solr/collection1/
[junit4:junit4]   2> 2369 T3429 oasc.SyncStrategy.syncReplicas Sync Success - now sync replicas to me
[junit4:junit4]   2> 2369 T3429 oasc.SyncStrategy.syncToMe http://127.0.0.1:17806/solr/collection1/ has no replicas
[junit4:junit4]   2> 2370 T3429 oasc.ShardLeaderElectionContext.runLeaderProcess I am the new leader: http://127.0.0.1:17806/solr/collection1/
[junit4:junit4]   2> 2370 T3429 oascc.SolrZkClient.makePath makePath: /collections/control_collection/leaders/control_shard
[junit4:junit4]   2> 2389 T3434 oazs.PrepRequestProcessor.pRequest Got user-level KeeperException when processing sessionid:0x139e6e3a81b0002 type:create cxid:0x8b zxid:0xfffffffffffffffe txntype:unknown reqpath:n/a Error Path:/solr/overseer Error:KeeperErrorCode = NodeExists for /solr/overseer
[junit4:junit4]   2> 2769 T3450 oascc.ZkStateReader.updateClusterState Updating cloud state from ZooKeeper... 
[junit4:junit4]   2> 2781 T3449 oascc.ZkStateReader$2.process A cluster state change has occurred - updating...
[junit4:junit4]   2> 2799 T3429 oasc.ZkController.register We are http://127.0.0.1:17806/solr/collection1/ and leader is http://127.0.0.1:17806/solr/collection1/
[junit4:junit4]   2> 2799 T3429 oasc.ZkController.register No LogReplay needed for core=collection1 baseURL=http://127.0.0.1:17806/solr
[junit4:junit4]   2> 2800 T3429 oasc.ZkController.checkRecovery I am the leader, no recovery necessary
[junit4:junit4]   2> 2802 T3429 oascc.ZkStateReader.updateClusterState Updating cloud state from ZooKeeper... 
[junit4:junit4]   2> 2803 T3429 oass.SolrDispatchFilter.init user.dir=/usr/home/hudson/hudson-slave/workspace/Lucene-Solr-NightlyTests-trunk/solr/build/solr-core/test/J1
[junit4:junit4]   2> 2803 T3429 oass.SolrDispatchFilter.init SolrDispatchFilter.init() done
[junit4:junit4]   2> 2804 T3429 oascsi.HttpClientUtil.createClient Creating new http client, config:maxConnections=128&maxConnectionsPerHost=32&followRedirects=false
[junit4:junit4]   2> 3285 T3450 oascc.ZkStateReader.updateClusterState Updating cloud state from ZooKeeper... 
[junit4:junit4]   2> 3307 T3449 oascc.ZkStateReader$2.process A cluster state change has occurred - updating...
[junit4:junit4]   2> 3591 T3429 oejs.Server.doStart jetty-8.1.2.v20120308
[junit4:junit4]   2> 3594 T3429 oejs.AbstractConnector.doStart Started SocketConnector@0.0.0.0:38577
[junit4:junit4]   2> 3595 T3429 oasc.SolrResourceLoader.locateSolrHome JNDI not configured for solr (NoInitialContextEx)
[junit4:junit4]   2> 3596 T3429 oasc.SolrResourceLoader.locateSolrHome using system property solr.solr.home: /usr/home/hudson/hudson-slave/workspace/Lucene-Solr-NightlyTests-trunk/solr/build/solr-core/test/J1/./solrtest-jetty1-1348198445829
[junit4:junit4]   2> 3596 T3429 oasc.SolrResourceLoader.<init> new SolrResourceLoader for deduced Solr Home: '/usr/home/hudson/hudson-slave/workspace/Lucene-Solr-NightlyTests-trunk/solr/build/solr-core/test/J1/./solrtest-jetty1-1348198445829/'
[junit4:junit4]   2> 3633 T3429 oass.SolrDispatchFilter.init SolrDispatchFilter.init()
[junit4:junit4]   2> 3634 T3429 oasc.SolrResourceLoader.locateSolrHome JNDI not configured for solr (NoInitialContextEx)
[junit4:junit4]   2> 3634 T3429 oasc.SolrResourceLoader.locateSolrHome using system property solr.solr.home: /usr/home/hudson/hudson-slave/workspace/Lucene-Solr-NightlyTests-trunk/solr/build/solr-core/test/J1/./solrtest-jetty1-1348198445829
[junit4:junit4]   2> 3634 T3429 oasc.CoreContainer$Initializer.initialize looking for solr.xml: /usr/home/hudson/hudson-slave/workspace/Lucene-Solr-NightlyTests-trunk/solr/build/solr-core/test/J1/./solrtest-jetty1-1348198445829/solr.xml
[junit4:junit4]   2> 3635 T3429 oasc.CoreContainer.<init> New CoreContainer 657232738
[junit4:junit4]   2> 3636 T3429 oasc.CoreContainer.load Loading CoreContainer using Solr Home: '/usr/home/hudson/hudson-slave/workspace/Lucene-Solr-NightlyTests-trunk/solr/build/solr-core/test/J1/./solrtest-jetty1-1348198445829/'
[junit4:junit4]   2> 3636 T3429 oasc.SolrResourceLoader.<init> new SolrResourceLoader for directory: '/usr/home/hudson/hudson-slave/workspace/Lucene-Solr-NightlyTests-trunk/solr/build/solr-core/test/J1/./solrtest-jetty1-1348198445829/'
[junit4:junit4]   2> 3662 T3429 oasc.CoreContainer.load Registering Log Listener
[junit4:junit4]   2> 3677 T3429 oasc.CoreContainer.initZooKeeper Zookeeper client=127.0.0.1:25019/solr
[junit4:junit4]   2> 3678 T3429 oaz.ZooKeeper.<init> Initiating client connection, connectString=127.0.0.1:25019/solr sessionTimeout=5000 watcher=org.apache.solr.common.cloud.ConnectionManager@536e163e
[junit4:junit4]   2> 3679 T3462 oaz.ClientCnxn$SendThread.startConnect Opening socket connection to server /127.0.0.1:25019
[junit4:junit4]   2> 3679 T3429 oascc.ConnectionManager.waitForConnected Waiting for client to connect to ZooKeeper
[junit4:junit4]   2> 3680 T3462 oaz.ClientCnxn$SendThread.primeConnection Socket connection established to localhost/127.0.0.1:25019, initiating session
[junit4:junit4]   2> 3680 T3431 oazs.NIOServerCnxn$Factory.run Accepted socket connection from /140.211.11.196:30338
[junit4:junit4]   2> 3681 T3431 oazs.NIOServerCnxn.readConnectRequest Client attempting to establish new session at /140.211.11.196:30338
[junit4:junit4]   2> 3683 T3433 oazs.NIOServerCnxn.finishSessionInit Established session 0x139e6e3a81b0003 with negotiated timeout 5000 for client /140.211.11.196:30338
[junit4:junit4]   2> 3683 T3462 oaz.ClientCnxn$SendThread.readConnectResult Session establishment complete on server localhost/127.0.0.1:25019, sessionid = 0x139e6e3a81b0003, negotiated timeout = 5000
[junit4:junit4]   2> 3683 T3463 oascc.ConnectionManager.process Watcher org.apache.solr.common.cloud.ConnectionManager@536e163e name:ZooKeeperConnection Watcher:127.0.0.1:25019/solr got event WatchedEvent state:SyncConnected type:None path:null path:null type:None
[junit4:junit4]   2> 3683 T3429 oascc.ConnectionManager.waitForConnected Client is connected to ZooKeeper
[junit4:junit4]   2> 3684 T3434 oazs.PrepRequestProcessor.pRequest Got user-level KeeperException when processing sessionid:0x139e6e3a81b0003 type:create cxid:0x1 zxid:0xfffffffffffffffe txntype:unknown reqpath:n/a Error Path:/solr/overseer Error:KeeperErrorCode = NodeExists for /solr/overseer
[junit4:junit4]   2> 3699 T3434 oazs.PrepRequestProcessor.pRequest Got user-level KeeperException when processing sessionid:0x139e6e3a81b0003 type:create cxid:0x2 zxid:0xfffffffffffffffe txntype:unknown reqpath:n/a Error Path:/solr/overseer Error:KeeperErrorCode = NodeExists for /solr/overseer
[junit4:junit4]   2> 3701 T3429 oasc.ZkController.createEphemeralLiveNode Register node as live in ZooKeeper:/live_nodes/127.0.0.1:38577_solr
[junit4:junit4]   2> 3701 T3434 oazs.PrepRequestProcessor.pRequest Got user-level KeeperException when processing sessionid:0x139e6e3a81b0003 type:delete cxid:0x4 zxid:0xfffffffffffffffe txntype:unknown reqpath:n/a Error Path:/solr/live_nodes/127.0.0.1:38577_solr Error:KeeperErrorCode = NoNode for /solr/live_nodes/127.0.0.1:38577_solr
[junit4:junit4]   2> 3703 T3429 oascc.SolrZkClient.makePath makePath: /live_nodes/127.0.0.1:38577_solr
[junit4:junit4]   2> 3712 T3449 oascc.ZkStateReader$3.process Updating live nodes
[junit4:junit4]   2> 3713 T3429 oashc.HttpShardHandlerFactory.getParameter Setting socketTimeout to: 0
[junit4:junit4]   2> 3713 T3429 oashc.HttpShardHandlerFactory.getParameter Setting urlScheme to: http://
[junit4:junit4]   2> 3714 T3429 oashc.HttpShardHandlerFactory.getParameter Setting connTimeout to: 0
[junit4:junit4]   2> 3714 T3429 oashc.HttpShardHandlerFactory.getParameter Setting maxConnectionsPerHost to: 20
[junit4:junit4]   2> 3715 T3429 oashc.HttpShardHandlerFactory.getParameter Setting corePoolSize to: 0
[junit4:junit4]   2> 3715 T3429 oashc.HttpShardHandlerFactory.getParameter Setting maximumPoolSize to: 2147483647
[junit4:junit4]   2> 3715 T3429 oashc.HttpShardHandlerFactory.getParameter Setting maxThreadIdleTime to: 5
[junit4:junit4]   2> 3716 T3429 oashc.HttpShardHandlerFactory.getParameter Setting sizeOfQueue to: -1
[junit4:junit4]   2> 3716 T3429 oashc.HttpShardHandlerFactory.getParameter Setting fairnessPolicy to: false
[junit4:junit4]   2> 3717 T3429 oascsi.HttpClientUtil.createClient Creating new http client, config:maxConnectionsPerHost=20&maxConnections=10000&socketTimeout=0&connTimeout=0&retry=false
[junit4:junit4]   2> 3740 T3429 oascc.ZkStateReader.createClusterStateWatchersAndUpdate Updating cluster state from ZooKeeper... 
[junit4:junit4]   2> 3746 T3429 oasc.CoreContainer.create Creating SolrCore 'collection1' using instanceDir: /usr/home/hudson/hudson-slave/workspace/Lucene-Solr-NightlyTests-trunk/solr/build/solr-core/test/J1/./solrtest-jetty1-1348198445829/collection1
[junit4:junit4]   2> 3747 T3429 oasc.ZkController.createCollectionZkNode Check for collection zkNode:collection1
[junit4:junit4]   2> 3748 T3429 oasc.ZkController.createCollectionZkNode Collection zkNode exists
[junit4:junit4]   2> 3748 T3429 oasc.ZkController.readConfigName Load collection config from:/collections/collection1
[junit4:junit4]   2> 3749 T3429 oasc.SolrResourceLoader.<init> new SolrResourceLoader for directory: '/usr/home/hudson/hudson-slave/workspace/Lucene-Solr-NightlyTests-trunk/solr/build/solr-core/test/J1/./solrtest-jetty1-1348198445829/collection1/'
[junit4:junit4]   2> 3751 T3429 oasc.SolrResourceLoader.replaceClassLoader Adding 'file:/usr/home/hudson/hudson-slave/workspace/Lucene-Solr-NightlyTests-trunk/solr/build/solr-core/test/J1/solrtest-jetty1-1348198445829/collection1/lib/classes/' to classloader
[junit4:junit4]   2> 3752 T3429 oasc.SolrResourceLoader.replaceClassLoader Adding 'file:/usr/home/hudson/hudson-slave/workspace/Lucene-Solr-NightlyTests-trunk/solr/build/solr-core/test/J1/solrtest-jetty1-1348198445829/collection1/lib/README' to classloader
[junit4:junit4]   2> 3804 T3429 oasc.SolrConfig.<init> Using Lucene MatchVersion: LUCENE_50
[junit4:junit4]   2> 3876 T3429 oasc.SolrConfig.<init> Loaded SolrConfig: solrconfig.xml
[junit4:junit4]   2> 3977 T3429 oass.IndexSchema.readSchema Reading Solr Schema
[junit4:junit4]   2> 3988 T3429 oass.IndexSchema.readSchema Schema name=test
[junit4:junit4]   2> 4470 T3429 oass.OpenExchangeRatesOrgProvider.init Initialized with rates=open-exchange-rates.json, refreshInterval=1440.
[junit4:junit4]   2> 4479 T3429 oass.IndexSchema.readSchema default search field in schema is text
[junit4:junit4]   2> 4482 T3429 oass.IndexSchema.readSchema unique key field: id
[junit4:junit4]   2> 4491 T3429 oass.FileExchangeRateProvider.reload Reloading exchange rates from file currency.xml
[junit4:junit4]   2> 4495 T3429 oass.FileExchangeRateProvider.reload Reloading exchange rates from file currency.xml
[junit4:junit4]   2> 4498 T3429 oass.OpenExchangeRatesOrgProvider.reload Reloading exchange rates from open-exchange-rates.json
[junit4:junit4]   2> 4499 T3429 oass.OpenExchangeRatesOrgProvider.reload Reloading exchange rates from open-exchange-rates.json
[junit4:junit4]   2> 4500 T3429 oasc.SolrCore.<init> [collection1] Opening new SolrCore at /usr/home/hudson/hudson-slave/workspace/Lucene-Solr-NightlyTests-trunk/solr/build/solr-core/test/J1/./solrtest-jetty1-1348198445829/collection1/, dataDir=./org.apache.solr.cloud.BasicDistributedZk2Test-1348198443016/jetty1/
[junit4:junit4]   2> 4501 T3429 oasc.JmxMonitoredMap.<init> JMX monitoring is enabled. Adding Solr mbeans to JMX Server: com.sun.jmx.mbeanserver.JmxMBeanServer@3c3228a1
[junit4:junit4]   2> 4502 T3429 oasc.SolrCore.getNewIndexDir WARNING New index directory detected: old=null new=./org.apache.solr.cloud.BasicDistributedZk2Test-1348198443016/jetty1/index/
[junit4:junit4]   2> 4502 T3429 oasc.SolrCore.initIndex WARNING [collection1] Solr index directory './org.apache.solr.cloud.BasicDistributedZk2Test-1348198443016/jetty1/index' doesn't exist. Creating new index...
[junit4:junit4]   2> 4503 T3429 oasc.CachingDirectoryFactory.get return new directory for /usr/home/hudson/hudson-slave/workspace/Lucene-Solr-NightlyTests-trunk/solr/build/solr-core/test/J1/./org.apache.solr.cloud.BasicDistributedZk2Test-1348198443016/jetty1/index forceNew:false
[junit4:junit4]   2> 4545 T3429 oasc.SolrDeletionPolicy.onCommit SolrDeletionPolicy.onCommit: commits:num=1
[junit4:junit4]   2> 		commit{dir=NRTCachingDirectory(org.apache.lucene.store.NIOFSDirectory@/usr/home/hudson/hudson-slave/workspace/Lucene-Solr-NightlyTests-trunk/solr/build/solr-core/test/J1/org.apache.solr.cloud.BasicDistributedZk2Test-1348198443016/jetty1/index lockFactory=org.apache.lucene.store.NativeFSLockFactory@78c7dc7d; maxCacheMB=48.0 maxMergeSizeMB=4.0),segFN=segments_1,generation=1,filenames=[segments_1]
[junit4:junit4]   2> 4546 T3429 oasc.SolrDeletionPolicy.updateCommits newest commit = 1
[junit4:junit4]   2> 4547 T3429 oasc.SolrCore.initWriters created xml: solr.XMLResponseWriter
[junit4:junit4]   2> 4549 T3429 oasup.UpdateRequestProcessorChain.init inserting DistributedUpdateProcessorFactory into updateRequestProcessorChain "dedupe"
[junit4:junit4]   2> 4549 T3429 oasup.UpdateRequestProcessorChain.init inserting DistributedUpdateProcessorFactory into updateRequestProcessorChain "dedupe-allfields"
[junit4:junit4]   2> 4549 T3429 oasup.UpdateRequestProcessorChain.init inserting DistributedUpdateProcessorFactory into updateRequestProcessorChain "stored_sig"
[junit4:junit4]   2> 4550 T3429 oasup.UpdateRequestProcessorChain.init inserting DistributedUpdateProcessorFactory into updateRequestProcessorChain "uniq-fields"
[junit4:junit4]   2> 4550 T3429 oasup.UpdateRequestProcessorChain.init inserting DistributedUpdateProcessorFactory into updateRequestProcessorChain "distrib-dup-test-chain-implicit"
[junit4:junit4]   2> 4551 T3429 oasc.RequestHandlers.initHandlersFromConfig adding lazy requestHandler: solr.ReplicationHandler
[junit4:junit4]   2> 4551 T3429 oasc.RequestHandlers.initHandlersFromConfig created /replication: solr.ReplicationHandler
[junit4:junit4]   2> 4552 T3429 oasc.RequestHandlers.initHandlersFromConfig created standard: solr.StandardRequestHandler
[junit4:junit4]   2> 4552 T3429 oasc.RequestHandlers.initHandlersFromConfig created /get: solr.RealTimeGetHandler
[junit4:junit4]   2> 4553 T3429 oasc.RequestHandlers.initHandlersFromConfig created dismax: solr.SearchHandler
[junit4:junit4]   2> 4553 T3429 oasc.RequestHandlers.initHandlersFromConfig created mock: org.apache.solr.core.MockQuerySenderListenerReqHandler
[junit4:junit4]   2> 4554 T3429 oasc.RequestHandlers.initHandlersFromConfig created /admin/: org.apache.solr.handler.admin.AdminHandlers
[junit4:junit4]   2> 4554 T3429 oasc.RequestHandlers.initHandlersFromConfig created defaults: solr.StandardRequestHandler
[junit4:junit4]   2> 4555 T3429 oasc.RequestHandlers.initHandlersFromConfig adding lazy requestHandler: solr.StandardRequestHandler
[junit4:junit4]   2> 4555 T3429 oasc.RequestHandlers.initHandlersFromConfig created lazy: solr.StandardRequestHandler
[junit4:junit4]   2> 4556 T3429 oasc.RequestHandlers.initHandlersFromConfig created /update: solr.UpdateRequestHandler
[junit4:junit4]   2> 4556 T3429 oasc.RequestHandlers.initHandlersFromConfig created /terms: org.apache.solr.handler.component.SearchHandler
[junit4:junit4]   2> 4557 T3429 oasc.RequestHandlers.initHandlersFromConfig created spellCheckCompRH: org.apache.solr.handler.component.SearchHandler
[junit4:junit4]   2> 4557 T3429 oasc.RequestHandlers.initHandlersFromConfig created spellCheckCompRH_Direct: org.apache.solr.handler.component.SearchHandler
[junit4:junit4]   2> 4558 T3429 oasc.RequestHandlers.initHandlersFromConfig created spellCheckWithWordbreak: org.apache.solr.handler.component.SearchHandler
[junit4:junit4]   2> 4558 T3429 oasc.RequestHandlers.initHandlersFromConfig created spellCheckWithWordbreak_Direct: org.apache.solr.handler.component.SearchHandler
[junit4:junit4]   2> 4559 T3429 oasc.RequestHandlers.initHandlersFromConfig created spellCheckCompRH1: org.apache.solr.handler.component.SearchHandler
[junit4:junit4]   2> 4559 T3429 oasc.RequestHandlers.initHandlersFromConfig created tvrh: org.apache.solr.handler.component.SearchHandler
[junit4:junit4]   2> 4560 T3429 oasc.RequestHandlers.initHandlersFromConfig created /mlt: solr.MoreLikeThisHandler
[junit4:junit4]   2> 4560 T3429 oasc.RequestHandlers.initHandlersFromConfig created /debug/dump: solr.DumpRequestHandler
[junit4:junit4]   2> 4563 T3429 oashl.XMLLoader.init xsltCacheLifetimeSeconds=60
[junit4:junit4]   2> 4567 T3429 oasc.SolrCore.initDeprecatedSupport WARNING solrconfig.xml uses deprecated <admin/gettableFiles>, Please update your config to use the ShowFileRequestHandler.
[junit4:junit4]   2> 4568 T3429 oasc.SolrCore.initDeprecatedSupport WARNING adding ShowFileRequestHandler with hidden files: [SCHEMA.XML, OLD_SYNONYMS.TXT, STOPWORDS.TXT, PROTWORDS.TXT, OPEN-EXCHANGE-RATES.JSON, SYNONYMS.TXT, CURRENCY.XML, MAPPING-ISOLATIN1ACCENT.TXT]
[junit4:junit4]   2> 4573 T3429 oass.SolrIndexSearcher.<init> Opening Searcher@35a84ff8 main
[junit4:junit4]   2> 4574 T3429 oasu.CommitTracker.<init> Hard AutoCommit: disabled
[junit4:junit4]   2> 4575 T3429 oasu.CommitTracker.<init> Soft AutoCommit: disabled
[junit4:junit4]   2> 4575 T3429 oashc.SpellCheckComponent.inform Initializing spell checkers
[junit4:junit4]   2> 4581 T3429 oass.DirectSolrSpellChecker.init init: {name=direct,classname=DirectSolrSpellChecker,field=lowerfilt,minQueryLength=3}
[junit4:junit4]   2> 4630 T3464 oasc.SolrCore.registerSearcher [collection1] Registered new searcher Searcher@35a84ff8 main{StandardDirectoryReader(segments_1:1)}
[junit4:junit4]   2> 4820 T3450 oascc.ZkStateReader.updateClusterState Updating cloud state from ZooKeeper... 
[junit4:junit4]   2> 4834 T3449 oascc.ZkStateReader$2.process A cluster state change has occurred - updating...
[junit4:junit4]   2> 4834 T3463 oascc.ZkStateReader$2.process A cluster state change has occurred - updating...
[junit4:junit4]   2> 5135 T3429 oasc.CoreContainer.register registering core: collection1
[junit4:junit4]   2> 5135 T3429 oasc.ZkController.register Register shard - core:collection1 address:http://127.0.0.1:38577/solr shardId:shard1
[junit4:junit4]   2> 5136 T3429 oascc.SolrZkClient.makePath makePath: /collections/collection1/leader_elect/shard1/election
[junit4:junit4]   2> 5198 T3434 oazs.PrepRequestProcessor.pRequest Got user-level KeeperException when processing sessionid:0x139e6e3a81b0003 type:delete cxid:0x42 zxid:0xfffffffffffffffe txntype:unknown reqpath:n/a Error Path:/solr/collections/collection1/leaders Error:KeeperErrorCode = NoNode for /solr/collections/collection1/leaders
[junit4:junit4]   2> 5199 T3429 oasc.ShardLeaderElectionContext.runLeaderProcess Running the leader process.
[junit4:junit4]   2> 5200 T3434 oazs.PrepRequestProcessor.pRequest Got user-level KeeperException when processing sessionid:0x139e6e3a81b0003 type:create cxid:0x43 zxid:0xfffffffffffffffe txntype:unknown reqpath:n/a Error Path:/solr/overseer Error:KeeperErrorCode = NodeExists for /solr/overseer
[junit4:junit4]   2> 5226 T3429 oasc.ShardLeaderElectionContext.waitForReplicasToComeUp Enough replicas found to continue.
[junit4:junit4]   2> 5227 T3429 oasc.ShardLeaderElectionContext.runLeaderProcess I may be the new leader - try and sync
[junit4:junit4]   2> 5227 T3429 oasc.SyncStrategy.sync Sync replicas to http://127.0.0.1:38577/solr/collection1/
[junit4:junit4]   2> 5228 T3429 oasc.SyncStrategy.syncReplicas Sync Success - now sync replicas to me
[junit4:junit4]   2> 5228 T3429 oasc.SyncStrategy.syncToMe http://127.0.0.1:38577/solr/collection1/ has no replicas
[junit4:junit4]   2> 5228 T3429 oasc.ShardLeaderElectionContext.runLeaderProcess I am the new leader: http://127.0.0.1:38577/solr/collection1/
[junit4:junit4]   2> 5229 T3429 oascc.SolrZkClient.makePath makePath: /collections/collection1/leaders/shard1
[junit4:junit4]   2> 5250 T3434 oazs.PrepRequestProcessor.pRequest Got user-level KeeperException when processing sessionid:0x139e6e3a81b0003 type:create cxid:0x4d zxid:0xfffffffffffffffe txntype:unknown reqpath:n/a Error Path:/solr/overseer Error:KeeperErrorCode = NodeExists for /solr/overseer
[junit4:junit4]   2> 5339 T3450 oascc.ZkStateReader.updateClusterState Updating cloud state from ZooKeeper... 
[junit4:junit4]   2> 5420 T3449 oascc.ZkStateReader$2.process A cluster state change has occurred - updating...
[junit4:junit4]   2> 5420 T3463 oascc.ZkStateReader$2.process A cluster state change has occurred - updating...
[junit4:junit4]   2> 5471 T3429 oasc.ZkController.register We are http://127.0.0.1:38577/solr/collection1/ and leader is http://127.0.0.1:38577/solr/collection1/
[junit4:junit4]   2> 5471 T3429 oasc.ZkController.register No LogReplay needed for core=collection1 baseURL=http://127.0.0.1:38577/solr
[junit4:junit4]   2> 5471 T3429 oasc.ZkController.checkRecovery I am the leader, no recovery necessary
[junit4:junit4]   2> 5483 T3429 oascc.ZkStateReader.updateClusterState Updating cloud state from ZooKeeper... 
[junit4:junit4]   2> 5484 T3429 oass.SolrDispatchFilter.init user.dir=/usr/home/hudson/hudson-slave/workspace/Lucene-Solr-NightlyTests-trunk/solr/build/solr-core/test/J1
[junit4:junit4]   2> 5484 T3429 oass.SolrDispatchFilter.init SolrDispatchFilter.init() done
[junit4:junit4]   2> 5484 T3429 oascsi.HttpClientUtil.createClient Creating new http client, config:maxConnections=128&maxConnectionsPerHost=32&followRedirects=false
[junit4:junit4]   2> 5939 T3450 oascc.ZkStateReader.updateClusterState Updating cloud state from ZooKeeper... 
[junit4:junit4]   2> 5957 T3449 oascc.ZkStateReader$2.process A cluster state change has occurred - updating...
[junit4:junit4]   2> 5957 T3463 oascc.ZkStateReader$2.process A cluster state change has occurred - updating...
[junit4:junit4]   2> 6319 T3429 oejs.Server.doStart jetty-8.1.2.v20120308
[junit4:junit4]   2> 6322 T3429 oejs.AbstractConnector.doStart Started SocketConnector@0.0.0.0:54719
[junit4:junit4]   2> 6323 T3429 oasc.SolrResourceLoader.locateSolrHome JNDI not configured for solr (NoInitialContextEx)
[junit4:junit4]   2> 6323 T3429 oasc.SolrResourceLoader.locateSolrHome using system property solr.solr.home: /usr/home/hudson/hudson-slave/workspace/Lucene-Solr-NightlyTests-trunk/solr/build/solr-core/test/J1/./solrtest-jetty2-1348198448505
[junit4:junit4]   2> 6324 T3429 oasc.SolrResourceLoader.<init> new SolrResourceLoader for deduced Solr Home: '/usr/home/hudson/hudson-slave/workspace/Lucene-Solr-NightlyTests-trunk/solr/build/solr-core/test/J1/./solrtest-jetty2-1348198448505/'
[junit4:junit4]   2> 6357 T3429 oass.SolrDispatchFilter.init SolrDispatchFilter.init()
[junit4:junit4]   2> 6358 T3429 oasc.SolrResourceLoader.locateSolrHome JNDI not configured for solr (NoInitialContextEx)
[junit4:junit4]   2> 6359 T3429 oasc.SolrResourceLoader.locateSolrHome using system property solr.solr.home: /usr/home/hudson/hudson-slave/workspace/Lucene-Solr-NightlyTests-trunk/solr/build/solr-core/test/J1/./solrtest-jetty2-1348198448505
[junit4:junit4]   2> 6359 T3429 oasc.CoreContainer$Initializer.initialize looking for solr.xml: /usr/home/hudson/hudson-slave/workspace/Lucene-Solr-NightlyTests-trunk/solr/build/solr-core/test/J1/./solrtest-jetty2-1348198448505/solr.xml
[junit4:junit4]   2> 6360 T3429 oasc.CoreContainer.<init> New CoreContainer 528246861
[junit4:junit4]   2> 6360 T3429 oasc.CoreContainer.load Loading CoreContainer using Solr Home: '/usr/home/hudson/hudson-slave/workspace/Lucene-Solr-NightlyTests-trunk/solr/build/solr-core/test/J1/./solrtest-jetty2-1348198448505/'
[junit4:junit4]   2> 6361 T3429 oasc.SolrResourceLoader.<init> new SolrResourceLoader for directory: '/usr/home/hudson/hudson-slave/workspace/Lucene-Solr-NightlyTests-trunk/solr/build/solr-core/test/J1/./solrtest-jetty2-1348198448505/'
[junit4:junit4]   2> 6385 T3429 oasc.CoreContainer.load Registering Log Listener
[junit4:junit4]   2> 6400 T3429 oasc.CoreContainer.initZooKeeper Zookeeper client=127.0.0.1:25019/solr
[junit4:junit4]   2> 6401 T3429 oaz.ZooKeeper.<init> Initiating client connection, connectString=127.0.0.1:25019/solr sessionTimeout=5000 watcher=org.apache.solr.common.cloud.ConnectionManager@5841e204
[junit4:junit4]   2> 6402 T3474 oaz.ClientCnxn$SendThread.startConnect Opening socket connection to server /127.0.0.1:25019
[junit4:junit4]   2> 6402 T3429 oascc.ConnectionManager.waitForConnected Waiting for client to connect to ZooKeeper
[junit4:junit4]   2> 6403 T3474 oaz.ClientCnxn$SendThread.primeConnection Socket connection established to localhost/127.0.0.1:25019, initiating session
[junit4:junit4]   2> 6403 T3431 oazs.NIOServerCnxn$Factory.run Accepted socket connection from /140.211.11.196:30159
[junit4:junit4]   2> 6404 T3431 oazs.NIOServerCnxn.readConnectRequest Client attempting to establish new session at /140.211.11.196:30159
[junit4:junit4]   2> 6411 T3433 oazs.NIOServerCnxn.finishSessionInit Established session 0x139e6e3a81b0004 with negotiated timeout 5000 for client /140.211.11.196:30159
[junit4:junit4]   2> 6411 T3474 oaz.ClientCnxn$SendThread.readConnectResult Session establishment complete on server localhost/127.0.0.1:25019, sessionid = 0x139e6e3a81b0004, negotiated timeout = 5000
[junit4:junit4]   2> 6411 T3475 oascc.ConnectionManager.process Watcher org.apache.solr.common.cloud.ConnectionManager@5841e204 name:ZooKeeperConnection Watcher:127.0.0.1:25019/solr got event WatchedEvent state:SyncConnected type:None path:null path:null type:None
[junit4:junit4]   2> 6411 T3429 oascc.ConnectionManager.waitForConnected Client is connected to ZooKeeper
[junit4:junit4]   2> 6412 T3434 oazs.PrepRequestProcessor.pRequest Got user-level KeeperException when processing sessionid:0x139e6e3a81b0004 type:create cxid:0x1 zxid:0xfffffffffffffffe txntype:unknown reqpath:n/a Error Path:/solr/overseer Error:KeeperErrorCode = NodeExists for /solr/overseer
[junit4:junit4]   2> 6413 T3434 oazs.PrepRequestProcessor.pRequest Got user-level KeeperException when processing sessionid:0x139e6e3a81b0004 type:create cxid:0x2 zxid:0xfffffffffffffffe txntype:unknown reqpath:n/a Error Path:/solr/overseer Error:KeeperErrorCode = NodeExists for /solr/overseer
[junit4:junit4]   2> 6414 T3429 oasc.ZkController.createEphemeralLiveNode Register node as live in ZooKeeper:/live_nodes/127.0.0.1:54719_solr
[junit4:junit4]   2> 6415 T3434 oazs.PrepRequestProcessor.pRequest Got user-level KeeperException when processing sessionid:0x139e6e3a81b0004 type:delete cxid:0x4 zxid:0xfffffffffffffffe txntype:unknown reqpath:n/a Error Path:/solr/live_nodes/127.0.0.1:54719_solr Error:KeeperErrorCode = NoNode for /solr/live_nodes/127.0.0.1:54719_solr
[junit4:junit4]   2> 6416 T3429 oascc.SolrZkClient.makePath makePath: /live_nodes/127.0.0.1:54719_solr
[junit4:junit4]   2> 6418 T3449 oascc.ZkStateReader$3.process Updating live nodes
[junit4:junit4]   2> 6418 T3463 oascc.ZkStateReader$3.process Updating live nodes
[junit4:junit4]   2> 6419 T3429 oashc.HttpShardHandlerFactory.getParameter Setting socketTimeout to: 0
[junit4:junit4]   2> 6419 T3429 oashc.HttpShardHandlerFactory.getParameter Setting urlScheme to: http://
[junit4:junit4]   2> 6420 T3429 oashc.HttpShardHandlerFactory.getParameter Setting connTimeout to: 0
[junit4:junit4]   2> 6420 T3429 oashc.HttpShardHandlerFactory.getParameter Setting maxConnectionsPerHost to: 20
[junit4:junit4]   2> 6421 T3429 oashc.HttpShardHandlerFactory.getParameter Setting corePoolSize to: 0
[junit4:junit4]   2> 6421 T3429 oashc.HttpShardHandlerFactory.getParameter Setting maximumPoolSize to: 2147483647
[junit4:junit4]   2> 6422 T3429 oashc.HttpShardHandlerFactory.getParameter Setting maxThreadIdleTime to: 5
[junit4:junit4]   2> 6422 T3429 oashc.HttpShardHandlerFactory.getParameter Setting sizeOfQueue to: -1
[junit4:junit4]   2> 6423 T3429 oashc.HttpShardHandlerFactory.getParameter Setting fairnessPolicy to: false
[junit4:junit4]   2> 6423 T3429 oascsi.HttpClientUtil.createClient Creating new http client, config:maxConnectionsPerHost=20&maxConnections=10000&socketTimeout=0&connTimeout=0&retry=false
[junit4:junit4]   2> 6449 T3429 oascc.ZkStateReader.createClusterStateWatchersAndUpdate Updating cluster state from ZooKeeper... 
[junit4:junit4]   2> 6456 T3429 oasc.CoreContainer.create Creating SolrCore 'collection1' using instanceDir: /usr/home/hudson/hudson-slave/workspace/Lucene-Solr-NightlyTests-trunk/solr/build/solr-core/test/J1/./solrtest-jetty2-1348198448505/collection1
[junit4:junit4]   2> 6457 T3429 oasc.ZkController.createCollectionZkNode Check for collection zkNode:collection1
[junit4:junit4]   2> 6457 T3429 oasc.ZkController.createCollectionZkNode Collection zkNode exists
[junit4:junit4]   2> 6458 T3429 oasc.ZkController.readConfigName Load collection config from:/collections/collection1
[junit4:junit4]   2> 6459 T3429 oasc.SolrResourceLoader.<init> new SolrResourceLoader for directory: '/usr/home/hudson/hudson-slave/workspace/Lucene-Solr-NightlyTests-trunk/solr/build/solr-core/test/J1/./solrtest-jetty2-1348198448505/collection1/'
[junit4:junit4]   2> 6461 T3429 oasc.SolrResourceLoader.replaceClassLoader Adding 'file:/usr/home/hudson/hudson-slave/workspace/Lucene-Solr-NightlyTests-trunk/solr/build/solr-core/test/J1/solrtest-jetty2-1348198448505/collection1/lib/classes/' to classloader
[junit4:junit4]   2> 6462 T3429 oasc.SolrResourceLoader.replaceClassLoader Adding 'file:/usr/home/hudson/hudson-slave/workspace/Lucene-Solr-NightlyTests-trunk/solr/build/solr-core/test/J1/solrtest-jetty2-1348198448505/collection1/lib/README' to classloader
[junit4:junit4]   2> 6515 T3429 oasc.SolrConfig.<init> Using Lucene MatchVersion: LUCENE_50
[junit4:junit4]   2> 6593 T3429 oasc.SolrConfig.<init> Loaded SolrConfig: solrconfig.xml
[junit4:junit4]   2> 6694 T3429 oass.IndexSchema.readSchema Reading Solr Schema
[junit4:junit4]   2> 6702 T3429 oass.IndexSchema.readSchema Schema name=test
[junit4:junit4]   2> 7427 T3429 oass.OpenExchangeRatesOrgProvider.init Initialized with rates=open-exchange-rates.json, refreshInterval=1440.
[junit4:junit4]   2> 7440 T3429 oass.IndexSchema.readSchema default search field in schema is text
[junit4:junit4]   2> 7444 T3429 oass.IndexSchema.readSchema unique key field: id
[junit4:junit4]   2> 7456 T3429 oass.FileExchangeRateProvider.reload Reloading exchange rates from file currency.xml
[junit4:junit4]   2> 7463 T3429 oass.FileExchangeRateProvider.reload Reloading exchange rates from file currency.xml
[junit4:junit4]   2> 7469 T3429 oass.OpenExchangeRatesOrgProvider.reload Reloading exchange rates from open-exchange-rates.json
[junit4:junit4]   2> 7471 T3429 oass.OpenExchangeRatesOrgProvider.reload Reloading exchange rates from open-exchange-rates.json
[junit4:junit4]   2> 7472 T3429 oasc.SolrCore.<init> [collection1] Opening new SolrCore at /usr/home/hudson/hudson-slave/workspace/Lucene-Solr-NightlyTests-trunk/solr/build/solr-core/test/J1/./solrtest-jetty2-1348198448505/collection1/, dataDir=./org.apache.solr.cloud.BasicDistributedZk2Test-1348198443016/jetty2/
[junit4:junit4]   2> 7473 T3429 oasc.JmxMonitoredMap.<init> JMX monitoring is enabled. Adding Solr mbeans to JMX Server: com.sun.jmx.mbeanserver.JmxMBeanServer@3c3228a1
[junit4:junit4]   2> 7479 T3429 oasc.SolrCore.getNewIndexDir WARNING New index directory detected: old=null new=./org.apache.solr.cloud.BasicDistributedZk2Test-1348198443016/jetty2/index/
[junit4:junit4]   2> 7481 T3429 oasc.SolrCore.initIndex WARNING [collection1] Solr index directory './org.apache.solr.cloud.BasicDistributedZk2Test-1348198443016/jetty2/index' doesn't exist. Creating new index...
[junit4:junit4]   2> 7482 T3429 oasc.CachingDirectoryFactory.get return new directory for /usr/home/hudson/hudson-slave/workspace/Lucene-Solr-NightlyTests-trunk/solr/build/solr-core/test/J1/./org.apache.solr.cloud.BasicDistributedZk2Test-1348198443016/jetty2/index forceNew:false
[junit4:junit4]   2> 7505 T3429 oasc.SolrDeletionPolicy.onCommit SolrDeletionPolicy.onCommit: commits:num=1
[junit4:junit4]   2> 		commit{dir=NRTCachingDirectory(org.apache.lucene.store.NIOFSDirectory@/usr/home/hudson/hudson-slave/workspace/Lucene-Solr-NightlyTests-trunk/solr/build/solr-core/test/J1/org.apache.solr.cloud.BasicDistributedZk2Test-1348198443016/jetty2/index lockFactory=org.apache.lucene.store.NativeFSLockFactory@39c099bd; maxCacheMB=48.0 maxMergeSizeMB=4.0),segFN=segments_1,generation=1,filenames=[segments_1]
[junit4:junit4]   2> 7506 T3429 oasc.SolrDeletionPolicy.updateCommits newest commit = 1
[junit4:junit4]   2> 7508 T3429 oasc.SolrCore.initWriters created xml: solr.XMLResponseWriter
[junit4:junit4]   2> 7511 T3429 oasup.UpdateRequestProcessorChain.init inserting DistributedUpdateProcessorFactory into updateRequestProcessorChain "dedupe"
[junit4:junit4]   2> 7512 T3429 oasup.UpdateRequestProcessorChain.init inserting DistributedUpdateProcessorFactory into updateRequestProcessorChain "dedupe-allfields"
[junit4:junit4]   2> 7512 T3429 oasup.UpdateRequestProcessorChain.init inserting DistributedUpdateProcessorFactory into updateRequestProcessorChain "stored_sig"
[junit4:junit4]   2> 7513 T3429 oasup.UpdateRequestProcessorChain.init inserting DistributedUpdateProcessorFactory into updateRequestProcessorChain "uniq-fields"
[junit4:junit4]   2> 7514 T3429 oasup.UpdateRequestProcessorChain.init inserting DistributedUpdateProcessorFactory into updateRequestProcessorChain "distrib-dup-test-chain-implicit"
[junit4:junit4]   2> 7515 T3429 oasc.RequestHandlers.initHandlersFromConfig adding lazy requestHandler: solr.ReplicationHandler
[junit4:junit4]   2> 7515 T3429 oasc.RequestHandlers.initHandlersFromConfig created /replication: solr.ReplicationHandler
[junit4:junit4]   2> 7516 T3429 oasc.RequestHandlers.initHandlersFromConfig created standard: solr.StandardRequestHandler
[junit4:junit4]   2> 7517 T3429 oasc.RequestHandlers.initHandlersFromConfig created /get: solr.RealTimeGetHandler
[junit4:junit4]   2> 7518 T3429 oasc.RequestHandlers.initHandlersFromConfig created dismax: solr.SearchHandler
[junit4:junit4]   2> 7518 T3429 oasc.RequestHandlers.initHandlersFromConfig created mock: org.apache.solr.core.MockQuerySenderListenerReqHandler
[junit4:junit4]   2> 7519 T3429 oasc.RequestHandlers.initHandlersFromConfig created /admin/: org.apache.solr.handler.admin.AdminHandlers
[junit4:junit4]   2> 7520 T3429 oasc.RequestHandlers.initHandlersFromConfig created defaults: solr.StandardRequestHandler
[junit4:junit4]   2> 7520 T3429 oasc.RequestHandlers.initHandlersFromConfig adding lazy requestHandler: solr.StandardRequestHandler
[junit4:junit4]   2> 7521 T3429 oasc.RequestHandlers.initHandlersFromConfig created lazy: solr.StandardRequestHandler
[junit4:junit4]   2> 7522 T3429 oasc.RequestHandlers.initHandlersFromConfig created /update: solr.UpdateRequestHandler
[junit4:junit4]   2> 7522 T3429 oasc.RequestHandlers.initHandlersFromConfig created /terms: org.apache.solr.handler.component.SearchHandler
[junit4:junit4]   2> 7523 T3429 oasc.RequestHandlers.initHandlersFromConfig created spellCheckCompRH: org.apache.solr.handler.component.SearchHandler
[junit4:junit4]   2> 7524 T3429 oasc.RequestHandlers.initHandlersFromConfig created spellCheckCompRH_Direct: org.apache.solr.handler.component.SearchHandler
[junit4:junit4]   2> 7525 T3429 oasc.RequestHandlers.initHandlersFromConfig created spellCheckWithWordbreak: org.apache.solr.handler.component.SearchHandler
[junit4:junit4]   2> 7525 T3429 oasc.RequestHandlers.initHandlersFromConfig created spellCheckWithWordbreak_Direct: org.apache.solr.handler.component.SearchHandler
[junit4:junit4]   2> 7529 T3429 oasc.RequestHandlers.initHandlersFromConfig created spellCheckCompRH1: org.apache.solr.handler.component.SearchHandler
[junit4:junit4]   2> 7530 T3429 oasc.RequestHandlers.initHandlersFromConfig created tvrh: org.apache.solr.handler.component.SearchHandler
[junit4:junit4]   2> 7530 T3429 oasc.RequestHandlers.initHandlersFromConfig created /mlt: solr.MoreLikeThisHandler
[junit4:junit4]   2> 7531 T3429 oasc.RequestHandlers.initHandlersFromConfig created /debug/dump: solr.DumpRequestHandler
[junit4:junit4]   2> 7535 T3429 oashl.XMLLoader.init xsltCacheLifetimeSeconds=60
[junit4:junit4]   2> 7541 T3429 oasc.SolrCore.initDeprecatedSupport WARNING solrconfig.xml uses deprecated <admin/gettableFiles>, Please update your config to use the ShowFileRequestHandler.
[junit4:junit4]   2> 7542 T3429 oasc.SolrCore.initDeprecatedSupport WARNING adding ShowFileRequestHandler with hidden files: [SCHEMA.XML, OLD_SYNONYMS.TXT, STOPWORDS.TXT, PROTWORDS.TXT, OPEN-EXCHANGE-RATES.JSON, SYNONYMS.TXT, CURRENCY.XML, MAPPING-ISOLATIN1ACCENT.TXT]
[junit4:junit4]   2> 7547 T3429 oass.SolrIndexSearcher.<init> Opening Searcher@71c5f6aa main
[junit4:junit4]   2> 7548 T3429 oasu.CommitTracker.<init> Hard AutoCommit: disabled
[junit4:junit4]   2> 7549 T3429 oasu.CommitTracker.<init> Soft AutoCommit: disabled
[junit4:junit4]   2> 7549 T3429 oashc.SpellCheckComponent.inform Initializing spell checkers
[junit4:junit4]   2> 7573 T3429 oass.DirectSolrSpellChecker.init init: {name=direct,classname=DirectSolrSpellChecker,field=lowerfilt,minQueryLength=3}
[junit4:junit4]   2> 7625 T3476 oasc.SolrCore.registerSearcher [collection1] Registered new searcher Searcher@71c5f6aa main{StandardDirectoryReader(segments_1:1)}
[junit4:junit4]   2> 7965 T3450 oascc.ZkStateReader.updateClusterState Updating cloud state from ZooKeeper... 
[junit4:junit4]   2> 7998 T3449 oascc.ZkStateReader$2.process A cluster state change has occurred - updating...
[junit4:junit4]   2> 7998 T3463 oascc.ZkStateReader$2.process A cluster state change has occurred - updating...
[junit4:junit4]   2> 7998 T3475 oascc.ZkStateReader$2.process A cluster state change has occurred - updating...
[junit4:junit4]   2> 8134 T3429 oasc.CoreContainer.register registering core: collection1
[junit4:junit4]   2> 8134 T3429 oasc.ZkController.register Register shard - core:collection1 address:http://127.0.0.1:54719/solr shardId:shard2
[junit4:junit4]   2> 8136 T3429 oascc.SolrZkClient.makePath makePath: /collections/collection1/leader_elect/shard2/election
[junit4:junit4]   2> 8158 T3434 oazs.PrepRequestProcessor.pRequest Got user-level KeeperException when processing sessionid:0x139e6e3a81b0004 type:delete cxid:0x41 zxid:0xfffffffffffffffe txntype:unknown reqpath:n/a Error Path:/solr/collections/collection1/leaders/shard2 Error:KeeperErrorCode = NoNode for /solr/collections/collection1/leaders/shard2
[junit4:junit4]   2> 8165 T3429 oasc.ShardLeaderElectionContext.runLeaderProcess Running the leader process.
[junit4:junit4]   2> 8166 T3434 oazs.PrepRequestProcessor.pRequest Got user-level KeeperException when processing sessionid:0x139e6e3a81b0004 type:create cxid:0x42 zxid:0xfffffffffffffffe txntype:unknown reqpath:n/a Error Path:/solr/overseer Error:KeeperErrorCode = NodeExists for /solr/overseer
[junit4:junit4]   2> 8181 T3429 oasc.ShardLeaderElectionContext.waitForReplicasToComeUp Enough replicas found to continue.
[junit4:junit4]   2> 8181 T3429 oasc.ShardLeaderElectionContext.runLeaderProcess I may be the new leader - try and sync
[junit4:junit4]   2> 8182 T3429 oasc.SyncStrategy.sync Sync replicas to http://127.0.0.1:54719/solr/collection1/
[junit4:junit4]   2> 8182 T3429 oasc.SyncStrategy.syncReplicas Sync Success - now sync replicas to me
[junit4:junit4]   2> 8183 T3429 oasc.SyncStrategy.syncToMe http://127.0.0.1:54719/solr/collection1/ has no replicas
[junit4:junit4]   2> 8183 T3429 oasc.ShardLeaderElectionContext.runLeaderProcess I am the new leader: http://127.0.0.1:54719/solr/collection1/
[junit4:junit4]   2> 8184 T3429 oascc.SolrZkClient.makePath makePath: /collections/collection1/leaders/shard2
[junit4:junit4]   2> 8190 T3434 oazs.PrepRequestProcessor.pRequest Got user-level KeeperException when processing sessionid:0x139e6e3a81b0004 type:create cxid:0x4b zxid:0xfffffffffffffffe txntype:unknown reqpath:n/a Error Path:/solr/overseer Error:KeeperErrorCode = NodeExists for /solr/overseer
[junit4:junit4]   2> 8510 T3450 oascc.ZkStateReader.updateClusterState Updating cloud state from ZooKeeper... 
[junit4:junit4]   2> 8586 T3449 oascc.ZkStateReader$2.process A cluster state change has occurred - updating...
[junit4:junit4]   2> 8586 T3475 oascc.ZkStateReader$2.process A cluster state change has occurred - updating...
[junit4:junit4]   2> 8586 T3463 oascc.ZkStateReader$2.process A cluster state change has occurred - updating...
[junit4:junit4]   2> 8613 T3429 oasc.ZkController.register We are http://127.0.0.1:54719/solr/collection1/ and leader is http://127.0.0.1:54719/solr/collection1/
[junit4:junit4]   2> 8613 T3429 oasc.ZkController.register No LogReplay needed for core=collection1 baseURL=http://127.0.0.1:54719/solr
[junit4:junit4]   2> 8614 T3429 oasc.ZkController.checkRecovery I am the leader, no recovery necessary
[junit4:junit4]   2> 8659 T3429 oascc.ZkStateReader.updateClusterState Updating cloud state from ZooKeeper... 
[junit4:junit4]   2> 8672 T3429 oass.SolrDispatchFilter.init user.dir=/usr/home/hudson/hudson-slave/workspace/Lucene-Solr-NightlyTests-trunk/solr/build/solr-core/test/J1
[junit4:junit4]   2> 8673 T3429 oass.SolrDispatchFilter.init SolrDispatchFilter.init() done
[junit4:junit4]   2> 8673 T3429 oascsi.HttpClientUtil.createClient Creating new http client, config:maxConnections=128&maxConnectionsPerHost=32&followRedirects=false
[junit4:junit4]   2> 9174 T3450 oascc.ZkStateReader.updateClusterState Updating cloud state from ZooKeeper... 
[junit4:junit4]   2> 9241 T3429 oejs.Server.doStart jetty-8.1.2.v20120308
[junit4:junit4]   2> 9244 T3429 oejs.AbstractConnector.doStart Started SocketConnector@0.0.0.0:50663
[junit4:junit4]   2> 9244 T3429 oasc.SolrResourceLoader.locateSolrHome JNDI not configured for solr (NoInitialContextEx)
[junit4:junit4]   2> 9244 T3429 oasc.SolrResourceLoader.locateSolrHome using system property solr.solr.home: /usr/home/hudson/hudson-slave/workspace/Lucene-Solr-NightlyTests-trunk/solr/build/solr-core/test/J1/./solrtest-jetty3-1348198451695
[junit4:junit4]   2> 9245 T3429 oasc.SolrResourceLoader.<init> new SolrResourceLoader for deduced Solr Home: '/usr/home/hudson/hudson-slave/workspace/Lucene-Solr-NightlyTests-trunk/solr/build/solr-core/test/J1/./solrtest-jetty3-1348198451695/'
[junit4:junit4]   2> 9267 T3429 oass.SolrDispatchFilter.init SolrDispatchFilter.init()
[junit4:junit4]   2> 9267 T3429 oasc.SolrResourceLoader.locateSolrHome JNDI not configured for solr (NoInitialContextEx)
[junit4:junit4]   2> 9268 T3429 oasc.SolrResourceLoader.locateSolrHome using system property solr.solr.home: /usr/home/hudson/hudson-slave/workspace/Lucene-Solr-NightlyTests-trunk/solr/build/solr-core/test/J1/./solrtest-jetty3-1348198451695
[junit4:junit4]   2> 9268 T3429 oasc.CoreContainer$Initializer.initialize looking for solr.xml: /usr/home/hudson/hudson-slave/workspace/Lucene-Solr-NightlyTests-trunk/solr/build/solr-core/test/J1/./solrtest-jetty3-1348198451695/solr.xml
[junit4:junit4]   2> 9268 T3429 oasc.CoreContainer.<init> New CoreContainer 494952701
[junit4:junit4]   2> 9269 T3429 oasc.CoreContainer.load Loading CoreContainer using Solr Home: '/usr/home/hudson/hudson-slave/workspace/Lucene-Solr-NightlyTests-trunk/solr/build/solr-core/test/J1/./solrtest-jetty3-1348198451695/'
[junit4:junit4]   2> 9269 T3429 oasc.SolrResourceLoader.<init> new SolrResourceLoader for directory: '/usr/home/hudson/hudson-slave/workspace/Lucene-Solr-NightlyTests-trunk/solr/build/solr-core/test/J1/./solrtest-jetty3-1348198451695/'
[junit4:junit4]   2> 9285 T3429 oasc.CoreContainer.load Registering Log Listener
[junit4:junit4]   2> 9290 T3449 oascc.ZkStateReader$2.process A cluster state change has occurred - updating...
[junit4:junit4]   2> 9290 T3463 oascc.ZkStateReader$2.process A cluster state change has occurred - updating...
[junit4:junit4]   2> 9290 T3475 oascc.ZkStateReader$2.process A cluster state change has occurred - updating...
[junit4:junit4]   2> 9295 T3429 oasc.CoreContainer.initZooKeeper Zookeeper client=127.0.0.1:25019/solr
[junit4:junit4]   2> 9296 T3429 oaz.ZooKeeper.<init> Initiating client connection, connectString=127.0.0.1:25019/solr sessionTimeout=5000 watcher=org.apache.solr.common.cloud.ConnectionManager@43340c84
[junit4:junit4]   2> 9297 T3486 oaz.ClientCnxn$SendThread.startConnect Opening socket connection to server /127.0.0.1:25019
[junit4:junit4]   2> 9297 T3429 oascc.ConnectionManager.waitForConnected Waiting for client to connect to ZooKeeper
[junit4:junit4]   2> 9297 T3486 oaz.ClientCnxn$SendThread.primeConnection Socket connection established to localhost/127.0.0.1:25019, initiating session
[junit4:junit4]   2> 9298 T3431 oazs.NIOServerCnxn$Factory.run Accepted socket connection from /140.211.11.196:61852
[junit4:junit4]   2> 9298 T3431 oazs.NIOServerCnxn.readConnectRequest Client attempting to establish new session at /140.211.11.196:61852
[junit4:junit4]   2> 9307 T3433 oazs.NIOServerCnxn.finishSessionInit Established session 0x139e6e3a81b0005 with negotiated timeout 5000 for client /140.211.11.196:61852
[junit4:junit4]   2> 9307 T3486 oaz.ClientCnxn$SendThread.readConnectResult Session establishment complete on server localhost/127.0.0.1:25019, sessionid = 0x139e6e3a81b0005, negotiated timeout = 5000
[junit4:junit4]   2> 9307 T3487 oascc.ConnectionManager.process Watcher org.apache.solr.common.cloud.ConnectionManager@43340c84 name:ZooKeeperConnection Watcher:127.0.0.1:25019/solr got event WatchedEvent state:SyncConnected type:None path:null path:null type:None
[junit4:junit4]   2> 9307 T3429 oascc.ConnectionManager.waitForConnected Client is connected to ZooKeeper
[junit4:junit4]   2> 9308 T3434 oazs.PrepRequestProcessor.pRequest Got user-level KeeperException when processing sessionid:0x139e6e3a81b0005 type:create cxid:0x1 zxid:0xfffffffffffffffe txntype:unknown reqpath:n/a Error Path:/solr/overseer Error:KeeperErrorCode = NodeExists for /solr/overseer
[junit4:junit4]   2> 9317 T3434 oazs.PrepRequestProcessor.pRequest Got user-level KeeperException when processing sessionid:0x139e6e3a81b0005 type:create cxid:0x2 zxid:0xfffffffffffffffe txntype:unknown reqpath:n/a Error Path:/solr/overseer Error:KeeperErrorCode = NodeExists for /solr/overseer
[junit4:junit4]   2> 9327 T3429 oasc.ZkController.createEphemeralLiveNode Register node as live in ZooKeeper:/live_nodes/127.0.0.1:50663_solr
[junit4:junit4]   2> 9327 T3434 oazs.PrepRequestProcessor.pRequest Got user-level KeeperException when processing sessionid:0x139e6e3a81b0005 type:delete cxid:0x4 zxid:0xfffffffffffffffe txntype:unknown reqpath:n/a Error Path:/solr/live_nodes/127.0.0.1:50663_solr Error:KeeperErrorCode = NoNode for /solr/live_nodes/127.0.0.1:50663_solr
[junit4:junit4]   2> 9346 T3429 oascc.SolrZkClient.makePath makePath: /live_nodes/127.0.0.1:50663_solr
[junit4:junit4]   2> 9384 T3449 oascc.ZkStateReader$3.process Updating live nodes
[junit4:junit4]   2> 9384 T3463 oascc.ZkStateReader$3.process Updating live nodes
[junit4:junit4]   2> 9384 T3475 oascc.ZkStateReader$3.process Updating live nodes
[junit4:junit4]   2> 9385 T3429 oashc.HttpShardHandlerFactory.getParameter Setting socketTimeout to: 0
[junit4:junit4]   2> 9386 T3429 oashc.HttpShardHandlerFactory.getParameter Setting urlScheme to: http://
[junit4:junit4]   2> 9386 T3429 oashc.HttpShardHandlerFactory.getParameter Setting connTimeout to: 0
[junit4:junit4]   2> 9386 T3429 oashc.HttpShardHandlerFactory.getParameter Setting maxConnectionsPerHost to: 20
[junit4:junit4]   2> 9387 T3429 oashc.HttpShardHandlerFactory.getParameter Setting corePoolSize to: 0
[junit4:junit4]   2> 9387 T3429 oashc.HttpShardHandlerFactory.getParameter Setting maximumPoolSize to: 2147483647
[junit4:junit4]   2> 9387 T3429 oashc.HttpShardHandlerFactory.getParameter Setting maxThreadIdleTime to: 5
[junit4:junit4]   2> 9388 T3429 oashc.HttpShardHandlerFactory.getParameter Setting sizeOfQueue to: -1
[junit4:junit4]   2> 9388 T3429 oashc.HttpShardHandlerFactory.getParameter Setting fairnessPolicy to: false
[junit4:junit4]   2> 9388 T3429 oascsi.HttpClientUtil.createClient Creating new http client, config:maxConnectionsPerHost=20&maxConnections=10000&socketTimeout=0&connTimeout=0&retry=false
[junit4:junit4]   2> 9419 T3429 oascc.ZkStateReader.createClusterStateWatchersAndUpdate Updating cluster state from ZooKeeper... 
[junit4:junit4]   2> 9424 T3429 oasc.CoreContainer.create Creating SolrCore 'collection1' using instanceDir: /usr/home/hudson/hudson-slave/workspace/Lucene-Solr-NightlyTests-trunk/solr/build/solr-core/test/J1/./solrtest-jetty3-1348198451695/collection1
[junit4:junit4]   2> 9425 T3429 oasc.ZkController.createCollectionZkNode Check for collection zkNode:collection1
[junit4:junit4]   2> 9425 T3429 oasc.ZkController.createCollectionZkNode Collection zkNode exists
[junit4:junit4]   2> 9426 T3429 oasc.ZkController.readConfigName Load collection config from:/collections/collection1
[junit4:junit4]   2> 9427 T3429 oasc.SolrResourceLoader.<init> new SolrResourceLoader for directory: '/usr/home/hudson/hudson-slave/workspace/Lucene-Solr-NightlyTests-trunk/solr/build/solr-core/test/J1/./solrtest-jetty3-1348198451695/collection1/'
[junit4:junit4]   2> 9428 T3429 oasc.SolrResourceLoader.replaceClassLoader Adding 'file:/usr/home/hudson/hudson-slave/workspace/Lucene-Solr-NightlyTests-trunk/solr/build/solr-core/test/J1/solrtest-jetty3-1348198451695/collection1/lib/classes/' to classloader
[junit4:junit4]   2> 9428 T3429 oasc.SolrResourceLoader.replaceClassLoader Adding 'file:/usr/home/hudson/hudson-slave/workspace/Lucene-Solr-NightlyTests-trunk/solr/build/solr-core/test/J1/solrtest-jetty3-1348198451695/collection1/lib/README' to classloader
[junit4:junit4]   2> 9462 T3429 oasc.SolrConfig.<init> Using Lucene MatchVersion: LUCENE_50
[junit4:junit4]   2> 9510 T3429 oasc.SolrConfig.<init> Loaded SolrConfig: solrconfig.xml
[junit4:junit4]   2> 9611 T3429 oass.IndexSchema.readSchema Reading Solr Schema
[junit4:junit4]   2> 9619 T3429 oass.IndexSchema.readSchema Schema name=test
[junit4:junit4]   2> 10384 T3429 oass.OpenExchangeRatesOrgProvider.init Initialized with rates=open-exchange-rates.json, refreshInterval=1440.
[junit4:junit4]   2> 10405 T3429 oass.IndexSchema.readSchema default search field in schema is text
[junit4:junit4]   2> 10409 T3429 oass.IndexSchema.readSchema unique key field: id
[junit4:junit4]   2> 10423 T3429 oass.FileExchangeRateProvider.reload Reloading exchange rates from file currency.xml
[junit4:junit4]   2> 10429 T3429 oass.FileExchangeRateProvider.reload Reloading exchange rates from file currency.xml
[junit4:junit4]   2> 10437 T3429 oass.OpenExchangeRatesOrgProvider.reload Reloading exchange rates from open-exchange-rates.json
[junit4:junit4]   2> 10439 T3429 oass.OpenExchangeRatesOrgProvider.reload Reloading exchange rates from open-exchange-rates.json
[junit4:junit4]   2> 10440 T3429 oasc.SolrCore.<init> [collection1] Opening new SolrCore at /usr/home/hudson/hudson-slave/workspace/Lucene-Solr-NightlyTests-trunk/solr/build/solr-core/test/J1/./solrtest-jetty3-1348198451695/collection1/, dataDir=./org.apache.solr.cloud.BasicDistributedZk2Test-1348198443016/jetty3/
[junit4:junit4]   2> 10441 T3429 oasc.JmxMonitoredMap.<init> JMX monitoring is enabled. Adding Solr mbeans to JMX Server: com.sun.jmx.mbeanserver.JmxMBeanServer@3c3228a1
[junit4:junit4]   2> 10443 T3429 oasc.SolrCore.getNewIndexDir WARNING New index directory detected: old=null new=./org.apache.solr.cloud.BasicDistributedZk2Test-1348198443016/jetty3/index/
[junit4:junit4]   2> 10444 T3429 oasc.SolrCore.initIndex WARNING [collection1] Solr index directory './org.apache.solr.cloud.BasicDistributedZk2Test-1348198443016/jetty3/index' doesn't exist. Creating new index...
[junit4:junit4]   2> 10445 T3429 oasc.CachingDirectoryFactory.get return new directory for /usr/home/hudson/hudson-slave/workspace/Lucene-Solr-NightlyTests-trunk/solr/build/solr-core/test/J1/./org.apache.solr.cloud.BasicDistributedZk2Test-1348198443016/jetty3/index forceNew:false
[junit4:junit4]   2> 10486 T3429 oasc.SolrDeletionPolicy.onCommit SolrDeletionPolicy.onCommit: commits:num=1
[junit4:junit4]   2> 		commit{dir=NRTCachingDirectory(org.apache.lucene.store.NIOFSDirectory@/usr/home/hudson/hudson-slave/workspace/Lucene-Solr-NightlyTests-trunk/solr/build/solr-core/test/J1/org.apache.solr.cloud.BasicDistributedZk2Test-1348198443016/jetty3/index lockFactory=org.apache.lucene.store.NativeFSLockFactory@5d9a3f32; maxCacheMB=48.0 maxMergeSizeMB=4.0),segFN=segments_1,generation=1,filenames=[segments_1]
[junit4:junit4]   2> 10487 T3429 oasc.SolrDeletionPolicy.updateCommits newest commit = 1
[junit4:junit4]   2> 10489 T3429 oasc.SolrCore.initWriters created xml: solr.XMLResponseWriter
[junit4:junit4]   2> 10492 T3429 oasup.UpdateRequestProcessorChain.init inserting DistributedUpdateProcessorFactory into updateRequestProcessorChain "dedupe"
[junit4:junit4]   2> 10493 T3429 oasup.UpdateRequestProcessorChain.init inserting DistributedUpdateProcessorFactory into updateRequestProcessorChain "dedupe-allfields"
[junit4:junit4]   2> 10493 T3429 oasup.UpdateRequestProcessorChain.init inserting DistributedUpdateProcessorFactory into updateRequestProcessorChain "stored_sig"
[junit4:junit4]   2> 10494 T3429 oasup.UpdateRequestProcessorChain.init inserting DistributedUpdateProcessorFactory into updateRequestProcessorChain "uniq-fields"
[junit4:junit4]   2> 10495 T3429 oasup.UpdateRequestProcessorChain.init inserting DistributedUpdateProcessorFactory into updateRequestProcessorChain "distrib-dup-test-chain-implicit"
[junit4:junit4]   2> 10496 T3429 oasc.RequestHandlers.initHandlersFromConfig adding lazy requestHandler: solr.ReplicationHandler
[junit4:junit4]   2> 10497 T3429 oasc.RequestHandlers.initHandlersFromConfig created /replication: solr.ReplicationHandler
[junit4:junit4]   2> 10498 T3429 oasc.RequestHandlers.initHandlersFromConfig created standard: solr.StandardRequestHandler
[junit4:junit4]   2> 10499 T3429 oasc.RequestHandlers.initHandlersFromConfig created /get: solr.RealTimeGetHandler
[junit4:junit4]   2> 10500 T3429 oasc.RequestHandlers.initHandlersFromConfig created dismax: solr.SearchHandler
[junit4:junit4]   2> 10501 T3429 oasc.RequestHandlers.initHandlersFromConfig created mock: org.apache.solr.core.MockQuerySenderListenerReqHandler
[junit4:junit4]   2> 10501 T3429 oasc.RequestHandlers.initHandlersFromConfig created /admin/: org.apache.solr.handler.admin.AdminHandlers
[junit4:junit4]   2> 10502 T3429 oasc.RequestHandlers.initHandlersFromConfig created defaults: solr.StandardRequestHandler
[junit4:junit4]   2> 10503 T3429 oasc.RequestHandlers.initHandlersFromConfig adding lazy requestHandler: solr.StandardRequestHandler
[junit4:junit4]   2> 10504 T3429 oasc.RequestHandlers.initHandlersFromConfig created lazy: solr.StandardRequestHandler
[junit4:junit4]   2> 10505 T3429 oasc.RequestHandlers.initHandlersFromConfig created /update: solr.UpdateRequestHandler
[junit4:junit4]   2> 10506 T3429 oasc.RequestHandlers.initHandlersFromConfig created /terms: org.apache.solr.handler.component.SearchHandler
[junit4:junit4]   2> 10507 T3429 oasc.RequestHandlers.initHandlersFromConfig created spellCheckCompRH: org.apache.solr.handler.component.SearchHandler
[junit4:junit4]   2> 10508 T3429 oasc.RequestHandlers.initHandlersFromConfig created spellCheckCompRH_Direct: org.apache.solr.handler.component.SearchHandler
[junit4:junit4]   2> 10509 T3429 oasc.RequestHandlers.initHandlersFromConfig created spellCheckWithWordbreak: org.apache.solr.handler.component.SearchHandler
[junit4:junit4]   2> 10510 T3429 oasc.RequestHandlers.initHandlersFromConfig created spellCheckWithWordbreak_Direct: org.apache.solr.handler.component.SearchHandler
[junit4:junit4]   2> 10511 T3429 oasc.RequestHandlers.initHandlersFromConfig created spellCheckCompRH1: org.apache.solr.handler.component.SearchHandler
[junit4:junit4]   2> 10511 T3429 oasc.RequestHandlers.initHandlersFromConfig created tvrh: org.apache.solr.handler.component.SearchHandler
[junit4:junit4]   2> 10512 T3429 oasc.RequestHandlers.initHandlersFromConfig created /mlt: solr.MoreLikeThisHandler
[junit4:junit4]   2> 10513 T3429 oasc.RequestHandlers.initHandlersFromConfig created /debug/dump: solr.DumpRequestHandler
[junit4:junit4]   2> 10518 T3429 oashl.XMLLoader.init xsltCacheLifetimeSeconds=60
[junit4:junit4]   2> 10525 T3429 oasc.SolrCore.initDeprecatedSupport WARNING solrconfig.xml uses deprecated <admin/gettableFiles>, Please update your config to use the ShowFileRequestHandler.
[junit4:junit4]   2> 10527 T3429 oasc.SolrCore.initDeprecatedSupport WARNING adding ShowFileRequestHandler with hidden files: [SCHEMA.XML, OLD_SYNONYMS.TXT, STOPWORDS.TXT, PROTWORDS.TXT, OPEN-EXCHANGE-RATES.JSON, SYNONYMS.TXT, CURRENCY.XML, MAPPING-ISOLATIN1ACCENT.TXT]
[junit4:junit4]   2> 10532 T3429 oass.SolrIndexSearcher.<init> Opening Searcher@161abb50 main
[junit4:junit4]   2> 10533 T3429 oasu.CommitTracker.<init> Hard AutoCommit: disabled
[junit4:junit4]   2> 10534 T3429 oasu.CommitTracker.<init> Soft AutoCommit: disabled
[junit4:junit4]   2> 10535 T3429 oashc.SpellCheckComponent.inform Initializing spell checkers
[junit4:junit4]   2> 10628 T3429 oass.DirectSolrSpellChecker.init init: {name=direct,classname=DirectSolrSpellChecker,field=lowerfilt,minQueryLength=3}
[junit4:junit4]   2> 10828 T3488 oasc.SolrCore.registerSearcher [collection1] Registered new searcher Searcher@161abb50 main{StandardDirectoryReader(segments_1:1)}
[junit4:junit4]   2> 11315 T3450 oascc.ZkStateReader.updateClusterState Updating cloud state from ZooKeeper... 
[junit4:junit4]   2> 11327 T3449 oascc.ZkStateReader$2.process A cluster state change has occurred - updating...
[junit4:junit4]   2> 11327 T3487 oascc.ZkStateReader$2.process A cluster state change has occurred - updating...
[junit4:junit4]   2> 11327 T3463 oascc.ZkStateReader$2.process A cluster state change has occurred - updating...
[junit4:junit4]   2> 11327 T3475 oascc.ZkStateReader$2.process A cluster state change has occurred - updating...
[junit4:junit4]   2> 11338 T3429 oasc.CoreContainer.register registering core: collection1
[junit4:junit4]   2> 11338 T3429 oasc.ZkController.register Register shard - core:collection1 address:http://127.0.0.1:50663/solr shardId:shard1
[junit4:junit4]   2> 11341 T3429 oasc.ZkController.register We are http://127.0.0.1:50663/solr/collection1/ and leader is http://127.0.0.1:38577/solr/collection1/
[junit4:junit4]   2> 11342 T3429 oasc.ZkController.register No LogReplay needed for core=collection1 baseURL=http://127.0.0.1:50663/solr
[junit4:junit4]   2> 11342 T3429 oasc.ZkController.checkRecovery Core needs to recover:collection1
[junit4:junit4]   2> 11343 T3429 oasu.DefaultSolrCoreState.doRecovery Running recovery - first canceling any ongoing recovery
[junit4:junit4]   2> ASYNC  NEW_CORE C170 name=collection1 org.apache.solr.core.SolrCore@31fa87bb url=http://127.0.0.1:50663/solr/collection1 node=127.0.0.1:50663_solr
[junit4:junit4]   2> 11344 T3489 C170 P50663 oasc.RecoveryStrategy.run Starting recovery process.  core=collection1 recoveringAfterStartup=true
[junit4:junit4]   2> 11344 T3489 C170 P50663 oasc.RecoveryStrategy.doRecovery ###### startupVersions=[]
[junit4:junit4]   2> 11344 T3429 oascc.ZkStateReader.updateClusterState Updating cloud state from ZooKeeper... 
[junit4:junit4]   2> 11346 T3489 C170 P50663 oasc.RecoveryStrategy.doRecovery Attempting to PeerSync from http://127.0.0.1:38577/solr/collection1/ core=collection1 - recoveringAfterStartup=true
[junit4:junit4]   2> 11346 T3489 C170 P50663 oasu.PeerSync.sync PeerSync: core=collection1 url=http://127.0.0.1:50663/solr START replicas=[http://127.0.0.1:38577/solr/collection1/] nUpdates=100
[junit4:junit4]   2> 11346 T3429 oass.SolrDispatchFilter.init user.dir=/usr/home/hudson/hudson-slave/workspace/Lucene-Solr-NightlyTests-trunk/solr/build/solr-core/test/J1
[junit4:junit4]   2> 11346 T3489 C170 P50663 oasu.PeerSync.sync WARNING no frame of reference to tell of we've missed updates
[junit4:junit4]   2> 11346 T3429 oass.SolrDispatchFilter.init SolrDispatchFilter.init() done
[junit4:junit4]   2> 11347 T3489 C170 P50663 oasc.RecoveryStrategy.doRecovery PeerSync Recovery was not successful - trying replication. core=collection1
[junit4:junit4]   2> 11347 T3489 C170 P50663 oasc.RecoveryStrategy.doRecovery Starting Replication Recovery. core=collection1
[junit4:junit4]   2> 11347 T3429 oascsi.HttpClientUtil.createClient Creating new http client, config:maxConnections=128&maxConnectionsPerHost=32&followRedirects=false
[junit4:junit4]   2> 11347 T3489 C170 P50663 oascsi.HttpClientUtil.createClient Creating new http client, config:maxConnections=128&maxConnectionsPerHost=32&followRedirects=false
[junit4:junit4]   2> ASYNC  NEW_CORE C171 name=collection1 org.apache.solr.core.SolrCore@388a91ee url=http://127.0.0.1:38577/solr/collection1 node=127.0.0.1:38577_solr
[junit4:junit4]   2> 11356 T3455 C171 P38577 REQ /get {distrib=false&qt=/get&wt=javabin&version=2&getVersions=100} status=0 QTime=0 
[junit4:junit4]   2> 11832 T3450 oascc.ZkStateReader.updateClusterState Updating cloud state from ZooKeeper... 
[junit4:junit4]   2> 11852 T3463 oascc.ZkStateReader$2.process A cluster state change has occurred - updating...
[junit4:junit4]   2> 11852 T3449 oascc.ZkStateReader$2.process A cluster state change has occurred - updating...
[junit4:junit4]   2> 11852 T3475 oascc.ZkStateReader$2.process A cluster state change has occurred - updating...
[junit4:junit4]   2> 11852 T3487 oascc.ZkStateReader$2.process A cluster state change has occurred - updating...
[junit4:junit4]   2> 12260 T3429 oejs.Server.doStart jetty-8.1.2.v20120308
[junit4:junit4]   2> 12263 T3429 oejs.AbstractConnector.doStart Started SocketConnector@0.0.0.0:56631
[junit4:junit4]   2> 12264 T3429 oasc.SolrResourceLoader.locateSolrHome JNDI not configured for solr (NoInitialContextEx)
[junit4:junit4]   2> 12265 T3429 oasc.SolrResourceLoader.locateSolrHome using system property solr.solr.home: /usr/home/hudson/hudson-slave/workspace/Lucene-Solr-NightlyTests-trunk/solr/build/solr-core/test/J1/./solrtest-jetty4-1348198454383
[junit4:junit4]   2> 12265 T3429 oasc.SolrResourceLoader.<init> new SolrResourceLoader for deduced Solr Home: '/usr/home/hudson/hudson-slave/workspace/Lucene-Solr-NightlyTests-trunk/solr/build/solr-core/test/J1/./solrtest-jetty4-1348198454383/'
[junit4:junit4]   2> 12305 T3429 oass.SolrDispatchFilter.init SolrDispatchFilter.init()
[junit4:junit4]   2> 12306 T3429 oasc.SolrResourceLoader.locateSolrHome JNDI not configured for solr (NoInitialContextEx)
[junit4:junit4]   2> 12307 T3429 oasc.SolrResourceLoader.locateSolrHome using system property solr.solr.home: /usr/home/hudson/hudson-slave/workspace/Lucene-Solr-NightlyTests-trunk/solr/build/solr-core/test/J1/./solrtest-jetty4-1348198454383
[junit4:junit4]   2> 12307 T3429 oasc.CoreContainer$Initializer.initialize looking for solr.xml: /usr/home/hudson/hudson-slave/workspace/Lucene-Solr-NightlyTests-trunk/solr/build/solr-core/test/J1/./solrtest-jetty4-1348198454383/solr.xml
[junit4:junit4]   2> 12307 T3429 oasc.CoreContainer.<init> New CoreContainer 1849435906
[junit4:junit4]   2> 12308 T3429 oasc.CoreContainer.load Loading CoreContainer using Solr Home: '/usr/home/hudson/hudson-slave/workspace/Lucene-Solr-NightlyTests-trunk/solr/build/solr-core/test/J1/./solrtest-jetty4-1348198454383/'
[junit4:junit4]   2> 12309 T3429 oasc.SolrResourceLoader.<init> new SolrResourceLoader for directory: '/usr/home/hudson/hudson-slave/workspace/Lucene-Solr-NightlyTests-trunk/solr/build/solr-core/test/J1/./solrtest-jetty4-1348198454383/'
[junit4:junit4]   2> 12334 T3429 oasc.CoreContainer.load Registering Log Listener
[junit4:junit4]   2> 12350 T3429 oasc.CoreContainer.initZooKeeper Zookeeper client=127.0.0.1:25019/solr
[junit4:junit4]   2> 12351 T3429 oaz.ZooKeeper.<init> Initiating client connection, connectString=127.0.0.1:25019/solr sessionTimeout=5000 watcher=org.apache.solr.common.cloud.ConnectionManager@31a33116
[junit4:junit4]   2> 12352 T3500 oaz.ClientCnxn$SendThread.startConnect Opening socket connection to server /127.0.0.1:25019
[junit4:junit4]   2> 12352 T3429 oascc.ConnectionManager.waitForConnected Waiting for client to connect to ZooKeeper
[junit4:junit4]   2> 12353 T3500 oaz.ClientCnxn$SendThread.primeConnection Socket connection established to localhost/127.0.0.1:25019, initiating session
[junit4:junit4]   2> 12353 T3431 oazs.NIOServerCnxn$Factory.run Accepted socket connection from /140.211.11.196:32487
[junit4:junit4]   2> 12354 T3431 oazs.NIOServerCnxn.readConnectRequest Client attempting to establish new session at /140.211.11.196:32487
[junit4:junit4]   2> 12363 T3433 oazs.NIOServerCnxn.finishSessionInit Established session 0x139e6e3a81b0006 with negotiated timeout 5000 for client /140.211.11.196:32487
[junit4:junit4]   2> 12363 T3500 oaz.ClientCnxn$SendThread.readConnectResult Session establishment complete on server localhost/127.0.0.1:25019, sessionid = 0x139e6e3a81b0006, negotiated timeout = 5000
[junit4:junit4]   2> 12363 T3501 oascc.ConnectionManager.process Watcher org.apache.solr.common.cloud.ConnectionManager@31a33116 name:ZooKeeperConnection Watcher:127.0.0.1:25019/solr got event WatchedEvent state:SyncConnected type:None path:null path:null type:None
[junit4:junit4]   2> 12364 T3429 oascc.ConnectionManager.waitForConnected Client is connected to ZooKeeper
[junit4:junit4]   2> 12365 T3434 oazs.PrepRequestProcessor.pRequest Got user-level KeeperException when processing sessionid:0x139e6e3a81b0006 type:create cxid:0x1 zxid:0xfffffffffffffffe txntype:unknown reqpath:n/a Error Path:/solr/overseer Error:KeeperErrorCode = NodeExists for /solr/overseer
[junit4:junit4]   2> 12369 T3434 oazs.PrepRequestProcessor.pRequest Got user-level KeeperException when processing sessionid:0x139e6e3a81b0006 type:create cxid:0x2 zxid:0xfffffffffffffffe txntype:unknown reqpath:n/a Error Path:/solr/overseer Error:KeeperErrorCode = NodeExists for /solr/overseer
[junit4:junit4]   2> 12378 T3429 oasc.ZkController.createEphemeralLiveNode Register node as live in ZooKeeper:/live_nodes/127.0.0.1:56631_solr
[junit4:junit4]   2> 12379 T3434 oazs.PrepRequestProcessor.pRequest Got user-level KeeperException when processing sessionid:0x139e6e3a81b0006 type:delete cxid:0x4 zxid:0xfffffffffffffffe txntype:unknown reqpath:n/a Error Path:/solr/live_nodes/127.0.0.1:56631_solr Error:KeeperErrorCode = NoNode for /solr/live_nodes/127.0.0.1:56631_solr
[junit4:junit4]   2> 12386 T3429 oascc.SolrZkClient.makePath makePath: /live_nodes/127.0.0.1:56631_solr
[junit4:junit4]   2> 12395 T3449 oascc.ZkStateReader$3.process Updating live nodes
[junit4:junit4]   2> 12395 T3475 oascc.ZkStateReader$3.process Updating live nodes
[junit4:junit4]   2> 12395 T3463 oascc.ZkStateReader$3.process Updating live nodes
[junit4:junit4]   2> 12395 T3487 oascc.ZkStateReader$3.process Updating live nodes
[junit4:junit4]   2> 12396 T3429 oashc.HttpShardHandlerFactory.getParameter Setting socketTimeout to: 0
[junit4:junit4]   2> 12396 T3429 oashc.HttpShardHandlerFactory.getParameter Setting urlScheme to: http://
[junit4:junit4]   2> 12397 T3429 oashc.HttpShardHandlerFactory.getParameter Setting connTimeout to: 0
[junit4:junit4]   2> 12397 T3429 oashc.HttpShardHandlerFactory.getParameter Setting maxConnectionsPerHost to: 20
[junit4:junit4]   2> 12398 T3429 oashc.HttpShardHandlerFactory.getParameter Setting corePoolSize to: 0
[junit4:junit4]   2> 12398 T3429 oashc.HttpShardHandlerFactory.getParameter Setting maximumPoolSize to: 2147483647
[junit4:junit4]   2> 12399 T3429 oashc.HttpShardHandlerFactory.getParameter Setting maxThreadIdleTime to: 5
[junit4:junit4]   2> 12399 T3429 oashc.HttpShardHandlerFactory.getParameter Setting sizeOfQueue to: -1
[junit4:junit4]   2> 12400 T3429 oashc.HttpShardHandlerFactory.getParameter Setting fairnessPolicy to: false
[junit4:junit4]   2> 12400 T3429 oascsi.HttpClientUtil.createClient Creating new http client, config:maxConnectionsPerHost=20&maxConnections=10000&socketTimeout=0&connTimeout=0&retry=false
[junit4:junit4]   2> 12424 T3429 oascc.ZkStateReader.createClusterStateWatchersAndUpdate Updating cluster state from ZooKeeper... 
[junit4:junit4]   2> 12431 T3429 oasc.CoreContainer.create Creating SolrCore 'collection1' using instanceDir: /usr/home/hudson/hudson-slave/workspace/Lucene-Solr-NightlyTests-trunk/solr/build/solr-core/test/J1/./solrtest-jetty4-1348198454383/collection1
[junit4:junit4]   2> 12432 T3429 oasc.ZkController.createCollectionZkNode Check for collection zkNode:collection1
[junit4:junit4]   2> 12432 T3429 oasc.ZkController.createCollectionZkNode Collection zkNode exists
[junit4:junit4]   2> 12433 T3429 oasc.ZkController.readConfigName Load collection config from:/collections/collection1
[junit4:junit4]   2> 12434 T3429 oasc.SolrResourceLoader.<init> new SolrResourceLoader for directory: '/usr/home/hudson/hudson-slave/workspace/Lucene-Solr-NightlyTests-trunk/solr/build/solr-core/test/J1/./solrtest-jetty4-1348198454383/collection1/'
[junit4:junit4]   2> 12436 T3429 oasc.SolrResourceLoader.replaceClassLoader Adding 'file:/usr/home/hudson/hudson-slave/workspace/Lucene-Solr-NightlyTests-trunk/solr/build/solr-core/test/J1/solrtest-jetty4-1348198454383/collection1/lib/README' to classloader
[junit4:junit4]   2> 12437 T3429 oasc.SolrResourceLoader.replaceClassLoader Adding 'file:/usr/home/hudson/hudson-slave/workspace/Lucene-Solr-NightlyTests-trunk/solr/build/solr-core/test/J1/solrtest-jetty4-1348198454383/collection1/lib/classes/' to classloader
[junit4:junit4]   2> 12486 T3429 oasc.SolrConfig.<init> Using Lucene MatchVersion: LUCENE_50
[junit4:junit4]   2> 12558 T3429 oasc.SolrConfig.<init> Loaded SolrConfig: solrconfig.xml
[junit4:junit4]   2> 12660 T3429 oass.IndexSchema.readSchema Reading Solr Schema
[junit4:junit4]   2> 12668 T3429 oass.IndexSchema.readSchema Schema name=test
[junit4:junit4]   2> 13328 T3429 oass.OpenExchangeRatesOrgProvider.init Initialized with rates=open-exchange-rates.json, refreshInterval=1440.
[junit4:junit4]   2> 13341 T3429 oass.IndexSchema.readSchema default search field in schema is text
[junit4:junit4]   2> 13345 T3429 oass.IndexSchema.readSchema unique key field: id
[junit4:junit4]   2> 13359 T3429 oass.FileExchangeRateProvider.reload Reloading exchange rates from file currency.xml
[junit4:junit4]   2> 13366 T3429 oass.FileExchangeRateProvider.reload Reloading exchange rates from file currency.xml
[junit4:junit4]   2> 13373 T3429 oass.OpenExchangeRatesOrgProvider.reload Reloading exchange rates from open-exchange-rates.json
[junit4:junit4]   2> 13375 T3429 oass.OpenExchangeRatesOrgProvider.reload Reloading exchange rates from open-exchange-rates.json
[junit4:junit4]   2> 13376 T3429 oasc.SolrCore.<init> [collection1] Opening new SolrCore at /usr/home/hudson/hudson-slave/workspace/Lucene-Solr-NightlyTests-trunk/solr/build/solr-core/test/J1/./solrtest-jetty4-1348198454383/collection1/, dataDir=./org.apache.solr.cloud.BasicDistributedZk2Test-1348198443016/jetty4/
[junit4:junit4]   2> 13377 T3429 oasc.JmxMonitoredMap.<init> JMX monitoring is enabled. Adding Solr mbeans to JMX Server: com.sun.jmx.mbeanserver.JmxMBeanServer@3c3228a1
[junit4:junit4]   2> 13379 T3429 oasc.SolrCore.getNewIndexDir WARNING New index directory detected: old=null new=./org.apache.solr.cloud.BasicDistributedZk2Test-1348198443016/jetty4/index/
[junit4:junit4]   2> 13380 T3429 oasc.SolrCore.initIndex WARNING [collection1] Solr index directory './org.apache.solr.cloud.BasicDistributedZk2Test-1348198443016/jetty4/index' doesn't exist. Creating new index...
[junit4:junit4]   2> 13381 T3429 oasc.CachingDirectoryFactory.get return new directory for /usr/home/hudson/hudson-slave/workspace/Lucene-Solr-NightlyTests-trunk/solr/build/solr-core/test/J1/./org.apache.solr.cloud.BasicDistributedZk2Test-1348198443016/jetty4/index forceNew:false
[junit4:junit4]   2> 13406 T3429 oasc.SolrDeletionPolicy.onCommit SolrDeletionPolicy.onCommit: commits:num=1
[junit4:junit4]   2> 		commit{dir=NRTCachingDirectory(org.apache.lucene.store.NIOFSDirectory@/usr/home/hudson/hudson-slave/workspace/Lucene-Solr-NightlyTests-trunk/solr/build/solr-core/test/J1/org.apache.solr.cloud.BasicDistributedZk2Test-1348198443016/jetty4/index lockFactory=org.apache.lucene.store.NativeFSLockFactory@3f5a64e3; maxCacheMB=48.0 maxMergeSizeMB=4.0),segFN=segments_1,generation=1,filenames=[segments_1]
[junit4:junit4]   2> 13406 T3429 oasc.SolrDeletionPolicy.updateCommits newest commit = 1
[junit4:junit4]   2> 13408 T3429 oasc.SolrCore.initWriters created xml: solr.XMLResponseWriter
[junit4:junit4]   2> 13410 T3429 oasup.UpdateRequestProcessorChain.init inserting DistributedUpdateProcessorFactory into updateRequestProcessorChain "dedupe"
[junit4:junit4]   2> 13411 T3429 oasup.UpdateRequestProcessorChain.init inserting DistributedUpdateProcessorFactory into updateRequestProcessorChain "dedupe-allfields"
[junit4:junit4]   2> 13411 T3429 oasup.UpdateRequestProcessorChain.init inserting DistributedUpdateProcessorFactory into updateRequestProcessorChain "stored_sig"
[junit4:junit4]   2> 13412 T3429 oasup.UpdateRequestProcessorChain.init inserting DistributedUpdateProcessorFactory into updateRequestProcessorChain "uniq-fields"
[junit4:junit4]   2> 13412 T3429 oasup.UpdateRequestProcessorChain.init inserting DistributedUpdateProcessorFactory into updateRequestProcessorChain "distrib-dup-test-chain-implicit"
[junit4:junit4]   2> 13413 T3429 oasc.RequestHandlers.initHandlersFromConfig adding lazy requestHandler: solr.ReplicationHandler
[junit4:junit4]   2> 13414 T3429 oasc.RequestHandlers.initHandlersFromConfig created /replication: solr.ReplicationHandler
[junit4:junit4]   2> 13414 T3429 oasc.RequestHandlers.initHandlersFromConfig created standard: solr.StandardRequestHandler
[junit4:junit4]   2> 13415 T3429 oasc.RequestHandlers.initHandlersFromConfig created /get: solr.RealTimeGetHandler
[junit4:junit4]   2> 13416 T3429 oasc.RequestHandlers.initHandlersFromConfig created dismax: solr.SearchHandler
[junit4:junit4]   2> 13417 T3429 oasc.RequestHandlers.initHandlersFromConfig created mock: org.apache.solr.core.MockQuerySenderListenerReqHandler
[junit4:junit4]   2> 13417 T3429 oasc.RequestHandlers.initHandlersFromConfig created /admin/: org.apache.solr.handler.admin.AdminHandlers
[junit4:junit4]   2> 13418 T3429 oasc.RequestHandlers.initHandlersFromConfig created defaults: solr.StandardRequestHandler
[junit4:junit4]   2> 13418 T3429 oasc.RequestHandlers.initHandlersFromConfig adding lazy requestHandler: solr.StandardRequestHandler
[junit4:junit4]   2> 13419 T3429 oasc.RequestHandlers.initHandlersFromConfig created lazy: solr.StandardRequestHandler
[junit4:junit4]   2> 13420 T3429 oasc.RequestHandlers.initHandlersFromConfig created /update: solr.UpdateRequestHandler
[junit4:junit4]   2> 13421 T3429 oasc.RequestHandlers.initHandlersFromConfig created /terms: org.apache.solr.handler.component.SearchHandler
[junit4:junit4]   2> 13421 T3429 oasc.RequestHandlers.initHandlersFromConfig created spellCheckCompRH: org.apache.solr.handler.component.SearchHandler
[junit4:junit4]   2> 13422 T3429 oasc.RequestHandlers.initHandlersFromConfig created spellCheckCompRH_Direct: org.apache.solr.handler.component.SearchHandler
[junit4:junit4]   2> 13423 T3429 oasc.RequestHandlers.initHandlersFromConfig created spellCheckWithWordbreak: org.apache.solr.handler.component.SearchHandler
[junit4:junit4]   2> 13424 T3429 oasc.RequestHandlers.initHandlersFromConfig created spellCheckWithWordbreak_Direct: org.apache.solr.handler.component.SearchHandler
[junit4:junit4]   2> 13424 T3429 oasc.RequestHandlers.initHandlersFromConfig created spellCheckCompRH1: org.apache.solr.handler.component.SearchHandler
[junit4:junit4]   2> 13425 T3429 oasc.RequestHandlers.initHandlersFromConfig created tvrh: org.apache.solr.handler.component.SearchHandler
[junit4:junit4]   2> 13426 T3429 oasc.RequestHandlers.initHandlersFromConfig created /mlt: solr.MoreLikeThisHandler
[junit4:junit4]   2> 13427 T3429 oasc.RequestHandlers.initHandlersFromConfig created /debug/dump: solr.DumpRequestHandler
[junit4:junit4]   2> 13431 T3429 oashl.XMLLoader.init xsltCacheLifetimeSeconds=60
[junit4:junit4]   2> 13437 T3429 oasc.SolrCore.initDeprecatedSupport WARNING solrconfig.xml uses deprecated <admin/gettableFiles>, Please update your config to use the ShowFileRequestHandler.
[junit4:junit4]   2> 13438 T3429 oasc.SolrCore.initDeprecatedSupport WARNING adding ShowFileRequestHandler with hidden files: [SCHEMA.XML, OLD_SYNONYMS.TXT, STOPWORDS.TXT, PROTWORDS.TXT, OPEN-EXCHANGE-RATES.JSON, SYNONYMS.TXT, CURRENCY.XML, MAPPING-ISOLATIN1ACCENT.TXT]
[junit4:junit4]   2> 13443 T3429 oass.SolrIndexSearcher.<init> Opening Searcher@6c568fc main
[junit4:junit4]   2> 13444 T3429 oasu.CommitTracker.<init> Hard AutoCommit: disabled
[junit4:junit4]   2> 13445 T3429 oasu.CommitTracker.<init> Soft AutoCommit: disabled
[junit4:junit4]   2> 13446 T3429 oashc.SpellCheckComponent.inform Initializing spell checkers
[junit4:junit4]   2> 13557 T3429 oass.DirectSolrSpellChecker.init init: {name=direct,classname=DirectSolrSpellChecker,field=lowerfilt,minQueryLength=3}
[junit4:junit4]   2> 13619 T3502 oasc.SolrCore.registerSearcher [collection1] Registered new searcher Searcher@6c568fc main{StandardDirectoryReader(segments_1:1)}
[junit4:junit4]   2> 13870 T3450 oascc.ZkStateReader.updateClusterState Updating cloud state from ZooKeeper... 
[junit4:junit4]   2> 13931 T3449 oascc.ZkStateReader$2.process A cluster state change has occurred - updating...
[junit4:junit4]   2> 13931 T3501 oascc.ZkStateReader$2.process A cluster state change has occurred - updating...
[junit4:junit4]   2> 13931 T3463 oascc.ZkStateReader$2.process A cluster state change has occurred - updating...
[junit4:junit4]   2> 13931 T3475 oascc.ZkStateReader$2.process A cluster state change has occurred - updating...
[junit4:junit4]   2> 13931 T3487 oascc.ZkStateReader$2.process A cluster state change has occurred - updating...
[junit4:junit4]   2> 14127 T3429 oasc.CoreContainer.register registering core: collection1
[junit4:junit4]   2> 14127 T3429 oasc.ZkController.register Register shard - core:collection1 address:http://127.0.0.1:56631/solr shardId:shard2
[junit4:junit4]   2> 14132 T3429 oasc.ZkController.register We are http://127.0.0.1:56631/solr/collection1/ and leader is http://127.0.0.1:54719/solr/collection1/
[junit4:junit4]   2> 14132 T3429 oasc.ZkController.register No LogReplay needed for core=collection1 baseURL=http://127.0.0.1:56631/solr
[junit4:junit4]   2> 14133 T3429 oasc.ZkController.checkRecovery Core needs to recover:collection1
[junit4:junit4]   2> 14133 T3429 oasu.DefaultSolrCoreState.doRecovery Running recovery - first canceling any ongoing recovery
[junit4:junit4]   2> ASYNC  NEW_CORE C172 name=collection1 org.apache.solr.core.SolrCore@6bdc6659 url=http://127.0.0.1:56631/solr/collection1 node=127.0.0.1:56631_solr
[junit4:junit4]   2> 14134 T3503 C172 P56631 oasc.RecoveryStrategy.run Starting recovery process.  core=collection1 recoveringAfterStartup=true
[junit4:junit4]   2> 14135 T3503 C172 P56631 oasc.RecoveryStrategy.doRecovery ###### startupVersions=[]
[junit4:junit4]   2> 14135 T3429 oascc.ZkStateReader.updateClusterState Updating cloud state from ZooKeeper... 
[junit4:junit4]   2> 14140 T3503 C172 P56631 oasc.RecoveryStrategy.doRecovery Attempting to PeerSync from http://127.0.0.1:54719/solr/collection1/ core=collection1 - recoveringAfterStartup=true
[junit4:junit4]   2> 14140 T3503 C172 P56631 oasu.PeerSync.sync PeerSync: core=collection1 url=http://127.0.0.1:56631/solr START replicas=[http://127.0.0.1:54719/solr/collection1/] nUpdates=100
[junit4:junit4]   2> 14140 T3429 oass.SolrDispatchFilter.init user.dir=/usr/home/hudson/hudson-slave/workspace/Lucene-Solr-NightlyTests-trunk/solr/build/solr-core/test/J1
[junit4:junit4]   2> 14141 T3503 C172 P56631 oasu.PeerSync.sync WARNING no frame of reference to tell of we've missed updates
[junit4:junit4]   2> 14141 T3429 oass.SolrDispatchFilter.init SolrDispatchFilter.init() done
[junit4:junit4]   2> 14141 T3503 C172 P56631 oasc.RecoveryStrategy.doRecovery PeerSync Recovery was not successful - trying replication. core=collection1
[junit4:junit4]   2> 14142 T3503 C172 P56631 oasc.RecoveryStrategy.doRecovery Starting Replication Recovery. core=collection1
[junit4:junit4]   2> 14142 T3429 oascsi.HttpClientUtil.createClient Creating new http client, config:maxConnections=128&maxConnectionsPerHost=32&followRedirects=false
[junit4:junit4]   2> 14142 T3503 C172 P56631 oascsi.HttpClientUtil.createClient Creating new http client, config:maxConnections=128&maxConnectionsPerHost=32&followRedirects=false
[junit4:junit4]   2> ASYNC  NEW_CORE C173 name=collection1 org.apache.solr.core.SolrCore@7a083d63 url=http://127.0.0.1:54719/solr/collection1 node=127.0.0.1:54719_solr
[junit4:junit4]   2> 14151 T3467 C173 P54719 REQ /get {distrib=false&qt=/get&wt=javabin&version=2&getVersions=100} status=0 QTime=0 
[junit4:junit4]   2> 14159 T3429 oaz.ZooKeeper.<init> Initiating client connection, connectString=127.0.0.1:25019/solr sessionTimeout=10000 watcher=org.apache.solr.common.cloud.ConnectionManager@1319fa40
[junit4:junit4]   2> 14160 T3505 oaz.ClientCnxn$SendThread.startConnect Opening socket connection to server /127.0.0.1:25019
[junit4:junit4]   2> 14160 T3429 oascc.ConnectionManager.waitForConnected Waiting for client to connect to ZooKeeper
[junit4:junit4]   2> 14160 T3505 oaz.ClientCnxn$SendThread.primeConnection Socket connection established to localhost/127.0.0.1:25019, initiating session
[junit4:junit4]   2> 14161 T3431 oazs.NIOServerCnxn$Factory.run Accepted socket connection from /140.211.11.196:49601
[junit4:junit4]   2> 14161 T3431 oazs.NIOServerCnxn.readConnectRequest Client attempting to establish new session at /140.211.11.196:49601
[junit4:junit4]   2> 14167 T3433 oazs.NIOServerCnxn.finishSessionInit Established session 0x139e6e3a81b0007 with negotiated timeout 10000 for client /140.211.11.196:49601
[junit4:junit4]   2> 14167 T3505 oaz.ClientCnxn$SendThread.readConnectResult Session establishment complete on server localhost/127.0.0.1:25019, sessionid = 0x139e6e3a81b0007, negotiated timeout = 10000
[junit4:junit4]   2> 14168 T3506 oascc.ConnectionManager.process Watcher org.apache.solr.common.cloud.ConnectionManager@1319fa40 name:ZooKeeperConnection Watcher:127.0.0.1:25019/solr got event WatchedEvent state:SyncConnected type:None path:null path:null type:None
[junit4:junit4]   2> 14168 T3429 oascc.ConnectionManager.waitForConnected Client is connected to ZooKeeper
[junit4:junit4]   2> 14169 T3429 oascc.ZkStateReader.createClusterStateWatchersAndUpdate Updating cluster state from ZooKeeper... 
[junit4:junit4]   2> 14171 T3429 oasc.ChaosMonkey.monkeyLog monkey: init - expire sessions:true cause connection loss:true
[junit4:junit4]   2> 14171 T3429 oascsi.HttpClientUtil.createClient Creating new http client, config:
[junit4:junit4]   2> 14183 T3429 oascc.ZkStateReader.updateClusterState Updating cloud state from ZooKeeper... 
[junit4:junit4]   2> ASYNC  NEW_CORE C174 name=collection1 org.apache.solr.core.SolrCore@7703eb8f url=http://127.0.0.1:17806/solr/collection1 node=127.0.0.1:17806_solr
[junit4:junit4]   2> 14201 T3441 C174 P17806 oasc.SolrDeletionPolicy.onInit SolrDeletionPolicy.onInit: commits:num=1
[junit4:junit4]   2> 		commit{dir=NRTCachingDirectory(org.apache.lucene.store.NIOFSDirectory@/usr/home/hudson/hudson-slave/workspace/Lucene-Solr-NightlyTests-trunk/solr/build/solr-core/test/J1/org.apache.solr.cloud.BasicDistributedZk2Test-1348198443016/control/data/index lockFactory=org.apache.lucene.store.NativeFSLockFactory@5e60770d; maxCacheMB=48.0 maxMergeSizeMB=4.0),segFN=segments_1,generation=1,filenames=[segments_1]
[junit4:junit4]   2> 14202 T3441 C174 P17806 oasc.SolrDeletionPolicy.updateCommits newest commit = 1
[junit4:junit4]   2> 14210 T3441 C174 P17806 /update {wt=javabin&version=2} {add=[1 (1413688545461141504)]} 0 18
[junit4:junit4]   2> 14211 T3429 oaz.ZooKeeper.<init> Initiating client connection, connectString=127.0.0.1:25019/solr sessionTimeout=10000 watcher=org.apache.solr.common.cloud.ConnectionManager@7b1e3ad7
[junit4:junit4]   2> 14213 T3507 oaz.ClientCnxn$SendThread.startConnect Opening socket connection to server /127.0.0.1:25019
[junit4:junit4]   2> 14213 T3429 oascc.ConnectionManager.waitForConnected Waiting for client to connect to ZooKeeper
[junit4:junit4]   2> 14213 T3507 oaz.ClientCnxn$SendThread.primeConnection Socket connection established to localhost/127.0.0.1:25019, initiating session
[junit4:junit4]   2> 14214 T3431 oazs.NIOServerCnxn$Factory.run Accepted socket connection from /140.211.11.196:27128
[junit4:junit4]   2> 14214 T3431 oazs.NIOServerCnxn.readConnectRequest Client attempting to establish new session at /140.211.11.196:27128
[junit4:junit4]   2> 14217 T3433 oazs.NIOServerCnxn.finishSessionInit Established session 0x139e6e3a81b0008 with negotiated timeout 10000 for client /140.211.11.196:27128
[junit4:junit4]   2> 14217 T3507 oaz.ClientCnxn$SendThread.readConnectResult Session establishment complete on server localhost/127.0.0.1:25019, sessionid = 0x139e6e3a81b0008, negotiated timeout = 10000
[junit4:junit4]   2> 14217 T3508 oascc.ConnectionManager.process Watcher org.apache.solr.common.cloud.ConnectionManager@7b1e3ad7 name:ZooKeeperConnection Watcher:127.0.0.1:25019/solr got event WatchedEvent state:SyncConnected type:None path:null path:null type:None
[junit4:junit4]   2> 14218 T3429 oascc.ConnectionManager.waitForConnected Client is connected to ZooKeeper
[junit4:junit4]   2> 14219 T3429 oascc.ZkStateReader.createClusterStateWatchersAndUpdate Updating cluster state from ZooKeeper... 
[junit4:junit4]   2> 14229 T3457 C171 P38577 oasc.SolrDeletionPolicy.onInit SolrDeletionPolicy.onInit: commits:num=1
[junit4:junit4]   2> 		commit{dir=NRTCachingDirectory(org.apache.lucene.store.NIOFSDirectory@/usr/home/hudson/hudson-slave/workspace/Lucene-Solr-NightlyTests-trunk/solr/build/solr-core/test/J1/org.apache.solr.cloud.BasicDistributedZk2Test-1348198443016/jetty1/index lockFactory=org.apache.lucene.store.NativeFSLockFactory@78c7dc7d; maxCacheMB=48.0 maxMergeSizeMB=4.0),segFN=segments_1,generation=1,filenames=[segments_1]
[junit4:junit4]   2> 14230 T3457 C171 P38577 oasc.SolrDeletionPolicy.updateCommits newest commit = 1
[junit4:junit4]   2>  C170_STATE=coll:collection1 core:collection1 props:{shard=shard1, roles=null, state=recovering, core=collection1, collection=collection1, node_name=127.0.0.1:50663_solr, base_url=http://127.0.0.1:50663/solr}
[junit4:junit4]   2> 14252 T3479 C170 P50663 oasc.SolrDeletionPolicy.onInit SolrDeletionPolicy.onInit: commits:num=1
[junit4:junit4]   2> 		commit{dir=NRTCachingDirectory(org.apache.lucene.store.NIOFSDirectory@/usr/home/hudson/hudson-slave/workspace/Lucene-Solr-NightlyTests-trunk/solr/build/solr-core/test/J1/org.apache.solr.cloud.BasicDistributedZk2Test-1348198443016/jetty3/index lockFactory=org.apache.lucene.store.NativeFSLockFactory@5d9a3f32; maxCacheMB=48.0 maxMergeSizeMB=4.0),segFN=segments_1,generation=1,filenames=[segments_1]
[junit4:junit4]   2> 14254 T3479 C170 P50663 oasc.SolrDeletionPolicy.updateCommits newest commit = 1
[junit4:junit4]   2> 14258 T3479 C170 P50663 REQ /update {distrib.from=http://127.0.0.1:38577/solr/collection1/&update.distrib=FROMLEADER&wt=javabin&version=2} status=0 QTime=10 
[junit4:junit4]   2> 14259 T3457 C171 P38577 /update {wt=javabin&version=2} {add=[1 (1413688545492598784)]} 0 37
[junit4:junit4]   2> 14259 T3429 oasc.AbstractDistribZkTestBase.waitForRecoveriesToFinish Wait for recoveries to finish - collection: collection1 failOnTimeout:true timeout (sec):3600
[junit4:junit4]   2> 14261 T3429 oascc.ZkStateReader.updateClusterState Updating cloud state from ZooKeeper... 
[junit4:junit4]   2> 14375 T3489 C170 P50663 oasc.RecoveryStrategy.doRecovery Begin buffering updates. core=collection1
[junit4:junit4]   2> 14375 T3489 C170 P50663 oasu.UpdateLog.bufferUpdates Starting to buffer updates. FSUpdateLog{state=ACTIVE, tlog=tlog{file=./org.apache.solr.cloud.BasicDistributedZk2Test-1348198443016/jetty3/tlog/tlog.0000000000000000000 refcount=1}}
[junit4:junit4]   2> 14375 T3489 C170 P50663 oasc.RecoveryStrategy.replicate Attempting to replicate from http://127.0.0.1:38577/solr/collection1/. core=collection1
[junit4:junit4]   2> 14375 T3489 C170 P50663 oascsi.HttpClientUtil.createClient Creating new http client, config:maxConnections=128&maxConnectionsPerHost=32&followRedirects=false
[junit4:junit4]   2> 14392 T3458 C171 P38577 oasu.DirectUpdateHandler2.commit start commit{flags=0,_version_=0,optimize=false,openSearcher=true,waitSearcher=true,expungeDeletes=false,softCommit=false}
[junit4:junit4]   2> 14453 T3450 oascc.ZkStateReader.updateClusterState Updating cloud state from ZooKeeper... 
[junit4:junit4]   2> 14476 T3501 oascc.ZkStateReader$2.process A cluster state change has occurred - updating...
[junit4:junit4]   2> 14476 T3475 oascc.ZkStateReader$2.process A cluster state change has occurred - updating...
[junit4:junit4]   2> 14477 T3449 oascc.ZkStateReader$2.process A cluster state change has occurred - updating...
[junit4:junit4]   2> 14477 T3487 oascc.ZkStateReader$2.process A cluster state change has occurred - updating...
[junit4:junit4]   2> 14476 T3506 oascc.ZkStateReader$2.process A cluster state change has occurred - updating...
[junit4:junit4]   2> 14477 T3508 oascc.ZkStateReader$2.process A cluster state change has occurred - updating...
[junit4:junit4]   2> 14476 T3463 oascc.ZkStateReader$2.process A cluster state change has occurred - updating...
[junit4:junit4]   2> 14511 T3458 C171 P38577 oasc.SolrDeletionPolicy.onCommit SolrDeletionPolicy.onCommit: commits:num=2
[junit4:junit4]   2> 		commit{dir=NRTCachingDirectory(org.apache.lucene.store.NIOFSDirectory@/usr/home/hudson/hudson-slave/workspace/Lucene-Solr-NightlyTests-trunk/solr/build/solr-core/test/J1/org.apache.solr.cloud.BasicDistributedZk2Test-1348198443016/jetty1/index lockFactory=org.apache.lucene.store.NativeFSLockFactory@78c7dc7d; maxCacheMB=48.0 maxMergeSizeMB=4.0),segFN=segments_1,generation=1,filenames=[segments_1]
[junit4:junit4]   2> 		commit{dir=NRTCachingDirectory(org.apache.lucene.store.NIOFSDirectory@/usr/home/hudson/hudson-slave/workspace/Lucene-Solr-NightlyTests-trunk/solr/build/solr-core/test/J1/org.apache.solr.cloud.BasicDistributedZk2Test-1348198443016/jetty1/index lockFactory=org.apache.lucene.store.NativeFSLockFactory@78c7dc7d; maxCacheMB=48.0 maxMergeSizeMB=4.0),segFN=segments_2,generation=2,filenames=[_0_Block_0.tip, _0_Block_0.pos, _0.fnm, _0_Pulsing40_0.tim, _0_Block_0.doc, _0_Block_0.tim, _0_nrm.cfs, _0_Pulsing40_1.prx, _0_Pulsing40_0.prx, _0_Direct_0.frq, _0_Pulsing40_0.frq, _0_Pulsing40_1.frq, _0_Pulsing40_1.tip, _0_Pulsing40_1.tim, _0_nrm.cfe, _0_Pulsing40_0.tip, segments_2, _0_Direct_0.tip, _0.fdx, _0_Direct_0.prx, _0.si, _0_Direct_0.tim, _0.fdt]
[junit4:junit4]   2> 14512 T3458 C171 P38577 oasc.SolrDeletionPolicy.updateCommits newest commit = 2
[junit4:junit4]   2> 14525 T3458 C171 P38577 oass.SolrIndexSearcher.<init> Opening Searcher@70b8c6e8 main
[junit4:junit4]   2> 14526 T3458 C171 P38577 oasu.DirectUpdateHandler2.commit end_commit_flush
[junit4:junit4]   2> 14527 T3464 oasc.SolrCore.registerSearcher [collection1] Registered new searcher Searcher@70b8c6e8 main{StandardDirectoryReader(segments_2:3 _0(5.0):C1)}
[junit4:junit4]   2> 14528 T3458 C171 P38577 /update {waitSearcher=true&commit=true&commit_end_point=true&wt=javabin&softCommit=false&version=2} {commit=} 0 136
[junit4:junit4]   2> 14529 T3489 C170 P50663 oash.ReplicationHandler.inform Commits will be reserved for  10000
[junit4:junit4]   2> 14529 T3489 C170 P50663 oash.SnapPuller.<init>  No value set for 'pollInterval'. Timer Task not started.
[junit4:junit4]   2> 14530 T3459 C171 P38577 oash.ReplicationHandler.inform Commits will be reserved for  10000
[junit4:junit4]   2> 14531 T3459 C171 P38577 REQ /replication {command=indexversion&wt=javabin&qt=/replication&version=2} status=0 QTime=1 
[junit4:junit4]   2> 14532 T3489 C170 P50663 oash.SnapPuller.fetchLatestIndex Master's generation: 2
[junit4:junit4]   2> 14532 T3489 C170 P50663 oash.SnapPuller.fetchLatestIndex Slave's generation: 1
[junit4:junit4]   2> 14532 T3489 C170 P50663 oash.SnapPuller.fetchLatestIndex Starting replication process
[junit4:junit4]   2> 14536 T3459 C171 P38577 REQ /replication {command=filelist&generation=2&wt=javabin&qt=/replication&version=2} status=0 QTime=2 
[junit4:junit4]   2> 14536 T3489 C170 P50663 oash.SnapPuller.fetchLatestIndex Number of files in latest index in master: 23
[junit4:junit4]   2> 14547 T3489 C170 P50663 oash.SnapPuller.fetchLatestIndex Starting download to ./org.apache.solr.cloud.BasicDistributedZk2Test-1348198443016/jetty3/index.20120921053417549 fullCopy=true
[junit4:junit4]   2> 14551 T3459 C171 P38577 REQ /replication {file=_0_Block_0.pos&command=filecontent&checksum=true&generation=2&qt=/replication&wt=filestream} status=0 QTime=0 
[junit4:junit4]   2> 14557 T3459 C171 P38577 REQ /replication {file=_0_Block_0.tip&command=filecontent&checksum=true&generation=2&qt=/replication&wt=filestream} status=0 QTime=0 
[junit4:junit4]   2> 14561 T3459 C171 P38577 REQ /replication {file=_0_Block_0.doc&command=filecontent&checksum=true&generation=2&qt=/replication&wt=filestream} status=0 QTime=0 
[junit4:junit4]   2> 14565 T3459 C171 P38577 REQ /replication {file=_0_Pulsing40_0.tim&command=filecontent&checksum=true&generation=2&qt=/replication&wt=filestream} status=0 QTime=0 
[junit4:junit4]   2> 14569 T3459 C171 P38577 REQ /replication {file=_0.fnm&command=filecontent&checksum=true&generation=2&qt=/replication&wt=filestream} status=0 QTime=0 
[junit4:junit4]   2> 14573 T3459 C171 P38577 REQ /replication {file=_0_Block_0.tim&command=filecontent&checksum=true&generation=2&qt=/replication&wt=filestream} status=0 QTime=0 
[junit4:junit4]   2> 14576 T3459 C171 P38577 REQ /replication {file=_0_nrm.cfs&command=filecontent&checksum=true&generation=2&qt=/replication&wt=filestream} status=0 QTime=0 
[junit4:junit4]   2> 14580 T3459 C171 P38577 REQ /replication {file=_0_Direct_0.frq&command=filecontent&checksum=true&generation=2&qt=/replication&wt=filestream} status=0 QTime=0 
[junit4:junit4]   2> 14583 T3459 C171 P38577 REQ /replication {file=_0_Pulsing40_0.prx&command=filecontent&checksum=true&generation=2&qt=/replication&wt=filestream} status=0 QTime=0 
[junit4:junit4]   2> 14587 T3459 C171 P38577 REQ /replication {file=_0_Pulsing40_1.prx&command=filecontent&checksum=true&generation=2&qt=/replication&wt=filestream} status=0 QTime=0 
[junit4:junit4]   2> 14591 T3459 C171 P38577 REQ /replication {file=_0_Pulsing40_0.frq&command=filecontent&checksum=true&generation=2&qt=/replication&wt=filestream} status=0 QTime=0 
[junit4:junit4]   2> 14595 T3459 C171 P38577 REQ /replication {file=_0_Pulsing40_1.tip&command=filecontent&checksum=true&generation=2&qt=/replication&wt=filestream} status=0 QTime=0 
[junit4:junit4]   2> 14599 T3459 C171 P38577 REQ /replication {file=_0_Pulsing40_1.frq&command=filecontent&checksum=true&generation=2&qt=/replication&wt=filestream} status=0 QTime=0 
[junit4:junit4]   2> 14607 T3459 C171 P38577 REQ /replication {file=_0_Pulsing40_1.tim&command=filecontent&checksum=true&generation=2&qt=/replication&wt=filestream} status=0 QTime=0 
[junit4:junit4]   2> 14611 T3459 C171 P38577 REQ /replication {file=_0_nrm.cfe&command=filecontent&checksum=true&generation=2&qt=/replication&wt=filestream} status=0 QTime=0 
[junit4:junit4]   2> 14615 T3459 C171 P38577 REQ /replication {file=segments_2&command=filecontent&checksum=true&generation=2&qt=/replication&wt=filestream} status=0 QTime=0 
[junit4:junit4]   2> 14618 T3459 C171 P38577 REQ /replication {file=_0_Pulsing40_0.tip&command=filecontent&checksum=true&generation=2&qt=/replication&wt=filestream} status=0 QTime=0 
[junit4:junit4]   2> 14621 T3459 C171 P38577 REQ /replication {file=_0.fdx&command=filecontent&checksum=true&generation=2&qt=/replication&wt=filestream} status=0 QTime=0 
[junit4:junit4]   2> 14624 T3459 C171 P38577 REQ /replication {file=_0_Direct_0.tip&command=filecontent&checksum=true&generation=2&qt=/replication&wt=filestream} status=0 QTime=0 
[junit4:junit4]   2> 14628 T3459 C171 P38577 REQ /replication {file=_0_Direct_0.prx&command=filecontent&checksum=true&generation=2&qt=/replication&wt=filestream} status=0 QTime=0 
[junit4:junit4]   2> 14631 T3459 C171 P38577 REQ /replication {file=_0.si&command=filecontent&checksum=true&generation=2&qt=/replication&wt=filestream} status=0 QTime=0 
[junit4:junit4]   2> 14634 T3459 C171 P38577 REQ /replication {file=_0_Direct_0.tim&command=filecontent&checksum=true&generation=2&qt=/replication&wt=filestream} status=0 QTime=0 
[junit4:junit4]   2> 14637 T3459 C171 P38577 REQ /replication {file=_0.fdt&command=filecontent&checksum=true&generation=2&qt=/replication&wt=filestream} status=0 QTime=0 
[junit4:junit4]   2> 14638 T3489 C170 P50663 oash.SnapPuller.fetchLatestIndex Total time taken for download : 0 secs
[junit4:junit4]   2> 14638 T3489 C170 P50663 oash.SnapPuller.modifyIndexProps New index installed. Updating index properties... index=index.20120921053417549
[junit4:junit4]   2> 14640 T3489 C170 P50663 oasu.DefaultSolrCoreState.newIndexWriter Creating new IndexWriter...
[junit4:junit4]   2> 14640 T3489 C170 P50663 oasu.DefaultSolrCoreState.newIndexWriter Waiting until IndexWriter is unused... core=collection1
[junit4:junit4]   2> 14640 T3489 C170 P50663 oasu.DefaultSolrCoreState.newIndexWriter Rollback old IndexWriter... core=collection1
[junit4:junit4]   2> 14646 T3489 C170 P50663 oasc.SolrCore.getNewIndexDir WARNING New index directory detected: old=./org.apache.solr.cloud.BasicDistributedZk2Test-1348198443016/jetty3/index/ new=./org.apache.solr.cloud.BasicDistributedZk2Test-1348198443016/jetty3/index.20120921053417549
[junit4:junit4]   2> 14647 T3489 C170 P50663 oasc.CachingDirectoryFactory.get return new directory for /usr/home/hudson/hudson-slave/workspace/Lucene-Solr-NightlyTests-trunk/solr/build/solr-core/test/J1/./org.apache.solr.cloud.BasicDistributedZk2Test-1348198443016/jetty3/index.20120921053417549 forceNew:true
[junit4:junit4]   2> 14658 T3489 C170 P50663 oasc.SolrDeletionPolicy.onInit SolrDeletionPolicy.onInit: commits:num=1
[junit4:junit4]   2> 		commit{dir=NRTCachingDirectory(org.apache.lucene.store.NIOFSDirectory@/usr/home/hudson/hudson-slave/workspace/Lucene-Solr-NightlyTests-trunk/solr/build/solr-core/test/J1/org.apache.solr.cloud.BasicDistributedZk2Test-1348198443016/jetty3/index.20120921053417549 lockFactory=org.apache.lucene.store.NativeFSLockFactory@36bad9cf; maxCacheMB=48.0 maxMergeSizeMB=4.0),segFN=segments_2,generation=2,filenames=[_0_Block_0.tip, _0_Block_0.pos, _0.fnm, _0_Pulsing40_0.tim, _0_Block_0.doc, _0_Block_0.tim, _0_nrm.cfs, _0_Pulsing40_1.prx, _0_Pulsing40_0.prx, _0_Direct_0.frq, _0_Pulsing40_0.frq, _0_Pulsing40_1.frq, _0_Pulsing40_1.tip, _0_Pulsing40_1.tim, _0_nrm.cfe, _0_Pulsing40_0.tip, segments_2, _0.fdx, _0_Direct_0.tip, _0_Direct_0.prx, _0.si, _0_Direct_0.tim, _0.fdt]
[junit4:junit4]   2> 14659 T3489 C170 P50663 oasc.SolrDeletionPolicy.updateCommits newest commit = 2
[junit4:junit4]   2> 14659 T3489 C170 P50663 oasu.DefaultSolrCoreState.newIndexWriter New IndexWriter is ready to be used.
[junit4:junit4]   2> 14663 T3489 C170 P50663 oass.SolrIndexSearcher.<init> Opening Searcher@265d19d2 main
[junit4:junit4]   2> 14665 T3488 oasc.SolrCore.registerSearcher [collection1] Registered new searcher Searcher@265d19d2 main{StandardDirectoryReader(segments_2:3:nrt _0(5.0):C1)}
[junit4:junit4]   2> 14665 T3488 oasc.CachingDirectoryFactory.close Closing directory:/usr/home/hudson/hudson-slave/workspace/Lucene-Solr-NightlyTests-trunk/solr/build/solr-core/test/J1/./org.apache.solr.cloud.BasicDistributedZk2Test-1348198443016/jetty3/index
[junit4:junit4]   2> 14665 T3488 oash.SnapPuller$2.onClose removing old index directory ./org.apache.solr.cloud.BasicDistributedZk2Test-1348198443016/jetty3/index
[junit4:junit4]   2> 14667 T3489 C170 P50663 oasu.DirectUpdateHandler2.commit start commit{flags=0,_version_=0,optimize=false,openSearcher=false,waitSearcher=false,expungeDeletes=false,softCommit=false}
[junit4:junit4]   2> 14668 T3489 C170 P50663 oasu.DirectUpdateHandler2.commit end_commit_flush
[junit4:junit4]   2> 14669 T3489 C170 P50663 oasc.RecoveryStrategy.replay Replaying buffered documents. core=collection1
[junit4:junit4]   2> 14669 T3511 C170 P50663 oasu.UpdateLog$LogReplayer.doReplay WARNING Starting log replay tlog{file=./org.apache.solr.cloud.BasicDistributedZk2Test-1348198443016/jetty3/tlog/tlog.0000000000000000000 refcount=2} active=true starting pos=431
[junit4:junit4]   2> 14669 T3511 C170 P50663 oasu.DirectUpdateHandler2.commit start commit{flags=2,_version_=0,optimize=false,openSearcher=true,waitSearcher=true,expungeDeletes=false,softCommit=false}
[junit4:junit4]   2> 14670 T3511 C170 P50663 oass.SolrIndexSearcher.<init> Opening Searcher@71c84cd8 main
[junit4:junit4]   2> 14671 T3511 C170 P50663 oasu.DirectUpdateHandler2.commit end_commit_flush
[junit4:junit4]   2> 14672 T3488 oasc.SolrCore.registerSearcher [collection1] Registered new searcher Searcher@71c84cd8 main{StandardDirectoryReader(segments_2:3:nrt _0(5.0):C1)}
[junit4:junit4]   2> 14673 T3511 C170 P50663 oasu.UpdateLog$LogReplayer.run WARNING Log replay finished. recoveryInfo=RecoveryInfo{adds=0 deletes=0 deleteByQuery=0 errors=0 positionOfStart=431}
[junit4:junit4]   2> 14673 T3489 C170 P50663 oasc.RecoveryStrategy.doRecovery Replication Recovery was successful - registering as Active. core=collection1
[junit4:junit4]   2> 14674 T3489 C170 P50663 oasc.RecoveryStrategy.doRecovery Finished recovery process. core=collection1
[junit4:junit4]   2> 14987 T3450 oascc.ZkStateReader.updateClusterState Updating cloud state from ZooKeeper... 
[junit4:junit4]   2> 14998 T3501 oascc.ZkStateReader$2.process A cluster state change has occurred - updating...
[junit4:junit4]   2> 14998 T3475 oascc.ZkStateReader$2.process A cluster state change has occurred - updating...
[junit4:junit4]   2> 14998 T3487 oascc.ZkStateReader$2.process A cluster state change has occurred - updating...
[junit4:junit4]   2> 14998 T3506 oascc.ZkStateReader$2.process A cluster state change has occurred - updating...
[junit4:junit4]   2> 14998 T3449 oascc.ZkStateReader$2.process A cluster state change has occurred - updating...
[junit4:junit4]   2> 14998 T3508 oascc.ZkStateReader$2.process A cluster state change has occurred - updating...
[junit4:junit4]   2> 14998 T3463 oascc.ZkStateReader$2.process A cluster state change has occurred - updating...
[junit4:junit4]   2> 15262 T3429 oascc.ZkStateReader.updateClusterState Updating cloud state from ZooKeeper... 
[junit4:junit4]   2> 16264 T3429 oascc.ZkStateReader.updateClusterState Updating cloud state from ZooKeeper... 
[junit4:junit4]   2>  C172_STATE=coll:collection1 core:collection1 props:{shard=shard2, roles=null, state=recovering, core=collection1, collection=collection1, node_name=127.0.0.1:56631_solr, base_url=http://127.0.0.1:56631/solr}
[junit4:junit4]   2> 17162 T3503 C172 P56631 oasc.RecoveryStrategy.doRecovery Begin buffering updates. core=collection1
[junit4:junit4]   2> 17162 T3503 C172 P56631 oasu.UpdateLog.bufferUpdates Starting to buffer updates. FSUpdateLog{state=ACTIVE, tlog=null}
[junit4:junit4]   2> 17162 T3503 C172 P56631 oasc.RecoveryStrategy.replicate Attempting to replicate from http://127.0.0.1:54719/solr/collection1/. core=collection1
[junit4:junit4]   2> 17162 T3503 C172 P56631 oascsi.HttpClientUtil.createClient Creating new http client, config:maxConnections=128&maxConnectionsPerHost=32&followRedirects=false
[junit4:junit4]   2> 17175 T3469 C173 P54719 oasu.DirectUpdateHandler2.commit start commit{flags=0,_version_=0,optimize=false,openSearcher=true,waitSearcher=true,expungeDeletes=false,softCommit=false}
[junit4:junit4]   2> 17182 T3469 C173 P54719 oasc.SolrDeletionPolicy.onInit SolrDeletionPolicy.onInit: commits:num=1
[junit4:junit4]   2> 		commit{dir=NRTCachingDirectory(org.apache.lucene.store.NIOFSDirectory@/usr/home/hudson/hudson-slave/workspace/Lucene-Solr-NightlyTests-trunk/solr/build/solr-core/test/J1/org.apache.solr.cloud.BasicDistributedZk2Test-1348198443016/jetty2/index lockFactory=org.apache.lucene.store.NativeFSLockFactory@39c099bd; maxCacheMB=48.0 maxMergeSizeMB=4.0),segFN=segments_1,generation=1,filenames=[segments_1]
[junit4:junit4]   2> 17182 T3469 C173 P54719 oasc.SolrDeletionPolicy.updateCommits newest commit = 1
[junit4:junit4]   2> 17183 T3469 C173 P54719 oass.SolrIndexSearcher.<init> Opening Searcher@3132faa7 main
[junit4:junit4]   2> 17184 T3469 C173 P54719 oasu.DirectUpdateHandler2.commit end_commit_flush
[junit4:junit4]   2> 17186 T3476 oasc.SolrCore.registerSearcher [collection1] Registered new searcher Searcher@3132faa7 main{StandardDirectoryReader(segments_1:1)}
[junit4:junit4]   2> 17187 T3469 C173 P54719 /update {waitSearcher=true&commit=true&commit_end_point=true&wt=javabin&softCommit=false&version=2} {commit=} 0 12
[junit4:junit4]   2> 17187 T3503 C172 P56631 oash.ReplicationHandler.inform Commits will be reserved for  10000
[junit4:junit4]   2> 17188 T3503 C172 P56631 oash.SnapPuller.<init>  No value set for 'pollInterval'. Timer Task not started.
[junit4:junit4]   2> 17189 T3470 C173 P54719 oash.ReplicationHandler.inform Commits will be reserved for  10000
[junit4:junit4]   2> 17189 T3470 C173 P54719 REQ /replication {command=indexversion&wt=javabin&qt=/replication&version=2} status=0 QTime=0 
[junit4:junit4]   2> 17197 T3503 C172 P56631 oasc.SolrDeletionPolicy.onInit SolrDeletionPolicy.onInit: commits:num=1
[junit4:junit4]   2> 		commit{dir=NRTCachingDirectory(org.apache.lucene.store.NIOFSDirectory@/usr/home/hudson/hudson-slave/workspace/Lucene-Solr-NightlyTests-trunk/solr/build/solr-core/test/J1/org.apache.solr.cloud.BasicDistributedZk2Test-1348198443016/jetty4/index lockFactory=org.apache.lucene.store.NativeFSLockFactory@3f5a64e3; maxCacheMB=48.0 maxMergeSizeMB=4.0),segFN=segments_1,generation=1,filenames=[segments_1]
[junit4:junit4]   2> 17197 T3503 C172 P56631 oasc.SolrDeletionPolicy.updateCommits newest commit = 1
[junit4:junit4]   2> 17198 T3503 C172 P56631 oasu.DirectUpdateHandler2.commit start commit{flags=0,_version_=0,optimize=false,openSearcher=true,waitSearcher=true,expungeDeletes=false,softCommit=false}
[junit4:junit4]   2> 17202 T3503 C172 P56631 oasc.SolrDeletionPolicy.onCommit SolrDeletionPolicy.onCommit: commits:num=2
[junit4:junit4]   2> 		commit{dir=NRTCachingDirectory(org.apache.lucene.store.NIOFSDirectory@/usr/home/hudson/hudson-slave/workspace/Lucene-Solr-NightlyTests-trunk/solr/build/solr-core/test/J1/org.apache.solr.cloud.BasicDistributedZk2Test-1348198443016/jetty4/index lockFactory=org.apache.lucene.store.NativeFSLockFactory@3f5a64e3; maxCacheMB=48.0 maxMergeSizeMB=4.0),segFN=segments_1,generation=1,filenames=[segments_1]
[junit4:junit4]   2> 		commit{dir=NRTCachingDirectory(org.apache.lucene.store.NIOFSDirectory@/usr/home/hudson/hudson-slave/workspace/Lucene-Solr-NightlyTests-trunk/solr/build/solr-core/test/J1/org.apache.solr.cloud.BasicDistributedZk2Test-1348198443016/jetty4/index lockFactory=org.apache.lucene.store.NativeFSLockFactory@3f5a64e3; maxCacheMB=48.0 maxMergeSizeMB=4.0),segFN=segments_2,generation=2,filenames=[segments_2]
[junit4:junit4]   2> 17203 T3503 C172 P56631 oasc.SolrDeletionPolicy.updateCommits newest commit = 2
[junit4:junit4]   2> 17206 T3503 C172 P56631 oass.SolrIndexSearcher.<init> Opening Searcher@5d3ddb03 main
[junit4:junit4]   2> 17206 T3503 C172 P56631 oasu.DirectUpdateHandler2.commit end_commit_flush
[junit4:junit4]   2> 17208 T3502 oasc.SolrCore.registerSearcher [collection1] Registered new searcher Searcher@5d3ddb03 main{StandardDirectoryReader(segments_2:2)}
[junit4:junit4]   2> 17208 T3503 C172 P56631 oasc.RecoveryStrategy.replay No replay needed. core=collection1
[junit4:junit4]   2> 17208 T3503 C172 P56631 oasc.RecoveryStrategy.doRecovery Replication Recovery was successful - registering as Active. core=collection1
[junit4:junit4]   2> 17210 T3503 C172 P56631 oasc.RecoveryStrategy.doRecovery Finished recovery process. core=collection1
[junit4:junit4]   2> 17266 T3429 oascc.ZkStateReader.updateClusterState Updating cloud state from ZooKeeper... 
[junit4:junit4]   2> 17518 T3450 oascc.ZkStateReader.updateClusterState Updating cloud state from ZooKeeper... 
[junit4:junit4]   2> 17523 T3501 oascc.ZkStateReader$2.process A cluster state change has occurred - updating...
[junit4:junit4]   2> 17524 T3506 oascc.ZkStateReader$2.process A cluster state change has occurred - updating...
[junit4:junit4]   2> 17524 T3487 oascc.ZkStateReader$2.process A cluster state change has occurred - updating...
[junit4:junit4]   2> 17524 T3508 oascc.ZkStateReader$2.process A cluster state change has occurred - updating...
[junit4:junit4]   2> 17524 T3449 oascc.ZkStateReader$2.process A cluster state change has occurred - updating...
[junit4:junit4]   2> 17524 T3475 oascc.ZkStateReader$2.process A cluster state change has occurred - updating...
[junit4:junit4]   2> 17524 T3463 oascc.ZkStateReader$2.process A cluster state change has occurred - updating...
[junit4:junit4]   2> 18268 T3429 oascc.ZkStateReader.updateClusterState Updating cloud state from ZooKeeper... 
[junit4:junit4]   2> 18271 T3441 C174 P17806 oasu.DirectUpdateHandler2.commit start commit{flags=0,_version_=0,optimize=false,openSearcher=true,waitSearcher=true,expungeDeletes=false,softCommit=false}
[junit4:junit4]   2> 18418 T3441 C174 P17806 oasc.SolrDeletionPolicy.onCommit SolrDeletionPolicy.onCommit: commits:num=2
[junit4:junit4]   2> 		commit{dir=NRTCachingDirectory(org.apache.lucene.store.NIOFSDirectory@/usr/home/hudson/hudson-slave/workspace/Lucene-Solr-NightlyTests-trunk/solr/build/solr-core/test/J1/org.apache.solr.cloud.BasicDistributedZk2Test-1348198443016/control/data/index lockFactory=org.apache.lucene.store.NativeFSLockFactory@5e60770d; maxCacheMB=48.0 maxMergeSizeMB=4.0),segFN=segments_1,generation=1,filenames=[segments_1]
[junit4:junit4]   2> 		commit{dir=NRTCachingDirectory(org.apache.lucene.store.NIOFSDirectory@/usr/home/hudson/hudson-slave/workspace/Lucene-Solr-NightlyTests-trunk/solr/build/solr-core/test/J1/org.apache.solr.cloud.BasicDistributedZk2Test-1348198443016/control/data/index lockFactory=org.apache.lucene.store.NativeFSLockFactory@5e60770d; maxCacheMB=48.0 maxMergeSizeMB=4.0),segFN=segments_2,generation=2,filenames=[_0_Block_0.tip, _0_Block_0.pos, _0.fnm, _0_Pulsing40_0.tim, _0_Block_0.doc, _0_Block_0.tim, _0_nrm.cfs, _0_Pulsing40_1.prx, _0_Pulsing40_0.prx, _0_Direct_0.frq, _0_Pulsing40_0.frq, _0_Pulsing40_1.frq, _0_Pulsing40_1.tip, _0_Pulsing40_1.tim, _0_nrm.cfe, _0_Pulsing40_0.tip, segments_2, _0_Direct_0.tip, _0.fdx, _0_Direct_0.prx, _0.si, _0_Direct_0.tim, _0.fdt]
[junit4:junit4]   2> 18419 T3441 C174 P17806 oasc.SolrDeletionPolicy.updateCommits newest commit = 2
[junit4:junit4]   2> 18430 T3441 C174 P17806 oass.SolrIndexSearcher.<init> Opening Searcher@6c039252 main
[junit4:junit4]   2> 18431 T3441 C174 P17806 oasu.DirectUpdateHandler2.commit end_commit_flush
[junit4:junit4]   2> 18432 T3452 oasc.SolrCore.registerSearcher [collection1] Registered new searcher Searcher@6c039252 main{StandardDirectoryReader(segments_2:3 _0(5.0):C1)}
[junit4:junit4]   2> 18433 T3441 C174 P17806 /update {waitSearcher=true&wt=javabin&commit=true&softCommit=false&version=2} {commit=} 0 162
[junit4:junit4]   2> 18434 T3471 C173 P54719 oasu.DirectUpdateHandler2.commit start commit{flags=0,_version_=0,optimize=false,openSearcher=true,waitSearcher=true,expungeDeletes=false,softCommit=false}
[junit4:junit4]   2> 18437 T3471 C173 P54719 oass.SolrIndexSearcher.<init> Opening Searcher@4ada04e7 main
[junit4:junit4]   2> 18437 T3471 C173 P54719 oasu.DirectUpdateHandler2.commit end_commit_flush
[junit4:junit4]   2> 18439 T3476 oasc.SolrCore.registerSearcher [collection1] Registered new searcher Searcher@4ada04e7 main{StandardDirectoryReader(segments_1:1)}
[junit4:junit4]   2> 18439 T3471 C173 P54719 oasu.SolrCmdDistributor.distribCommit Distrib commit to:[StdNode: http://127.0.0.1:38577/solr/collection1/, StdNode: http://127.0.0.1:50663/solr/collection1/, StdNode: http://127.0.0.1:56631/solr/collection1/]
[junit4:junit4]   2> 18441 T3460 C171 P38577 oasu.DirectUpdateHandler2.commit start commit{flags=0,_version_=0,optimize=false,openSearcher=true,waitSearcher=true,expungeDeletes=false,softCommit=false}
[junit4:junit4]   2>  C170_STATE=coll:collection1 core:collection1 props:{shard=shard1, roles=null, state=active, core=collection1, collection=collection1, node_name=127.0.0.1:50663_solr, base_url=http://127.0.0.1:50663/solr}
[junit4:junit4]   2> 18443 T3479 C170 P50663 oasu.DirectUpdateHandler2.commit start commit{flags=0,_version_=0,optimize=false,openSearcher=true,waitSearcher=true,expungeDeletes=false,softCommit=false}
[junit4:junit4]   2> 18445 T3479 C170 P50663 oass.SolrIndexSearcher.<init> Opening Searcher@19776c11 main
[junit4:junit4]   2> 18445 T3479 C170 P50663 oasu.DirectUpdateHandler2.commit end_commit_flush
[junit4:junit4]   2> 18446 T3488 oasc.SolrCore.registerSearcher [collection1] Registered new searcher Searcher@19776c11 main{StandardDirectoryReader(segments_2:3:nrt _0(5.0):C1)}
[junit4:junit4]   2> 18447 T3479 C170 P50663 /update {waitSearcher=true&commit=true&wt=javabin&commit_end_point=true&expungeDeletes=false&softCommit=false&version=2} {commit=} 0 4
[junit4:junit4]   2>  C172_STATE=coll:collection1 core:collection1 props:{shard=shard2, roles=null, state=active, core=collection1, collection=collection1, node_name=127.0.0.1:56631_solr, base_url=http://127.0.0.1:56631/solr}
[junit4:junit4]   2> 18448 T3493 C172 P56631 oasu.DirectUpdateHandler2.commit start commit{flags=0,_version_=0,optimize=false,openSearcher=true,waitSearcher=true,expungeDeletes=false,softCommit=false}
[junit4:junit4]   2> 18450 T3493 C172 P56631 oass.SolrIndexSearcher.<init> Opening Searcher@69c8a01d main
[junit4:junit4]   2> 18451 T3493 C172 P56631 oasu.DirectUpdateHandler2.commit end_commit_flush
[junit4:junit4]   2> 18452 T3502 oasc.SolrCore.registerSearcher [collection1] Registered new searcher Searcher@69c8a01d main{StandardDirectoryReader(segments_2:2)}
[junit4:junit4]   2> 18453 T3493 C172 P56631 /update {waitSearcher=true&commit=true&wt=javabin&commit_end_point=true&expungeDeletes=false&softCommit=false&version=2} {commit=} 0 5
[junit4:junit4]   2> 18458 T3460 C171 P38577 oass.SolrIndexSearcher.<init> Opening Searcher@404d6d72 main
[junit4:junit4]   2> 18458 T3460 C171 P38577 oasu.DirectUpdateHandler2.commit end_commit_flush
[junit4:junit4]   2> 18460 T3464 oasc.SolrCore.registerSearcher [collection1] Registered new searcher Searcher@404d6d72 main{StandardDirectoryReader(segments_2:3 _0(5.0):C1)}
[junit4:junit4]   2> 18460 T3460 C171 P38577 /update {waitSearcher=true&commit=true&wt=javabin&commit_end_point=true&expungeDeletes=false&softCommit=false&version=2} {commit=} 0 19
[junit4:junit4]   2> 18461 T3471 C173 P54719 /update {waitSearcher=true&wt=javabin&commit=true&softCommit=false&version=2} {commit=} 0 27
[junit4:junit4]   2> 18465 T3442 C174 P17806 REQ /select {fl=id,score&shard.url=127.0.0.1:17806/solr/collection1/&NOW=1348198461475&start=0&q=*:*&distrib=false&isShard=true&wt=javabin&fsv=true&rows=10&version=2} hits=1 status=0 QTime=0 
[junit4:junit4]   2> 18468 T3442 C174 P17806 REQ /select {shard.url=127.0.0.1:17806/solr/collection1/&NOW=1348198461475&q=*:*&ids=1&distrib=false&isShard=true&wt=javabin&version=2} status=0 QTime=0 
[junit4:junit4]   2> 18469 T3441 C174 P17806 REQ /select {wt=javabin&q=*:*&version=2} hits=1 status=0 QTime=6 
[junit4:junit4]   2> 18469 T3429 oaz.ZooKeeper.<init> Initiating client connection, connectString=127.0.0.1:25019/solr sessionTimeout=10000 watcher=org.apache.solr.common.cloud.ConnectionManager@7969a98c
[junit4:junit4]   2> 18470 T3516 oaz.ClientCnxn$SendThread.startConnect Opening socket connection to server /127.0.0.1:25019
[junit4:junit4]   2> 18470 T3429 oascc.ConnectionManager.waitForConnected Waiting for client to connect to ZooKeeper
[junit4:junit4]   2> 18471 T3516 oaz.ClientCnxn$SendThread.primeConnection Socket connection established to localhost/127.0.0.1:25019, initiating session
[junit4:junit4]   2> 18471 T3431 oazs.NIOServerCnxn$Factory.run Accepted socket connection from /140.211.11.196:56714
[junit4:junit4]   2> 18472 T3431 oazs.NIOServerCnxn.readConnectRequest Client attempting to establish new session at /140.211.11.196:56714
[junit4:junit4]   2> 18474 T3433 oazs.NIOServerCnxn.finishSessionInit Established session 0x139e6e3a81b0009 with negotiated timeout 10000 for client /140.211.11.196:56714
[junit4:junit4]   2> 18474 T3516 oaz.ClientCnxn$SendThread.readConnectResult Session establishment complete on server localhost/127.0.0.1:25019, sessionid = 0x139e6e3a81b0009, negotiated timeout = 10000
[junit4:junit4]   2> 18474 T3517 oascc.ConnectionManager.process Watcher org.apache.solr.common.cloud.ConnectionManager@7969a98c name:ZooKeeperConnection Watcher:127.0.0.1:25019/solr got event WatchedEvent state:SyncConnected type:None path:null path:null type:None
[junit4:junit4]   2> 18474 T3429 oascc.ConnectionManager.waitForConnected Client is connected to ZooKeeper
[junit4:junit4]   2> 18475 T3429 oascc.ZkStateReader.createClusterStateWatchersAndUpdate Updating cluster state from ZooKeeper... 
[junit4:junit4]   2> 18477 T3434 oazs.PrepRequestProcessor.pRequest Processed session termination for sessionid: 0x139e6e3a81b0009
[junit4:junit4]   2> 18480 T3517 oaz.ClientCnxn$EventThread.run EventThread shut down
[junit4:junit4]   2> 18480 T3431 oazs.NIOServerCnxn.closeSock Closed socket connection for client /140.211.11.196:56714 which had sessionid 0x139e6e3a81b0009
[junit4:junit4]   2> 18480 T3429 oaz.ZooKeeper.close Session: 0x139e6e3a81b0009 closed
[junit4:junit4]   2> 18482 T3461 C171 P38577 REQ /select {distrib=false&wt=javabin&q=*:*&version=2} hits=1 status=0 QTime=0 
[junit4:junit4]   2> 18484 T3472 C173 P54719 REQ /select {distrib=false&wt=javabin&q=*:*&version=2} hits=0 status=0 QTime=0 
[junit4:junit4]   2> 18490 T3494 C172 P56631 REQ /select {fl=id,score&shard.url=127.0.0.1:54719/solr/collection1/|127.0.0.1:56631/solr/collection1/&NOW=1348198461499&start=0&q=*:*&distrib=false&isShard=true&wt=javabin&fsv=true&rows=10&version=2} hits=0 status=0 QTime=0 
[junit4:junit4]   2> 18490 T3456 C171 P38577 REQ /select {fl=id,score&shard.url=127.0.0.1:38577/solr/collection1/|127.0.0.1:50663/solr/collection1/&NOW=1348198461499&start=0&q=*:*&distrib=false&isShard=true&wt=javabin&fsv=true&rows=10&version=2} hits=1 status=0 QTime=0 
[junit4:junit4]   2> 18493 T3456 C171 P38577 REQ /select {shard.url=127.0.0.1:38577/solr/collection1/|127.0.0.1:50663/solr/collection1/&NOW=1348198461499&q=*:*&ids=1&distrib=false&isShard=true&wt=javabin&version=2} status=0 QTime=0 
[junit4:junit4]   2> 18494 T3471 C173 P54719 REQ /select {wt=javabin&q=*:*&version=2} hits=1 status=0 QTime=7 
[junit4:junit4]   2> 18501 T3441 C174 P17806 /update {wt=javabin&version=2} {add=[2 (1413688549974212608)]} 0 5
[junit4:junit4]   2> 18517 T3493 C172 P56631 REQ /update {distrib.from=http://127.0.0.1:54719/solr/collection1/&update.distrib=FROMLEADER&wt=javabin&version=2} status=0 QTime=8 
[junit4:junit4]   2> 18518 T3471 C173 P54719 /update {wt=javabin&version=2} {add=[2 (1413688549981552640)]} 0 15
[junit4:junit4]   2> 18521 T3441 C174 P17806 /update {wt=javabin&version=2} {add=[3 (1413688549999378432)]} 0 1
[junit4:junit4]   2> 18529 T3493 C172 P56631 REQ /update {distrib.from=http://127.0.0.1:54719/solr/collection1/&update.distrib=FROMLEADER&wt=javabin&version=2} status=0 QTime=1 
[junit4:junit4]   2> 18529 T3471 C173 P54719 /update {wt=javabin&version=2} {add=[3 (1413688550003572736)]} 0 5
[junit4:junit4]   2> 18533 T3441 C174 P17806 /update {wt=javabin&version=2} {add=[4 (1413688550011961344)]} 0 1
[junit4:junit4]   2> 18561 T3479 C170 P50663 REQ /update {update.distrib=FROMLEADER&distrib.from=http://127.0.0.1:38577/solr/collection1/&wt=javabin&version=2} status=0 QTime=14 
[junit4:junit4]   2> 18561 T3460 C171 P38577 REQ /update {distrib.from=http://127.0.0.1:54719/solr/collection1/&update.distrib=TOLEADER&wt=javabin&version=2} status=0 QTime=24 
[junit4:junit4]   2> 18562 T3471 C173 P54719 /update {wt=javabin&version=2} {add=[4]} 0 27
[junit4:junit4]   2> 18565 T3441 C174 P17806 /update {wt=javabin&version=2} {add=[5 (1413688550045515776)]} 0 1
[junit4:junit4]   2> 18574 T3493 C172 P56631 REQ /update {update.distrib=FROMLEADER&distrib.from=http://127.0.0.1:54719/solr/collection1/&wt=javabin&version=2} status=0 QTime=1 
[junit4:junit4]   2> 18574 T3473 C173 P54719 REQ /update {distrib.from=http://127.0.0.1:38577/solr/collection1/&update.distrib=TOLEADER&wt=javabin&version=2} status=0 QTime=5 
[junit4:junit4]   2> 18575 T3457 C171 P38577 /update {wt=javabin&version=2} {add=[5]} 0 7
[junit4:junit4]   2> 18579 T3441 C174 P17806 /update {wt=javabin&version=2} {add=[6 (1413688550060195840)]} 0 1
[junit4:junit4]   2> 18587 T3493 C172 P56631 REQ /update {update.distrib=FROMLEADER&distrib.from=http://127.0.0.1:54719/solr/collection1/&wt=javabin&version=2} status=0 QTime=1 
[junit4:junit4]   2> 18587 T3473 C173 P54719 REQ /update {distrib.from=http://127.0.0.1:38577/solr/collection1/&update.distrib=TOLEADER&wt=javabin&version=2} status=0 QTime=4 
[junit4:junit4]   2> 18588 T3457 C171 P38577 /update {wt=javabin&version=2} {add=[6]} 0 7
[junit4:junit4]   2> 18592 T3441 C174 P17806 /update {wt=javabin&version=2} {add=[7 (1413688550073827328)]} 0 1
[junit4:junit4]   2> 18602 T3493 C172 P56631 REQ /update {update.distrib=FROMLEADER&distrib.from=http://127.0.0.1:54719/solr/collection1/&wt=javabin&version=2} status=0 QTime=1 
[junit4:junit4]   2> 18603 T3473 C173 P54719 REQ /update {distrib.from=http://127.0.0.1:38577/solr/collection1/&update.distrib=TOLEADER&wt=javabin&version=2} status=0 QTime=6 
[junit4:junit4]   2> 18603 T3457 C171 P38577 /update {wt=javabin&version=2} {add=[7]} 0 8
[junit4:junit4]   2> 18607 T3441 C174 P17806 /update {wt=javabin&version=2} {add=[8 (1413688550089555968)]} 0 1
[junit4:junit4]   2> 18617 T3479 C170 P50663 REQ /update {update.distrib=FROMLEADER&distrib.from=http://127.0.0.1:38577/solr/collection1/&wt=javabin&version=2} status=0 QTime=1 
[junit4:junit4]   2> 18618 T3460 C171 P38577 REQ /update {distrib.from=http://127.0.0.1:54719/solr/collection1/&update.distrib=TOLEADER&wt=javabin&version=2} status=0 QTime=6 
[junit4:junit4]   2> 18619 T3471 C173 P54719 /update {wt=javabin&version=2} {add=[8]} 0 9
[junit4:junit4]   2> 18623 T3441 C174 P17806 /update {wt=javabin&version=2} {add=[9 (1413688550106333184)]} 0 1
[junit4:junit4]   2> 18630 T3493 C172 P56631 REQ /update {distrib.from=http://127.0.0.1:54719/solr/collection1/&update.distrib=FROMLEADER&wt=javabin&version=2} status=0 QTime=1 
[junit4:junit4]   2> 18631 T3471 C173 P54719 /update {wt=javabin&version=2} {add=[9 (1413688550110527488)]} 0 5
[junit4:junit4]   2> 18635 T3441 C174 P17806 /update {wt=javabin&version=2} {add=[10 (1413688550118916096)]} 0 1
[junit4:junit4]   2> 18645 T3479 C170 P50663 REQ /update {distrib.from=http://127.0.0.1:38577/solr/collection1/&update.distrib=FROMLEADER&wt=javabin&version=2} status=0 QTime=2 
[junit4:junit4]   2> 18645 T3457 C171 P38577 /update {wt=javabin&version=2} {add=[10 (1413688550123110400)]} 0 7
[junit4:junit4]   2> 18656 T3441 C174 P17806 /update {wt=javabin&version=2} {add=[11 (1413688550133596160)]} 0 8
[junit4:junit4]   2> 18664 T3479 C170 P50663 REQ /update {distrib.from=http://127.0.0.1:38577/solr/collection1/&update.distrib=FROMLEADER&wt=javabin&version=2} status=0 QTime=2 
[junit4:junit4]   2> 18664 T3457 C171 P38577 /update {wt=javabin&version=2} {add=[11 (1413688550145130496)]} 0 5
[junit4:junit4]   2> 18669 T3441 C174 P17806 /update {wt=javabin&version=2} {add=[12 (1413688550153519104)]} 0 2
[junit4:junit4]   2> 18679 T3479 C170 P50663 REQ /update {update.distrib=FROMLEADER&distrib.from=http://127.0.0.1:38577/solr/collection1/&wt=javabin&version=2} status=0 QTime=2 
[junit4:junit4]   2> 18679 T3460 C171 P38577 REQ /update {distrib.from=http://127.0.0.1:54719/solr/collection1/&update.distrib=TOLEADER&wt=javabin&version=2} status=0 QTime=6 
[junit4:junit4]   2> 18680 T3471 C173 P54719 /update {wt=javabin&version=2} {add=[12]} 0 9
[junit4:junit4]   2> 18684 T3441 C174 P17806 /update {wt=javabin&version=2} {add=[13 (1413688550170296320)]} 0 1
[junit4:junit4]   2> 18693 T3479 C170 P50663 REQ /update {update.distrib=FROMLEADER&distrib.from=http://127.0.0.1:38577/solr/collection1/&wt=javabin&version=2} status=0 QTime=2 
[junit4:junit4]   2> 18693 T3460 C171 P38577 REQ /update {distrib.from=http://127.0.0.1:54719/solr/collection1/&update.distrib=TOLEADER&wt=javabin&version=2} status=0 QTime=5 
[junit4:junit4]   2> 18694 T3471 C173 P54719 /update {wt=javabin&version=2} {add=[13]} 0 8
[junit4:junit4]   2> 18698 T3441 C174 P17806 /update {wt=javabin&version=2} {add=[14 (1413688550184976384)]} 0 1
[junit4:junit4]   2> 18704 T3479 C170 P50663 REQ /update {distrib.from=http://127.0.0.1:38577/solr/collection1/&update.distrib=FROMLEADER&wt=javabin&version=2} status=0 QTime=1 
[junit4:junit4]   2> 18704 T3457 C171 P38577 /update {wt=javabin&version=2} {add=[14 (1413688550188122112)]} 0 4
[junit4:junit4]   2> 18708 T3441 C174 P17806 /update {wt=javabin&version=2} {add=[15 (1413688550195462144)]} 0 1
[junit4:junit4]   2> 18714 T3479 C170 P50663 REQ /update {distrib.from=http://127.0.0.1:38577/solr/collection1/&update.distrib=FROMLEADER&wt=javabin&version=2} status=0 QTime=1 
[junit4:junit4]   2> 18715 T3457 C171 P38577 /update {wt=javabin&version=2} {add=[15 (1413688550198607872)]} 0 5
[junit4:junit4]   2> 18718 T3441 C174 P17806 /update {wt=javabin&version=2} {add=[16 (1413688550205947904)]} 0 1
[junit4:junit4]   2> 18726 T3479 C170 P50663 REQ /update {update.distrib=FROMLEADER&distrib.from=http://127.0.0.1:38577/solr/collection1/&wt=javabin&version=2} status=0 QTime=1 
[junit4:junit4]   2> 18727 T3460 C171 P38577 REQ /update {distrib.from=http://127.0.0.1:54719/solr/collection1/&update.distrib=TOLEADER&wt=javabin&version=2} status=0 QTime=5 
[junit4:junit4]   2> 18727 T3471 C173 P54719 /update {wt=javabin&version=2} {add=[16]} 0 7
[junit4:junit4]   2> 18733 T3441 C174 P17806 /update {wt=javabin&version=2} {add=[17 (1413688550219579392)]} 0 3
[junit4:junit4]   2> 18745 T3493 C172 P56631 REQ /update {distrib.from=http://127.0.0.1:54719/solr/collection1/&update.distrib=FROMLEADER&wt=javabin&version=2} status=0 QTime=3 
[junit4:junit4]   2> 18746 T3471 C173 P54719 /update {wt=javabin&version=2} {add=[17 (1413688550225870848)]} 0 10
[junit4:junit4]   2> 18749 T3441 C174 P17806 /update {wt=javabin&version=2} {add=[100 (1413688550238453760)]} 0 1
[junit4:junit4]   2> 18780 T3479 C170 P50663 REQ /update {update.distrib=FROMLEADER&distrib.from=http://127.0.0.1:38577/solr/collection1/&wt=javabin&version=2} status=0 QTime=14 
[junit4:junit4]   2> 18781 T3460 C171 P38577 REQ /update {distrib.from=http://127.0.0.1:54719/solr/collection1/&update.distrib=TOLEADER&wt=javabin&version=2} status=0 QTime=28 
[junit4:junit4]   2> 18781 T3471 C173 P54719 /update {wt=javabin&version=2} {add=[100]} 0 30
[junit4:junit4]   2> 18785 T3441 C174 P17806 /update {wt=javabin&version=2} {add=[101 (1413688550276202496)]} 0 1
[junit4:junit4]   2> 18799 T3479 C170 P50663 REQ /update {update.distrib=FROMLEADER&distrib.from=http://127.0.0.1:38577/solr/collection1/&wt=javabin&version=2} status=0 QTime=3 
[junit4:junit4]   2> 18799 T3460 C171 P38577 REQ /update {distrib.from=http://127.0.0.1:54719/solr/collection1/&update.distrib=TOLEADER&wt=javabin&version=2} status=0 QTime=9 
[junit4:junit4]   2> 18800 T3471 C173 P54719 /update {wt=javabin&version=2} {add=[101]} 0 12
[junit4:junit4]   2> 18804 T3441 C174 P17806 /update {wt=javabin&version=2} {add=[102 (1413688550296125440)]} 0 1
[junit4:junit4]   2> 18814 T3479 C170 P50663 REQ /update {update.distrib=FROMLEADER&distrib.from=http://127.0.0.1:38577/solr/collection1/&wt=javabin&version=2} status=0 QTime=2 
[junit4:junit4]   2> 18814 T3460 C171 P38577 REQ /update {distrib.from=http://127.0.0.1:54719/solr/collection1/&update.distrib=TOLEADER&wt=javabin&version=2} status=0 QTime=5 
[junit4:junit4]   2> 18815 T3471 C173 P54719 /update {wt=javabin&version=2} {add=[102]} 0 8
[junit4:junit4]   2> 18827 T3441 C174 P17806 /update {wt=javabin&version=2} {add=[103 (1413688550310805504)]} 0 10
[junit4:junit4]   2> 18834 T3493 C172 P56631 REQ /update {distrib.from=http://127.0.0.1:54719/solr/collection1/&update.distrib=FROMLEADER&wt=javabin&version=2} status=0 QTime=1 
[junit4:junit4]   2> 18835 T3471 C173 P54719 /update {wt=javabin&version=2} {add=[103 (1413688550324436992)]} 0 5
[junit4:junit4]   2> 18840 T3441 C174 P17806 /update {wt=javabin&version=2} {add=[104 (1413688550332825600)]} 0 2
[junit4:junit4]   2> 18846 T3493 C172 P56631 REQ /update {distrib.from=http://127.0.0.1:54719/solr/collection1/&update.distrib=FROMLEADER&wt=javabin&version=2} status=0 QTime=1 
[junit4:junit4]   2> 18846 T3471 C173 P54719 /update {wt=javabin&version=2} {add=[104 (1413688550337019904)]} 0 4
[junit4:junit4]   2> 18850 T3441 C174 P17806 /update {wt=javabin&version=2} {add=[105 (1413688550344359936)]} 0 1
[junit4:junit4]   2> 18870 T3493 C172 P56631 REQ /update {distrib.from=http://127.0.0.1:54719/solr/collection1/&update.distrib=FROMLEADER&wt=javabin&version=2} status=0 QTime=8 
[junit4:junit4]   2> 18871 T3471 C173 P54719 /update {wt=javabin&version=2} {add=[105 (1413688550347505664)]} 0 19
[junit4:junit4]   2> 18878 T3441 C174 P17806 /update {wt=javabin&version=2} {add=[106 (1413688550370574336)]} 0 4
[junit4:junit4]   2> 18891 T3493 C172 P56631 REQ /update {update.distrib=FROMLEADER&distrib.from=http://127.0.0.1:54719/solr/collection1/&wt=javabin&version=2} status=0 QTime=1 
[junit4:junit4]   2> 18892 T3473 C173 P54719 REQ /update {distrib.from=http://127.0.0.1:38577/solr/collection1/&update.distrib=TOLEADER&wt=javabin&version=2} status=0 QTime=9 
[junit4:junit4]   2> 18892 T3457 C171 P38577 /update {wt=javabin&version=2} {add=[106]} 0 11
[junit4:junit4]   2> 18895 T3441 C174 P17806 /update {wt=javabin&version=2} {add=[107 (1413688550392594432)]} 0 0
[junit4:junit4]   2> 18904 T3479 C170 P50663 REQ /update {update.distrib=FROMLEADER&distrib.from=http://127.0.0.1:38577/solr/collection1/&wt=javabin&version=2} status=0 QTime=1 
[junit4:junit4]   2> 18905 T3460 C171 P38577 REQ /update {distrib.from=http://127.0.0.1:54719/solr/collection1/&update.distrib=TOLEADER&wt=javabin&version=2} status=0 QTime=5 
[junit4:junit4]   2> 18905 T3471 C173 P54719 /update {wt=javabin&version=2} {add=[107]} 0 7
[junit4:junit4]   2> 18909 T3441 C174 P17806 /update {wt=javabin&version=2} {add=[108 (1413688550406225920)]} 0 1
[junit4:junit4]   2> 18914 T3479 C170 P50663 REQ /update {distrib.from=http://127.0.0.1:38577/solr/collection1/&update.distrib=FROMLEADER&wt=javabin&version=2} status=0 QTime=1 
[junit4:junit4]   2> 18915 T3457 C171 P38577 /update {wt=javabin&version=2} {add=[108 (1413688550409371648)]} 0 4
[junit4:junit4]   2> 18918 T3441 C174 P17806 /update {wt=javabin&version=2} {add=[109 (1413688550415663104)]} 0 1
[junit4:junit4]   2> 18923 T3479 C170 P50663 REQ /update {distrib.from=http://127.0.0.1:38577/solr/collection1/&update.distrib=FROMLEADER&wt=javabin&version=2} status=0 QTime=1 
[junit4:junit4]   2> 18923 T3457 C171 P38577 /update {wt=javabin&version=2} {add=[109 (1413688550418808832)]} 0 3
[junit4:junit4]   2> 18926 T3441 C174 P17806 /update {wt=javabin&version=2} {add=[110 (1413688550425100288)]} 0 0
[junit4:junit4]   2> 18934 T3479 C170 P50663 REQ /update {update.distrib=FROMLEADER&distrib.from=http://127.0.0.1:38577/solr/collection1/&wt=javabin&version=2} status=0 QTime=1 
[junit4:junit4]   2> 18935 T3460 C171 P38577 REQ /update {distrib.from=http://127.0.0.1:54719/solr/collection1/&update.distrib=TOLEADER&wt=javabin&version=2} status=0 QTime=4 
[junit4:junit4]   2> 18935 T3471 C173 P54719 /update {wt=javabin&version=2} {add=[110]} 0 6
[junit4:junit4]   2> 18937 T3441 C174 P17806 /update {wt=javabin&version=2} {add=[111 (1413688550436634624)]} 0 0
[junit4:junit4]   2> 18945 T3479 C170 P50663 REQ /update {update.distrib=FROMLEADER&distrib.from=http://127.0.0.1:38577/solr/collection1/&wt=javabin&version=2} status=0 QTime=1 
[junit4:junit4]   2> 18945 T3460 C171 P38577 REQ /update {distrib.from=http://127.0.0.1:54719/solr/collection1/&update.distrib=TOLEADER&wt=javabin&version=2} status=0 QTime=3 
[junit4:junit4]   2> 18946 T3471 C173 P54719 /update {wt=javabin&version=2} {add=[111]} 0 6
[junit4:junit4]   2> 18948 T3441 C174 P17806 /update {wt=javabin&version=2} {add=[112 (1413688550448168960)]} 0 0
[junit4:junit4]   2> 18955 T3493 C172 P56631 REQ /update {update.distrib=FROMLEADER&distrib.from=http://127.0.0.1:54719/solr/collection1/&wt=javabin&version=2} status=0 QTime=0 
[junit4:junit4]   2> 18956 T3473 C173 P54719 REQ /update {distrib.from=http://127.0.0.1:38577/solr/collection1/&update.distrib=TOLEADER&wt=javabin&version=2} status=0 QTime=3 
[junit4:junit4]   2> 18956 T3457 C171 P38577 /update {wt=javabin&version=2} {add=[112]} 0 5
[junit4:junit4]   2> 18968 T3441 C174 P17806 /update {wt=javabin&version=2} {add=[113 (1413688550459703296)]} 0 9
[junit4:junit4]   2> 18976 T3479 C170 P50663 REQ /update {update.distrib=FROMLEADER&distrib.from=http://127.0.0.1:38577/solr/collection1/&wt=javabin&version=2} status=0 QTime=1 
[junit4:junit4]   2> 18977 T3460 C171 P38577 REQ /update {distrib.from=http://127.0.0.1:54719/solr/collection1/&update.distrib=TOLEADER&wt=javabin&version=2} status=0 QTime=4 
[junit4:junit4]   2> 18977 T3471 C173 P54719 /update {wt=javabin&version=2} {add=[113]} 0 6
[junit4:junit4]   2> 18981 T3441 C174 P17806 /update {wt=javabin&version=2} {add=[114 (1413688550481723392)]} 0 1
[junit4:junit4]   2> 18987 T3479 C170 P50663 REQ /update {distrib.from=http://127.0.0.1:38577/solr/collection1/&update.distrib=FROMLEADER&wt=javabin&version=2} status=0 QTime=1 
[junit4:junit4]   2> 18987 T3457 C171 P38577 /update {wt=javabin&version=2} {add=[114 (1413688550485917696)]} 0 3
[junit4:junit4]   2> 18990 T3441 C174 P17806 /update {wt=javabin&version=2} {add=[115 (1413688550492209152)]} 0 0
[junit4:junit4]   2> 18999 T3493 C172 P56631 REQ /update {update.distrib=FROMLEADER&distrib.from=http://127.0.0.1:54719/solr/collection1/&wt=javabin&version=2} status=0 QTime=1 
[junit4:junit4]   2> 18999 T3473 C173 P54719 REQ /update {distrib.from=http://127.0.0.1:38577/solr/collection1/&update.distrib=TOLEADER&wt=javabin&version=2} status=0 QTime=4 
[junit4:junit4]   2> 19000 T3457 C171 P38577 /update {wt=javabin&version=2} {add=[115]} 0 7
[junit4:junit4]   2> 19002 T3441 C174 P17806 /update {wt=javabin&version=2} {add=[116 (1413688550504792064)]} 0 0
[junit4:junit4]   2> 19008 T3493 C172 P56631 REQ /update {distrib.from=http://127.0.0.1:54719/solr/collection1/&update.distrib=FROMLEADER&wt=javabin&version=2} status=0 QTime=0 
[junit4:junit4]   2> 19009 T3471 C173 P54719 /update {wt=javabin&version=2} {add=[116 (1413688550507937792)]} 0 4
[junit4:junit4]   2> 19012 T3441 C174 P17806 /update {wt=javabin&version=2} {add=[117 (1413688550515277824)]} 0 0
[junit4:junit4]   2> 19019 T3493 C172 P56631 REQ /update {distrib.from=http://127.0.0.1:54719/solr/collection1/&update.distrib=FROMLEADER&wt=javabin&version=2} status=0 QTime=1 
[junit4:junit4]   2> 19019 T3471 C173 P54719 /update {wt=javabin&version=2} {add=[117 (1413688550518423552)]} 0 4
[junit4:junit4]   2> 19023 T3441 C174 P17806 /update {wt=javabin&version=2} {add=[118 (1413688550525763584)]} 0 1
[junit4:junit4]   2> 19050 T3479 C170 P50663 REQ /update {distrib.from=http://127.0.0.1:38577/solr/collection1/&update.distrib=FROMLEADER&wt=javabin&version=2} status=0 QTime=11 
[junit4:junit4]   2> 19051 T3457 C171 P38577 /update {wt=javabin&version=2} {add=[118 (1413688550528909312)]} 0 26
[junit4:junit4]   2> 19055 T3441 C174 P17806 /update {wt=javabin&version=2} {add=[119 (1413688550559318016)]} 0 1
[junit4:junit4]   2> 19061 T3493 C172 P56631 REQ /update {distrib.from=http://127.0.0.1:54719/solr/collection1/&update.distrib=FROMLEADER&wt=javabin&version=2} status=0 QTime=1 
[junit4:junit4]   2> 19061 T3471 C173 P54719 /update {wt=javabin&version=2} {add=[119 (1413688550562463744)]} 0 4
[junit4:junit4]   2> 19065 T3441 C174 P17806 /update {wt=javabin&version=2} {add=[120 (1413688550569803776)]} 0 1
[junit4:junit4]   2> 19071 T3493 C172 P56631 REQ /update {distrib.from=http://127.0.0.1:54719/solr/collection1/&update.distrib=FROMLEADER&wt=javabin&version=2} status=0 QTime=1 
[junit4:junit4]   2> 19071 T3471 C173 P54719 /update {wt=javabin&version=2} {add=[120 (1413688550572949504)]} 0 4
[junit4:junit4]   2> 19075 T3441 C174 P17806 /update {wt=javabin&version=2} {add=[121 (1413688550580289536)]} 0 1
[junit4:junit4]   2> 19083 T3493 C172 P56631 REQ /update {update.distrib=FROMLEADER&distrib.from=http://127.0.0.1:54719/solr/collection1/&wt=javabin&version=2} status=0 QTime=1 
[junit4:junit4]   2> 19083 T3473 C173 P54719 REQ /update {distrib.from=http://127.0.0.1:38577/solr/collection1/&update.distrib=TOLEADER&wt=javabin&version=2} status=0 QTime=4 
[junit4:junit4]   2> 19084 T3457 C171 P38577 /update {wt=javabin&version=2} {add=[121]} 0 7
[junit4:junit4]   2> 19087 T3441 C174 P17806 /update {wt=javabin&version=2} {add=[122 (1413688550592872448)]} 0 1
[junit4:junit4]   2> 19095 T3479 C170 P50663 REQ /update {distrib.from=http://127.0.0.1:38577/solr/collection1/&update.distrib=FROMLEADER&wt=javabin&version=2} status=0 QTime=2 
[junit4:junit4]   2> 19095 T3457 C171 P38577 /update {wt=javabin&version=2} {add=[122 (1413688550596018176)]} 0 6
[junit4:junit4]   2> 19107 T3441 C174 P17806 /update {wt=javabin&version=2} {add=[123 (1413688550606503936)]} 0 8
[junit4:junit4]   2> 19116 T3479 C170 P50663 REQ /update {update.distrib=FROMLEADER&distrib.from=http://127.0.0.1:38577/solr/collection1/&wt=javabin&version=2} status=0 QTime=1 
[junit4:junit4]   2> 19117 T3460 C171 P38577 REQ /update {distrib.from=http://127.0.0.1:54719/solr/collection1/&update.distrib=TOLEADER&wt=javabin&version=2} status=0 QTime=5 
[junit4:junit4]   2> 19117 T3471 C173 P54719 /update {wt=javabin&version=2} {add=[123]} 0 7
[junit4:junit4]   2> 19122 T3441 C174 P17806 /update {wt=javabin&version=2} {add=[124 (1413688550628524032)]} 0 2
[junit4:junit4]   2> 19129 T3479 C170 P50663 REQ /update {update.distrib=FROMLEADER&distrib.from=http://127.0.0.1:38577/solr/collection1/&wt=javabin&version=2} status=0 QTime=1 
[junit4:junit4]   2> 19129 T3460 C171 P38577 REQ /update {distrib.from=http://127.0.0.1:54719/solr/collection1/&update.distrib=TOLEADER&wt=javabin&version=2} status=0 QTime=3 
[junit4:junit4]   2> 19130 T3471 C173 P54719 /update {wt=javabin&version=2} {add=[124]} 0 6
[junit4:junit4]   2> 19134 T3441 C174 P17806 /update {wt=javabin&version=2} {add=[125 (1413688550642155520)]} 0 1
[junit4:junit4]   2> 19140 T3479 C170 P50663 REQ /update {distrib.from=http://127.0.0.1:38577/solr/collection1/&update.distrib=FROMLEADER&wt=javabin&version=2} status=0 QTime=1 
[junit4:junit4]   2> 19140 T3457 C171 P38577 /update {wt=javabin&version=2} {add=[125 (1413688550645301248)]} 0 4
[junit4:junit4]   2> 19144 T3441 C174 P17806 /update {wt=javabin&version=2} {add=[126 (1413688550652641280)]} 0 0
[junit4:junit4]   2> 19152 T3493 C172 P56631 REQ /update {update.distrib=FROMLEADER&distrib.from=http://127.0.0.1:54719/solr/collection1/&wt=javabin&version=2} status=0 QTime=1 
[junit4:junit4]   2> 19153 T3473 C173 P54719 REQ /update {distrib.from=http://127.0.0.1:38577/solr/collection1/&update.distrib=TOLEADER&wt=javabin&version=2} status=0 QTime=5 
[junit4:junit4]   2> 19153 T3457 C171 P38577 /update {wt=javabin&version=2} {add=[126]} 0 7
[junit4:junit4]   2> 19157 T3441 C174 P17806 /update {wt=javabin&version=2} {add=[127 (1413688550666272768)]} 0 1
[junit4:junit4]   2> 19180 T3493 C172 P56631 REQ /update {update.distrib=FROMLEADER&distrib.from=http://127.0.0.1:54719/solr/collection1/&wt=javabin&version=2} status=0 QTime=10 
[junit4:junit4]   2> 19180 T3473 C173 P54719 REQ /update {distrib.from=http://127.0.0.1:38577/solr/collection1/&update.distrib=TOLEADER&wt=javabin&version=2} status=0 QTime=19 
[junit4:junit4]   2> 19181 T3457 C171 P38577 /update {wt=javabin&version=2} {add=[127]} 0 22
[junit4:junit4]   2> 19185 T3441 C174 P17806 /update {wt=javabin&version=2} {add=[128 (1413688550695632896)]} 0 1
[junit4:junit4]   2> 19194 T3493 C172 P56631 REQ /update {update.distrib=FROMLEADER&distrib.from=http://127.0.0.1:54719/solr/collection1/&wt=javabin&version=2} status=0 QTime=2 
[junit4:junit4]   2> 19194 T3473 C173 P54719 REQ /update {distrib.from=http://127.0.0.1:38577/solr/collection1/&update.distrib=TOLEADER&wt=javabin&version=2} status=0 QTime=5 
[junit4:junit4]   2> 19195 T3457 C171 P38577 /update {wt=javabin&version=2} {add=[128]} 0 8
[junit4:junit4]   2> 19197 T3441 C174 P17806 /update {wt=javabin&version=2} {add=[129 (1413688550709264384)]} 0 0
[junit4:junit4]   2> 19205 T3479 C170 P50663 REQ /update {update.distrib=FROMLEADER&distrib.from=http://127.0.0.1:38577/solr/collection1/&wt=javabin&version=2} status=0 QTime=1 
[junit4:junit4]   2> 19205 T3460 C171 P38577 REQ /update {distrib.from=http://127.0.0.1:54719/solr/collection1/&update.distrib=TOLEADER&wt=javabin&version=2} status=0 QTime=3 
[junit4:junit4]   2> 19206 T3471 C173 P54719 /update {wt=javabin&version=2} {add=[129]} 0 6
[junit4:junit4]   2> 19208 T3441 C174 P17806 /update {wt=javabin&version=2} {add=[130 (1413688550720798720)]} 0 0
[junit4:junit4]   2> 19216 T3493 C172 P56631 REQ /update {update.distrib=FROMLEADER&distrib.from=http://127.0.0.1:54719/solr/collection1/&wt=javabin&version=2} status=0 QTime=1 
[junit4:junit4]   2> 19216 T3473 C173 P54719 REQ /update {distrib.from=http://127.0.0.1:38577/solr/collection1/&update.distrib=TOLEADER&wt=javabin&version=2} status=0 QTime=3 
[junit4:junit4]   2> 19217 T3457 C171 P38577 /update {wt=javabin&version=2} {add=[130]} 0 6
[junit4:junit4]   2> 19219 T3441 C174 P17806 /update {wt=javabin&version=2} {add=[131 (1413688550732333056)]} 0 0
[junit4:junit4]   2> 19228 T3493 C172 P56631 REQ /update {update.distrib=FROMLEADER&distrib.from=http://127.0.0.1:54719/solr/collection1/&wt=javabin&version=2} status=0 QTime=1 
[junit4:junit4]   2> 19228 T3473 C173 P54719 REQ /update {distrib.from=http://127.0.0.1:38577/solr/collection1/&update.distrib=TOLEADER&wt=javabin&version=2} status=0 QTime=4 
[junit4:junit4]   2> 19229 T3457 C171 P38577 /update {wt=javabin&version=2} {add=[131]} 0 7
[junit4:junit4]   2> 19231 T3441 C174 P17806 /update {wt=javabin&version=2} {add=[132 (1413688550744915968)]} 0 0
[junit4:junit4]   2> 19238 T3479 C170 P50663 REQ /update {distrib.from=http://127.0.0.1:38577/solr/collection1/&update.distrib=FROMLEADER&wt=javabin&version=2} status=0 QTime=1 
[junit4:junit4]   2> 19238 T3457 C171 P38577 /update {wt=javabin&version=2} {add=[132 (1413688550748061696)]} 0 4
[junit4:junit4]   2> 19247 T3441 C174 P17806 /update {wt=javabin&version=2} {add=[133 (1413688550755401728)]} 0 6
[junit4:junit4]   2> 19256 T3479 C170 P50663 REQ /update {update.distrib=FROMLEADER&distrib.from=http://127.0.0.1:38577/solr/collection1/&wt=javabin&version=2} status=0 QTime=1 
[junit4:junit4]   2> 19256 T3460 C171 P38577 REQ /update {distrib.from=http://127.0.0.1:54719/solr/collection1/&update.distrib=TOLEADER&wt=javabin&version=2} status=0 QTime=4 
[junit4:junit4]   2> 19257 T3471 C173 P54719 /update {wt=javabin&version=2} {add=[133]} 0 7
[junit4:junit4]   2> 19260 T3441 C174 P17806 /update {wt=javabin&version=2} {add=[134 (1413688550774276096)]} 0 1
[junit4:junit4]   2> 19266 T3493 C172 P56631 REQ /update {distrib.from=http://127.0.0.1:54719/solr/collection1/&update.distrib=FROMLEADER&wt=javabin&version=2} status=0 QTime=1 
[junit4:junit4]   2> 19267 T3471 C173 P54719 /update {wt=javabin&version=2} {add=[134 (1413688550778470400)]} 0 4
[junit4:junit4]   2> 19269 T3441 C174 P17806 /update {wt=javabin&version=2} {add=[135 (1413688550784761856)]} 0 0
[junit4:junit4]   2> 19276 T3479 C170 P50663 REQ /update {distrib.from=http://127.0.0.1:38577/solr/collection1/&update.distrib=FROMLEADER&wt=javabin&version=2} status=0 QTime=1 
[junit4:junit4]   2> 19276 T3457 C171 P38577 /update {wt=javabin&version=2} {add=[135 (1413688550787907584)]} 0 4
[junit4:junit4]   2> 19279 T3441 C174 P17806 /update {wt=javabin&version=2} {add=[136 (1413688550795247616)]} 0 0
[junit4:junit4]   2> 19287 T3493 C172 P56631 REQ /update {update.distrib=FROMLEADER&distrib.from=http://127.0.0.1:54719/solr/collection1/&wt=javabin&version=2} status=0 QTime=1 
[junit4:junit4]   2> 19288 T3473 C173 P54719 REQ /update {distrib.from=http://127.0.0.1:38577/solr/collection1/&update.distrib=TOLEADER&wt=javabin&version=2} status=0 QTime=4 
[junit4:junit4]   2> 19288 T3457 C171 P38577 /update {wt=javabin&version=2} {add=[136]} 0 6
[junit4:junit4]   2> 19291 T3441 C174 P17806 /update {wt=javabin&version=2} {add=[137 (1413688550807830528)]} 0 0
[junit4:junit4]   2> 19299 T3493 C172 P56631 REQ /update {update.distrib=FROMLEADER&distrib.from=http://127.0.0.1:54719/solr/collection1/&wt=javabin&version=2} status=0 QTime=1 
[junit4:junit4]   2> 19300 T3473 C173 P54719 REQ /update {distrib.from=http://127.0.0.1:38577/solr/collection1/&update.distrib=TOLEADER&wt=javabin&version=2} status=0 QTime=4 
[junit4:junit4]   2> 19300 T3457 C171 P38577 /update {wt=javabin&version=2} {add=[137]} 0 6
[junit4:junit4]   2> 19303 T3441 C174 P17806 /update {wt=javabin&version=2} {add=[138 (1413688550820413440)]} 0 0
[junit4:junit4]   2> 19309 T3479 C170 P50663 REQ /update {distrib.from=http://127.0.0.1:38577/solr/collection1/&update.distrib=FROMLEADER&wt=javabin&version=2} status=0 QTime=1 
[junit4:junit4]   2> 19309 T3457 C171 P38577 /update {wt=javabin&version=2} {add=[138 (1413688550823559168)]} 0 3
[junit4:junit4]   2> 19313 T3441 C174 P17806 /update {wt=javabin&version=2} {add=[139 (1413688550829850624)]} 0 1
[junit4:junit4]   2> 19320 T3493 C172 P56631 REQ /update {update.distrib=FROMLEADER&distrib.from=http://127.0.0.1:54719/solr/collection1/&wt=javabin&version=2} status=0 QTime=1 
[junit4:junit4]   2> 19321 T3473 C173 P54719 REQ /update {distrib.from=http://127.0.0.1:38577/solr/collection1/&update.distrib=TOLEADER&wt=javabin&version=2} status=0 QTime=4 
[junit4:junit4]   2> 19321 T3457 C171 P38577 /update {wt=javabin&version=2} {add=[139]} 0 6
[junit4:junit4]   2> 19324 T3441 C174 P17806 /update {wt=javabin&version=2} {add=[140 (1413688550842433536)]} 0 0
[junit4:junit4]   2> 19330 T3493 C172 P56631 REQ /update {distrib.from=http://127.0.0.1:54719/solr/collection1/&update.distrib=FROMLEADER&wt=javabin&version=2} status=0 QTime=1 
[junit4:junit4]   2> 19331 T3471 C173 P54719 /update {wt=javabin&version=2} {add=[140 (1413688550845579264)]} 0 4
[junit4:junit4]   2> 19334 T3441 C174 P17806 /update {wt=javabin&version=2} {add=[141 (1413688550852919296)]} 0 0
[junit4:junit4]   2> 19342 T3493 C172 P56631 REQ /update {update.distrib=FROMLEADER&distrib.from=http://127.0.0.1:54719/solr/collection1/&wt=javabin&version=2} status=0 QTime=1 
[junit4:junit4]   2> 19343 T3473 C173 P54719 REQ /update {distrib.from=http://127.0.0.1:38577/solr/collection1/&update.distrib=TOLEADER&wt=javabin&version=2} status=0 QTime=4 
[junit4:junit4]   2> 19343 T3457 C171 P38577 /update {wt=javabin&version=2} {add=[141]} 0 6
[junit4:junit4]   2> 19346 T3441 C174 P17806 /update {wt=javabin&version=2} {add=[142 (1413688550865502208)]} 0 0
[junit4:junit4]   2> 19375 T3493 C172 P56631 REQ /update {update.distrib=FROMLEADER&distrib.from=http://127.0.0.1:54719/solr/collection1/&wt=javabin&version=2} status=0 QTime=15 
[junit4:junit4]   2> 19376 T3473 C173 P54719 REQ /update {distrib.from=http://127.0.0.1:38577/solr/collection1/&update.distrib=TOLEADER&wt=javabin&version=2} status=0 QTime=25 
[junit4:junit4]   2> 19376 T3457 C171 P38577 /update {wt=javabin&version=2} {add=[142]} 0 27
[junit4:junit4]   2> 19386 T3441 C174 P17806 /update {wt=javabin&version=2} {add=[143 (1413688550900105216)]} 0 7
[junit4:junit4]   2> 19395 T3493 C172 P56631 REQ /update {distrib.from=http://127.0.0.1:54719/solr/collection1/&update.distrib=FROMLEADER&wt=javabin&version=2} status=0 QTime=3 
[junit4:junit4]   2> 19396 T3471 C173 P54719 /update {wt=javabin&version=2} {add=[143 (1413688550910590976)]} 0 7
[junit4:junit4]   2> 19399 T3441 C174 P17806 /update {wt=javabin&version=2} {add=[144 (1413688550920028160)]} 0 1
[junit4:junit4]   2> 19405 T3493 C172 P56631 REQ /update {distrib.from=http://127.0.0.1:54719/solr/collection1/&update.distrib=FROMLEADER&wt=javabin&version=2} status=0 QTime=1 
[junit4:junit4]   2> 19406 T3471 C173 P54719 /update {wt=javabin&version=2} {add=[144 (1413688550924222464)]} 0 4
[junit4:junit4]   2> 19408 T3441 C174 P17806 /update {wt=javabin&version=2} {add=[145 (1413688550930513920)]} 0 0
[junit4:junit4]   2> 19416 T3493 C172 P56631 REQ /update {update.distrib=FROMLEADER&distrib.from=http://127.0.0.1:54719/solr/collection1/&wt=javabin&version=2} status=0 QTime=1 
[junit4:junit4]   2> 19417 T3473 C173 P54719 REQ /update {distrib.from=http://127.0.0.1:38577/solr/collection1/&update.distrib=TOLEADER&wt=javabin&version=2} status=0 QTime=4 
[junit4:junit4]   2> 19417 T3457 C171 P38577 /update {wt=javabin&version=2} {add=[145]} 0 6
[junit4:junit4]   2> 19420 T3441 C174 P17806 /update {wt=javabin&version=2} {add=[146 (1413688550943096832)]} 0 0
[junit4:junit4]   2> 19445 T3479 C170 P50663 REQ /update {update.distrib=FROMLEADER&distrib.from=http://127.0.0.1:38577/solr/collection1/&wt=javabin&version=2} status=0 QTime=10 
[junit4:junit4]   2> 19446 T3460 C171 P38577 REQ /update {distrib.from=http://127.0.0.1:54719/solr/collection1/&update.distrib=TOLEADER&wt=javabin&version=2} status=0 QTime=21 
[junit4:junit4]   2> 19446 T3471 C173 P54719 /update {wt=javabin&version=2} {add=[146]} 0 23
[junit4:junit4]   2> 19449 T3441 C174 P17806 /update {wt=javabin&version=2} {add=[147 (1413688550973505536)]} 0 0
[junit4:junit4]   2> 19455 T3493 C172 P56631 REQ /update {distrib.from=http://127.0.0.1:54719/solr/collection1/&update.distrib=FROMLEADER&wt=javabin&version=2} status=0 QTime=1 
[junit4:junit4]   2> 19455 T3471 C173 P54719 /update {wt=javabin&version=2} {add=[147 (1413688550976651264)]} 0 3
[junit4:junit4]   2> 19458 T3441 C174 P17806 /update {wt=javabin&version=2} {add=[148 (1413688550982942720)]} 0 0
[junit4:junit4]   2> 19468 T3479 C170 P50663 REQ /update {update.distrib=FROMLEADER&distrib.from=http://127.0.0.1:38577/solr/collection1/&wt=javabin&version=2} status=0 QTime=2 
[junit4:junit4]   2> 19468 T3460 C171 P38577 REQ /update {distrib.from=http://127.0.0.1:54719/solr/collection1/&update.distrib=TOLEADER&wt=javabin&version=2} status=0 QTime=5 
[junit4:junit4]   2> 19469 T3471 C173 P54719 /update {wt=javabin&version=2} {add=[148]} 0 8
[junit4:junit4]   2> 19471 T3441 C174 P17806 /update {wt=javabin&version=2} {add=[149 (1413688550996574208)]} 0 0
[junit4:junit4]   2> 19479 T3493 C172 P56631 REQ /update {update.distrib=FROMLEADER&distrib.from=http://127.0.0.1:54719/solr/collection1/&wt=javabin&version=2} status=0 QTime=1 
[junit4:junit4]   2> 19479 T3473 C173 P54719 REQ /update {distrib.from=http://127.0.0.1:38577/solr/collection1/&update.distrib=TOLEADER&wt=javabin&version=2} status=0 QTime=3 
[junit4:junit4]   2> 19480 T3457 C171 P38577 /update {wt=javabin&version=2} {add=[149]} 0 6
[junit4:junit4]   2> 19480 T3429 oasc.AbstractDistribZkTestBase.waitForRecoveriesToFinish Wait for recoveries to finish - collection: collection1 failOnTimeout:true timeout (sec):3600
[junit4:junit4]   2> 19481 T3429 oascc.ZkStateReader.updateClusterState Updating cloud state from ZooKeeper... 
[junit4:junit4]   2> 19484 T3441 C174 P17806 oasu.DirectUpdateHandler2.commit start commit{flags=0,_version_=0,optimize=false,openSearcher=true,waitSearcher=true,expungeDeletes=false,softCommit=false}
[junit4:junit4]   2> 20440 T3441 C174 P17806 oasc.SolrDeletionPolicy.onCommit SolrDeletionPolicy.onCommit: commits:num=2
[junit4:junit4]   2> 		commit{dir=NRTCachingDirectory(org.apache.lucene.store.NIOFSDirectory@/usr/home/hudson/hudson-slave/workspace/Lucene-Solr-NightlyTests-trunk/solr/build/solr-core/test/J1/org.apache.solr.cloud.BasicDistributedZk2Test-1348198443016/control/data/index lockFactory=org.apache.lucene.store.NativeFSLockFactory@5e60770d; maxCacheMB=48.0 maxMergeSizeMB=4.0),segFN=segments_2,generation=2,filenames=[_0_Block_0.tip, _0_Block_0.pos, _0.fnm, _0_Pulsing40_0.tim, _0_Block_0.doc, _0_Block_0.tim, _0_nrm.cfs, _0_Pulsing40_1.prx, _0_Pulsing40_0.prx, _0_Direct_0.frq, _0_Pulsing40_0.frq, _0_Pulsing40_1.frq, _0_Pulsing40_1.tip, _0_Pulsing40_1.tim, _0_nrm.cfe, _0_Pulsing40_0.tip, segments_2, _0_Direct_0.tip, _0.fdx, _0_Direct_0.prx, _0.si, _0_Direct_0.tim, _0.fdt]
[junit4:junit4]   2> 		commit{dir=NRTCachingDirectory(org.apache.lucene.store.NIOFSDirectory@/usr/home/hudson/hudson-slave/workspace/Lucene-Solr-NightlyTests-trunk/solr/build/solr-core/test/J1/org.apache.solr.cloud.BasicDistributedZk2Test-1348198443016/control/data/index lockFactory=org.apache.lucene.store.NativeFSLockFactory@5e60770d; maxCacheMB=48.0 maxMergeSizeMB=4.0),segFN=segments_3,generation=3,filenames=[_5_nrm.cfe, _2_Direct_0.tip, _2_Block_0.pos, _2_Direct_0.tim, _7.si, _6_Direct_0.tip, _6_Direct_0.tim, _3.fdt, _0_Pulsing40_1.prx, _0_Pulsing40_0.frq, _6_Pulsing40_1.tim, _7.fnm, _6_Block_0.pos, _0_Pulsing40_1.tip, _5_Pulsing40_1.tim, _0_Pulsing40_1.tim, _2_Pulsing40_1.frq, _5_Pulsing40_1.tip, _5_Pulsing40_0.tip, _6_Pulsing40_1.tip, _5_Pulsing40_0.tim, _1_Block_0.tip, _1_Block_0.pos, _5_Direct_0.prx, _0_Pulsing40_0.tim, _1_Block_0.tim, _2.fdt, _3_Pulsing40_0.tip, _7.fdx, _7_Pulsing40_1.prx, _2.fdx, _7.fdt, _3_Pulsing40_0.tim, _3_Block_0.pos, _3_Block_0.doc, _1.fdx, _7_Pulsing40_0.frq, _6_Pulsing40_1.prx, _5_nrm.cfs, _1.fdt, _0_Pulsing40_1.frq, _7_Block_0.pos, _3.si, _6.fdt, _2.si, _3_Pulsing40_0.frq, _3_Pulsing40_1.tip, _5_Direct_0.tim, _2_Pulsing40_0.tim, _2_Block_0.tim, _3_Pulsing40_1.tim, _6.fdx, _2_Block_0.tip, _2_Pulsing40_0.tip, _3.fnm, _5_Block_0.tim, _4_Pulsing40_0.prx, _2_nrm.cfe, _5_Pulsing40_0.frq, _0_Pulsing40_0.tip, _2_nrm.cfs, _5_Direct_0.tip, _5_Block_0.doc, _4_Block_0.pos, _3_Block_0.tip, _4_Block_0.tip, _1_Direct_0.prx, _6_Direct_0.prx, _2.fnm, _7_Pulsing40_0.tim, _3.fdx, _4_Pulsing40_0.tip, _4_Pulsing40_0.tim, _5_Pulsing40_0.prx, _1.si, _6.si, _6.fnm, _0_Direct_0.tip, _0_Direct_0.prx, _0_Direct_0.tim, _7_Pulsing40_0.tip, _5_Pulsing40_1.prx, _1_Direct_0.frq, _3_nrm.cfe, _0_Block_0.tip, _3_Direct_0.frq, _5.fdt, _1_Pulsing40_0.tip, _6_Pulsing40_0.frq, _0_Block_0.tim, _2_Pulsing40_1.prx, _1_Pulsing40_0.tim, _4_Pulsing40_1.prx, _7_Pulsing40_1.frq, _7_Block_0.tim, _4.fnm, _4_nrm.cfe, _1_Pulsing40_1.tip, _7_Block_0.tip, _0_Pulsing40_0.prx, _7_Pulsing40_0.prx, _1.fnm, _1_Pulsing40_1.tim, _4.fdx, _1_Pulsing40_0.frq, _3_Block_0.tim, _4_Direct_0.frq, _6_Pulsing40_0.tim, _1_Pulsing40_0.prx, _7_Direct_0.tim, _6_Pulsing40_0.tip, _1_Direct_0.tim, _3_Direct_0.prx, _7_Direct_0.tip, _1_Block_0.doc, _1_Direct_0.tip, _2_Pulsing40_0.prx, _3_Direct_0.tip, _0.fnm, _2_Pulsing40_1.tim, _4_Block_0.tim, _2_Pulsing40_1.tip, _4_Pulsing40_1.tip, _4_Pulsing40_1.tim, _6_Block_0.doc, _4_Direct_0.tim, _5_Direct_0.frq, _0_Direct_0.frq, _2_Pulsing40_0.frq, _4_Pulsing40_1.frq, _5.si, _3_nrm.cfs, _1_Pulsing40_1.frq, _6_Pulsing40_0.prx, _4_Direct_0.prx, _7_Direct_0.frq, _4_nrm.cfs, _3_Pulsing40_1.prx, _4_Direct_0.tip, _5_Block_0.tip, _3_Direct_0.tim, _7_Block_0.doc, _0_Block_0.pos, _4_Block_0.doc, _6_Pulsing40_1.frq, _6_nrm.cfs, _7_nrm.cfs, _5_Pulsing40_1.frq, _5_Block_0.pos, _0.si, _1_Pulsing40_1.prx, _1_nrm.cfs, _5.fnm, _0_Block_0.doc, _7_nrm.cfe, _6_nrm.cfe, _4.si, _4.fdt, _0_nrm.cfs, _1_nrm.cfe, _2_Direct_0.prx, _4_Pulsing40_0.frq, _3_Pulsing40_0.prx, _7_Direct_0.prx, _3_Pulsing40_1.frq, _7_Pulsing40_1.tim, _6_Block_0.tip, _0_nrm.cfe, _5.fdx, _7_Pulsing40_1.tip, _0.fdx, _2_Direct_0.frq, _6_Block_0.tim, _2_Block_0.doc, _6_Direct_0.frq, segments_3, _0.fdt]
[junit4:junit4]   2> 20441 T3441 C174 P17806 oasc.SolrDeletionPolicy.updateCommits newest commit = 3
[junit4:junit4]   2> 20551 T3441 C174 P17806 oass.SolrIndexSearcher.<init> Opening Searcher@56528fe3 main
[junit4:junit4]   2> 20552 T3441 C174 P17806 oasu.DirectUpdateHandler2.commit end_commit_flush
[junit4:junit4]   2> 20554 T3452 oasc.SolrCore.registerSearcher [collection1] Registered new searcher Searcher@56528fe3 main{StandardDirectoryReader(segments_3:17 _0(5.0):C1 _1(5.0):C10 _2(5.0):C10 _3(5.0):C10 _4(5.0):C10 _5(5.0):C10 _6(5.0):C10 _7(5.0):C6)}
[junit4:junit4]   2> 20555 T3441 C174 P17806 /update {waitSearcher=true&wt=javabin&commit=true&softCommit=false&version=2} {commit=} 0 1071
[junit4:junit4]   2> 20557 T3457 C171 P38577 oasu.DirectUpdateHandler2.commit start commit{flags=0,_version_=0,optimize=false,openSearcher=true,waitSearcher=true,expungeDeletes=false,softCommit=false}
[junit4:junit4]   2> 20946 T3457 C171 P38577 oasc.SolrDeletionPolicy.onCommit SolrDeletionPolicy.onCommit: commits:num=2
[junit4:junit4]   2> 		commi

[...truncated too long message...]

4/index does not exist
[junit4:junit4]   2> 	at org.apache.commons.io.FileUtils.sizeOfDirectory(FileUtils.java:2074)
[junit4:junit4]   2> 	at org.apache.solr.handler.ReplicationHandler.getIndexSize(ReplicationHandler.java:477)
[junit4:junit4]   2> 	at org.apache.solr.handler.ReplicationHandler.getStatistics(ReplicationHandler.java:525)
[junit4:junit4]   2> 	at org.apache.solr.core.RequestHandlers$LazyRequestHandlerWrapper.getStatistics(RequestHandlers.java:310)
[junit4:junit4]   2> 	at org.apache.solr.core.JmxMonitoredMap$SolrDynamicMBean.getMBeanInfo(JmxMonitoredMap.java:231)
[junit4:junit4]   2> 	at com.sun.jmx.interceptor.DefaultMBeanServerInterceptor.getClassName(DefaultMBeanServerInterceptor.java:1824)
[junit4:junit4]   2> 	at com.sun.jmx.interceptor.DefaultMBeanServerInterceptor.safeGetClassName(DefaultMBeanServerInterceptor.java:1661)
[junit4:junit4]   2> 	at com.sun.jmx.interceptor.DefaultMBeanServerInterceptor.checkMBeanPermission(DefaultMBeanServerInterceptor.java:1833)
[junit4:junit4]   2> 	at com.sun.jmx.interceptor.DefaultMBeanServerInterceptor.exclusiveUnregisterMBean(DefaultMBeanServerInterceptor.java:436)
[junit4:junit4]   2> 	at com.sun.jmx.interceptor.DefaultMBeanServerInterceptor.unregisterMBean(DefaultMBeanServerInterceptor.java:421)
[junit4:junit4]   2> 	at com.sun.jmx.mbeanserver.JmxMBeanServer.unregisterMBean(JmxMBeanServer.java:540)
[junit4:junit4]   2> 	at org.apache.solr.core.JmxMonitoredMap.unregister(JmxMonitoredMap.java:175)
[junit4:junit4]   2> 	at org.apache.solr.core.JmxMonitoredMap.clear(JmxMonitoredMap.java:116)
[junit4:junit4]   2> 	at org.apache.solr.core.SolrCore.close(SolrCore.java:864)
[junit4:junit4]   2> 	at org.apache.solr.cloud.ShardLeaderElectionContext.runLeaderProcess(ElectionContext.java:213)
[junit4:junit4]   2> 	at org.apache.solr.cloud.LeaderElector.runIamLeaderProcess(LeaderElector.java:158)
[junit4:junit4]   2> 	at org.apache.solr.cloud.LeaderElector.checkIfIamLeader(LeaderElector.java:102)
[junit4:junit4]   2> 	at org.apache.solr.cloud.LeaderElector.access$000(LeaderElector.java:56)
[junit4:junit4]   2> 	at org.apache.solr.cloud.LeaderElector$1.process(LeaderElector.java:131)
[junit4:junit4]   2> 	at org.apache.zookeeper.ClientCnxn$EventThread.processEvent(ClientCnxn.java:526)
[junit4:junit4]   2> 	at org.apache.zookeeper.ClientCnxn$EventThread.run(ClientCnxn.java:502)
[junit4:junit4]   2> 
[junit4:junit4]   2> 312096 T3501 oasc.SolrCore.closeSearcher [collection1] Closing main searcher on request.
[junit4:junit4]   2> 312359 T3501 oasu.DirectUpdateHandler2.close closing DirectUpdateHandler2{commits=5,autocommits=0,soft autocommits=0,optimizes=0,rollbacks=0,expungeDeletes=0,docsPending=0,adds=0,deletesById=0,deletesByQuery=0,errors=0,cumulative_adds=35,cumulative_deletesById=0,cumulative_deletesByQuery=0,cumulative_errors=0}
[junit4:junit4]   2> 312359 T3501 oasu.DefaultSolrCoreState.decref SolrCoreState ref count has reached 0 - closing IndexWriter
[junit4:junit4]   2> 312394 T3501 oasu.DefaultSolrCoreState.decref Closing SolrCoreState - canceling any ongoing recovery
[junit4:junit4]   2> 312394 T3501 oascc.ZkStateReader$3.process Updating live nodes
[junit4:junit4]   2> 312394 T3501 oascc.ZkStateReader$3.process WARNING ZooKeeper watch triggered, but Solr cannot talk to ZK
[junit4:junit4]   2> 312395 T3501 oascc.ZkStateReader$2.process A cluster state change has occurred - updating...
[junit4:junit4]   2> 312395 T3501 oascc.ZkStateReader$2.process WARNING ZooKeeper watch triggered, but Solr cannot talk to ZK
[junit4:junit4]   2> 312395 T3501 oascc.ConnectionManager.process Watcher org.apache.solr.common.cloud.ConnectionManager@31a33116 name:ZooKeeperConnection Watcher:127.0.0.1:25019/solr got event WatchedEvent state:Disconnected type:None path:null path:null type:None
[junit4:junit4]   2> 312395 T3501 oascc.ConnectionManager.process Client->ZooKeeper status change trigger but we are already closed
[junit4:junit4]   2> 312395 T3501 oaz.ClientCnxn$EventThread.run EventThread shut down
[junit4:junit4]   2> NOTE: test params are: codec=Lucene40: {n_f1=PostingsFormat(name=Direct), foo_b=Block(blocksize=128), foo_d=Pulsing40(freqCutoff=12 minBlockSize=78 maxBlockSize=191), foo_f=Block(blocksize=128), n_tl1=PostingsFormat(name=Direct), n_d1=Pulsing40(freqCutoff=5 minBlockSize=78 maxBlockSize=191), rnd_b=Pulsing40(freqCutoff=12 minBlockSize=78 maxBlockSize=191), intDefault=Pulsing40(freqCutoff=5 minBlockSize=78 maxBlockSize=191), n_td1=PostingsFormat(name=Direct), id=Pulsing40(freqCutoff=12 minBlockSize=78 maxBlockSize=191), timestamp=Pulsing40(freqCutoff=5 minBlockSize=78 maxBlockSize=191), range_facet_sl=Block(blocksize=128), range_facet_si=PostingsFormat(name=Direct), oddField_s=Block(blocksize=128), multiDefault=PostingsFormat(name=Direct), n_tf1=Pulsing40(freqCutoff=5 minBlockSize=78 maxBlockSize=191), n_dt1=PostingsFormat(name=Direct), n_ti1=Pulsing40(freqCutoff=12 minBlockSize=78 maxBlockSize=191), range_facet_l=Pulsing40(freqCutoff=5 minBlockSize=78 maxBlockSize=191), text=Block(blocksize=128), _version_=Pulsing40(freqCutoff=5 minBlockSize=78 maxBlockSize=191), SubjectTerms_mfacet=Pulsing40(freqCutoff=5 minBlockSize=78 maxBlockSize=191), a_t=Pulsing40(freqCutoff=5 minBlockSize=78 maxBlockSize=191), n_tdt1=Pulsing40(freqCutoff=5 minBlockSize=78 maxBlockSize=191), other_tl1=Pulsing40(freqCutoff=5 minBlockSize=78 maxBlockSize=191), n_l1=Pulsing40(freqCutoff=5 minBlockSize=78 maxBlockSize=191), a_si=PostingsFormat(name=Direct)}, sim=RandomSimilarityProvider(queryNorm=true,coord=yes): {}, locale=no_NO, timezone=Europe/Podgorica
[junit4:junit4]   2> NOTE: FreeBSD 9.0-RELEASE amd64/Sun Microsystems Inc. 1.6.0_32 (64-bit)/cpus=16,threads=2,free=125248200,total=193855488
[junit4:junit4]   2> NOTE: All tests run in this JVM: [TestFunctionQuery, TestCSVLoader, HighlighterTest, TermVectorComponentDistributedTest, QueryEqualityTest, TestUtils, TestRealTimeGet, ShowFileRequestHandlerTest, SyncSliceTest, TestHashPartitioner, TestTrie, FieldMutatingUpdateProcessorTest, BadIndexSchemaTest, PingRequestHandlerTest, PrimitiveFieldTypeTest, TestDistributedSearch, UpdateParamsTest, RecoveryZkTest, TestPropInject, XsltUpdateRequestHandlerTest, TestArbitraryIndexDir, LeaderElectionTest, TestSolrCoreProperties, ZkNodePropsTest, IndexSchemaRuntimeFieldTest, TestSurroundQueryParser, OutputWriterTest, TestPhraseSuggestions, BasicFunctionalityTest, SuggesterTest, TestBM25SimilarityFactory, TestValueSourceCache, TestCharFilters, QueryParsingTest, ClusterStateUpdateTest, LukeRequestHandlerTest, TestUpdate, XmlUpdateRequestHandlerTest, IndexReaderFactoryTest, LegacyHTMLStripCharFilterTest, TestWriterPerf, TestSolrDeletionPolicy2, SolrCoreTest, ZkSolrClientTest, DocumentAnalysisRequestHandlerTest, TestSolrXMLSerializer, SoftAutoCommitTest, TermVectorComponentTest, SpellingQueryConverterTest, FullSolrCloudDistribCmdsTest, TestQueryUtils, TestOmitPositions, TestLRUCache, BasicZkTest, TestCSVResponseWriter, SpellCheckCollatorTest, AutoCommitTest, WordBreakSolrSpellCheckerTest, DistributedTermsComponentTest, StatsComponentTest, TestRecovery, TestRangeQuery, DirectUpdateHandlerTest, TestMultiCoreConfBootstrap, SimpleFacetsTest, TestSort, TestGroupingSearch, DirectSolrSpellCheckerTest, FileBasedSpellCheckerTest, ConvertedLegacyTest, PeerSyncTest, SortByFunctionTest, SignatureUpdateProcessorFactoryTest, TestJmxIntegration, TestIndexSearcher, DirectSolrConnectionTest, TestRemoteStreaming, CacheHeaderTest, PolyFieldTest, SpatialFilterTest, MoreLikeThisHandlerTest, DocumentBuilderTest, MBeansHandlerTest, DistributedQueryElevationComponentTest, DisMaxRequestHandlerTest, IndexSchemaTest, TermsComponentTest, DistanceFunctionTest, SolrInfoMBeanTest, StandardRequestHandlerTest, TestQueryTypes, FieldAnalysisRequestHandlerTest, JsonLoaderTest, DirectUpdateHandlerOptimizeTest, TestReversedWildcardFilterFactory, DebugComponentTest, ReturnFieldsTest, RequestHandlersTest, RequiredFieldsTest, SuggesterFSTTest, CopyFieldTest, SuggesterTSTTest, SolrCmdDistributorTest, TestSearchPerf, TestFoldingMultitermQuery, SolrCoreCheckLockOnStartupTest, TestSolrDeletionPolicy1, NoCacheHeaderTest, BadComponentTest, TestBinaryField, HighlighterConfigTest, SOLR749Test, TestPropInjectDefaults, DefaultValueUpdateProcessorTest, TestMergePolicyConfig, TestXIncludeConfig, TestDocSet, TestQuerySenderListener, TestCollationField, SolrIndexConfigTest, TestQuerySenderNoQuery, NumericFieldsTest, TestNumberUtils, MultiTermTest, TestConfig, EchoParamsTest, TestPluginEnable, TestDFRSimilarityFactory, TestCodecSupport, TestDefaultSimilarityFactory, TimeZoneUtilsTest, URLClassifyProcessorTest, PrimUtilsTest, OpenExchangeRatesOrgProviderTest, FileUtilsTest, TestSuggestSpellingConverter, TestBadConfig, DOMUtilTest, UUIDFieldTest, RAMDirectoryFactoryTest, PreAnalyzedFieldTest, AnalysisAfterCoreReloadTest, TestDocumentBuilder, PathHierarchyTokenizerFactoryTest, BasicDistributedZk2Test]
[junit4:junit4] Completed on J1 in 313.33s, 1 test, 1 failure <<< FAILURES!

[...truncated 25 lines...]
BUILD FAILED
/usr/home/hudson/hudson-slave/workspace/Lucene-Solr-NightlyTests-trunk/build.xml:32: The following error occurred while executing this line:
/usr/home/hudson/hudson-slave/workspace/Lucene-Solr-NightlyTests-trunk/solr/build.xml:179: The following error occurred while executing this line:
/usr/home/hudson/hudson-slave/workspace/Lucene-Solr-NightlyTests-trunk/lucene/module-build.xml:63: The following error occurred while executing this line:
/usr/home/hudson/hudson-slave/workspace/Lucene-Solr-NightlyTests-trunk/lucene/common-build.xml:1140: The following error occurred while executing this line:
/usr/home/hudson/hudson-slave/workspace/Lucene-Solr-NightlyTests-trunk/lucene/common-build.xml:813: There were test failures: 230 suites, 950 tests, 1 failure, 7 ignored (2 assumptions)

Total time: 89 minutes 34 seconds
Build step 'Invoke Ant' marked build as failure
Recording test results
Email was triggered for: Failure
Sending email for trigger: Failure



Mime
View raw message