lucene-dev mailing list archives

Site index · List index
Message view « Date » · « Thread »
Top « Date » · « Thread »
From Apache Jenkins Server <jenk...@builds.apache.org>
Subject [JENKINS] Lucene-Solr-Tests-trunk-Java6 - Build # 15232 - Still Failing
Date Sat, 15 Sep 2012 00:01:42 GMT
Build: https://builds.apache.org/job/Lucene-Solr-Tests-trunk-Java6/15232/

2 tests failed.
FAILED:  org.apache.solr.cloud.SyncSliceTest.testDistribSearch

Error Message:
There are still nodes recoverying

Stack Trace:
java.lang.AssertionError: There are still nodes recoverying
	at __randomizedtesting.SeedInfo.seed([D9D845B2159B7A8B:583ECBAA62C41AB7]:0)
	at org.junit.Assert.fail(Assert.java:93)
	at org.apache.solr.cloud.AbstractDistribZkTestBase.waitForRecoveriesToFinish(AbstractDistribZkTestBase.java:153)
	at org.apache.solr.cloud.AbstractFullDistribZkTestBase.waitForRecoveriesToFinish(AbstractFullDistribZkTestBase.java:555)
	at org.apache.solr.cloud.AbstractFullDistribZkTestBase.waitForThingsToLevelOut(AbstractFullDistribZkTestBase.java:1130)
	at org.apache.solr.cloud.SyncSliceTest.doTest(SyncSliceTest.java:162)
	at org.apache.solr.BaseDistributedSearchTestCase.testDistribSearch(BaseDistributedSearchTestCase.java:691)
	at sun.reflect.NativeMethodAccessorImpl.invoke0(Native Method)
	at sun.reflect.NativeMethodAccessorImpl.invoke(NativeMethodAccessorImpl.java:57)
	at sun.reflect.DelegatingMethodAccessorImpl.invoke(DelegatingMethodAccessorImpl.java:43)
	at java.lang.reflect.Method.invoke(Method.java:616)
	at com.carrotsearch.randomizedtesting.RandomizedRunner.invoke(RandomizedRunner.java:1559)
	at com.carrotsearch.randomizedtesting.RandomizedRunner.access$600(RandomizedRunner.java:79)
	at com.carrotsearch.randomizedtesting.RandomizedRunner$6.evaluate(RandomizedRunner.java:737)
	at com.carrotsearch.randomizedtesting.RandomizedRunner$7.evaluate(RandomizedRunner.java:773)
	at com.carrotsearch.randomizedtesting.RandomizedRunner$8.evaluate(RandomizedRunner.java:787)
	at com.carrotsearch.randomizedtesting.rules.SystemPropertiesRestoreRule$1.evaluate(SystemPropertiesRestoreRule.java:53)
	at org.apache.lucene.util.TestRuleSetupTeardownChained$1.evaluate(TestRuleSetupTeardownChained.java:50)
	at org.apache.lucene.util.TestRuleFieldCacheSanity$1.evaluate(TestRuleFieldCacheSanity.java:51)
	at org.apache.lucene.util.AbstractBeforeAfterRule$1.evaluate(AbstractBeforeAfterRule.java:45)
	at com.carrotsearch.randomizedtesting.rules.SystemPropertiesInvariantRule$1.evaluate(SystemPropertiesInvariantRule.java:55)
	at org.apache.lucene.util.TestRuleThreadAndTestName$1.evaluate(TestRuleThreadAndTestName.java:48)
	at org.apache.lucene.util.TestRuleIgnoreAfterMaxFailures$1.evaluate(TestRuleIgnoreAfterMaxFailures.java:70)
	at org.apache.lucene.util.TestRuleMarkFailure$1.evaluate(TestRuleMarkFailure.java:48)
	at com.carrotsearch.randomizedtesting.rules.StatementAdapter.evaluate(StatementAdapter.java:36)
	at com.carrotsearch.randomizedtesting.ThreadLeakControl$StatementRunner.run(ThreadLeakControl.java:358)
	at com.carrotsearch.randomizedtesting.ThreadLeakControl.forkTimeoutingTask(ThreadLeakControl.java:782)
	at com.carrotsearch.randomizedtesting.ThreadLeakControl$3.evaluate(ThreadLeakControl.java:442)
	at com.carrotsearch.randomizedtesting.RandomizedRunner.runSingleTest(RandomizedRunner.java:746)
	at com.carrotsearch.randomizedtesting.RandomizedRunner$3.evaluate(RandomizedRunner.java:648)
	at com.carrotsearch.randomizedtesting.RandomizedRunner$4.evaluate(RandomizedRunner.java:682)
	at com.carrotsearch.randomizedtesting.RandomizedRunner$5.evaluate(RandomizedRunner.java:693)
	at com.carrotsearch.randomizedtesting.rules.StatementAdapter.evaluate(StatementAdapter.java:36)
	at com.carrotsearch.randomizedtesting.rules.SystemPropertiesRestoreRule$1.evaluate(SystemPropertiesRestoreRule.java:53)
	at org.apache.lucene.util.AbstractBeforeAfterRule$1.evaluate(AbstractBeforeAfterRule.java:45)
	at org.apache.lucene.util.TestRuleStoreClassName$1.evaluate(TestRuleStoreClassName.java:42)
	at com.carrotsearch.randomizedtesting.rules.SystemPropertiesInvariantRule$1.evaluate(SystemPropertiesInvariantRule.java:55)
	at com.carrotsearch.randomizedtesting.rules.NoShadowingOrOverridesOnMethodsRule$1.evaluate(NoShadowingOrOverridesOnMethodsRule.java:39)
	at com.carrotsearch.randomizedtesting.rules.NoShadowingOrOverridesOnMethodsRule$1.evaluate(NoShadowingOrOverridesOnMethodsRule.java:39)
	at com.carrotsearch.randomizedtesting.rules.StatementAdapter.evaluate(StatementAdapter.java:36)
	at org.apache.lucene.util.TestRuleAssertionsRequired$1.evaluate(TestRuleAssertionsRequired.java:43)
	at org.apache.lucene.util.TestRuleMarkFailure$1.evaluate(TestRuleMarkFailure.java:48)
	at org.apache.lucene.util.TestRuleIgnoreAfterMaxFailures$1.evaluate(TestRuleIgnoreAfterMaxFailures.java:70)
	at org.apache.lucene.util.TestRuleIgnoreTestSuites$1.evaluate(TestRuleIgnoreTestSuites.java:55)
	at com.carrotsearch.randomizedtesting.rules.StatementAdapter.evaluate(StatementAdapter.java:36)
	at com.carrotsearch.randomizedtesting.ThreadLeakControl$StatementRunner.run(ThreadLeakControl.java:358)
	at java.lang.Thread.run(Thread.java:679)


FAILED:  org.apache.solr.update.SolrCmdDistributorTest.testDistribSearch

Error Message:


Stack Trace:
java.util.concurrent.RejectedExecutionException
	at __randomizedtesting.SeedInfo.seed([D9D845B2159B7A8B:583ECBAA62C41AB7]:0)
	at java.util.concurrent.ThreadPoolExecutor$AbortPolicy.rejectedExecution(ThreadPoolExecutor.java:1956)
	at java.util.concurrent.ThreadPoolExecutor.reject(ThreadPoolExecutor.java:816)
	at java.util.concurrent.ThreadPoolExecutor.execute(ThreadPoolExecutor.java:1337)
	at java.util.concurrent.ExecutorCompletionService.submit(ExecutorCompletionService.java:181)
	at org.apache.solr.update.SolrCmdDistributor.submit(SolrCmdDistributor.java:356)
	at org.apache.solr.update.SolrCmdDistributor.submit(SolrCmdDistributor.java:301)
	at org.apache.solr.update.SolrCmdDistributor.flushAdds(SolrCmdDistributor.java:233)
	at org.apache.solr.update.SolrCmdDistributor.distribAdd(SolrCmdDistributor.java:147)
	at org.apache.solr.update.SolrCmdDistributorTest.doTest(SolrCmdDistributorTest.java:204)
	at org.apache.solr.BaseDistributedSearchTestCase.testDistribSearch(BaseDistributedSearchTestCase.java:691)
	at sun.reflect.NativeMethodAccessorImpl.invoke0(Native Method)
	at sun.reflect.NativeMethodAccessorImpl.invoke(NativeMethodAccessorImpl.java:57)
	at sun.reflect.DelegatingMethodAccessorImpl.invoke(DelegatingMethodAccessorImpl.java:43)
	at java.lang.reflect.Method.invoke(Method.java:616)
	at com.carrotsearch.randomizedtesting.RandomizedRunner.invoke(RandomizedRunner.java:1559)
	at com.carrotsearch.randomizedtesting.RandomizedRunner.access$600(RandomizedRunner.java:79)
	at com.carrotsearch.randomizedtesting.RandomizedRunner$6.evaluate(RandomizedRunner.java:737)
	at com.carrotsearch.randomizedtesting.RandomizedRunner$7.evaluate(RandomizedRunner.java:773)
	at com.carrotsearch.randomizedtesting.RandomizedRunner$8.evaluate(RandomizedRunner.java:787)
	at com.carrotsearch.randomizedtesting.rules.SystemPropertiesRestoreRule$1.evaluate(SystemPropertiesRestoreRule.java:53)
	at org.apache.lucene.util.TestRuleSetupTeardownChained$1.evaluate(TestRuleSetupTeardownChained.java:50)
	at org.apache.lucene.util.TestRuleFieldCacheSanity$1.evaluate(TestRuleFieldCacheSanity.java:51)
	at org.apache.lucene.util.AbstractBeforeAfterRule$1.evaluate(AbstractBeforeAfterRule.java:45)
	at com.carrotsearch.randomizedtesting.rules.SystemPropertiesInvariantRule$1.evaluate(SystemPropertiesInvariantRule.java:55)
	at org.apache.lucene.util.TestRuleThreadAndTestName$1.evaluate(TestRuleThreadAndTestName.java:48)
	at org.apache.lucene.util.TestRuleIgnoreAfterMaxFailures$1.evaluate(TestRuleIgnoreAfterMaxFailures.java:70)
	at org.apache.lucene.util.TestRuleMarkFailure$1.evaluate(TestRuleMarkFailure.java:48)
	at com.carrotsearch.randomizedtesting.rules.StatementAdapter.evaluate(StatementAdapter.java:36)
	at com.carrotsearch.randomizedtesting.ThreadLeakControl$StatementRunner.run(ThreadLeakControl.java:358)
	at com.carrotsearch.randomizedtesting.ThreadLeakControl.forkTimeoutingTask(ThreadLeakControl.java:782)
	at com.carrotsearch.randomizedtesting.ThreadLeakControl$3.evaluate(ThreadLeakControl.java:442)
	at com.carrotsearch.randomizedtesting.RandomizedRunner.runSingleTest(RandomizedRunner.java:746)
	at com.carrotsearch.randomizedtesting.RandomizedRunner$3.evaluate(RandomizedRunner.java:648)
	at com.carrotsearch.randomizedtesting.RandomizedRunner$4.evaluate(RandomizedRunner.java:682)
	at com.carrotsearch.randomizedtesting.RandomizedRunner$5.evaluate(RandomizedRunner.java:693)
	at com.carrotsearch.randomizedtesting.rules.StatementAdapter.evaluate(StatementAdapter.java:36)
	at com.carrotsearch.randomizedtesting.rules.SystemPropertiesRestoreRule$1.evaluate(SystemPropertiesRestoreRule.java:53)
	at org.apache.lucene.util.AbstractBeforeAfterRule$1.evaluate(AbstractBeforeAfterRule.java:45)
	at org.apache.lucene.util.TestRuleStoreClassName$1.evaluate(TestRuleStoreClassName.java:42)
	at com.carrotsearch.randomizedtesting.rules.SystemPropertiesInvariantRule$1.evaluate(SystemPropertiesInvariantRule.java:55)
	at com.carrotsearch.randomizedtesting.rules.NoShadowingOrOverridesOnMethodsRule$1.evaluate(NoShadowingOrOverridesOnMethodsRule.java:39)
	at com.carrotsearch.randomizedtesting.rules.NoShadowingOrOverridesOnMethodsRule$1.evaluate(NoShadowingOrOverridesOnMethodsRule.java:39)
	at com.carrotsearch.randomizedtesting.rules.StatementAdapter.evaluate(StatementAdapter.java:36)
	at org.apache.lucene.util.TestRuleAssertionsRequired$1.evaluate(TestRuleAssertionsRequired.java:43)
	at org.apache.lucene.util.TestRuleMarkFailure$1.evaluate(TestRuleMarkFailure.java:48)
	at org.apache.lucene.util.TestRuleIgnoreAfterMaxFailures$1.evaluate(TestRuleIgnoreAfterMaxFailures.java:70)
	at org.apache.lucene.util.TestRuleIgnoreTestSuites$1.evaluate(TestRuleIgnoreTestSuites.java:55)
	at com.carrotsearch.randomizedtesting.rules.StatementAdapter.evaluate(StatementAdapter.java:36)
	at com.carrotsearch.randomizedtesting.ThreadLeakControl$StatementRunner.run(ThreadLeakControl.java:358)
	at java.lang.Thread.run(Thread.java:679)




Build Log:
[...truncated 7449 lines...]
[junit4:junit4] Suite: org.apache.solr.update.SolrCmdDistributorTest
[junit4:junit4]   2> 3 T1289 oas.SolrTestCaseJ4.setUp ###Starting testDistribSearch
[junit4:junit4]   2> 5 T1289 oejs.Server.doStart jetty-8.1.2.v20120308
[junit4:junit4]   2> 9 T1289 oejs.AbstractConnector.doStart Started SocketConnector@0.0.0.0:39775
[junit4:junit4]   2> 10 T1289 oasc.SolrResourceLoader.locateSolrHome JNDI not configured for solr (NoInitialContextEx)
[junit4:junit4]   2> 10 T1289 oasc.SolrResourceLoader.locateSolrHome using system property solr.solr.home: /usr/home/hudson/hudson-slave/workspace/Lucene-Solr-Tests-trunk-Java6/solr/build/solr-core/test-files/solr
[junit4:junit4]   2> 11 T1289 oasc.SolrResourceLoader.<init> new SolrResourceLoader for deduced Solr Home: '/usr/home/hudson/hudson-slave/workspace/Lucene-Solr-Tests-trunk-Java6/solr/build/solr-core/test-files/solr/'
[junit4:junit4]   2> 45 T1289 oass.SolrDispatchFilter.init SolrDispatchFilter.init()
[junit4:junit4]   2> 46 T1289 oasc.SolrResourceLoader.locateSolrHome JNDI not configured for solr (NoInitialContextEx)
[junit4:junit4]   2> 46 T1289 oasc.SolrResourceLoader.locateSolrHome using system property solr.solr.home: /usr/home/hudson/hudson-slave/workspace/Lucene-Solr-Tests-trunk-Java6/solr/build/solr-core/test-files/solr
[junit4:junit4]   2> 46 T1289 oasc.CoreContainer$Initializer.initialize looking for solr.xml: /usr/home/hudson/hudson-slave/workspace/Lucene-Solr-Tests-trunk-Java6/solr/build/solr-core/test-files/solr/solr.xml
[junit4:junit4]   2> 47 T1289 oasc.CoreContainer.<init> New CoreContainer 1901068626
[junit4:junit4]   2> 48 T1289 oasc.CoreContainer.load Loading CoreContainer using Solr Home: '/usr/home/hudson/hudson-slave/workspace/Lucene-Solr-Tests-trunk-Java6/solr/build/solr-core/test-files/solr/'
[junit4:junit4]   2> 48 T1289 oasc.SolrResourceLoader.<init> new SolrResourceLoader for directory: '/usr/home/hudson/hudson-slave/workspace/Lucene-Solr-Tests-trunk-Java6/solr/build/solr-core/test-files/solr/'
[junit4:junit4]   2> 72 T1289 oasc.CoreContainer.load Registering Log Listener
[junit4:junit4]   2> 90 T1289 oasc.CoreContainer.create Creating SolrCore 'collection1' using instanceDir: /usr/home/hudson/hudson-slave/workspace/Lucene-Solr-Tests-trunk-Java6/solr/build/solr-core/test-files/solr/collection1
[junit4:junit4]   2> 91 T1289 oasc.SolrResourceLoader.<init> new SolrResourceLoader for directory: '/usr/home/hudson/hudson-slave/workspace/Lucene-Solr-Tests-trunk-Java6/solr/build/solr-core/test-files/solr/collection1/'
[junit4:junit4]   2> 92 T1289 oasc.SolrResourceLoader.replaceClassLoader Adding 'file:/usr/home/hudson/hudson-slave/workspace/Lucene-Solr-Tests-trunk-Java6/solr/build/solr-core/test-files/solr/collection1/lib/classes/' to classloader
[junit4:junit4]   2> 93 T1289 oasc.SolrResourceLoader.replaceClassLoader Adding 'file:/usr/home/hudson/hudson-slave/workspace/Lucene-Solr-Tests-trunk-Java6/solr/build/solr-core/test-files/solr/collection1/lib/README' to classloader
[junit4:junit4]   2> 136 T1289 oasc.SolrConfig.<init> Using Lucene MatchVersion: LUCENE_50
[junit4:junit4]   2> 194 T1289 oasc.SolrConfig.<init> Loaded SolrConfig: solrconfig-tlog.xml
[junit4:junit4]   2> 195 T1289 oass.IndexSchema.readSchema Reading Solr Schema
[junit4:junit4]   2> 201 T1289 oass.IndexSchema.readSchema Schema name=test
[junit4:junit4]   2> 773 T1289 oass.OpenExchangeRatesOrgProvider.init Initialized with rates=open-exchange-rates.json, refreshInterval=1440.
[junit4:junit4]   2> 782 T1289 oass.IndexSchema.readSchema default search field in schema is text
[junit4:junit4]   2> 785 T1289 oass.IndexSchema.readSchema unique key field: id
[junit4:junit4]   2> 833 T1289 oass.FileExchangeRateProvider.reload Reloading exchange rates from file currency.xml
[junit4:junit4]   2> 837 T1289 oass.FileExchangeRateProvider.reload Reloading exchange rates from file currency.xml
[junit4:junit4]   2> 840 T1289 oass.OpenExchangeRatesOrgProvider.reload Reloading exchange rates from open-exchange-rates.json
[junit4:junit4]   2> 840 T1289 oass.OpenExchangeRatesOrgProvider.reload Reloading exchange rates from open-exchange-rates.json
[junit4:junit4]   2> 841 T1289 oasc.SolrCore.<init> [collection1] Opening new SolrCore at /usr/home/hudson/hudson-slave/workspace/Lucene-Solr-Tests-trunk-Java6/solr/build/solr-core/test-files/solr/collection1/, dataDir=./org.apache.solr.update.SolrCmdDistributorTest-1347667133305/control/data/
[junit4:junit4]   2> 841 T1289 oasc.SolrCore.<init> JMX monitoring not detected for core: collection1
[junit4:junit4]   2> 842 T1289 oasc.SolrCore.getNewIndexDir WARNING New index directory detected: old=null new=./org.apache.solr.update.SolrCmdDistributorTest-1347667133305/control/data/index/
[junit4:junit4]   2> 843 T1289 oasc.SolrCore.initIndex WARNING [collection1] Solr index directory './org.apache.solr.update.SolrCmdDistributorTest-1347667133305/control/data/index' doesn't exist. Creating new index...
[junit4:junit4]   2> 844 T1289 oasc.CachingDirectoryFactory.get return new directory for /usr/home/hudson/hudson-slave/workspace/Lucene-Solr-Tests-trunk-Java6/solr/build/solr-core/test/J0/./org.apache.solr.update.SolrCmdDistributorTest-1347667133305/control/data/index forceNew:false
[junit4:junit4]   2> 846 T1289 oasc.SolrDeletionPolicy.onCommit SolrDeletionPolicy.onCommit: commits:num=1
[junit4:junit4]   2> 		commit{dir=MockDirWrapper(org.apache.lucene.store.RAMDirectory@73f2153f lockFactory=org.apache.lucene.store.NativeFSLockFactory@41a09716),segFN=segments_1,generation=1,filenames=[segments_1]
[junit4:junit4]   2> 846 T1289 oasc.SolrDeletionPolicy.updateCommits newest commit = 1
[junit4:junit4]   2> 847 T1289 oasc.RequestHandlers.initHandlersFromConfig created standard: solr.StandardRequestHandler
[junit4:junit4]   2> 847 T1289 oasc.RequestHandlers.initHandlersFromConfig created /get: solr.RealTimeGetHandler
[junit4:junit4]   2> 848 T1289 oasc.RequestHandlers.initHandlersFromConfig created /update: solr.UpdateRequestHandler
[junit4:junit4]   2> 848 T1289 oasc.RequestHandlers.initHandlersFromConfig created /admin/: org.apache.solr.handler.admin.AdminHandlers
[junit4:junit4]   2> 851 T1289 oashl.XMLLoader.init xsltCacheLifetimeSeconds=60
[junit4:junit4]   2> 855 T1289 oass.SolrIndexSearcher.<init> Opening Searcher@68920860 main
[junit4:junit4]   2> 855 T1289 oass.SolrIndexSearcher.getIndexDir WARNING WARNING: Directory impl does not support setting indexDir: org.apache.lucene.store.MockDirectoryWrapper
[junit4:junit4]   2> 856 T1289 oasu.CommitTracker.<init> Hard AutoCommit: disabled
[junit4:junit4]   2> 856 T1289 oasu.CommitTracker.<init> Soft AutoCommit: disabled
[junit4:junit4]   2> 857 T1289 oashc.HttpShardHandlerFactory.getParameter Setting socketTimeout to: 0
[junit4:junit4]   2> 857 T1289 oashc.HttpShardHandlerFactory.getParameter Setting urlScheme to: http://
[junit4:junit4]   2> 857 T1289 oashc.HttpShardHandlerFactory.getParameter Setting connTimeout to: 0
[junit4:junit4]   2> 858 T1289 oashc.HttpShardHandlerFactory.getParameter Setting maxConnectionsPerHost to: 20
[junit4:junit4]   2> 858 T1289 oashc.HttpShardHandlerFactory.getParameter Setting corePoolSize to: 0
[junit4:junit4]   2> 859 T1289 oashc.HttpShardHandlerFactory.getParameter Setting maximumPoolSize to: 2147483647
[junit4:junit4]   2> 859 T1289 oashc.HttpShardHandlerFactory.getParameter Setting maxThreadIdleTime to: 5
[junit4:junit4]   2> 859 T1289 oashc.HttpShardHandlerFactory.getParameter Setting sizeOfQueue to: -1
[junit4:junit4]   2> 859 T1289 oashc.HttpShardHandlerFactory.getParameter Setting fairnessPolicy to: false
[junit4:junit4]   2> 860 T1289 oascsi.HttpClientUtil.createClient Creating new http client, config:maxConnectionsPerHost=20&maxConnections=10000&socketTimeout=0&connTimeout=0&retry=false
[junit4:junit4]   2> 869 T1299 oasc.SolrCore.registerSearcher [collection1] Registered new searcher Searcher@68920860 main{StandardDirectoryReader(segments_1:1)}
[junit4:junit4]   2> 869 T1289 oasc.CoreContainer.register registering core: collection1
[junit4:junit4]   2> 870 T1289 oass.SolrDispatchFilter.init user.dir=/usr/home/hudson/hudson-slave/workspace/Lucene-Solr-Tests-trunk-Java6/solr/build/solr-core/test/J0
[junit4:junit4]   2> 870 T1289 oass.SolrDispatchFilter.init SolrDispatchFilter.init() done
[junit4:junit4]   2> 871 T1289 oascsi.HttpClientUtil.createClient Creating new http client, config:maxConnections=128&maxConnectionsPerHost=32&followRedirects=false
[junit4:junit4]   2> 878 T1289 oejs.Server.doStart jetty-8.1.2.v20120308
[junit4:junit4]   2> 880 T1289 oejs.AbstractConnector.doStart Started SocketConnector@0.0.0.0:29147
[junit4:junit4]   2> 881 T1289 oasc.SolrResourceLoader.locateSolrHome JNDI not configured for solr (NoInitialContextEx)
[junit4:junit4]   2> 881 T1289 oasc.SolrResourceLoader.locateSolrHome using system property solr.solr.home: /usr/home/hudson/hudson-slave/workspace/Lucene-Solr-Tests-trunk-Java6/solr/build/solr-core/test-files/solr
[junit4:junit4]   2> 881 T1289 oasc.SolrResourceLoader.<init> new SolrResourceLoader for deduced Solr Home: '/usr/home/hudson/hudson-slave/workspace/Lucene-Solr-Tests-trunk-Java6/solr/build/solr-core/test-files/solr/'
[junit4:junit4]   2> 905 T1289 oass.SolrDispatchFilter.init SolrDispatchFilter.init()
[junit4:junit4]   2> 905 T1289 oasc.SolrResourceLoader.locateSolrHome JNDI not configured for solr (NoInitialContextEx)
[junit4:junit4]   2> 905 T1289 oasc.SolrResourceLoader.locateSolrHome using system property solr.solr.home: /usr/home/hudson/hudson-slave/workspace/Lucene-Solr-Tests-trunk-Java6/solr/build/solr-core/test-files/solr
[junit4:junit4]   2> 906 T1289 oasc.CoreContainer$Initializer.initialize looking for solr.xml: /usr/home/hudson/hudson-slave/workspace/Lucene-Solr-Tests-trunk-Java6/solr/build/solr-core/test-files/solr/solr.xml
[junit4:junit4]   2> 906 T1289 oasc.CoreContainer.<init> New CoreContainer 531765918
[junit4:junit4]   2> 907 T1289 oasc.CoreContainer.load Loading CoreContainer using Solr Home: '/usr/home/hudson/hudson-slave/workspace/Lucene-Solr-Tests-trunk-Java6/solr/build/solr-core/test-files/solr/'
[junit4:junit4]   2> 907 T1289 oasc.SolrResourceLoader.<init> new SolrResourceLoader for directory: '/usr/home/hudson/hudson-slave/workspace/Lucene-Solr-Tests-trunk-Java6/solr/build/solr-core/test-files/solr/'
[junit4:junit4]   2> 925 T1289 oasc.CoreContainer.load Registering Log Listener
[junit4:junit4]   2> 938 T1289 oasc.CoreContainer.create Creating SolrCore 'collection1' using instanceDir: /usr/home/hudson/hudson-slave/workspace/Lucene-Solr-Tests-trunk-Java6/solr/build/solr-core/test-files/solr/collection1
[junit4:junit4]   2> 939 T1289 oasc.SolrResourceLoader.<init> new SolrResourceLoader for directory: '/usr/home/hudson/hudson-slave/workspace/Lucene-Solr-Tests-trunk-Java6/solr/build/solr-core/test-files/solr/collection1/'
[junit4:junit4]   2> 940 T1289 oasc.SolrResourceLoader.replaceClassLoader Adding 'file:/usr/home/hudson/hudson-slave/workspace/Lucene-Solr-Tests-trunk-Java6/solr/build/solr-core/test-files/solr/collection1/lib/classes/' to classloader
[junit4:junit4]   2> 940 T1289 oasc.SolrResourceLoader.replaceClassLoader Adding 'file:/usr/home/hudson/hudson-slave/workspace/Lucene-Solr-Tests-trunk-Java6/solr/build/solr-core/test-files/solr/collection1/lib/README' to classloader
[junit4:junit4]   2> 969 T1289 oasc.SolrConfig.<init> Using Lucene MatchVersion: LUCENE_50
[junit4:junit4]   2> 1004 T1289 oasc.SolrConfig.<init> Loaded SolrConfig: solrconfig-tlog.xml
[junit4:junit4]   2> 1005 T1289 oass.IndexSchema.readSchema Reading Solr Schema
[junit4:junit4]   2> 1009 T1289 oass.IndexSchema.readSchema Schema name=test
[junit4:junit4]   2> 1413 T1289 oass.OpenExchangeRatesOrgProvider.init Initialized with rates=open-exchange-rates.json, refreshInterval=1440.
[junit4:junit4]   2> 1422 T1289 oass.IndexSchema.readSchema default search field in schema is text
[junit4:junit4]   2> 1425 T1289 oass.IndexSchema.readSchema unique key field: id
[junit4:junit4]   2> 1431 T1289 oass.FileExchangeRateProvider.reload Reloading exchange rates from file currency.xml
[junit4:junit4]   2> 1435 T1289 oass.FileExchangeRateProvider.reload Reloading exchange rates from file currency.xml
[junit4:junit4]   2> 1438 T1289 oass.OpenExchangeRatesOrgProvider.reload Reloading exchange rates from open-exchange-rates.json
[junit4:junit4]   2> 1438 T1289 oass.OpenExchangeRatesOrgProvider.reload Reloading exchange rates from open-exchange-rates.json
[junit4:junit4]   2> 1439 T1289 oasc.SolrCore.<init> [collection1] Opening new SolrCore at /usr/home/hudson/hudson-slave/workspace/Lucene-Solr-Tests-trunk-Java6/solr/build/solr-core/test-files/solr/collection1/, dataDir=./org.apache.solr.update.SolrCmdDistributorTest-1347667133305/shard0/data/
[junit4:junit4]   2> 1439 T1289 oasc.SolrCore.<init> JMX monitoring not detected for core: collection1
[junit4:junit4]   2> 1440 T1289 oasc.SolrCore.getNewIndexDir WARNING New index directory detected: old=null new=./org.apache.solr.update.SolrCmdDistributorTest-1347667133305/shard0/data/index/
[junit4:junit4]   2> 1441 T1289 oasc.SolrCore.initIndex WARNING [collection1] Solr index directory './org.apache.solr.update.SolrCmdDistributorTest-1347667133305/shard0/data/index' doesn't exist. Creating new index...
[junit4:junit4]   2> 1443 T1289 oasc.CachingDirectoryFactory.get return new directory for /usr/home/hudson/hudson-slave/workspace/Lucene-Solr-Tests-trunk-Java6/solr/build/solr-core/test/J0/./org.apache.solr.update.SolrCmdDistributorTest-1347667133305/shard0/data/index forceNew:false
[junit4:junit4]   2> 1446 T1289 oasc.SolrDeletionPolicy.onCommit SolrDeletionPolicy.onCommit: commits:num=1
[junit4:junit4]   2> 		commit{dir=MockDirWrapper(org.apache.lucene.store.NIOFSDirectory@/usr/home/hudson/hudson-slave/workspace/Lucene-Solr-Tests-trunk-Java6/solr/build/solr-core/test/J0/index3450234510tmp lockFactory=org.apache.lucene.store.NativeFSLockFactory@65ca273f),segFN=segments_1,generation=1,filenames=[segments_1]
[junit4:junit4]   2> 1447 T1289 oasc.SolrDeletionPolicy.updateCommits newest commit = 1
[junit4:junit4]   2> 1448 T1289 oasc.RequestHandlers.initHandlersFromConfig created standard: solr.StandardRequestHandler
[junit4:junit4]   2> 1448 T1289 oasc.RequestHandlers.initHandlersFromConfig created /get: solr.RealTimeGetHandler
[junit4:junit4]   2> 1448 T1289 oasc.RequestHandlers.initHandlersFromConfig created /update: solr.UpdateRequestHandler
[junit4:junit4]   2> 1448 T1289 oasc.RequestHandlers.initHandlersFromConfig created /admin/: org.apache.solr.handler.admin.AdminHandlers
[junit4:junit4]   2> 1451 T1289 oashl.XMLLoader.init xsltCacheLifetimeSeconds=60
[junit4:junit4]   2> 1457 T1289 oass.SolrIndexSearcher.<init> Opening Searcher@dc85095 main
[junit4:junit4]   2> 1457 T1289 oass.SolrIndexSearcher.getIndexDir WARNING WARNING: Directory impl does not support setting indexDir: org.apache.lucene.store.MockDirectoryWrapper
[junit4:junit4]   2> 1458 T1289 oasu.CommitTracker.<init> Hard AutoCommit: disabled
[junit4:junit4]   2> 1458 T1289 oasu.CommitTracker.<init> Soft AutoCommit: disabled
[junit4:junit4]   2> 1459 T1289 oashc.HttpShardHandlerFactory.getParameter Setting socketTimeout to: 0
[junit4:junit4]   2> 1459 T1289 oashc.HttpShardHandlerFactory.getParameter Setting urlScheme to: http://
[junit4:junit4]   2> 1459 T1289 oashc.HttpShardHandlerFactory.getParameter Setting connTimeout to: 0
[junit4:junit4]   2> 1459 T1289 oashc.HttpShardHandlerFactory.getParameter Setting maxConnectionsPerHost to: 20
[junit4:junit4]   2> 1460 T1289 oashc.HttpShardHandlerFactory.getParameter Setting corePoolSize to: 0
[junit4:junit4]   2> 1460 T1289 oashc.HttpShardHandlerFactory.getParameter Setting maximumPoolSize to: 2147483647
[junit4:junit4]   2> 1460 T1289 oashc.HttpShardHandlerFactory.getParameter Setting maxThreadIdleTime to: 5
[junit4:junit4]   2> 1461 T1289 oashc.HttpShardHandlerFactory.getParameter Setting sizeOfQueue to: -1
[junit4:junit4]   2> 1461 T1289 oashc.HttpShardHandlerFactory.getParameter Setting fairnessPolicy to: false
[junit4:junit4]   2> 1461 T1289 oascsi.HttpClientUtil.createClient Creating new http client, config:maxConnectionsPerHost=20&maxConnections=10000&socketTimeout=0&connTimeout=0&retry=false
[junit4:junit4]   2> 1471 T1309 oasc.SolrCore.registerSearcher [collection1] Registered new searcher Searcher@dc85095 main{StandardDirectoryReader(segments_1:1)}
[junit4:junit4]   2> 1471 T1289 oasc.CoreContainer.register registering core: collection1
[junit4:junit4]   2> 1472 T1289 oass.SolrDispatchFilter.init user.dir=/usr/home/hudson/hudson-slave/workspace/Lucene-Solr-Tests-trunk-Java6/solr/build/solr-core/test/J0
[junit4:junit4]   2> 1473 T1289 oass.SolrDispatchFilter.init SolrDispatchFilter.init() done
[junit4:junit4]   2> 1473 T1289 oascsi.HttpClientUtil.createClient Creating new http client, config:maxConnections=128&maxConnectionsPerHost=32&followRedirects=false
[junit4:junit4]   2> 1480 T1289 oejs.Server.doStart jetty-8.1.2.v20120308
[junit4:junit4]   2> 1481 T1289 oejs.AbstractConnector.doStart Started SocketConnector@0.0.0.0:52555
[junit4:junit4]   2> 1482 T1289 oasc.SolrResourceLoader.locateSolrHome JNDI not configured for solr (NoInitialContextEx)
[junit4:junit4]   2> 1482 T1289 oasc.SolrResourceLoader.locateSolrHome using system property solr.solr.home: /usr/home/hudson/hudson-slave/workspace/Lucene-Solr-Tests-trunk-Java6/solr/build/solr-core/test-files/solr
[junit4:junit4]   2> 1482 T1289 oasc.SolrResourceLoader.<init> new SolrResourceLoader for deduced Solr Home: '/usr/home/hudson/hudson-slave/workspace/Lucene-Solr-Tests-trunk-Java6/solr/build/solr-core/test-files/solr/'
[junit4:junit4]   2> 1506 T1289 oass.SolrDispatchFilter.init SolrDispatchFilter.init()
[junit4:junit4]   2> 1506 T1289 oasc.SolrResourceLoader.locateSolrHome JNDI not configured for solr (NoInitialContextEx)
[junit4:junit4]   2> 1507 T1289 oasc.SolrResourceLoader.locateSolrHome using system property solr.solr.home: /usr/home/hudson/hudson-slave/workspace/Lucene-Solr-Tests-trunk-Java6/solr/build/solr-core/test-files/solr
[junit4:junit4]   2> 1507 T1289 oasc.CoreContainer$Initializer.initialize looking for solr.xml: /usr/home/hudson/hudson-slave/workspace/Lucene-Solr-Tests-trunk-Java6/solr/build/solr-core/test-files/solr/solr.xml
[junit4:junit4]   2> 1507 T1289 oasc.CoreContainer.<init> New CoreContainer 1718966618
[junit4:junit4]   2> 1508 T1289 oasc.CoreContainer.load Loading CoreContainer using Solr Home: '/usr/home/hudson/hudson-slave/workspace/Lucene-Solr-Tests-trunk-Java6/solr/build/solr-core/test-files/solr/'
[junit4:junit4]   2> 1508 T1289 oasc.SolrResourceLoader.<init> new SolrResourceLoader for directory: '/usr/home/hudson/hudson-slave/workspace/Lucene-Solr-Tests-trunk-Java6/solr/build/solr-core/test-files/solr/'
[junit4:junit4]   2> 1526 T1289 oasc.CoreContainer.load Registering Log Listener
[junit4:junit4]   2> 1540 T1289 oasc.CoreContainer.create Creating SolrCore 'collection1' using instanceDir: /usr/home/hudson/hudson-slave/workspace/Lucene-Solr-Tests-trunk-Java6/solr/build/solr-core/test-files/solr/collection1
[junit4:junit4]   2> 1541 T1289 oasc.SolrResourceLoader.<init> new SolrResourceLoader for directory: '/usr/home/hudson/hudson-slave/workspace/Lucene-Solr-Tests-trunk-Java6/solr/build/solr-core/test-files/solr/collection1/'
[junit4:junit4]   2> 1542 T1289 oasc.SolrResourceLoader.replaceClassLoader Adding 'file:/usr/home/hudson/hudson-slave/workspace/Lucene-Solr-Tests-trunk-Java6/solr/build/solr-core/test-files/solr/collection1/lib/classes/' to classloader
[junit4:junit4]   2> 1542 T1289 oasc.SolrResourceLoader.replaceClassLoader Adding 'file:/usr/home/hudson/hudson-slave/workspace/Lucene-Solr-Tests-trunk-Java6/solr/build/solr-core/test-files/solr/collection1/lib/README' to classloader
[junit4:junit4]   2> 1572 T1289 oasc.SolrConfig.<init> Using Lucene MatchVersion: LUCENE_50
[junit4:junit4]   2> 1613 T1289 oasc.SolrConfig.<init> Loaded SolrConfig: solrconfig-tlog.xml
[junit4:junit4]   2> 1614 T1289 oass.IndexSchema.readSchema Reading Solr Schema
[junit4:junit4]   2> 1618 T1289 oass.IndexSchema.readSchema Schema name=test
[junit4:junit4]   2> 2056 T1289 oass.OpenExchangeRatesOrgProvider.init Initialized with rates=open-exchange-rates.json, refreshInterval=1440.
[junit4:junit4]   2> 2065 T1289 oass.IndexSchema.readSchema default search field in schema is text
[junit4:junit4]   2> 2068 T1289 oass.IndexSchema.readSchema unique key field: id
[junit4:junit4]   2> 2074 T1289 oass.FileExchangeRateProvider.reload Reloading exchange rates from file currency.xml
[junit4:junit4]   2> 2078 T1289 oass.FileExchangeRateProvider.reload Reloading exchange rates from file currency.xml
[junit4:junit4]   2> 2081 T1289 oass.OpenExchangeRatesOrgProvider.reload Reloading exchange rates from open-exchange-rates.json
[junit4:junit4]   2> 2082 T1289 oass.OpenExchangeRatesOrgProvider.reload Reloading exchange rates from open-exchange-rates.json
[junit4:junit4]   2> 2082 T1289 oasc.SolrCore.<init> [collection1] Opening new SolrCore at /usr/home/hudson/hudson-slave/workspace/Lucene-Solr-Tests-trunk-Java6/solr/build/solr-core/test-files/solr/collection1/, dataDir=./org.apache.solr.update.SolrCmdDistributorTest-1347667133305/shard1/data/
[junit4:junit4]   2> 2083 T1289 oasc.SolrCore.<init> JMX monitoring not detected for core: collection1
[junit4:junit4]   2> 2083 T1289 oasc.SolrCore.getNewIndexDir WARNING New index directory detected: old=null new=./org.apache.solr.update.SolrCmdDistributorTest-1347667133305/shard1/data/index/
[junit4:junit4]   2> 2084 T1289 oasc.SolrCore.initIndex WARNING [collection1] Solr index directory './org.apache.solr.update.SolrCmdDistributorTest-1347667133305/shard1/data/index' doesn't exist. Creating new index...
[junit4:junit4]   2> 2085 T1289 oasc.CachingDirectoryFactory.get return new directory for /usr/home/hudson/hudson-slave/workspace/Lucene-Solr-Tests-trunk-Java6/solr/build/solr-core/test/J0/./org.apache.solr.update.SolrCmdDistributorTest-1347667133305/shard1/data/index forceNew:false
[junit4:junit4]   2> 2087 T1289 oasc.SolrDeletionPolicy.onCommit SolrDeletionPolicy.onCommit: commits:num=1
[junit4:junit4]   2> 		commit{dir=MockDirWrapper(org.apache.lucene.store.RAMDirectory@38d2c662 lockFactory=org.apache.lucene.store.NativeFSLockFactory@3cc4699c),segFN=segments_1,generation=1,filenames=[segments_1]
[junit4:junit4]   2> 2088 T1289 oasc.SolrDeletionPolicy.updateCommits newest commit = 1
[junit4:junit4]   2> 2089 T1289 oasc.RequestHandlers.initHandlersFromConfig created standard: solr.StandardRequestHandler
[junit4:junit4]   2> 2089 T1289 oasc.RequestHandlers.initHandlersFromConfig created /get: solr.RealTimeGetHandler
[junit4:junit4]   2> 2089 T1289 oasc.RequestHandlers.initHandlersFromConfig created /update: solr.UpdateRequestHandler
[junit4:junit4]   2> 2090 T1289 oasc.RequestHandlers.initHandlersFromConfig created /admin/: org.apache.solr.handler.admin.AdminHandlers
[junit4:junit4]   2> 2092 T1289 oashl.XMLLoader.init xsltCacheLifetimeSeconds=60
[junit4:junit4]   2> 2097 T1289 oass.SolrIndexSearcher.<init> Opening Searcher@20eb3eb main
[junit4:junit4]   2> 2097 T1289 oass.SolrIndexSearcher.getIndexDir WARNING WARNING: Directory impl does not support setting indexDir: org.apache.lucene.store.MockDirectoryWrapper
[junit4:junit4]   2> 2098 T1289 oasu.CommitTracker.<init> Hard AutoCommit: disabled
[junit4:junit4]   2> 2098 T1289 oasu.CommitTracker.<init> Soft AutoCommit: disabled
[junit4:junit4]   2> 2099 T1289 oashc.HttpShardHandlerFactory.getParameter Setting socketTimeout to: 0
[junit4:junit4]   2> 2099 T1289 oashc.HttpShardHandlerFactory.getParameter Setting urlScheme to: http://
[junit4:junit4]   2> 2099 T1289 oashc.HttpShardHandlerFactory.getParameter Setting connTimeout to: 0
[junit4:junit4]   2> 2100 T1289 oashc.HttpShardHandlerFactory.getParameter Setting maxConnectionsPerHost to: 20
[junit4:junit4]   2> 2100 T1289 oashc.HttpShardHandlerFactory.getParameter Setting corePoolSize to: 0
[junit4:junit4]   2> 2100 T1289 oashc.HttpShardHandlerFactory.getParameter Setting maximumPoolSize to: 2147483647
[junit4:junit4]   2> 2101 T1289 oashc.HttpShardHandlerFactory.getParameter Setting maxThreadIdleTime to: 5
[junit4:junit4]   2> 2101 T1289 oashc.HttpShardHandlerFactory.getParameter Setting sizeOfQueue to: -1
[junit4:junit4]   2> 2101 T1289 oashc.HttpShardHandlerFactory.getParameter Setting fairnessPolicy to: false
[junit4:junit4]   2> 2101 T1289 oascsi.HttpClientUtil.createClient Creating new http client, config:maxConnectionsPerHost=20&maxConnections=10000&socketTimeout=0&connTimeout=0&retry=false
[junit4:junit4]   2> 2111 T1319 oasc.SolrCore.registerSearcher [collection1] Registered new searcher Searcher@20eb3eb main{StandardDirectoryReader(segments_1:1)}
[junit4:junit4]   2> 2111 T1289 oasc.CoreContainer.register registering core: collection1
[junit4:junit4]   2> 2111 T1289 oass.SolrDispatchFilter.init user.dir=/usr/home/hudson/hudson-slave/workspace/Lucene-Solr-Tests-trunk-Java6/solr/build/solr-core/test/J0
[junit4:junit4]   2> 2112 T1289 oass.SolrDispatchFilter.init SolrDispatchFilter.init() done
[junit4:junit4]   2> 2112 T1289 oascsi.HttpClientUtil.createClient Creating new http client, config:maxConnections=128&maxConnectionsPerHost=32&followRedirects=false
[junit4:junit4]   2> 2118 T1289 oejs.Server.doStart jetty-8.1.2.v20120308
[junit4:junit4]   2> 2120 T1289 oejs.AbstractConnector.doStart Started SocketConnector@0.0.0.0:37122
[junit4:junit4]   2> 2121 T1289 oasc.SolrResourceLoader.locateSolrHome JNDI not configured for solr (NoInitialContextEx)
[junit4:junit4]   2> 2121 T1289 oasc.SolrResourceLoader.locateSolrHome using system property solr.solr.home: /usr/home/hudson/hudson-slave/workspace/Lucene-Solr-Tests-trunk-Java6/solr/build/solr-core/test-files/solr
[junit4:junit4]   2> 2121 T1289 oasc.SolrResourceLoader.<init> new SolrResourceLoader for deduced Solr Home: '/usr/home/hudson/hudson-slave/workspace/Lucene-Solr-Tests-trunk-Java6/solr/build/solr-core/test-files/solr/'
[junit4:junit4]   2> 2145 T1289 oass.SolrDispatchFilter.init SolrDispatchFilter.init()
[junit4:junit4]   2> 2145 T1289 oasc.SolrResourceLoader.locateSolrHome JNDI not configured for solr (NoInitialContextEx)
[junit4:junit4]   2> 2145 T1289 oasc.SolrResourceLoader.locateSolrHome using system property solr.solr.home: /usr/home/hudson/hudson-slave/workspace/Lucene-Solr-Tests-trunk-Java6/solr/build/solr-core/test-files/solr
[junit4:junit4]   2> 2146 T1289 oasc.CoreContainer$Initializer.initialize looking for solr.xml: /usr/home/hudson/hudson-slave/workspace/Lucene-Solr-Tests-trunk-Java6/solr/build/solr-core/test-files/solr/solr.xml
[junit4:junit4]   2> 2146 T1289 oasc.CoreContainer.<init> New CoreContainer 585903321
[junit4:junit4]   2> 2146 T1289 oasc.CoreContainer.load Loading CoreContainer using Solr Home: '/usr/home/hudson/hudson-slave/workspace/Lucene-Solr-Tests-trunk-Java6/solr/build/solr-core/test-files/solr/'
[junit4:junit4]   2> 2147 T1289 oasc.SolrResourceLoader.<init> new SolrResourceLoader for directory: '/usr/home/hudson/hudson-slave/workspace/Lucene-Solr-Tests-trunk-Java6/solr/build/solr-core/test-files/solr/'
[junit4:junit4]   2> 2164 T1289 oasc.CoreContainer.load Registering Log Listener
[junit4:junit4]   2> 2178 T1289 oasc.CoreContainer.create Creating SolrCore 'collection1' using instanceDir: /usr/home/hudson/hudson-slave/workspace/Lucene-Solr-Tests-trunk-Java6/solr/build/solr-core/test-files/solr/collection1
[junit4:junit4]   2> 2178 T1289 oasc.SolrResourceLoader.<init> new SolrResourceLoader for directory: '/usr/home/hudson/hudson-slave/workspace/Lucene-Solr-Tests-trunk-Java6/solr/build/solr-core/test-files/solr/collection1/'
[junit4:junit4]   2> 2179 T1289 oasc.SolrResourceLoader.replaceClassLoader Adding 'file:/usr/home/hudson/hudson-slave/workspace/Lucene-Solr-Tests-trunk-Java6/solr/build/solr-core/test-files/solr/collection1/lib/classes/' to classloader
[junit4:junit4]   2> 2180 T1289 oasc.SolrResourceLoader.replaceClassLoader Adding 'file:/usr/home/hudson/hudson-slave/workspace/Lucene-Solr-Tests-trunk-Java6/solr/build/solr-core/test-files/solr/collection1/lib/README' to classloader
[junit4:junit4]   2> 2209 T1289 oasc.SolrConfig.<init> Using Lucene MatchVersion: LUCENE_50
[junit4:junit4]   2> 2242 T1289 oasc.SolrConfig.<init> Loaded SolrConfig: solrconfig-tlog.xml
[junit4:junit4]   2> 2243 T1289 oass.IndexSchema.readSchema Reading Solr Schema
[junit4:junit4]   2> 2247 T1289 oass.IndexSchema.readSchema Schema name=test
[junit4:junit4]   2> 2651 T1289 oass.OpenExchangeRatesOrgProvider.init Initialized with rates=open-exchange-rates.json, refreshInterval=1440.
[junit4:junit4]   2> 2659 T1289 oass.IndexSchema.readSchema default search field in schema is text
[junit4:junit4]   2> 2662 T1289 oass.IndexSchema.readSchema unique key field: id
[junit4:junit4]   2> 2669 T1289 oass.FileExchangeRateProvider.reload Reloading exchange rates from file currency.xml
[junit4:junit4]   2> 2672 T1289 oass.FileExchangeRateProvider.reload Reloading exchange rates from file currency.xml
[junit4:junit4]   2> 2675 T1289 oass.OpenExchangeRatesOrgProvider.reload Reloading exchange rates from open-exchange-rates.json
[junit4:junit4]   2> 2676 T1289 oass.OpenExchangeRatesOrgProvider.reload Reloading exchange rates from open-exchange-rates.json
[junit4:junit4]   2> 2677 T1289 oasc.SolrCore.<init> [collection1] Opening new SolrCore at /usr/home/hudson/hudson-slave/workspace/Lucene-Solr-Tests-trunk-Java6/solr/build/solr-core/test-files/solr/collection1/, dataDir=./org.apache.solr.update.SolrCmdDistributorTest-1347667133305/shard2/data/
[junit4:junit4]   2> 2677 T1289 oasc.SolrCore.<init> JMX monitoring not detected for core: collection1
[junit4:junit4]   2> 2678 T1289 oasc.SolrCore.getNewIndexDir WARNING New index directory detected: old=null new=./org.apache.solr.update.SolrCmdDistributorTest-1347667133305/shard2/data/index/
[junit4:junit4]   2> 2679 T1289 oasc.SolrCore.initIndex WARNING [collection1] Solr index directory './org.apache.solr.update.SolrCmdDistributorTest-1347667133305/shard2/data/index' doesn't exist. Creating new index...
[junit4:junit4]   2> 2679 T1289 oasc.CachingDirectoryFactory.get return new directory for /usr/home/hudson/hudson-slave/workspace/Lucene-Solr-Tests-trunk-Java6/solr/build/solr-core/test/J0/./org.apache.solr.update.SolrCmdDistributorTest-1347667133305/shard2/data/index forceNew:false
[junit4:junit4]   2> 2682 T1289 oasc.SolrDeletionPolicy.onCommit SolrDeletionPolicy.onCommit: commits:num=1
[junit4:junit4]   2> 		commit{dir=MockDirWrapper(org.apache.lucene.store.RAMDirectory@74834659 lockFactory=org.apache.lucene.store.NativeFSLockFactory@5b3ecdb4),segFN=segments_1,generation=1,filenames=[segments_1]
[junit4:junit4]   2> 2682 T1289 oasc.SolrDeletionPolicy.updateCommits newest commit = 1
[junit4:junit4]   2> 2683 T1289 oasc.RequestHandlers.initHandlersFromConfig created standard: solr.StandardRequestHandler
[junit4:junit4]   2> 2683 T1289 oasc.RequestHandlers.initHandlersFromConfig created /get: solr.RealTimeGetHandler
[junit4:junit4]   2> 2684 T1289 oasc.RequestHandlers.initHandlersFromConfig created /update: solr.UpdateRequestHandler
[junit4:junit4]   2> 2684 T1289 oasc.RequestHandlers.initHandlersFromConfig created /admin/: org.apache.solr.handler.admin.AdminHandlers
[junit4:junit4]   2> 2687 T1289 oashl.XMLLoader.init xsltCacheLifetimeSeconds=60
[junit4:junit4]   2> 2691 T1289 oass.SolrIndexSearcher.<init> Opening Searcher@62822511 main
[junit4:junit4]   2> 2692 T1289 oass.SolrIndexSearcher.getIndexDir WARNING WARNING: Directory impl does not support setting indexDir: org.apache.lucene.store.MockDirectoryWrapper
[junit4:junit4]   2> 2692 T1289 oasu.CommitTracker.<init> Hard AutoCommit: disabled
[junit4:junit4]   2> 2693 T1289 oasu.CommitTracker.<init> Soft AutoCommit: disabled
[junit4:junit4]   2> 2693 T1289 oashc.HttpShardHandlerFactory.getParameter Setting socketTimeout to: 0
[junit4:junit4]   2> 2693 T1289 oashc.HttpShardHandlerFactory.getParameter Setting urlScheme to: http://
[junit4:junit4]   2> 2694 T1289 oashc.HttpShardHandlerFactory.getParameter Setting connTimeout to: 0
[junit4:junit4]   2> 2694 T1289 oashc.HttpShardHandlerFactory.getParameter Setting maxConnectionsPerHost to: 20
[junit4:junit4]   2> 2694 T1289 oashc.HttpShardHandlerFactory.getParameter Setting corePoolSize to: 0
[junit4:junit4]   2> 2695 T1289 oashc.HttpShardHandlerFactory.getParameter Setting maximumPoolSize to: 2147483647
[junit4:junit4]   2> 2695 T1289 oashc.HttpShardHandlerFactory.getParameter Setting maxThreadIdleTime to: 5
[junit4:junit4]   2> 2695 T1289 oashc.HttpShardHandlerFactory.getParameter Setting sizeOfQueue to: -1
[junit4:junit4]   2> 2695 T1289 oashc.HttpShardHandlerFactory.getParameter Setting fairnessPolicy to: false
[junit4:junit4]   2> 2696 T1289 oascsi.HttpClientUtil.createClient Creating new http client, config:maxConnectionsPerHost=20&maxConnections=10000&socketTimeout=0&connTimeout=0&retry=false
[junit4:junit4]   2> 2705 T1329 oasc.SolrCore.registerSearcher [collection1] Registered new searcher Searcher@62822511 main{StandardDirectoryReader(segments_1:1)}
[junit4:junit4]   2> 2705 T1289 oasc.CoreContainer.register registering core: collection1
[junit4:junit4]   2> 2706 T1289 oass.SolrDispatchFilter.init user.dir=/usr/home/hudson/hudson-slave/workspace/Lucene-Solr-Tests-trunk-Java6/solr/build/solr-core/test/J0
[junit4:junit4]   2> 2706 T1289 oass.SolrDispatchFilter.init SolrDispatchFilter.init() done
[junit4:junit4]   2> 2707 T1289 oascsi.HttpClientUtil.createClient Creating new http client, config:maxConnections=128&maxConnectionsPerHost=32&followRedirects=false
[junit4:junit4]   2> 2713 T1289 oejs.Server.doStart jetty-8.1.2.v20120308
[junit4:junit4]   2> 2715 T1289 oejs.AbstractConnector.doStart Started SocketConnector@0.0.0.0:19712
[junit4:junit4]   2> 2715 T1289 oasc.SolrResourceLoader.locateSolrHome JNDI not configured for solr (NoInitialContextEx)
[junit4:junit4]   2> 2715 T1289 oasc.SolrResourceLoader.locateSolrHome using system property solr.solr.home: /usr/home/hudson/hudson-slave/workspace/Lucene-Solr-Tests-trunk-Java6/solr/build/solr-core/test-files/solr
[junit4:junit4]   2> 2716 T1289 oasc.SolrResourceLoader.<init> new SolrResourceLoader for deduced Solr Home: '/usr/home/hudson/hudson-slave/workspace/Lucene-Solr-Tests-trunk-Java6/solr/build/solr-core/test-files/solr/'
[junit4:junit4]   2> 2740 T1289 oass.SolrDispatchFilter.init SolrDispatchFilter.init()
[junit4:junit4]   2> 2740 T1289 oasc.SolrResourceLoader.locateSolrHome JNDI not configured for solr (NoInitialContextEx)
[junit4:junit4]   2> 2740 T1289 oasc.SolrResourceLoader.locateSolrHome using system property solr.solr.home: /usr/home/hudson/hudson-slave/workspace/Lucene-Solr-Tests-trunk-Java6/solr/build/solr-core/test-files/solr
[junit4:junit4]   2> 2741 T1289 oasc.CoreContainer$Initializer.initialize looking for solr.xml: /usr/home/hudson/hudson-slave/workspace/Lucene-Solr-Tests-trunk-Java6/solr/build/solr-core/test-files/solr/solr.xml
[junit4:junit4]   2> 2741 T1289 oasc.CoreContainer.<init> New CoreContainer 1391121967
[junit4:junit4]   2> 2741 T1289 oasc.CoreContainer.load Loading CoreContainer using Solr Home: '/usr/home/hudson/hudson-slave/workspace/Lucene-Solr-Tests-trunk-Java6/solr/build/solr-core/test-files/solr/'
[junit4:junit4]   2> 2742 T1289 oasc.SolrResourceLoader.<init> new SolrResourceLoader for directory: '/usr/home/hudson/hudson-slave/workspace/Lucene-Solr-Tests-trunk-Java6/solr/build/solr-core/test-files/solr/'
[junit4:junit4]   2> 2759 T1289 oasc.CoreContainer.load Registering Log Listener
[junit4:junit4]   2> 2774 T1289 oasc.CoreContainer.create Creating SolrCore 'collection1' using instanceDir: /usr/home/hudson/hudson-slave/workspace/Lucene-Solr-Tests-trunk-Java6/solr/build/solr-core/test-files/solr/collection1
[junit4:junit4]   2> 2774 T1289 oasc.SolrResourceLoader.<init> new SolrResourceLoader for directory: '/usr/home/hudson/hudson-slave/workspace/Lucene-Solr-Tests-trunk-Java6/solr/build/solr-core/test-files/solr/collection1/'
[junit4:junit4]   2> 2775 T1289 oasc.SolrResourceLoader.replaceClassLoader Adding 'file:/usr/home/hudson/hudson-slave/workspace/Lucene-Solr-Tests-trunk-Java6/solr/build/solr-core/test-files/solr/collection1/lib/classes/' to classloader
[junit4:junit4]   2> 2776 T1289 oasc.SolrResourceLoader.replaceClassLoader Adding 'file:/usr/home/hudson/hudson-slave/workspace/Lucene-Solr-Tests-trunk-Java6/solr/build/solr-core/test-files/solr/collection1/lib/README' to classloader
[junit4:junit4]   2> 2806 T1289 oasc.SolrConfig.<init> Using Lucene MatchVersion: LUCENE_50
[junit4:junit4]   2> 2839 T1289 oasc.SolrConfig.<init> Loaded SolrConfig: solrconfig-tlog.xml
[junit4:junit4]   2> 2840 T1289 oass.IndexSchema.readSchema Reading Solr Schema
[junit4:junit4]   2> 2844 T1289 oass.IndexSchema.readSchema Schema name=test
[junit4:junit4]   2> 3262 T1289 oass.OpenExchangeRatesOrgProvider.init Initialized with rates=open-exchange-rates.json, refreshInterval=1440.
[junit4:junit4]   2> 3271 T1289 oass.IndexSchema.readSchema default search field in schema is text
[junit4:junit4]   2> 3274 T1289 oass.IndexSchema.readSchema unique key field: id
[junit4:junit4]   2> 3281 T1289 oass.FileExchangeRateProvider.reload Reloading exchange rates from file currency.xml
[junit4:junit4]   2> 3284 T1289 oass.FileExchangeRateProvider.reload Reloading exchange rates from file currency.xml
[junit4:junit4]   2> 3287 T1289 oass.OpenExchangeRatesOrgProvider.reload Reloading exchange rates from open-exchange-rates.json
[junit4:junit4]   2> 3288 T1289 oass.OpenExchangeRatesOrgProvider.reload Reloading exchange rates from open-exchange-rates.json
[junit4:junit4]   2> 3288 T1289 oasc.SolrCore.<init> [collection1] Opening new SolrCore at /usr/home/hudson/hudson-slave/workspace/Lucene-Solr-Tests-trunk-Java6/solr/build/solr-core/test-files/solr/collection1/, dataDir=./org.apache.solr.update.SolrCmdDistributorTest-1347667133305/shard3/data/
[junit4:junit4]   2> 3289 T1289 oasc.SolrCore.<init> JMX monitoring not detected for core: collection1
[junit4:junit4]   2> 3290 T1289 oasc.SolrCore.getNewIndexDir WARNING New index directory detected: old=null new=./org.apache.solr.update.SolrCmdDistributorTest-1347667133305/shard3/data/index/
[junit4:junit4]   2> 3290 T1289 oasc.SolrCore.initIndex WARNING [collection1] Solr index directory './org.apache.solr.update.SolrCmdDistributorTest-1347667133305/shard3/data/index' doesn't exist. Creating new index...
[junit4:junit4]   2> 3291 T1289 oasc.CachingDirectoryFactory.get return new directory for /usr/home/hudson/hudson-slave/workspace/Lucene-Solr-Tests-trunk-Java6/solr/build/solr-core/test/J0/./org.apache.solr.update.SolrCmdDistributorTest-1347667133305/shard3/data/index forceNew:false
[junit4:junit4]   2> 3293 T1289 oasc.SolrDeletionPolicy.onCommit SolrDeletionPolicy.onCommit: commits:num=1
[junit4:junit4]   2> 		commit{dir=MockDirWrapper(org.apache.lucene.store.RAMDirectory@65440a34 lockFactory=org.apache.lucene.store.NativeFSLockFactory@1427609d),segFN=segments_1,generation=1,filenames=[segments_1]
[junit4:junit4]   2> 3294 T1289 oasc.SolrDeletionPolicy.updateCommits newest commit = 1
[junit4:junit4]   2> 3295 T1289 oasc.RequestHandlers.initHandlersFromConfig created standard: solr.StandardRequestHandler
[junit4:junit4]   2> 3295 T1289 oasc.RequestHandlers.initHandlersFromConfig created /get: solr.RealTimeGetHandler
[junit4:junit4]   2> 3295 T1289 oasc.RequestHandlers.initHandlersFromConfig created /update: solr.UpdateRequestHandler
[junit4:junit4]   2> 3296 T1289 oasc.RequestHandlers.initHandlersFromConfig created /admin/: org.apache.solr.handler.admin.AdminHandlers
[junit4:junit4]   2> 3299 T1289 oashl.XMLLoader.init xsltCacheLifetimeSeconds=60
[junit4:junit4]   2> 3303 T1289 oass.SolrIndexSearcher.<init> Opening Searcher@3157f877 main
[junit4:junit4]   2> 3304 T1289 oass.SolrIndexSearcher.getIndexDir WARNING WARNING: Directory impl does not support setting indexDir: org.apache.lucene.store.MockDirectoryWrapper
[junit4:junit4]   2> 3304 T1289 oasu.CommitTracker.<init> Hard AutoCommit: disabled
[junit4:junit4]   2> 3305 T1289 oasu.CommitTracker.<init> Soft AutoCommit: disabled
[junit4:junit4]   2> 3305 T1289 oashc.HttpShardHandlerFactory.getParameter Setting socketTimeout to: 0
[junit4:junit4]   2> 3305 T1289 oashc.HttpShardHandlerFactory.getParameter Setting urlScheme to: http://
[junit4:junit4]   2> 3306 T1289 oashc.HttpShardHandlerFactory.getParameter Setting connTimeout to: 0
[junit4:junit4]   2> 3306 T1289 oashc.HttpShardHandlerFactory.getParameter Setting maxConnectionsPerHost to: 20
[junit4:junit4]   2> 3306 T1289 oashc.HttpShardHandlerFactory.getParameter Setting corePoolSize to: 0
[junit4:junit4]   2> 3307 T1289 oashc.HttpShardHandlerFactory.getParameter Setting maximumPoolSize to: 2147483647
[junit4:junit4]   2> 3307 T1289 oashc.HttpShardHandlerFactory.getParameter Setting maxThreadIdleTime to: 5
[junit4:junit4]   2> 3307 T1289 oashc.HttpShardHandlerFactory.getParameter Setting sizeOfQueue to: -1
[junit4:junit4]   2> 3308 T1289 oashc.HttpShardHandlerFactory.getParameter Setting fairnessPolicy to: false
[junit4:junit4]   2> 3308 T1289 oascsi.HttpClientUtil.createClient Creating new http client, config:maxConnectionsPerHost=20&maxConnections=10000&socketTimeout=0&connTimeout=0&retry=false
[junit4:junit4]   2> 3317 T1339 oasc.SolrCore.registerSearcher [collection1] Registered new searcher Searcher@3157f877 main{StandardDirectoryReader(segments_1:1)}
[junit4:junit4]   2> 3317 T1289 oasc.CoreContainer.register registering core: collection1
[junit4:junit4]   2> 3319 T1289 oass.SolrDispatchFilter.init user.dir=/usr/home/hudson/hudson-slave/workspace/Lucene-Solr-Tests-trunk-Java6/solr/build/solr-core/test/J0
[junit4:junit4]   2> 3319 T1289 oass.SolrDispatchFilter.init SolrDispatchFilter.init() done
[junit4:junit4]   2> 3319 T1289 oascsi.HttpClientUtil.createClient Creating new http client, config:maxConnections=128&maxConnectionsPerHost=32&followRedirects=false
[junit4:junit4]   2> ASYNC  NEW_CORE C124 name=collection1 org.apache.solr.core.SolrCore@27ea9a99
[junit4:junit4]   2> 3331 T1292 C124 oasc.SolrDeletionPolicy.onInit SolrDeletionPolicy.onInit: commits:num=1
[junit4:junit4]   2> 		commit{dir=MockDirWrapper(org.apache.lucene.store.RAMDirectory@73f2153f lockFactory=org.apache.lucene.store.NativeFSLockFactory@41a09716),segFN=segments_1,generation=1,filenames=[segments_1]
[junit4:junit4]   2> 3332 T1292 C124 oasc.SolrDeletionPolicy.updateCommits newest commit = 1
[junit4:junit4]   2> 3333 T1292 C124 oass.SolrIndexSearcher.<init> Opening Searcher@4c4ec7d4 realtime
[junit4:junit4]   2> 3333 T1292 C124 oass.SolrIndexSearcher.getIndexDir WARNING WARNING: Directory impl does not support setting indexDir: org.apache.lucene.store.MockDirectoryWrapper
[junit4:junit4]   2> 3334 T1292 C124 UPDATE [collection1] webapp=/solr path=/update params={wt=javabin&version=2} {deleteByQuery=*:* (-1413131415459987456)} 0 5
[junit4:junit4]   2> ASYNC  NEW_CORE C125 name=collection1 org.apache.solr.core.SolrCore@77043782
[junit4:junit4]   2> 3347 T1302 C125 oasc.SolrDeletionPolicy.onInit SolrDeletionPolicy.onInit: commits:num=1
[junit4:junit4]   2> 		commit{dir=MockDirWrapper(org.apache.lucene.store.NIOFSDirectory@/usr/home/hudson/hudson-slave/workspace/Lucene-Solr-Tests-trunk-Java6/solr/build/solr-core/test/J0/index3450234510tmp lockFactory=org.apache.lucene.store.NativeFSLockFactory@65ca273f),segFN=segments_1,generation=1,filenames=[segments_1]
[junit4:junit4]   2> 3347 T1302 C125 oasc.SolrDeletionPolicy.updateCommits newest commit = 1
[junit4:junit4]   2> 3348 T1302 C125 oass.SolrIndexSearcher.<init> Opening Searcher@14e8e992 realtime
[junit4:junit4]   2> 3348 T1302 C125 oass.SolrIndexSearcher.getIndexDir WARNING WARNING: Directory impl does not support setting indexDir: org.apache.lucene.store.MockDirectoryWrapper
[junit4:junit4]   2> 3349 T1302 C125 UPDATE [collection1] webapp=/solr path=/update params={wt=javabin&version=2} {deleteByQuery=*:* (-1413131415470473216)} 0 10
[junit4:junit4]   2> ASYNC  NEW_CORE C126 name=collection1 org.apache.solr.core.SolrCore@7858050e
[junit4:junit4]   2> 3355 T1312 C126 oasc.SolrDeletionPolicy.onInit SolrDeletionPolicy.onInit: commits:num=1
[junit4:junit4]   2> 		commit{dir=MockDirWrapper(org.apache.lucene.store.RAMDirectory@38d2c662 lockFactory=org.apache.lucene.store.NativeFSLockFactory@3cc4699c),segFN=segments_1,generation=1,filenames=[segments_1]
[junit4:junit4]   2> 3355 T1312 C126 oasc.SolrDeletionPolicy.updateCommits newest commit = 1
[junit4:junit4]   2> 3356 T1312 C126 oass.SolrIndexSearcher.<init> Opening Searcher@59a82966 realtime
[junit4:junit4]   2> 3356 T1312 C126 oass.SolrIndexSearcher.getIndexDir WARNING WARNING: Directory impl does not support setting indexDir: org.apache.lucene.store.MockDirectoryWrapper
[junit4:junit4]   2> 3357 T1312 C126 UPDATE [collection1] webapp=/solr path=/update params={wt=javabin&version=2} {deleteByQuery=*:* (-1413131415485153280)} 0 4
[junit4:junit4]   2> ASYNC  NEW_CORE C127 name=collection1 org.apache.solr.core.SolrCore@54eb6acc
[junit4:junit4]   2> 3362 T1322 C127 oasc.SolrDeletionPolicy.onInit SolrDeletionPolicy.onInit: commits:num=1
[junit4:junit4]   2> 		commit{dir=MockDirWrapper(org.apache.lucene.store.RAMDirectory@74834659 lockFactory=org.apache.lucene.store.NativeFSLockFactory@5b3ecdb4),segFN=segments_1,generation=1,filenames=[segments_1]
[junit4:junit4]   2> 3363 T1322 C127 oasc.SolrDeletionPolicy.updateCommits newest commit = 1
[junit4:junit4]   2> 3364 T1322 C127 oass.SolrIndexSearcher.<init> Opening Searcher@36836161 realtime
[junit4:junit4]   2> 3364 T1322 C127 oass.SolrIndexSearcher.getIndexDir WARNING WARNING: Directory impl does not support setting indexDir: org.apache.lucene.store.MockDirectoryWrapper
[junit4:junit4]   2> 3364 T1322 C127 UPDATE [collection1] webapp=/solr path=/update params={wt=javabin&version=2} {deleteByQuery=*:* (-1413131415493541888)} 0 3
[junit4:junit4]   2> ASYNC  NEW_CORE C128 name=collection1 org.apache.solr.core.SolrCore@62b29b28
[junit4:junit4]   2> 3370 T1332 C128 oasc.SolrDeletionPolicy.onInit SolrDeletionPolicy.onInit: commits:num=1
[junit4:junit4]   2> 		commit{dir=MockDirWrapper(org.apache.lucene.store.RAMDirectory@65440a34 lockFactory=org.apache.lucene.store.NativeFSLockFactory@1427609d),segFN=segments_1,generation=1,filenames=[segments_1]
[junit4:junit4]   2> 3370 T1332 C128 oasc.SolrDeletionPolicy.updateCommits newest commit = 1
[junit4:junit4]   2> 3371 T1332 C128 oass.SolrIndexSearcher.<init> Opening Searcher@2dbeb863 realtime
[junit4:junit4]   2> 3372 T1332 C128 oass.SolrIndexSearcher.getIndexDir WARNING WARNING: Directory impl does not support setting indexDir: org.apache.lucene.store.MockDirectoryWrapper
[junit4:junit4]   2> 3372 T1332 C128 UPDATE [collection1] webapp=/solr path=/update params={wt=javabin&version=2} {deleteByQuery=*:* (-1413131415500881920)} 0 4
[junit4:junit4]   2> 3372 T1289 oasu.SolrCmdDistributor.distribCommit Distrib commit to:[StdNode: http://localhost:39775/solr/]
[junit4:junit4]   2> 3374 T1293 C124 oasu.DirectUpdateHandler2.commit start commit{flags=0,_version_=0,optimize=false,openSearcher=true,waitSearcher=true,expungeDeletes=false,softCommit=false}
[junit4:junit4]   2> 3375 T1293 C124 oass.SolrIndexSearcher.<init> Opening Searcher@43c558ae main
[junit4:junit4]   2> 3376 T1293 C124 oass.SolrIndexSearcher.getIndexDir WARNING WARNING: Directory impl does not support setting indexDir: org.apache.lucene.store.MockDirectoryWrapper
[junit4:junit4]   2> 3376 T1299 oasc.SolrCore.registerSearcher [collection1] Registered new searcher Searcher@43c558ae main{StandardDirectoryReader(segments_1:1:nrt)}
[junit4:junit4]   2> 3376 T1293 C124 oasu.DirectUpdateHandler2.commit end_commit_flush
[junit4:junit4]   2> 3377 T1293 C124 UPDATE [collection1] webapp=/solr path=/update params={waitSearcher=true&commit=true&expungeDeletes=false&wt=javabin&softCommit=false&version=2} {commit=} 0 3
[junit4:junit4]   2> 3381 T1293 C124 oasu.DirectUpdateHandler2.commit start commit{flags=0,_version_=0,optimize=false,openSearcher=true,waitSearcher=true,expungeDeletes=false,softCommit=false}
[junit4:junit4]   2> 3383 T1293 C124 oasc.SolrDeletionPolicy.onCommit SolrDeletionPolicy.onCommit: commits:num=2
[junit4:junit4]   2> 		commit{dir=MockDirWrapper(org.apache.lucene.store.RAMDirectory@73f2153f lockFactory=org.apache.lucene.store.NativeFSLockFactory@41a09716),segFN=segments_1,generation=1,filenames=[segments_1]
[junit4:junit4]   2> 		commit{dir=MockDirWrapper(org.apache.lucene.store.RAMDirectory@73f2153f lockFactory=org.apache.lucene.store.NativeFSLockFactory@41a09716),segFN=segments_2,generation=2,filenames=[_0_TestBloomFilteredLucene40Postings_0.tim, _0_Block_0.pos, _0_Block_0.tip, _0_TestBloomFilteredLucene40Postings_0.blm, _0_TestBloomFilteredLucene40Postings_0.tip, _0.fnm, _0_Pulsing40_0.tim, _0_Block_0.doc, _0_Memory_0.ram, _0_Block_0.tim, _0_TestBloomFilteredLucene40Postings_0.prx, _0_nrm.cfs, _0_Pulsing40_0.prx, _0_Pulsing40_0.frq, _0_nrm.cfe, _0_Pulsing40_0.tip, segments_2, _0_TestBloomFilteredLucene40Postings_0.frq, _0.fdx, _0.si, _0.fdt]
[junit4:junit4]   2> 3383 T1293 C124 oasc.SolrDeletionPolicy.updateCommits newest commit = 2
[junit4:junit4]   2> 3385 T1293 C124 oass.SolrIndexSearcher.<init> Opening Searcher@7e10ece2 main
[junit4:junit4]   2> 3385 T1293 C124 oass.SolrIndexSearcher.getIndexDir WARNING WARNING: Directory impl does not support setting indexDir: org.apache.lucene.store.MockDirectoryWrapper
[junit4:junit4]   2> 3385 T1299 oasc.SolrCore.registerSearcher [collection1] Registered new searcher Searcher@7e10ece2 main{StandardDirectoryReader(segments_2:3:nrt _0(5.0):C1)}
[junit4:junit4]   2> 3386 T1293 C124 oasu.DirectUpdateHandler2.commit end_commit_flush
[junit4:junit4]   2> 3386 T1293 C124 UPDATE [collection1] webapp=/solr path=/update params={waitSearcher=true&commit=true&wt=javabin&expungeDeletes=false&version=2&softCommit=false} {add=[1 (1413131415512416256)],commit=} 0 7
[junit4:junit4]   2> 3389 T1292 C124 REQ [collection1] webapp=/solr path=/select params={wt=javabin&q=*:*&version=2} hits=1 status=0 QTime=1 
[junit4:junit4]   2> 3389 T1289 oasu.SolrCmdDistributor.distribCommit Distrib commit to:[StdNode: http://localhost:39775/solr/, StdNode: http://localhost:29147/solr/]
[junit4:junit4]   2> 3391 T1303 C125 oasu.DirectUpdateHandler2.commit start commit{flags=0,_version_=0,optimize=false,openSearcher=true,waitSearcher=true,expungeDeletes=false,softCommit=false}
[junit4:junit4]   2> 3392 T1303 C125 oass.SolrIndexSearcher.<init> Opening Searcher@5ab58e69 main
[junit4:junit4]   2> 3392 T1303 C125 oass.SolrIndexSearcher.getIndexDir WARNING WARNING: Directory impl does not support setting indexDir: org.apache.lucene.store.MockDirectoryWrapper
[junit4:junit4]   2> 3392 T1293 C124 oasu.DirectUpdateHandler2.commit start commit{flags=0,_version_=0,optimize=false,openSearcher=true,waitSearcher=true,expungeDeletes=false,softCommit=false}
[junit4:junit4]   2> 3393 T1309 oasc.SolrCore.registerSearcher [collection1] Registered new searcher Searcher@5ab58e69 main{StandardDirectoryReader(segments_1:1:nrt)}
[junit4:junit4]   2> 3393 T1303 C125 oasu.DirectUpdateHandler2.commit end_commit_flush
[junit4:junit4]   2> 3393 T1303 C125 UPDATE [collection1] webapp=/solr path=/update params={waitSearcher=true&commit=true&expungeDeletes=false&wt=javabin&softCommit=false&version=2} {commit=} 0 2
[junit4:junit4]   2> 3393 T1293 C124 oass.SolrIndexSearcher.<init> Opening Searcher@2ee35df5 main
[junit4:junit4]   2> 3393 T1293 C124 oass.SolrIndexSearcher.getIndexDir WARNING WARNING: Directory impl does not support setting indexDir: org.apache.lucene.store.MockDirectoryWrapper
[junit4:junit4]   2> 3394 T1299 oasc.SolrCore.registerSearcher [collection1] Registered new searcher Searcher@2ee35df5 main{StandardDirectoryReader(segments_2:3:nrt _0(5.0):C1)}
[junit4:junit4]   2> 3394 T1293 C124 oasu.DirectUpdateHandler2.commit end_commit_flush
[junit4:junit4]   2> 3394 T1293 C124 UPDATE [collection1] webapp=/solr path=/update params={waitSearcher=true&commit=true&expungeDeletes=false&wt=javabin&softCommit=false&version=2} {commit=} 0 2
[junit4:junit4]   2> 3399 T1293 C124 oasu.DirectUpdateHandler2.commit start commit{flags=0,_version_=0,optimize=false,openSearcher=true,waitSearcher=true,expungeDeletes=false,softCommit=false}
[junit4:junit4]   2> 3399 T1303 C125 oasu.DirectUpdateHandler2.commit start commit{flags=0,_version_=0,optimize=false,openSearcher=true,waitSearcher=true,expungeDeletes=false,softCommit=false}
[junit4:junit4]   2> 3402 T1293 C124 oasc.SolrDeletionPolicy.onCommit SolrDeletionPolicy.onCommit: commits:num=2
[junit4:junit4]   2> 		commit{dir=MockDirWrapper(org.apache.lucene.store.RAMDirectory@73f2153f lockFactory=org.apache.lucene.store.NativeFSLockFactory@41a09716),segFN=segments_2,generation=2,filenames=[_0_TestBloomFilteredLucene40Postings_0.tim, _0_Block_0.pos, _0_Block_0.tip, _0_TestBloomFilteredLucene40Postings_0.blm, _0_TestBloomFilteredLucene40Postings_0.tip, _0.fnm, _0_Pulsing40_0.tim, _0_Block_0.doc, _0_Memory_0.ram, _0_Block_0.tim, _0_TestBloomFilteredLucene40Postings_0.prx, _0_nrm.cfs, _0_Pulsing40_0.prx, _0_Pulsing40_0.frq, _0_nrm.cfe, _0_Pulsing40_0.tip, segments_2, _0_TestBloomFilteredLucene40Postings_0.frq, _0.fdx, _0.si, _0.fdt]
[junit4:junit4]   2> 		commit{dir=MockDirWrapper(org.apache.lucene.store.RAMDirectory@73f2153f lockFactory=org.apache.lucene.store.NativeFSLockFactory@41a09716),segFN=segments_3,generation=3,filenames=[_0_Block_0.tip, _0_Block_0.pos, _1_Pulsing40_0.tip, _0_Block_0.tim, _1_Pulsing40_0.tim, _0_TestBloomFilteredLucene40Postings_0.prx, _1_TestBloomFilteredLucene40Postings_0.blm, _0_Pulsing40_0.prx, _1.fnm, _0_Pulsing40_0.frq, _1_Pulsing40_0.frq, _1_TestBloomFilteredLucene40Postings_0.tip, _1_Memory_0.ram, _1_Pulsing40_0.prx, _0_Pulsing40_0.tip, _0_TestBloomFilteredLucene40Postings_0.frq, _1_TestBloomFilteredLucene40Postings_0.tim, _0.si, _1_Block_0.doc, _1_Block_0.pos, _1_Block_0.tip, _0_TestBloomFilteredLucene40Postings_0.tim, _1_nrm.cfs, _0_TestBloomFilteredLucene40Postings_0.tip, _0_TestBloomFilteredLucene40Postings_0.blm, _0_Block_0.doc, _0_Pulsing40_0.tim, _0.fnm, _1_TestBloomFilteredLucene40Postings_0.prx, _1_Block_0.tim, _0_Memory_0.ram, _0_nrm.cfs, _1_TestBloomFilteredLucene40Postings_0.frq, _1_nrm.cfe, _1.fdx, _1.fdt, _1.si, _0_nrm.cfe, _0.fdx, segments_3, _0.fdt]
[junit4:junit4]   2> 3402 T1293 C124 oasc.SolrDeletionPolicy.updateCommits newest commit = 3
[junit4:junit4]   2> 3404 T1293 C124 oass.SolrIndexSearcher.<init> Opening Searcher@4cf5286d main
[junit4:junit4]   2> 3404 T1293 C124 oass.SolrIndexSearcher.getIndexDir WARNING WARNING: Directory impl does not support setting indexDir: org.apache.lucene.store.MockDirectoryWrapper
[junit4:junit4]   2> 3404 T1299 oasc.SolrCore.registerSearcher [collection1] Registered new searcher Searcher@4cf5286d main{StandardDirectoryReader(segments_3:5:nrt _0(5.0):C1 _1(5.0):C2)}
[junit4:junit4]   2> 3405 T1293 C124 oasu.DirectUpdateHandler2.commit end_commit_flush
[junit4:junit4]   2> 3405 T1293 C124 UPDATE [collection1] webapp=/solr path=/update params={waitSearcher=true&commit=true&wt=javabin&expungeDeletes=false&version=2&softCommit=false} {add=[2 (1413131415531290624), 3 (1413131415533387776)],commit=} 0 8
[junit4:junit4]   2> 3411 T1303 C125 oasc.SolrDeletionPolicy.onCommit SolrDeletionPolicy.onCommit: commits:num=2
[junit4:junit4]   2> 		commit{dir=MockDirWrapper(org.apache.lucene.store.NIOFSDirectory@/usr/home/hudson/hudson-slave/workspace/Lucene-Solr-Tests-trunk-Java6/solr/build/solr-core/test/J0/index3450234510tmp lockFactory=org.apache.lucene.store.NativeFSLockFactory@65ca273f),segFN=segments_1,generation=1,filenames=[segments_1]
[junit4:junit4]   2> 		commit{dir=MockDirWrapper(org.apache.lucene.store.NIOFSDirectory@/usr/home/hudson/hudson-slave/workspace/Lucene-Solr-Tests-trunk-Java6/solr/build/solr-core/test/J0/index3450234510tmp lockFactory=org.apache.lucene.store.NativeFSLockFactory@65ca273f),segFN=segments_2,generation=2,filenames=[_0_TestBloomFilteredLucene40Postings_0.tim, _0_Block_0.pos, _0_Block_0.tip, _0_TestBloomFilteredLucene40Postings_0.blm, _0_TestBloomFilteredLucene40Postings_0.tip, _0.fnm, _0_Pulsing40_0.tim, _0_Block_0.doc, _0_Memory_0.ram, _0_Block_0.tim, _0_TestBloomFilteredLucene40Postings_0.prx, _0_nrm.cfs, _0_Pulsing40_0.prx, _0_Pulsing40_0.frq, _0_nrm.cfe, _0_Pulsing40_0.tip, segments_2, _0_TestBloomFilteredLucene40Postings_0.frq, _0.fdx, _0.si, _0.fdt]
[junit4:junit4]   2> 3412 T1303 C125 oasc.SolrDeletionPolicy.updateCommits newest commit = 2
[junit4:junit4]   2> 3418 T1303 C125 oass.SolrIndexSearcher.<init> Opening Searcher@13d2c6a main
[junit4:junit4]   2> 3418 T1303 C125 oass.SolrIndexSearcher.getIndexDir WARNING WARNING: Directory impl does not support setting indexDir: org.apache.lucene.store.MockDirectoryWrapper
[junit4:junit4]   2> 3419 T1309 oasc.SolrCore.registerSearcher [collection1] Registered new searcher Searcher@13d2c6a main{StandardDirectoryReader(segments_2:3:nrt _0(5.0):C3)}
[junit4:junit4]   2> 3419 T1303 C125 oasu.DirectUpdateHandler2.commit end_commit_flush
[junit4:junit4]   2> 3419 T1303 C125 UPDATE [collection1] webapp=/solr path=/update params={waitSearcher=true&commit=true&wt=javabin&expungeDeletes=false&version=2&softCommit=false} {add=[2 (1413131415531290624), 3 (1413131415533387776), 4 (1413131415533387777)],commit=} 0 22
[junit4:junit4]   2> 3421 T1292 C124 REQ [collection1] webapp=/solr path=/select params={wt=javabin&q=*:*&version=2} hits=3 status=0 QTime=0 
[junit4:junit4]   2> 3424 T1302 C125 REQ [collection1] webapp=/solr path=/select params={wt=javabin&q=*:*&version=2} hits=3 status=0 QTime=0 
[junit4:junit4]   2> 3425 T1289 oasu.SolrCmdDistributor.distribCommit Distrib commit to:[StdNode: http://localhost:39775/solr/, StdNode: http://localhost:29147/solr/]
[junit4:junit4]   2> 3427 T1303 C125 oasu.DirectUpdateHandler2.commit start commit{flags=0,_version_=0,optimize=false,openSearcher=true,waitSearcher=true,expungeDeletes=false,softCommit=false}
[junit4:junit4]   2> 3427 T1293 C124 oasu.DirectUpdateHandler2.commit start commit{flags=0,_version_=0,optimize=false,openSearcher=true,waitSearcher=true,expungeDeletes=false,softCommit=false}
[junit4:junit4]   2> 3427 T1303 C125 oass.SolrIndexSearcher.<init> Opening Searcher@4c34e9e main
[junit4:junit4]   2> 3427 T1303 C125 oass.SolrIndexSearcher.getIndexDir WARNING WARNING: Directory impl does not support setting indexDir: org.apache.lucene.store.MockDirectoryWrapper
[junit4:junit4]   2> 3428 T1303 C125 oasu.DirectUpdateHandler2.commit end_commit_flush
[junit4:junit4]   2> 3428 T1293 C124 oass.SolrIndexSearcher.<init> Opening Searcher@5461314a main
[junit4:junit4]   2> 3428 T1309 oasc.SolrCore.registerSearcher [collection1] Registered new searcher Searcher@4c34e9e main{StandardDirectoryReader(segments_2:3:nrt _0(5.0):C3)}
[junit4:junit4]   2> 3428 T1293 C124 oass.SolrIndexSearcher.getIndexDir WARNING WARNING: Directory impl does not support setting indexDir: org.apache.lucene.store.MockDirectoryWrapper
[junit4:junit4]   2> 3428 T1303 C125 UPDATE [collection1] webapp=/solr path=/update params={waitSearcher=true&commit=true&expungeDeletes=false&wt=javabin&softCommit=false&version=2} {commit=} 0 1
[junit4:junit4]   2> 3428 T1299 oasc.SolrCore.registerSearcher [collection1] Registered new searcher Searcher@5461314a main{StandardDirectoryReader(segments_3:5:nrt _0(5.0):C1 _1(5.0):C2)}
[junit4:junit4]   2> 3428 T1293 C124 oasu.DirectUpdateHandler2.commit end_commit_flush
[junit4:junit4]   2> 3429 T1293 C124 UPDATE [collection1] webapp=/solr path=/update params={waitSearcher=true&commit=true&expungeDeletes=false&wt=javabin&softCommit=false&version=2} {commit=} 0 2
[junit4:junit4]   2> 3432 T1293 C124 oasu.DirectUpdateHandler2.commit start commit{flags=0,_version_=0,optimize=false,openSearcher=true,waitSearcher=true,expungeDeletes=false,softCommit=false}
[junit4:junit4]   2> 3432 T1303 C125 oasu.DirectUpdateHandler2.commit start commit{flags=0,_version_=0,optimize=false,openSearcher=true,waitSearcher=true,expungeDeletes=false,softCommit=false}
[junit4:junit4]   2> 3432 T1293 C124 oasc.SolrDeletionPolicy.onCommit SolrDeletionPolicy.onCommit: commits:num=2
[junit4:junit4]   2> 		commit{dir=MockDirWrapper(org.apache.lucene.store.RAMDirectory@73f2153f lockFactory=org.apache.lucene.store.NativeFSLockFactory@41a09716),segFN=segments_3,generation=3,filenames=[_0_Block_0.tip, _0_Block_0.pos, _1_Pulsing40_0.tip, _0_Block_0.tim, _1_Pulsing40_0.tim, _0_TestBloomFilteredLucene40Postings_0.prx, _1_TestBloomFilteredLucene40Postings_0.blm, _0_Pulsing40_0.prx, _1.fnm, _0_Pulsing40_0.frq, _1_Pulsing40_0.frq, _1_TestBloomFilteredLucene40Postings_0.tip, _1_Memory_0.ram, _1_Pulsing40_0.prx, _0_Pulsing40_0.tip, _0_TestBloomFilteredLucene40Postings_0.frq, _1_TestBloomFilteredLucene40Postings_0.tim, _0.si, _1_Block_0.doc, _1_Block_0.pos, _1_Block_0.tip, _0_TestBloomFilteredLucene40Postings_0.tim, _1_nrm.cfs, _0_TestBloomFilteredLucene40Postings_0.tip, _0_TestBloomFilteredLucene40Postings_0.blm, _0_Block_0.doc, _0_Pulsing40_0.tim, _0.fnm, _1_TestBloomFilteredLucene40Postings_0.prx, _1_Block_0.tim, _0_Memory_0.ram, _0_nrm.cfs, _1_TestBloomFilteredLucene40Postings_0.frq, _1_nrm.cfe, _1.fdx, _1.fdt, _1.si, _0_nrm.cfe, _0.fdx, segments_3, _0.fdt]
[junit4:junit4]   2> 		commit{dir=MockDirWrapper(org.apache.lucene.store.RAMDirectory@73f2153f lockFactory=org.apache.lucene.store.NativeFSLockFactory@41a09716),segFN=segments_4,generation=4,filenames=[_0_Block_0.tip, _0_Block_0.pos, _1_Pulsing40_0.tip, _0_Block_0.tim, _1_Pulsing40_0.tim, _0_TestBloomFilteredLucene40Postings_0.prx, _1_TestBloomFilteredLucene40Postings_0.blm, _0_Pulsing40_0.prx, _1.fnm, _0_Pulsing40_0.frq, _1_Pulsing40_0.frq, _1_TestBloomFilteredLucene40Postings_0.tip, _1_Memory_0.ram, _1_Pulsing40_0.prx, _0_Pulsing40_0.tip, _0_TestBloomFilteredLucene40Postings_0.frq, _1_TestBloomFilteredLucene40Postings_0.tim, _0.si, _1_Block_0.doc, _1_Block_0.pos, _1_Block_0.tip, _0_TestBloomFilteredLucene40Postings_0.tim, _1_nrm.cfs, _0_TestBloomFilteredLucene40Postings_0.tip, _0_TestBloomFilteredLucene40Postings_0.blm, _0_Block_0.doc, _0_Pulsing40_0.tim, _0.fnm, _1_TestBloomFilteredLucene40Postings_0.prx, _1_Block_0.tim, _0_Memory_0.ram, _0_nrm.cfs, _1_1.del, _1_TestBloomFilteredLucene40Postings_0.frq, _1_nrm.cfe, _1.fdx, _1.fdt, _1.si, _0_nrm.cfe, _0.fdx, _0.fdt, segments_4]
[junit4:junit4]   2> 3433 T1293 C124 oasc.SolrDeletionPolicy.updateCommits newest commit = 4
[junit4:junit4]   2> 3433 T1293 C124 oass.SolrIndexSearcher.<init> Opening Searcher@191a9dd3 main
[junit4:junit4]   2> 3433 T1293 C124 oass.SolrIndexSearcher.getIndexDir WARNING WARNING: Directory impl does not support setting indexDir: org.apache.lucene.store.MockDirectoryWrapper
[junit4:junit4]   2> 3434 T1299 oasc.SolrCore.registerSearcher [collection1] Registered new searcher Searcher@191a9dd3 main{StandardDirectoryReader(segments_4:6:nrt _0(5.0):C1 _1(5.0):C2/1)}
[junit4:junit4]   2> 3434 T1293 C124 oasu.DirectUpdateHandler2.commit end_commit_flush
[junit4:junit4]   2> 3434 T1293 C124 UPDATE [collection1] webapp=/solr path=/update params={waitSearcher=true&commit=true&wt=javabin&expungeDeletes=false&version=2&softCommit=false} {delete=[2 (-1413131415566942208)],commit=} 0 3
[junit4:junit4]   2> 3435 T1303 C125 oasc.SolrDeletionPolicy.onCommit SolrDeletionPolicy.onCommit: commits:num=2
[junit4:junit4]   2> 		commit{dir=MockDirWrapper(org.apache.lucene.store.NIOFSDirectory@/usr/home/hudson/hudson-slave/workspace/Lucene-Solr-Tests-trunk-Java6/solr/build/solr-core/test/J0/index3450234510tmp lockFactory=org.apache.lucene.store.NativeFSLockFactory@65ca273f),segFN=segments_2,generation=2,filenames=[_0_TestBloomFilteredLucene40Postings_0.tim, _0_Block_0.pos, _0_Block_0.tip, _0_TestBloomFilteredLucene40Postings_0.blm, _0_TestBloomFilteredLucene40Postings_0.tip, _0.fnm, _0_Pulsing40_0.tim, _0_Block_0.doc, _0_Memory_0.ram, _0_Block_0.tim, _0_TestBloomFilteredLucene40Postings_0.prx, _0_nrm.cfs, _0_Pulsing40_0.prx, _0_Pulsing40_0.frq, _0_nrm.cfe, _0_Pulsing40_0.tip, segments_2, _0_TestBloomFilteredLucene40Postings_0.frq, _0.fdx, _0.si, _0.fdt]
[junit4:junit4]   2> 		commit{dir=MockDirWrapper(org.apache.lucene.store.NIOFSDirectory@/usr/home/hudson/hudson-slave/workspace/Lucene-Solr-Tests-trunk-Java6/solr/build/solr-core/test/J0/index3450234510tmp lockFactory=org.apache.lucene.store.NativeFSLockFactory@65ca273f),segFN=segments_3,generation=3,filenames=[_0_TestBloomFilteredLucene40Postings_0.tim, _0_Block_0.pos, _0_Block_0.tip, _0_TestBloomFilteredLucene40Postings_0.blm, _0_TestBloomFilteredLucene40Postings_0.tip, _0.fnm, _0_Pulsing40_0.tim, _0_Block_0.doc, _0_Memory_0.ram, _0_Block_0.tim, _0_TestBloomFilteredLucene40Postings_0.prx, _0_1.del, _0_nrm.cfs, _0_Pulsing40_0.prx, _0_Pulsing40_0.frq, _0_nrm.cfe, _0_Pulsing40_0.tip, _0_TestBloomFilteredLucene40Postings_0.frq, _0.fdx, _0.si, _0.fdt, segments_3]
[junit4:junit4]   2> 3436 T1303 C125 oasc.SolrDeletionPolicy.updateCommits newest commit = 3
[junit4:junit4]   2> 3437 T1303 C125 oass.SolrIndexSearcher.<init> Opening Searcher@1518de2c main
[junit4:junit4]   2> 3437 T1303 C125 oass.SolrIndexSearcher.getIndexDir WARNING WARNING: Directory impl does not support setting indexDir: org.apache.lucene.store.MockDirectoryWrapper
[junit4:junit4]   2> 3438 T1309 oasc.SolrCore.registerSearcher [collection1] Registered new searcher Searcher@1518de2c main{StandardDirectoryReader(segments_3:4:nrt _0(5.0):C3/1)}
[junit4:junit4]   2> 3438 T1303 C125 oasu.DirectUpdateHandler2.commit end_commit_flush
[junit4:junit4]   2> 3438 T1303 C125 UPDATE [collection1] webapp=/solr path=/update params={waitSearcher=true&commit=true&wt=javabin&expungeDeletes=false&version=2&softCommit=false} {delete=[2 (-1413131415566942208)],commit=} 0 7
[junit4:junit4]   2> 3441 T1292 C124 REQ [collection1] webapp=/solr path=/select params={wt=javabin&q=*:*&version=2} hits=2 status=0 QTime=0 
[junit4:junit4]   2> 3444 T1302 C125 REQ [collection1] webapp=/solr path=/select params={wt=javabin&q=*:*&version=2} hits=2 status=0 QTime=0 
[junit4:junit4]   2> 3447 T1302 C125 oasu.DirectUpdateHandler2.commit start commit{flags=0,_version_=0,optimize=true,openSearcher=true,waitSearcher=true,expungeDeletes=false,softCommit=false}
[junit4:junit4]   2> 3463 T1302 C125 oasc.SolrDeletionPolicy.onCommit SolrDeletionPolicy.onCommit: commits:num=2
[junit4:junit4]   2> 		commit{dir=MockDirWrapper(org.apache.lucene.store.NIOFSDirectory@/usr/home/hudson/hudson-slave/workspace/Lucene-Solr-Tests-trunk-Java6/solr/build/solr-core/test/J0/index3450234510tmp lockFactory=org.apache.lucene.store.NativeFSLockFactory@65ca273f),segFN=segments_3,generation=3,filenames=[_0_TestBloomFilteredLucene40Postings_0.tim, _0_Block_0.pos, _0_Block_0.tip, _0_TestBloomFilteredLucene40Postings_0.blm, _0_TestBloomFilteredLucene40Postings_0.tip, _0.fnm, _0_Pulsing40_0.tim, _0_Block_0.doc, _0_Memory_0.ram, _0_Block_0.tim, _0_TestBloomFilteredLucene40Postings_0.prx, _0_1.del, _0_nrm.cfs, _0_Pulsing40_0.prx, _0_Pulsing40_0.frq, _0_nrm.cfe, _0_Pulsing40_0.tip, _0_TestBloomFilteredLucene40Postings_0.frq, _0.fdx, _0.si, _0.fdt, segments_3]
[junit4:junit4]   2> 		commit{dir=MockDirWrapper(org.apache.lucene.store.NIOFSDirectory@/usr/home/hudson/hudson-slave/workspace/Lucene-Solr-Tests-trunk-Java6/solr/build/solr-core/test/J0/index3450234510tmp lockFactory=org.apache.lucene.store.NativeFSLockFactory@65ca273f),segFN=segments_4,generation=4,filenames=[_1_Block_0.pos, _1_Block_0.tip, _1_nrm.cfs, _1_TestBloomFilteredLucene40Postings_0.prx, _1_Pulsing40_0.tip, _1_Block_0.tim, _1_Pulsing40_0.tim, _1_TestBloomFilteredLucene40Postings_0.blm, _1.fnm, _1_TestBloomFilteredLucene40Postings_0.frq, _1_nrm.cfe, _1_Pulsing40_0.frq, _1.fdx, _1_TestBloomFilteredLucene40Postings_0.tip, _1_Memory_0.ram, _1.fdt, _1.si, _1_Pulsing40_0.prx, _1_TestBloomFilteredLucene40Postings_0.tim, _1_Block_0.doc, segments_4]
[junit4:junit4]   2> 3463 T1302 C125 oasc.SolrDeletionPolicy.updateCommits newest commit = 4
[junit4:junit4]   2> 3475 T1302 C125 oass.SolrIndexSearcher.<init> Opening Searcher@1fd9549 main
[junit4:junit4]   2> 3475 T1302 C125 oass.SolrIndexSearcher.getIndexDir WARNING WARNING: Directory impl does not support setting indexDir: org.apache.lucene.store.MockDirectoryWrapper
[junit4:junit4]   2> 3475 T1302 C125 oasu.DirectUpdateHandler2.commit end_commit_flush
[junit4:junit4]   2> 3475 T1309 oasc.SolrCore.registerSearcher [collection1] Registered new searcher Searcher@1fd9549 main{StandardDirectoryReader(segments_4:6:nrt _1(5.0):C2)}
[junit4:junit4]   2> 3480 T1302 C125 UPDATE [collection1] webapp=/solr path=/update params={optimize=true&maxSegments=1&waitSearcher=true&wt=javabin&version=2} {optimize=} 0 33
[junit4:junit4]   2> 3483 T1312 C126 oasu.DirectUpdateHandler2.commit start commit{flags=0,_version_=0,optimize=true,openSearcher=true,waitSearcher=true,expungeDeletes=false,softCommit=false}
[junit4:junit4]   2> 3484 T1312 C126 oass.SolrIndexSearcher.<init> Opening Searcher@2ed51b42 main
[junit4:junit4]   2> 3484 T1312 C126 oass.SolrIndexSearcher.getIndexDir WARNING WARNING: Directory impl does not support setting indexDir: org.apache.lucene.store.MockDirectoryWrapper
[junit4:junit4]   2> 3484 T1319 oasc.SolrCore.registerSearcher [collection1] Registered new searcher Searcher@2ed51b42 main{StandardDirectoryReader(segments_1:1:nrt)}
[junit4:junit4]   2> 3484 T1312 C126 oasu.DirectUpdateHandler2.commit end_commit_flush
[junit4:junit4]   2> 3485 T1312 C126 UPDATE [collection1] webapp=/solr path=/update params={optimize=true&maxSegments=1&waitSearcher=true&wt=javabin&version=2} {optimize=} 0 2
[junit4:junit4]   2> 3487 T1322 C127 oasu.DirectUpdateHandler2.commit start commit{flags=0,_version_=0,optimize=true,openSearcher=true,waitSearcher=true,expungeDeletes=false,softCommit=false}
[junit4:junit4]   2> 3488 T1322 C127 oass.SolrIndexSearcher.<init> Opening Searcher@4e20a264 main
[junit4:junit4]   2> 3488 T1322 C127 oass.SolrIndexSearcher.getIndexDir WARNING WARNING: Directory impl does not support setting indexDir: org.apache.lucene.store.MockDirectoryWrapper
[junit4:junit4]   2> 3488 T1329 oasc.SolrCore.registerSearcher [collection1] Registered new searcher Searcher@4e20a264 main{StandardDirectoryReader(segments_1:1:nrt)}
[junit4:junit4]   2> 3488 T1322 C127 oasu.DirectUpdateHandler2.commit end_commit_flush
[junit4:junit4]   2> 3489 T1322 C127 UPDATE [collection1] webapp=/solr path=/update params={optimize=true&maxSegments=1&waitSearcher=true&wt=javabin&version=2} {optimize=} 0 2
[junit4:junit4]   2> 3491 T1332 C128 oasu.DirectUpdateHandler2.commit start commit{flags=0,_version_=0,optimize=true,openSearcher=true,waitSearcher=true,expungeDeletes=false,softCommit=false}
[junit4:junit4]   2> 3492 T1332 C128 oass.SolrIndexSearcher.<init> Opening Searcher@7b625ef9 main
[junit4:junit4]   2> 3492 T1332 C128 oass.SolrIndexSearcher.getIndexDir WARNING WARNING: Directory impl does not support setting indexDir: org.apache.lucene.store.MockDirectoryWrapper
[junit4:junit4]   2> 3492 T1339 oasc.SolrCore.registerSearcher [collection1] Registered new searcher Searcher@7b625ef9 main{StandardDirectoryReader(segments_1:1:nrt)}
[junit4:junit4]   2> 3492 T1332 C128 oasu.DirectUpdateHandler2.commit end_commit_flush
[junit4:junit4]   2> 3492 T1332 C128 UPDATE [collection1] webapp=/solr path=/update params={optimize=true&maxSegments=1&waitSearcher=true&wt=javabin&version=2} {optimize=} 0 1
[junit4:junit4]   2> 3514 T1314 C126 oasu.DirectUpdateHandler2.commit start commit{flags=0,_version_=0,optimize=false,openSearcher=true,waitSearcher=true,expungeDeletes=false,softCommit=false}
[junit4:junit4]   2> 3518 T1325 C127 oasu.DirectUpdateHandler2.commit start commit{flags=0,_version_=0,optimize=false,openSearcher=true,waitSearcher=true,expungeDeletes=false,softCommit=false}
[junit4:junit4]   2> 3521 T1333 C128 oasu.DirectUpdateHandler2.commit start commit{flags=0,_version_=0,optimize=false,openSearcher=true,waitSearcher=true,expungeDeletes=false,softCommit=false}
[junit4:junit4]   2> 3523 T1314 C126 oasc.SolrDeletionPolicy.onCommit SolrDeletionPolicy.onCommit: commits:num=2
[junit4:junit4]   2> 		commit{dir=MockDirWrapper(org.apache.lucene.store.RAMDirectory@38d2c662 lockFactory=org.apache.lucene.store.NativeFSLockFactory@3cc4699c),segFN=segments_1,generation=1,filenames=[segments_1]
[junit4:junit4]   2> 		commit{dir=MockDirWrapper(org.apache.lucene.store.RAMDirectory@38d2c662 lockFactory=org.apache.lucene.store.NativeFSLockFactory@3cc4699c),segFN=segments_2,generation=2,filenames=[_0_Block_0.tip, _0_Block_0.pos, _1_Pulsing40_0.tip, _0_Block_0.tim, _1_Pulsing40_0.tim, _0_TestBloomFilteredLucene40Postings_0.prx, _1_TestBloomFilteredLucene40Postings_0.blm, _0_Pulsing40_0.prx, _1.fnm, _0_Pulsing40_0.frq, _1_Pulsing40_0.frq, _1_TestBloomFilteredLucene40Postings_0.tip, _1_Memory_0.ram, _1_Pulsing40_0.prx, _0_Pulsing40_0.tip, _0_TestBloomFilteredLucene40Postings_0.frq, _1_TestBloomFilteredLucene40Postings_0.tim, _0.si, _1_Block_0.doc, _1_Block_0.pos, _1_Block_0.tip, _0_TestBloomFilteredLucene40Postings_0.tim, _1_nrm.cfs, _0_TestBloomFilteredLucene40Postings_0.tip, _0_TestBloomFilteredLucene40Postings_0.blm, _0_Block_0.doc, _0_Pulsing40_0.tim, _0.fnm, _1_TestBloomFilteredLucene40Postings_0.prx, _1_Block_0.tim, _0_Memory_0.ram, _0_nrm.cfs, _1_TestBloomFilteredLucene40Postings_0.frq, _1_nrm.cfe, _1.fdx, _1.fdt, _1.si, _0_nrm.cfe, segments_2, _0.fdx, _0.fdt]
[junit4:junit4]   2> 3524 T1314 C126 oasc.SolrDeletionPolicy.updateCommits newest commit = 2
[junit4:junit4]   2> 3524 T1305 C125 oasu.DirectUpdateHandler2.commit start commit{flags=0,_version_=0,optimize=false,openSearcher=true,waitSearcher=true,expungeDeletes=false,softCommit=false}
[junit4:junit4]   2> 3528 T1325 C127 oasc.SolrDeletionPolicy.onCommit SolrDeletionPolicy.onCommit: commits:num=2
[junit4:junit4]   2> 		commit{dir=MockDirWrapper(org.apache.lucene.store.RAMDirectory@74834659 lockFactory=org.apache.lucene.store.NativeFSLockFactory@5b3ecdb4),segFN=segments_1,generation=1,filenames=[segments_1]
[junit4:junit4]   2> 		commit{dir=MockDirWrapper(org.apache.lucene.store.RAMDirectory@74834659 lockFactory=org.apache.lucene.store.NativeFSLockFactory@5b3ecdb4),segFN=segments_2,generation=2,filenames=[_0_Block_0.tip, _2_Block_0.pos, _1_Pulsing40_0.tip, _2_TestBloomFilteredLucene40Postings_0.prx, _0_Block_0.tim, _1_Pulsing40_0.tim, _2_TestBloomFilteredLucene40Postings_0.blm, _0_Pulsing40_0.prx, _0_Pulsing40_0.frq, _1.fnm, _1_Pulsing40_0.frq, _1_Pulsing40_0.prx, _0_TestBloomFilteredLucene40Postings_0.frq, _1_Block_0.doc, _2_Pulsing40_0.prx, _1_Block_0.tip, _1_Block_0.pos, _0_TestBloomFilteredLucene40Postings_0.tim, _2_TestBloomFilteredLucene40Postings_0.tim, _0_TestBloomFilteredLucene40Postings_0.blm, _0_TestBloomFilteredLucene40Postings_0.tip, _0.fnm, _0_Pulsing40_0.tim, _1_Block_0.tim, _0_Memory_0.ram, _2.fdt, _2.fdx, _2_Pulsing40_0.frq, _2_TestBloomFilteredLucene40Postings_0.tip, _1_TestBloomFilteredLucene40Postings_0.frq, _1.fdx, _1.fdt, _2.si, _0_Block_0.pos, _2_Pulsing40_0.tim, _2_Block_0.tim, _2_Block_0.tip, _2_Pulsing40_0.tip, _0_TestBloomFilteredLucene40Postings_0.prx, _1_TestBloomFilteredLucene40Postings_0.blm, _1_TestBloomFilteredLucene40Postings_0.tip, _2_nrm.cfe, _1_Memory_0.ram, _0_Pulsing40_0.tip, _2_Memory_0.ram, _2_nrm.cfs, _0.si, _1_TestBloomFilteredLucene40Postings_0.tim, _2_TestBloomFilteredLucene40Postings_0.frq, _1_nrm.cfs, _1_TestBloomFilteredLucene40Postings_0.prx, _0_Block_0.doc, _0_nrm.cfs, _2.fnm, _1_nrm.cfe, _1.si, _0_nrm.cfe, segments_2, _0.fdx, _2_Block_0.doc, _0.fdt]
[junit4:junit4]   2> 3529 T1325 C127 oasc.SolrDeletionPolicy.updateCommits newest commit = 2
[junit4:junit4]   2> 3562 T1314 C126 oass.SolrIndexSearcher.<init> Opening Searcher@1ed6b3b9 main
[junit4:junit4]   2> 3563 T1314 C126 oass.SolrIndexSearcher.getIndexDir WARNING WARNING: Directory impl does not support setting indexDir: org.apache.lucene.store.MockDirectoryWrapper
[junit4:junit4]   2> 3566 T1319 oasc.SolrCore.registerSearcher [collection1] Registered new searcher Searcher@1ed6b3b9 main{StandardDirectoryReader(segments_2:11:nrt _0(5.0):C21 _1(5.0):C8 _2(5.0):C9 _3(5.0):C1)}
[junit4:junit4]   2> 3566 T1314 C126 oasu.DirectUpdateHandler2.commit end_commit_flush
[junit4:junit4]   2> 3567 T1314 C126 UPDATE [collection1] webapp=/solr path=/update params={waitSearcher=true&commit=true&wt=javabin&expungeDeletes=false&version=2&softCommit=false} {add=[24 (1413131415646633984), 28 (1413131415646633986), 30 (1413131415647682560), 31 (1413131415648731137), 33 (1413131415649779712), 38 (1413131415650828289), 39 (1413131415651876865), 40 (1413131415651876868), 42 (1413131415652925441), 44 (1413131415653974016)],commit=} 0 61
[junit4:junit4]   2> 3567 T1313 C126 oasu.DirectUpdateHandler2.commit start commit{flags=0,_version_=0,optimize=false,openSearcher=true,waitSearcher=true,expungeDeletes=false,softCommit=false}
[junit4:junit4]   2> 3568 T1333 C128 oasc.SolrDeletionPolicy.onCommit SolrDeletionPolicy.onCommit: commits:num=2
[junit4:junit4]   2> 		commit{dir=MockDirWrapper(org.apache.lucene.store.RAMDirectory@65440a34 lockFactory=org.apache.lucene.store.NativeFSLockFactory@1427609d),segFN=segments_1,generation=1,filenames=[segments_1]
[junit4:junit4]   2> 		commit{dir=MockDirWrapper(org.apache.lucene.store.RAMDirectory@65440a34 lockFactory=org.apache.lucene.store.NativeFSLockFactory@1427609d),segFN=segments_2,generation=2,filenames=[_2_Block_0.pos, _0_Block_0.tip, _2_TestBloomFilteredLucene40Postings_0.prx, _1_Pulsing40_0.tip, _0_Block_0.tim, _2_TestBloomFilteredLucene40Postings_0.blm, _1_Pulsing40_0.tim, _0_Pulsing40_0.prx, _1.fnm, _0_Pulsing40_0.frq, _1_Pulsing40_0.frq, _1_Pulsing40_0.prx, _0_TestBloomFilteredLucene40Postings_0.frq, _1_Block_0.doc, _2_Pulsing40_0.prx, _1_Block_0.pos, _1_Block_0.tip, _2_TestBloomFilteredLucene40Postings_0.tim, _0_TestBloomFilteredLucene40Postings_0.tim, _0_TestBloomFilteredLucene40Postings_0.blm, _0_TestBloomFilteredLucene40Postings_0.tip, _0.fnm, _0_Pulsing40_0.tim, _1_Block_0.tim, _0_Memory_0.ram, _2.fdt, _2.fdx, _1_TestBloomFilteredLucene40Postings_0.frq, _2_TestBloomFilteredLucene40Postings_0.tip, _2_Pulsing40_0.frq, _1.fdx, _1.fdt, _2.si, _0_Block_0.pos, _2_Pulsing40_0.tim, _2_Block_0.tim, _2_Pulsing40_0.tip, _2_Block_0.tip, _0_TestBloomFilteredLucene40Postings_0.prx, _1_TestBloomFilteredLucene40Postings_0.blm, _1_TestBloomFilteredLucene40Postings_0.tip, _1_Memory_0.ram, _2_nrm.cfe, _0_Pulsing40_0.tip, _2_Memory_0.ram, _1_TestBloomFilteredLucene40Postings_0.tim, _0.si, _2_nrm.cfs, _2_TestBloomFilteredLucene40Postings_0.frq, _1_nrm.cfs, _0_Block_0.doc, _1_TestBloomFilteredLucene40Postings_0.prx, _0_nrm.cfs, _1_nrm.cfe, _2.fnm, _1.si, _0_nrm.cfe, segments_2, _0.fdx, _2_Block_0.doc, _0.fdt]
[junit4:junit4]   2> 3913 T1333 C128 oasc.SolrDeletionPolicy.updateCommits newest commit = 2
[junit4:junit4]   2> 3915 T1325 C127 oass.SolrIndexSearcher.<init> Opening Searcher@378fd3eb main
[junit4:junit4]   2> 3916 T1325 C127 oass.SolrIndexSearcher.getIndexDir WARNING WARNING: Directory impl does not support setting indexDir: org.apache.lucene.store.MockDirectoryWrapper
[junit4:junit4]   2> 3917 T1329 oasc.SolrCore.registerSearcher [collection1] Registered new searcher Searcher@378fd3eb main{StandardDirectoryReader(segments_2:13:nrt _0(5.0):C23 _1(5.0):C13 _2(5.0):C1 _3(5.0):C14 _4(5.0):C8)}
[junit4:junit4]   2> 3917 T1325 C127 oasu.DirectUpdateHandler2.commit end_commit_flush
[junit4:junit4]   2> 3918 T1325 C127 UPDATE [collection1] webapp=/solr path=/update params={waitSearcher=true&commit=true&wt=javabin&expungeDeletes=false&version=2&softCommit=false} {add=[45 (1413131415649779713), 48 (1413131415651876864), 50 (1413131415651876866), 51 (1413131415651876868), 53 (1413131415652925441), 59 (1413131415652925444), 63 (1413131415653974017), 65 (1413131415655022593), 66 (1413131415656071168), 71 (1413131415657119746)],commit=} 0 408
[junit4:junit4]   2> 3918 T1323 C127 oasu.DirectUpdateHandler2.commit start commit{flags=0,_version_=0,optimize=false,openSearcher=true,waitSearcher=true,expungeDeletes=false,softCommit=false}
[junit4:junit4]   2> 3920 T1313 C126 oasc.SolrDeletionPolicy.onCommit SolrDeletionPolicy.onCommit: commits:num=2
[junit4:junit4]   2> 		commit{dir=MockDirWrapper(org.apache.lucene.store.RAMDirectory@38d2c662 lockFactory=org.apache.lucene.store.NativeFSLockFactory@3cc4699c),segFN=segments_2,generation=2,filenames=[_0_Block_0.tip, _0_Block_0.pos, _1_Pulsing40_0.tip, _0_Block_0.tim, _1_Pulsing40_0.tim, _0_TestBloomFilteredLucene40Postings_0.prx, _1_TestBloomFilteredLucene40Postings_0.blm, _0_Pulsing40_0.prx, _1.fnm, _0_Pulsing40_0.frq, _1_Pulsing40_0.frq, _1_TestBloomFilteredLucene40Postings_0.tip, _1_Memory_0.ram, _1_Pulsing40_0.prx, _0_Pulsing40_0.tip, _0_TestBloomFilteredLucene40Postings_0.frq, _1_TestBloomFilteredLucene40Postings_0.tim, _0.si, _1_Block_0.doc, _1_Block_0.pos, _1_Block_0.tip, _0_TestBloomFilteredLucene40Postings_0.tim, _1_nrm.cfs, _0_TestBloomFilteredLucene40Postings_0.tip, _0_TestBloomFilteredLucene40Postings_0.blm, _0_Block_0.doc, _0_Pulsing40_0.tim, _0.fnm, _1_TestBloomFilteredLucene40Postings_0.prx, _1_Block_0.tim, _0_Memory_0.ram, _0_nrm.cfs, _1_TestBloomFilteredLucene40Postings_0.frq, _1_nrm.cfe, _1.fdx, _1.fdt, _1.si, _0_nrm.cfe, segments_2, _0.fdx, _0.fdt]
[junit4:junit4]   2> 		commit{dir=MockDirWrapper(org.apache.lucene.store.RAMDirectory@38d2c662 lockFactory=org.apache.lucene.store.NativeFSLockFactory@3cc4699c),segFN=segments_3,generation=3,filenames=[_4_TestBloomFilteredLucene40Postings_0.frq, _5_nrm.cfe, _2_Block_0.pos, _5_Memory_0.ram, _3_TestBloomFilteredLucene40Postings_0.prx, _2_TestBloomFilteredLucene40Postings_0.blm, _3.fdt, _0_Pulsing40_0.frq, _0_TestBloomFilteredLucene40Postings_0.frq, _5_Pulsing40_0.tip, _3_TestBloomFilteredLucene40Postings_0.frq, _5_Pulsing40_0.tim, _1_Block_0.pos, _1_Block_0.tip, _3_TestBloomFilteredLucene40Postings_0.tim, _0_TestBloomFilteredLucene40Postings_0.blm, _0_Pulsing40_0.tim, _1_Block_0.tim, _0_Memory_0.ram, _2.fdt, _3_Pulsing40_0.tip, _3_TestBloomFilteredLucene40Postings_0.tip, _2.fdx, _3_Pulsing40_0.tim, _3_Block_0.pos, _3_Block_0.doc, _5_TestBloomFilteredLucene40Postings_0.frq, _1.fdx, _1.fdt, _5_nrm.cfs, _3.si, _3_TestBloomFilteredLucene40Postings_0.blm, _2.si, _3_Pulsing40_0.frq, _2_Pulsing40_0.tim, _2_Block_0.tim, _2_Pulsing40_0.tip, _2_Block_0.tip, _3.fnm, _5_Block_0.tim, _4_TestBloomFilteredLucene40Postings_0.prx, _4_Pulsing40_0.prx, _1_Memory_0.ram, _2_nrm.cfe, _5_Pulsing40_0.frq, _5_TestBloomFilteredLucene40Postings_0.blm, _0_Pulsing40_0.tip, _2_nrm.cfs, _5_Block_0.doc, _4_Block_0.pos, _2_TestBloomFilteredLucene40Postings_0.frq, _3_Block_0.tip, _4_TestBloomFilteredLucene40Postings_0.blm, _4_Block_0.tip, _2.fnm, _3.fdx, _4_Pulsing40_0.tip, _4_Pulsing40_0.tim, _5_Pulsing40_0.prx, _1.si, _4_TestBloomFilteredLucene40Postings_0.tim, _4_TestBloomFilteredLucene40Postings_0.tip, _3_nrm.cfe, _0_Block_0.tip, _5.fdt, _2_TestBloomFilteredLucene40Postings_0.prx, _1_Pulsing40_0.tip, _0_Block_0.tim, _1_Pulsing40_0.tim, _4_nrm.cfe, _4.fnm, _0_Pulsing40_0.prx, _1.fnm, _4.fdx, _1_Pulsing40_0.frq, _3_Block_0.tim, _1_Pulsing40_0.prx, _5_TestBloomFilteredLucene40Postings_0.prx, _1_Block_0.doc, _2_Pulsing40_0.prx, _2_TestBloomFilteredLucene40Postings_0.tim, _0_TestBloomFilteredLucene40Postings_0.tim, _0_TestBloomFilteredLucene40Postings_0.tip, _4_Block_0.tim, _0.fnm, _1_TestBloomFilteredLucene40Postings_0.frq, _2_TestBloomFilteredLucene40Postings_0.tip, _2_Pulsing40_0.frq, _5.si, _3_nrm.cfs, _4_Memory_0.ram, _4_nrm.cfs, _5_Block_0.tip, _0_Block_0.pos, _0_TestBloomFilteredLucene40Postings_0.prx, _1_TestBloomFilteredLucene40Postings_0.blm, _4_Block_0.doc, _1_TestBloomFilteredLucene40Postings_0.tip, _5_Block_0.pos, _2_Memory_0.ram, _1_TestBloomFilteredLucene40Postings_0.tim, _0.si, _3_Memory_0.ram, _1_nrm.cfs, _5.fnm, _0_Block_0.doc, _1_TestBloomFilteredLucene40Postings_0.prx, _4.si, _4.fdt, _0_nrm.cfs, _1_nrm.cfe, _4_Pulsing40_0.frq, _3_Pulsing40_0.prx, _0_nrm.cfe, _5.fdx, _0.fdx, _5_TestBloomFilteredLucene40Postings_0.tim, _2_Block_0.doc, _5_TestBloomFilteredLucene40Postings_0.tip, segments_3, _0.fdt]
[junit4:junit4]   2> 3921 T1313 C126 oasc.SolrDeletionPolicy.updateCommits newest commit = 3
[junit4:junit4]   2> 3927 T1323 C127 oasc.SolrDeletionPolicy.onCommit SolrDeletionPolicy.onCommit: commits:num=2
[junit4:junit4]   2> 		commit{dir=MockDirWrapper(org.apache.lucene.store.RAMDirectory@74834659 lockFactory=org.apache.lucene.store.NativeFSLockFactory@5b3ecdb4),segFN=segments_2,generation=2,filenames=[_0_Block_0.tip, _2_Block_0.pos, _1_Pulsing40_0.tip, _2_TestBloomFilteredLucene40Postings_0.prx, _0_Block_0.tim, _1_Pulsing40_0.tim, _2_TestBloomFilteredLucene40Postings_0.blm, _0_Pulsing40_0.prx, _0_Pulsing40_0.frq, _1.fnm, _1_Pulsing40_0.frq, _1_Pulsing40_0.prx, _0_TestBloomFilteredLucene40Postings_0.frq, _1_Block_0.doc, _2_Pulsing40_0.prx, _1_Block_0.tip, _1_Block_0.pos, _0_TestBloomFilteredLucene40Postings_0.tim, _2_TestBloomFilteredLucene40Postings_0.tim, _0_TestBloomFilteredLucene40Postings_0.blm, _0_TestBloomFilteredLucene40Postings_0.tip, _0.fnm, _0_Pulsing40_0.tim, _1_Block_0.tim, _0_Memory_0.ram, _2.fdt, _2.fdx, _2_Pulsing40_0.frq, _2_TestBloomFilteredLucene40Postings_0.tip, _1_TestBloomFilteredLucene40Postings_0.frq, _1.fdx, _1.fdt, _2.si, _0_Block_0.pos, _2_Pulsing40_0.tim, _2_Block_0.tim, _2_Block_0.tip, _2_Pulsing40_0.tip, _0_TestBloomFilteredLucene40Postings_0.prx, _1_TestBloomFilteredLucene40Postings_0.blm, _1_TestBloomFilteredLucene40Postings_0.tip, _2_nrm.cfe, _1_Memory_0.ram, _0_Pulsing40_0.tip, _2_Memory_0.ram, _2_nrm.cfs, _0.si, _1_TestBloomFilteredLucene40Postings_0.tim, _2_TestBloomFilteredLucene40Postings_0.frq, _1_nrm.cfs, _1_TestBloomFilteredLucene40Postings_0.prx, _0_Block_0.doc, _0_nrm.cfs, _2.fnm, _1_nrm.cfe, _1.si, _0_nrm.cfe, segments_2, _0.fdx, _2_Block_0.doc, _0.fdt]
[junit4:junit4]   2> 		commit{dir=MockDirWrapper(org.apache.lucene.store.RAMDirectory@74834659 lockFactory=org.apache.lucene.store.NativeFSLockFactory@5b3ecdb4),segFN=segments_3,generation=3,filenames=[_5_nrm.cfe, _4_TestBloomFilteredLucene40Postings_0.frq, _5_Memory_0.ram, _2_Block_0.pos, _3_TestBloomFilteredLucene40Postings_0.prx, _2_TestBloomFilteredLucene40Postings_0.blm, _3.fdt, _0_Pulsing40_0.frq, _6_Block_0.pos, _0_TestBloomFilteredLucene40Postings_0.frq, _5_Pulsing40_0.tip, _3_TestBloomFilteredLucene40Postings_0.frq, _5_Pulsing40_0.tim, _1_Block_0.pos, _1_Block_0.tip, _3_TestBloomFilteredLucene40Postings_0.tim, _0_TestBloomFilteredLucene40Postings_0.blm, _0_Pulsing40_0.tim, _1_Block_0.tim, _0_Memory_0.ram, _2.fdt, _3_Pulsing40_0.tip, _3_TestBloomFilteredLucene40Postings_0.tip, _2.fdx, _3_Pulsing40_0.tim, _3_Block_0.pos, _5_TestBloomFilteredLucene40Postings_0.frq, _3_Block_0.doc, _1.fdx, _5_nrm.cfs, _1.fdt, _3.si, _6.fdt, _3_TestBloomFilteredLucene40Postings_0.blm, _6_Memory_0.ram, _2.si, _3_Pulsing40_0.frq, _2_Pulsing40_0.tim, _2_Block_0.tim, _6.fdx, _2_Pulsing40_0.tip, _2_Block_0.tip, _3.fnm, _5_Block_0.tim, _4_TestBloomFilteredLucene40Postings_0.prx, _4_Pulsing40_0.prx, _1_Memory_0.ram, _2_nrm.cfe, _5_Pulsing40_0.frq, _5_TestBloomFilteredLucene40Postings_0.blm, _0_Pulsing40_0.tip, _2_nrm.cfs, _5_Block_0.doc, _4_Block_0.pos, _2_TestBloomFilteredLucene40Postings_0.frq, _3_Block_0.tip, _4_TestBloomFilteredLucene40Postings_0.blm, _4_Block_0.tip, _2.fnm, _3.fdx, _4_Pulsing40_0.tip, _4_Pulsing40_0.tim, _5_Pulsing40_0.prx, _1.si, _4_TestBloomFilteredLucene40Postings_0.tim, _6.si, _6.fnm, _4_TestBloomFilteredLucene40Postings_0.tip, _3_nrm.cfe, _0_Block_0.tip, _5.fdt, _2_TestBloomFilteredLucene40Postings_0.prx, _1_Pulsing40_0.tip, _6_Pulsing40_0.frq, _0_Block_0.tim, _1_Pulsing40_0.tim, _4.fnm, _4_nrm.cfe, _0_Pulsing40_0.prx, _1.fnm, _1_Pulsing40_0.frq, _4.fdx, _3_Block_0.tim, _6_Pulsing40_0.tim, _1_Pulsing40_0.prx, _5_TestBloomFilteredLucene40Postings_0.prx, _6_Pulsing40_0.tip, _1_Block_0.doc, _2_Pulsing40_0.prx, _2_TestBloomFilteredLucene40Postings_0.tim, _0_TestBloomFilteredLucene40Postings_0.tim, _0_TestBloomFilteredLucene40Postings_0.tip, _0.fnm, _4_Block_0.tim, _6_Block_0.doc, _1_TestBloomFilteredLucene40Postings_0.frq, _2_TestBloomFilteredLucene40Postings_0.tip, _2_Pulsing40_0.frq, _5.si, _3_nrm.cfs, _6_Pulsing40_0.prx, _4_Memory_0.ram, _4_nrm.cfs, _5_Block_0.tip, _0_Block_0.pos, _0_TestBloomFilteredLucene40Postings_0.prx, _1_TestBloomFilteredLucene40Postings_0.blm, _4_Block_0.doc, _1_TestBloomFilteredLucene40Postings_0.tip, _6_nrm.cfs, _5_Block_0.pos, _6_TestBloomFilteredLucene40Postings_0.tip, _2_Memory_0.ram, _1_TestBloomFilteredLucene40Postings_0.tim, _0.si, _3_Memory_0.ram, _6_TestBloomFilteredLucene40Postings_0.tim, _6_TestBloomFilteredLucene40Postings_0.frq, _1_nrm.cfs, _5.fnm, _0_Block_0.doc, _1_TestBloomFilteredLucene40Postings_0.prx, _6_nrm.cfe, _0_nrm.cfs, _4.fdt, _4.si, _1_nrm.cfe, _3_Pulsing40_0.prx, _4_Pulsing40_0.frq, _6_Block_0.tip, _0_nrm.cfe, _5.fdx, _6_TestBloomFilteredLucene40Postings_0.blm, _0.fdx, _5_TestBloomFilteredLucene40Postings_0.tim, _6_TestBloomFilteredLucene40Postings_0.prx, _6_Block_0.tim, _2_Block_0.doc, _5_TestBloomFilteredLucene40Postings_0.tip, segments_3, _0.fdt]
[junit4:junit4]   2> 3929 T1323 C127 oasc.SolrDeletionPolicy.updateCommits newest commit = 3
[junit4:junit4]   2> 3932 T1313 C126 oass.SolrIndexSearcher.<init> Opening Searcher@94037d5 main
[junit4:junit4]   2> 3932 T1313 C126 oass.SolrIndexSearcher.getIndexDir WARNING WARNING: Directory impl does not support setting indexDir: org.apache.lucene.store.MockDirectoryWrapper
[junit4:junit4]   2> 3933 T1319 oasc.SolrCore.registerSearcher [collection1] Registered new searcher Searcher@94037d5 main{StandardDirectoryReader(segments_3:19:nrt _0(5.0):C21 _1(5.0):C8 _2(5.0):C9 _3(5.0):C1 _5(5.0):C2 _4(5.0):C31 _7(5.0):C5 _6(5.0):C12)}
[junit4:junit4]   2> 3934 T1313 C126 oasu.DirectUpdateHandler2.commit end_commit_flush
[junit4:junit4]   2> 3934 T1313 C126 UPDATE [collection1] webapp=/solr path=/update params={waitSearcher=true&commit=true&wt=javabin&expungeDeletes=false&version=2&softCommit=false} {add=[5 (1413131415638245376), 6 (1413131415646633985), 10 (1413131415646633988), 11 (1413131415648731136), 16 (1413131415649779713), 17 (1413131415651876864), 19 (1413131415651876867), 20 (1413131415652925442), 21 (1413131415652925444), 23 (1413131415653974018)],commit=} 0 435
[junit4:junit4]   2> 3934 T1315 C126 oasu.DirectUpdateHandler2.commit start commit{flags=0,_version_=0,optimize=false,openSearcher=true,waitSearcher=true,expungeDeletes=false,softCommit=false}
[junit4:junit4]   2> 3941 T1333 C128 oass.SolrIndexSearcher.<init> Opening Searcher@4376048d main
[junit4:junit4]   2> 3941 T1333 C128 oass.SolrIndexSearcher.getIndexDir WARNING WARNING: Directory impl does not support setting indexDir: org.apache.lucene.store.MockDirectoryWrapper
[junit4:junit4]   2> 3942 T1339 oasc.SolrCore.registerSearcher [collection1] Registered new searcher Searcher@4376048d main{StandardDirectoryReader(segments_2:18:nrt _0(5.0):C19 _2(5.0):C3 _1(5.0):C8 _3(5.0):C20 _4(5.0):C20 _5(5.0):C5 _6(5.0):C5)}
[junit4:junit4]   2> 3942 T1315 C126 oasc.SolrDeletionPolicy.onCommit SolrDeletionPolicy.onCommit: commits:num=2
[junit4:junit4]   2> 		commit{dir=MockDirWrapper(org.apache.lucene.store.RAMDirectory@38d2c662 lockFactory=org.apache.lucene.store.NativeFSLockFactory@3cc4699c),segFN=segments_3,generation=3,filenames=[_4_TestBloomFilteredLucene40Postings_0.frq, _5_nrm.cfe, _2_Block_0.pos, _5_Memory_0.ram, _3_TestBloomFilteredLucene40Postings_0.prx, _2_TestBloomFilteredLucene40Postings_0.blm, _3.fdt, _0_Pulsing40_0.frq, _0_TestBloomFilteredLucene40Postings_0.frq, _5_Pulsing40_0.tip, _3_TestBloomFilteredLucene40Postings_0.frq, _5_Pulsing40_0.tim, _1_Block_0.pos, _1_Block_0.tip, _3_TestBloomFilteredLucene40Postings_0.tim, _0_TestBloomFilteredLucene40Postings_0.blm, _0_Pulsing40_0.tim, _1_Block_0.tim, _0_Memory_0.ram, _2.fdt, _3_Pulsing40_0.tip, _3_TestBloomFilteredLucene40Postings_0.tip, _2.fdx, _3_Pulsing40_0.tim, _3_Block_0.pos, _3_Block_0.doc, _5_TestBloomFilteredLucene40Postings_0.frq, _1.fdx, _1.fdt, _5_nrm.cfs, _3.si, _3_TestBloomFilteredLucene40Postings_0.blm, _2.si, _3_Pulsing40_0.frq, _2_Pulsing40_0.tim, _2_Block_0.tim, _2_Pulsing40_0.tip, _2_Block_0.tip, _3.fnm, _5_Block_0.tim, _4_TestBloomFilteredLucene40Postings_0.prx, _4_Pulsing40_0.prx, _1_Memory_0.ram, _2_nrm.cfe, _5_Pulsing40_0.frq, _5_TestBloomFilteredLucene40Postings_0.blm, _0_Pulsing40_0.tip, _2_nrm.cfs, _5_Block_0.doc, _4_Block_0.pos, _2_TestBloomFilteredLucene40Postings_0.frq, _3_Block_0.tip, _4_TestBloomFilteredLucene40Postings_0.blm, _4_Block_0.tip, _2.fnm, _3.fdx, _4_Pulsing40_0.tip, _4_Pulsing40_0.tim, _5_Pulsing40_0.prx, _1.si, _4_TestBloomFilteredLucene40Postings_0.tim, _4_TestBloomFilteredLucene40Postings_0.tip, _3_nrm.cfe, _0_Block_0.tip, _5.fdt, _2_TestBloomFilteredLucene40Postings_0.prx, _1_Pulsing40_0.tip, _0_Block_0.tim, _1_Pulsing40_0.tim, _4_nrm.cfe, _4.fnm, _0_Pulsing40_0.prx, _1.fnm, _4.fdx, _1_Pulsing40_0.frq, _3_Block_0.tim, _1_Pulsing40_0.prx, _5_TestBloomFilteredLucene40Postings_0.prx, _1_Block_0.doc, _2_Pulsing40_0.prx, _2_TestBloomFilteredLucene40Postings_0.tim, _0_TestBloomFilteredLucene40Postings_0.tim, _0_TestBloomFilteredLucene40Postings_0.tip, _4_Block_0.tim, _0.fnm, _1_TestBloomFilteredLucene40Postings_0.frq, _2_TestBloomFilteredLucene40Postings_0.tip, _2_Pulsing40_0.frq, _5.si, _3_nrm.cfs, _4_Memory_0.ram, _4_nrm.cfs, _5_Block_0.tip, _0_Block_0.pos, _0_TestBloomFilteredLucene40Postings_0.prx, _1_TestBloomFilteredLucene40Postings_0.blm, _4_Block_0.doc, _1_TestBloomFilteredLucene40Postings_0.tip, _5_Block_0.pos, _2_Memory_0.ram, _1_TestBloomFilteredLucene40Postings_0.tim, _0.si, _3_Memory_0.ram, _1_nrm.cfs, _5.fnm, _0_Block_0.doc, _1_TestBloomFilteredLucene40Postings_0.prx, _4.si, _4.fdt, _0_nrm.cfs, _1_nrm.cfe, _4_Pulsing40_0.frq, _3_Pulsing40_0.prx, _0_nrm.cfe, _5.fdx, _0.fdx, _5_TestBloomFilteredLucene40Postings_0.tim, _2_Block_0.doc, _5_TestBloomFilteredLucene40Postings_0.tip, segments_3, _0.fdt]
[junit4:junit4]   2> 		commit{dir=MockDirWrapper(org.apache.lucene.store.RAMDirectory@38d2c662 lockFactory=org.apache.lucene.store.NativeFSLockFactory@3cc4699c),segFN=segments_4,generation=4,filenames=[_5_nrm.cfe, _5_Memory_0.ram, _3.fdt, _9_TestBloomFilteredLucene40Postings_0.prx, _8_TestBloomFilteredLucene40Postings_0.prx, _7.fnm, _6_Block_0.pos, _5_Pulsing40_0.tip, _3_TestBloomFilteredLucene40Postings_0.frq, _5_Pulsing40_0.tim, _1_Block_0.pos, _3_TestBloomFilteredLucene40Postings_0.tim, _0_TestBloomFilteredLucene40Postings_0.blm, _0_Pulsing40_0.tim, _0_Memory_0.ram, _9.fdt, _3_TestBloomFilteredLucene40Postings_0.tip, _9.fdx, _5_TestBloomFilteredLucene40Postings_0.frq, _1.fdx, _5_nrm.cfs, _1.fdt, _8_Pulsing40_0.frq, _6.fdt, _3_Pulsing40_0.frq, _2.si, _2_Pulsing40_0.tim, _2_Block_0.tim, _2_Block_0.tip, _2_Pulsing40_0.tip, _6.fdx, _8_Block_0.doc, _5_Block_0.tim, _2_nrm.cfe, _1_Memory_0.ram, _5_Pulsing40_0.frq, _0_Pulsing40_0.tip, _2_nrm.cfs, _2_TestBloomFilteredLucene40Postings_0.frq, _4_TestBloomFilteredLucene40Postings_0.blm, _4_Block_0.tip, _8_Memory_0.ram, _2.fnm, _9_Block_0.pos, _3.fdx, _7_Pulsing40_0.tim, _4_Pulsing40_0.tip, _4_Pulsing40_0.tim, _1.si, _4_TestBloomFilteredLucene40Postings_0.tim, _4_TestBloomFilteredLucene40Postings_0.tip, _7_Pulsing40_0.tip, _3_nrm.cfe, _0_Block_0.tip, _8_nrm.cfe, _0_Block_0.tim, _4_nrm.cfe, _7_Block_0.tim, _0_Pulsing40_0.prx, _7_Block_0.tip, _4.fdx, _1_Pulsing40_0.prx, _9.si, _1_Block_0.doc, _2_TestBloomFilteredLucene40Postings_0.tim, _2_TestBloomFilteredLucene40Postings_0.tip, _1_TestBloomFilteredLucene40Postings_0.frq, _5.si, _8_nrm.cfs, _3_nrm.cfs, _8_Pulsing40_0.tip, _6_Pulsing40_0.prx, _4_nrm.cfs, _8_Pulsing40_0.tim, _5_Block_0.tip, _7_Block_0.doc, _0_TestBloomFilteredLucene40Postings_0.prx, _8_TestBloomFilteredLucene40Postings_0.blm, _9_TestBloomFilteredLucene40Postings_0.tip, _9_TestBloomFilteredLucene40Postings_0.tim, _6_nrm.cfs, _7_nrm.cfs, _5_Block_0.pos, _6_TestBloomFilteredLucene40Postings_0.tip, _3_Memory_0.ram, _6_TestBloomFilteredLucene40Postings_0.tim, _6_TestBloomFilteredLucene40Postings_0.frq, _1_nrm.cfs, _5.fnm, _1_TestBloomFilteredLucene40Postings_0.prx, _0_Block_0.doc, _7_nrm.cfe, _6_nrm.cfe, _7_TestBloomFilteredLucene40Postings_0.frq, _4.fdt, _4.si, _9_TestBloomFilteredLucene40Postings_0.frq, _7_TestBloomFilteredLucene40Postings_0.prx, _1_nrm.cfe, _4_Pulsing40_0.frq, _9_Pulsing40_0.prx, _6_Block_0.tip, _5_TestBloomFilteredLucene40Postings_0.tim, _6_Block_0.tim, _8.fdx, _5_TestBloomFilteredLucene40Postings_0.tip, _8.fdt, _4_TestBloomFilteredLucene40Postings_0.frq, _2_Block_0.pos, _3_TestBloomFilteredLucene40Postings_0.prx, _2_TestBloomFilteredLucene40Postings_0.blm, _7.si, _7_TestBloomFilteredLucene40Postings_0.tip, _0_Pulsing40_0.frq, _7_TestBloomFilteredLucene40Postings_0.tim, _7_Memory_0.ram, _8.si, _8_Block_0.pos, _0_TestBloomFilteredLucene40Postings_0.frq, _1_Block_0.tip, _1_Block_0.tim, _3_Pulsing40_0.tip, _2.fdt, _7.fdx, _2.fdx, _3_Pulsing40_0.tim, _7.fdt, _3_Block_0.pos, _3_Block_0.doc, _7_Pulsing40_0.frq, _3.si, _7_Block_0.pos, _3_TestBloomFilteredLucene40Postings_0.blm, _6_Memory_0.ram, _9_Block_0.tip, _9_Block_0.tim, _3.fnm, _4_TestBloomFilteredLucene40Postings_0.prx, _4_Pulsing40_0.prx, _5_TestBloomFilteredLucene40Postings_0.blm, _5_Block_0.doc, _4_Block_0.pos, _3_Block_0.tip, _8_TestBloomFilteredLucene40Postings_0.tip, _8_TestBloomFilteredLucene40Postings_0.tim, _9.fnm, _9_Memory_0.ram, _5_Pulsing40_0.prx, _6.fnm, _6.si, _5.fdt, _7_TestBloomFilteredLucene40Postings_0.blm, _1_Pulsing40_0.tip, _2_TestBloomFilteredLucene40Postings_0.prx, _6_Pulsing40_0.frq, _1_Pulsing40_0.tim, _4.fnm, _1.fnm, _7_Pulsing40_0.prx, _1_Pulsing40_0.frq, _3_Block_0.tim, _9_Pulsing40_0.tip, _9_Pulsing40_0.tim, _6_Pulsing40_0.tim, _9_nrm.cfs, _8_Pulsing40_0.prx, _5_TestBloomFilteredLucene40Postings_0.prx, _6_Pulsing40_0.tip, _2_Pulsing40_0.prx, _0_TestBloomFilteredLucene40Postings_0.tim, _0_TestBloomFilteredLucene40Postings_0.tip, _0.fnm, _4_Block_0.tim, _9_nrm.cfe, _6_Block_0.doc, _8_TestBloomFilteredLucene40Postings_0.frq, _2_Pulsing40_0.frq, _8.fnm, _4_Memory_0.ram, _9_Block_0.doc, _0_Block_0.pos, _1_TestBloomFilteredLucene40Postings_0.blm, _9_TestBloomFilteredLucene40Postings_0.blm, _4_Block_0.doc, _1_TestBloomFilteredLucene40Postings_0.tip, _8_Block_0.tip, _9_Pulsing40_0.frq, _8_Block_0.tim, _2_Memory_0.ram, _0.si, _1_TestBloomFilteredLucene40Postings_0.tim, _0_nrm.cfs, _3_Pulsing40_0.prx, _0_nrm.cfe, _5.fdx, _0.fdx, _6_TestBloomFilteredLucene40Postings_0.blm, _6_TestBloomFilteredLucene40Postings_0.prx, _2_Block_0.doc, _0.fdt, segments_4]
[junit4:junit4]   2> 3942 T1323 C127 oass.SolrIndexSearcher.<init> Opening Searcher@379959d0 main
[junit4:junit4]   2> 3944 T1315 C126 oasc.SolrDeletionPolicy.updateCommits newest commit = 4
[junit4:junit4]   2> 3944 T1323 C127 oass.SolrIndexSearcher.getIndexDir WARNING WARNING: Directory impl does not support setting indexDir: org.apache.lucene.store.MockDirectoryWrapper
[junit4:junit4]   2> 3943 T1333 C128 oasu.DirectUpdateHandler2.commit end_commit_flush
[junit4:junit4]   2> 3945 T1329 oasc.SolrCore.registerSearcher [collection1] Registered new searcher Searcher@379959d0 main{StandardDirectoryReader(segments_3:21:nrt _0(5.0):C23 _1(5.0):C13 _2(5.0):C1 _3(5.0):C14 _4(5.0):C8 _6(5.0):C2 _5(5.0):C32 _7(5.0):C12 _8(5.0):C16)}
[junit4:junit4]   2> 3945 T1335 C128 oasu.DirectUpdateHandler2.commit start commit{flags=0,_version_=0,optimize=false,openSearcher=true,waitSearcher=true,expungeDeletes=false,softCommit=false}
[junit4:junit4]   2> 3945 T1333 C128 UPDATE [collection1] webapp=/solr path=/update params={waitSearcher=true&commit=true&wt=javabin&expungeDeletes=false&version=2&softCommit=false} {add=[5 (1413131415638245376), 6 (1413131415646633984), 9 (1413131415646633985), 10 (1413131415647682560), 11 (1413131415648731136), 12 (1413131415650828288), 13 (1413131415651876866), 14 (1413131415652925441), 15 (1413131415655022595), 16 (1413131415659216897)],commit=} 0 450
[junit4:junit4]   2> 3947 T1323 C127 oasu.DirectUpdateHandler2.commit end_commit_flush
[junit4:junit4]   2> 3947 T1324 C127 oasu.DirectUpdateHandler2.commit start commit{flags=0,_version_=0,optimize=false,openSearcher=true,waitSearcher=true,expungeDeletes=false,softCommit=false}
[junit4:junit4]   2> 3947 T1323 C127 UPDATE [collection1] webapp=/solr path=/update params={waitSearcher=true&commit=true&wt=javabin&expungeDeletes=false&version=2&softCommit=false} {add=[7 (1413131415638245376), 9 (1413131415646633984), 10 (1413131415648731136), 12 (1413131415648731138), 16 (1413131415650828288), 17 (1413131415651876867), 18 (1413131415652925443), 20 (1413131415653974018), 22 (1413131415656071169), 23 (1413131415657119745)],commit=} 0 448
[junit4:junit4]   2> 3960 T1324 C127 oasc.SolrDeletionPolicy.onCommit SolrDeletionPolicy.onCommit: commits:num=2
[junit4:junit4]   2> 		commit{dir=MockDirWrapper(org.apache.lucene.store.RAMDirectory@74834659 lockFactory=org.apache.lucene.store.NativeFSLockFactory@5b3ecdb4),segFN=segments_3,generation=3,filenames=[_5_nrm.cfe, _4_TestBloomFilteredLucene40Postings_0.frq, _5_Memory_0.ram, _2_Block_0.pos, _3_TestBloomFilteredLucene40Postings_0.prx, _2_TestBloomFilteredLucene40Postings_0.blm, _3.fdt, _0_Pulsing40_0.frq, _6_Block_0.pos, _0_TestBloomFilteredLucene40Postings_0.frq, _5_Pulsing40_0.tip, _3_TestBloomFilteredLucene40Postings_0.frq, _5_Pulsing40_0.tim, _1_Block_0.pos, _1_Block_0.tip, _3_TestBloomFilteredLucene40Postings_0.tim, _0_TestBloomFilteredLucene40Postings_0.blm, _0_Pulsing40_0.tim, _1_Block_0.tim, _0_Memory_0.ram, _2.fdt, _3_Pulsing40_0.tip, _3_TestBloomFilteredLucene40Postings_0.tip, _2.fdx, _3_Pulsing40_0.tim, _3_Block_0.pos, _5_TestBloomFilteredLucene40Postings_0.frq, _3_Block_0.doc, _1.fdx, _5_nrm.cfs, _1.fdt, _3.si, _6.fdt, _3_TestBloomFilteredLucene40Postings_0.blm, _6_Memory_0.ram, _2.si, _3_Pulsing40_0.frq, _2_Pulsing40_0.tim, _2_Block_0.tim, _6.fdx, _2_Pulsing40_0.tip, _2_Block_0.tip, _3.fnm, _5_Block_0.tim, _4_TestBloomFilteredLucene40Postings_0.prx, _4_Pulsing40_0.prx, _1_Memory_0.ram, _2_nrm.cfe, _5_Pulsing40_0.frq, _5_TestBloomFilteredLucene40Postings_0.blm, _0_Pulsing40_0.tip, _2_nrm.cfs, _5_Block_0.doc, _4_Block_0.pos, _2_TestBloomFilteredLucene40Postings_0.frq, _3_Block_0.tip, _4_TestBloomFilteredLucene40Postings_0.blm, _4_Block_0.tip, _2.fnm, _3.fdx, _4_Pulsing40_0.tip, _4_Pulsing40_0.tim, _5_Pulsing40_0.prx, _1.si, _4_TestBloomFilteredLucene40Postings_0.tim, _6.si, _6.fnm, _4_TestBloomFilteredLucene40Postings_0.tip, _3_nrm.cfe, _0_Block_0.tip, _5.fdt, _2_TestBloomFilteredLucene40Postings_0.prx, _1_Pulsing40_0.tip, _6_Pulsing40_0.frq, _0_Block_0.tim, _1_Pulsing40_0.tim, _4.fnm, _4_nrm.cfe, _0_Pulsing40_0.prx, _1.fnm, _1_Pulsing40_0.frq, _4.fdx, _3_Block_0.tim, _6_Pulsing40_0.tim, _1_Pulsing40_0.prx, _5_TestBloomFilteredLucene40Postings_0.prx, _6_Pulsing40_0.tip, _1_Block_0.doc, _2_Pulsing40_0.prx, _2_TestBloomFilteredLucene40Postings_0.tim, _0_TestBloomFilteredLucene40Postings_0.tim, _0_TestBloomFilteredLucene40Postings_0.tip, _0.fnm, _4_Block_0.tim, _6_Block_0.doc, _1_TestBloomFilteredLucene40Postings_0.frq, _2_TestBloomFilteredLucene40Postings_0.tip, _2_Pulsing40_0.frq, _5.si, _3_nrm.cfs, _6_Pulsing40_0.prx, _4_Memory_0.ram, _4_nrm.cfs, _5_Block_0.tip, _0_Block_0.pos, _0_TestBloomFilteredLucene40Postings_0.prx, _1_TestBloomFilteredLucene40Postings_0.blm, _4_Block_0.doc, _1_TestBloomFilteredLucene40Postings_0.tip, _6_nrm.cfs, _5_Block_0.pos, _6_TestBloomFilteredLucene40Postings_0.tip, _2_Memory_0.ram, _1_TestBloomFilteredLucene40Postings_0.tim, _0.si, _3_Memory_0.ram, _6_TestBloomFilteredLucene40Postings_0.tim, _6_TestBloomFilteredLucene40Postings_0.frq, _1_nrm.cfs, _5.fnm, _0_Block_0.doc, _1_TestBloomFilteredLucene40Postings_0.prx, _6_nrm.cfe, _0_nrm.cfs, _4.fdt, _4.si, _1_nrm.cfe, _3_Pulsing40_0.prx, _4_Pulsing40_0.frq, _6_Block_0.tip, _0_nrm.cfe, _5.fdx, _6_TestBloomFilteredLucene40Postings_0.blm, _0.fdx, _5_TestBloomFilteredLucene40Postings_0.tim, _6_TestBloomFilteredLucene40Postings_0.prx, _6_Block_0.tim, _2_Block_0.doc, _5_TestBloomFilteredLucene40Postings_0.tip, segments_3, _0.fdt]
[junit4:junit4]   2> 		commit{dir=MockDirWrapper(org.apache.lucene.store.RAMDirectory@74834659 lockFactory=org.apache.lucene.store.NativeFSLockFactory@5b3ecdb4),segFN=segments_4,generation=4,filenames=[_5_nrm.cfe, _a_Block_0.pos, _5_Memory_0.ram, _a_TestBloomFilteredLucene40Postings_0.blm, _9_TestBloomFilteredLucene40Postings_0.prx, _3.fdt, _8_TestBloomFilteredLucene40Postings_0.prx, _7.fnm, _6_Block_0.pos, _5_Pulsing40_0.tip, _3_TestBloomFilteredLucene40Postings_0.frq, _5_Pulsing40_0.tim, _1_Block_0.pos, _3_TestBloomFilteredLucene40Postings_0.tim, _0_TestBloomFilteredLucene40Postings_0.blm, _0_Pulsing40_0.tim, _0_Memory_0.ram, _9.fdt, _3_TestBloomFilteredLucene40Postings_0.tip, _9.fdx, _5_TestBloomFilteredLucene40Postings_0.frq, _1.fdx, _1.fdt, _5_nrm.cfs, _8_Pulsing40_0.frq, _6.fdt, _a.fnm, _3_Pulsing40_0.frq, _2.si, _2_Pulsing40_0.tim, _2_Block_0.tim, _2_Block_0.tip, _2_Pulsing40_0.tip, _6.fdx, _8_Block_0.doc, _5_Block_0.tim, _a_TestBloomFilteredLucene40Postings_0.prx, _2_nrm.cfe, _1_Memory_0.ram, _5_Pulsing40_0.frq, _0_Pulsing40_0.tip, _2_nrm.cfs, _2_TestBloomFilteredLucene40Postings_0.frq, _4_TestBloomFilteredLucene40Postings_0.blm, _4_Block_0.tip, _8_Memory_0.ram, _9_Block_0.pos, _2.fnm, _3.fdx, _7_Pulsing40_0.tim, _4_Pulsing40_0.tip, _4_Pulsing40_0.tim, _1.si, _4_TestBloomFilteredLucene40Postings_0.tim, _4_TestBloomFilteredLucene40Postings_0.tip, _7_Pulsing40_0.tip, _3_nrm.cfe, _0_Block_0.tip, _8_nrm.cfe, _0_Block_0.tim, _4_nrm.cfe, _7_Block_0.tim, _0_Pulsing40_0.prx, _7_Block_0.tip, _4.fdx, _1_Pulsing40_0.prx, _9.si, _1_Block_0.doc, _2_TestBloomFilteredLucene40Postings_0.tim, _a_Pulsing40_0.prx, _2_TestBloomFilteredLucene40Postings_0.tip, _1_TestBloomFilteredLucene40Postings_0.frq, _5.si, _8_nrm.cfs, _3_nrm.cfs, _8_Pulsing40_0.tip, _6_Pulsing40_0.prx, _4_nrm.cfs, _a_TestBloomFilteredLucene40Postings_0.frq, _8_Pulsing40_0.tim, _5_Block_0.tip, _7_Block_0.doc, _0_TestBloomFilteredLucene40Postings_0.prx, _a.fdt, _8_TestBloomFilteredLucene40Postings_0.blm, _a.fdx, _9_TestBloomFilteredLucene40Postings_0.tip, _9_TestBloomFilteredLucene40Postings_0.tim, _6_nrm.cfs, _7_nrm.cfs, _5_Block_0.pos, _6_TestBloomFilteredLucene40Postings_0.tip, _3_Memory_0.ram, _6_TestBloomFilteredLucene40Postings_0.tim, _6_TestBloomFilteredLucene40Postings_0.frq, _1_nrm.cfs, _5.fnm, _1_TestBloomFilteredLucene40Postings_0.prx, _0_Block_0.doc, _7_nrm.cfe, _6_nrm.cfe, _7_TestBloomFilteredLucene40Postings_0.frq, _9_TestBloomFilteredLucene40Postings_0.frq, _4.si, _4.fdt, _7_TestBloomFilteredLucene40Postings_0.prx, _1_nrm.cfe, _4_Pulsing40_0.frq, _9_Pulsing40_0.prx, _a_Pulsing40_0.frq, _6_Block_0.tip, _6_Block_0.tim, _5_TestBloomFilteredLucene40Postings_0.tim, _8.fdx, _5_TestBloomFilteredLucene40Postings_0.tip, _8.fdt, _4_TestBloomFilteredLucene40Postings_0.frq, _2_Block_0.pos, _3_TestBloomFilteredLucene40Postings_0.prx, _2_TestBloomFilteredLucene40Postings_0.blm, _7.si, _7_TestBloomFilteredLucene40Postings_0.tip, _0_Pulsing40_0.frq, _7_TestBloomFilteredLucene40Postings_0.tim, _7_Memory_0.ram, _8.si, _8_Block_0.pos, _a_Pulsing40_0.tip, _a_Pulsing40_0.tim, _0_TestBloomFilteredLucene40Postings_0.frq, _1_Block_0.tip, _1_Block_0.tim, _3_Pulsing40_0.tip, _2.fdt, _7.fdx, _2.fdx, _3_Pulsing40_0.tim, _7.fdt, _3_Block_0.pos, _3_Block_0.doc, _7_Pulsing40_0.frq, _3.si, _7_Block_0.pos, _3_TestBloomFilteredLucene40Postings_0.blm, _6_Memory_0.ram, _9_Block_0.tip, _9_Block_0.tim, _a_Memory_0.ram, _3.fnm, _4_TestBloomFilteredLucene40Postings_0.prx, _4_Pulsing40_0.prx, _5_TestBloomFilteredLucene40Postings_0.blm, _5_Block_0.doc, _4_Block_0.pos, _3_Block_0.tip, _8_TestBloomFilteredLucene40Postings_0.tip, _8_TestBloomFilteredLucene40Postings_0.tim, _9_Memory_0.ram, _9.fnm, _5_Pulsing40_0.prx, _6.fnm, _6.si, _a_Block_0.doc, _5.fdt, _7_TestBloomFilteredLucene40Postings_0.blm, _1_Pulsing40_0.tip, _2_TestBloomFilteredLucene40Postings_0.prx, _6_Pulsing40_0.frq, _1_Pulsing40_0.tim, _4.fnm, _1.fnm, _7_Pulsing40_0.prx, _1_Pulsing40_0.frq, _3_Block_0.tim, _9_Pulsing40_0.tip, _9_Pulsing40_0.tim, _6_Pulsing40_0.tim, _9_nrm.cfs, _8_Pulsing40_0.prx, _6_Pulsing40_0.tip, _5_TestBloomFilteredLucene40Postings_0.prx, _2_Pulsing40_0.prx, _0_TestBloomFilteredLucene40Postings_0.tim, _0_TestBloomFilteredLucene40Postings_0.tip, _a_nrm.cfe, _4_Block_0.tim, _0.fnm, _9_nrm.cfe, _6_Block_0.doc, _8_TestBloomFilteredLucene40Postings_0.frq, _a.si, _a_nrm.cfs, _2_Pulsing40_0.frq, _8.fnm, _4_Memory_0.ram, _9_Block_0.doc, _0_Block_0.pos, _1_TestBloomFilteredLucene40Postings_0.blm, _a_Block_0.tip, _9_TestBloomFilteredLucene40Postings_0.blm, _a_Block_0.tim, _4_Block_0.doc, _1_TestBloomFilteredLucene40Postings_0.tip, _8_Block_0.tip, _9_Pulsing40_0.frq, _8_Block_0.tim, _2_Memory_0.ram, _0.si, _1_TestBloomFilteredLucene40Postings_0.tim, _a_TestBloomFilteredLucene40Postings_0.tip, _0_nrm.cfs, _a_TestBloomFilteredLucene40Postings_0.tim, _3_Pulsing40_0.prx, _0_nrm.cfe, _5.fdx, _0.fdx, _6_TestBloomFilteredLucene40Postings_0.blm, _6_TestBloomFilteredLucene40Postings_0.prx, _2_Block_0.doc, _0.fdt, segments_4]
[junit4:junit4]   2> 3962 T1324 C127 oasc.SolrDeletionPolicy.updateCommits newest commit = 4
[junit4:junit4]   2> 3963 T1335 C128 oasc.SolrDeletionPolicy.onCommit SolrDeletionPolicy.onCommit: commits:num=2
[junit4:junit4]   2> 		commit{dir=MockDirWrapper(org.apache.lucene.store.RAMDirectory@65440a34 lockFactory=org.apache.lucene.store.NativeFSLockFactory@1427609d),segFN=segments_2,generation=2,filenames=[_2_Block_0.pos, _0_Block_0.tip, _2_TestBloomFilteredLucene40Postings_0.prx, _1_Pulsing40_0.tip, _0_Block_0.tim, _2_TestBloomFilteredLucene40Postings_0.blm, _1_Pulsing40_0.tim, _0_Pulsing40_0.prx, _1.fnm, _0_Pulsing40_0.frq, _1_Pulsing40_0.frq, _1_Pulsing40_0.prx, _0_TestBloomFilteredLucene40Postings_0.frq, _1_Block_0.doc, _2_Pulsing40_0.prx, _1_Block_0.pos, _1_Block_0.tip, _2_TestBloomFilteredLucene40Postings_0.tim, _0_TestBloomFilteredLucene40Postings_0.tim, _0_TestBloomFilteredLucene40Postings_0.blm, _0_TestBloomFilteredLucene40Postings_0.tip, _0.fnm, _0_Pulsing40_0.tim, _1_Block_0.tim, _0_Memory_0.ram, _2.fdt, _2.fdx, _1_TestBloomFilteredLucene40Postings_0.frq, _2_TestBloomFilteredLucene40Postings_0.tip, _2_Pulsing40_0.frq, _1.fdx, _1.fdt, _2.si, _0_Block_0.pos, _2_Pulsing40_0.tim, _2_Block_0.tim, _2_Pulsing40_0.tip, _2_Block_0.tip, _0_TestBloomFilteredLucene40Postings_0.prx, _1_TestBloomFilteredLucene40Postings_0.blm, _1_TestBloomFilteredLucene40Postings_0.tip, _1_Memory_0.ram, _2_nrm.cfe, _0_Pulsing40_0.tip, _2_Memory_0.ram, _1_TestBloomFilteredLucene40Postings_0.tim, _0.si, _2_nrm.cfs, _2_TestBloomFilteredLucene40Postings_0.frq, _1_nrm.cfs, _0_Block_0.doc, _1_TestBloomFilteredLucene40Postings_0.prx, _0_nrm.cfs, _1_nrm.cfe, _2.fnm, _1.si, _0_nrm.cfe, segments_2, _0.fdx, _2_Block_0.doc, _0.fdt]
[junit4:junit4]   2> 		commit{dir=MockDirWrapper(org.apache.lucene.store.RAMDirectory@65440a34 lockFactory=org.apache.lucene.store.NativeFSLockFactory@1427609d),segFN=segments_3,generation=3,filenames=[_5_nrm.cfe, _5_Memory_0.ram, _3.fdt, _9_TestBloomFilteredLucene40Postings_0.prx, _8_TestBloomFilteredLucene40Postings_0.prx, _7.fnm, _6_Block_0.pos, _5_Pulsing40_0.tip, _3_TestBloomFilteredLucene40Postings_0.frq, _5_Pulsing40_0.tim, _1_Block_0.pos, _3_TestBloomFilteredLucene40Postings_0.tim, _0_TestBloomFilteredLucene40Postings_0.blm, _0_Pulsing40_0.tim, _0_Memory_0.ram, _9.fdt, _3_TestBloomFilteredLucene40Postings_0.tip, _9.fdx, _5_TestBloomFilteredLucene40Postings_0.frq, _1.fdx, _1.fdt, _5_nrm.cfs, _8_Pulsing40_0.frq, _6.fdt, _3_Pulsing40_0.frq, _2.si, _2_Pulsing40_0.tim, _2_Block_0.tim, _2_Pulsing40_0.tip, _2_Block_0.tip, _6.fdx, _8_Block_0.doc, _5_Block_0.tim, _1_Memory_0.ram, _2_nrm.cfe, _5_Pulsing40_0.frq, _0_Pulsing40_0.tip, _2_nrm.cfs, _2_TestBloomFilteredLucene40Postings_0.frq, _4_TestBloomFilteredLucene40Postings_0.blm, _4_Block_0.tip, _8_Memory_0.ram, _2.fnm, _9_Block_0.pos, _3.fdx, _7_Pulsing40_0.tim, _4_Pulsing40_0.tip, _4_Pulsing40_0.tim, _1.si, _4_TestBloomFilteredLucene40Postings_0.tim, _4_TestBloomFilteredLucene40Postings_0.tip, _7_Pulsing40_0.tip, _3_nrm.cfe, _0_Block_0.tip, _8_nrm.cfe, _0_Block_0.tim, _4_nrm.cfe, _7_Block_0.tim, _0_Pulsing40_0.prx, _7_Block_0.tip, _4.fdx, _1_Pulsing40_0.prx, _9.si, _1_Block_0.doc, _2_TestBloomFilteredLucene40Postings_0.tim, _1_TestBloomFilteredLucene40Postings_0.frq, _2_TestBloomFilteredLucene40Postings_0.tip, _5.si, _8_nrm.cfs, _3_nrm.cfs, _8_Pulsing40_0.tip, _6_Pulsing40_0.prx, _4_nrm.cfs, _8_Pulsing40_0.tim, _5_Block_0.tip, _7_Block_0.doc, _0_TestBloomFilteredLucene40Postings_0.prx, _8_TestBloomFilteredLucene40Postings_0.blm, _9_TestBloomFilteredLucene40Postings_0.tip, _9_TestBloomFilteredLucene40Postings_0.tim, _6_nrm.cfs, _7_nrm.cfs, _5_Block_0.pos, _6_TestBloomFilteredLucene40Postings_0.tip, _3_Memory_0.ram, _6_TestBloomFilteredLucene40Postings_0.tim, _6_TestBloomFilteredLucene40Postings_0.frq, _1_nrm.cfs, _5.fnm, _0_Block_0.doc, _1_TestBloomFilteredLucene40Postings_0.prx, _7_nrm.cfe, _6_nrm.cfe, _7_TestBloomFilteredLucene40Postings_0.frq, _4.si, _4.fdt, _9_TestBloomFilteredLucene40Postings_0.frq, _7_TestBloomFilteredLucene40Postings_0.prx, _1_nrm.cfe, _4_Pulsing40_0.frq, _9_Pulsing40_0.prx, _6_Block_0.tip, _5_TestBloomFilteredLucene40Postings_0.tim, _6_Block_0.tim, _8.fdx, _5_TestBloomFilteredLucene40Postings_0.tip, _8.fdt, _4_TestBloomFilteredLucene40Postings_0.frq, _2_Block_0.pos, _3_TestBloomFilteredLucene40Postings_0.prx, _2_TestBloomFilteredLucene40Postings_0.blm, _7.si, _7_TestBloomFilteredLucene40Postings_0.tip, _0_Pulsing40_0.frq, _7_TestBloomFilteredLucene40Postings_0.tim, _7_Memory_0.ram, _8.si, _8_Block_0.pos, _0_TestBloomFilteredLucene40Postings_0.frq, _1_Block_0.tip, _1_Block_0.tim, _3_Pulsing40_0.tip, _2.fdt, _7.fdx, _2.fdx, _3_Pulsing40_0.tim, _7.fdt, _3_Block_0.pos, _3_Block_0.doc, _7_Pulsing40_0.frq, _3.si, _7_Block_0.pos, _3_TestBloomFilteredLucene40Postings_0.blm, _6_Memory_0.ram, _9_Block_0.tip, _9_Block_0.tim, _3.fnm, _4_TestBloomFilteredLucene40Postings_0.prx, _4_Pulsing40_0.prx, _5_TestBloomFilteredLucene40Postings_0.blm, _5_Block_0.doc, _4_Block_0.pos, _3_Block_0.tip, _8_TestBloomFilteredLucene40Postings_0.tip, _8_TestBloomFilteredLucene40Postings_0.tim, _9.fnm, _9_Memory_0.ram, _5_Pulsing40_0.prx, _6.fnm, _6.si, _5.fdt, _7_TestBloomFilteredLucene40Postings_0.blm, _2_TestBloomFilteredLucene40Postings_0.prx, _1_Pulsing40_0.tip, _6_Pulsing40_0.frq, _1_Pulsing40_0.tim, _4.fnm, _1.fnm, _7_Pulsing40_0.prx, _1_Pulsing40_0.frq, _3_Block_0.tim, _9_Pulsing40_0.tip, _9_Pulsing40_0.tim, _6_Pulsing40_0.tim, _9_nrm.cfs, _8_Pulsing40_0.prx, _5_TestBloomFilteredLucene40Postings_0.prx, _6_Pulsing40_0.tip, _2_Pulsing40_0.prx, _0_TestBloomFilteredLucene40Postings_0.tim, _0_TestBloomFilteredLucene40Postings_0.tip, _4_Block_0.tim, _0.fnm, _9_nrm.cfe, _6_Block_0.doc, _8_TestBloomFilteredLucene40Postings_0.frq, _2_Pulsing40_0.frq, _8.fnm, _4_Memory_0.ram, _9_Block_0.doc, _0_Block_0.pos, _1_TestBloomFilteredLucene40Postings_0.blm, _9_TestBloomFilteredLucene40Postings_0.blm, _4_Block_0.doc, _1_TestBloomFilteredLucene40Postings_0.tip, _8_Block_0.tip, _9_Pulsing40_0.frq, _8_Block_0.tim, _2_Memory_0.ram, _1_TestBloomFilteredLucene40Postings_0.tim, _0.si, _0_nrm.cfs, _3_Pulsing40_0.prx, _0_nrm.cfe, _5.fdx, _0.fdx, _6_TestBloomFilteredLucene40Postings_0.blm, _6_TestBloomFilteredLucene40Postings_0.prx, _2_Block_0.doc, _0.fdt, segments_3]
[junit4:junit4]   2> 3964 T1315 C126 oass.SolrIndexSearcher.<init> Opening Searcher@3b2119bc main
[junit4:junit4]   2> 3964 T1335 C128 oasc.SolrDeletionPolicy.updateCommits newest commit = 3
[junit4:junit4]   2> 3964 T1315 C126 oass.SolrIndexSearcher.getIndexDir WARNING WARNING: Directory impl does not support setting indexDir: org.apache.lucene.store.MockDirectoryWrapper
[junit4:junit4]   2> 3966 T1319 oasc.SolrCore.registerSearcher [collection1] Registered new searcher Searcher@3b2119bc main{StandardDirectoryReader(segments_4:31:nrt _d(5.0):C123 _c(5.0):C1 _a(5.0):C14 _b(5.0):C3)}
[junit4:junit4]   2> 3966 T1315 C126 oasu.DirectUpdateHandler2.commit end_commit_flush
[junit4:junit4]   2> 3966 T1316 C126 oasu.DirectUpdateHandler2.commit start commit{flags=0,_version_=0,optimize=false,openSearcher=true,waitSearcher=true,expungeDeletes=false,softCommit=false}
[junit4:junit4]   2> 3967 T1315 C126 UPDATE [collection1] webapp=/solr path=/update params={waitSearcher=true&commit=true&wt=javabin&expungeDeletes=false&version=2&softCommit=false} {add=[47 (1413131415646633987), 49 (1413131415648731138), 50 (1413131415650828288), 53 (1413131415651876866), 55 (1413131415652925440), 57 (1413131415652925443), 58 (1413131415653974017), 59 (1413131415653974019), 60 (1413131415655022592), 61 (1413131415657119744)],commit=} 0 460
[junit4:junit4]   2> 3967 T1324 C127 oass.SolrIndexSearcher.<init> Opening Searcher@52f49bd4 main
[junit4:junit4]   2> 3967 T1324 C127 oass.SolrIndexSearcher.getIndexDir WARNING WARNING: Directory impl does not support setting indexDir: org.apache.lucene.store.MockDirectoryWrapper
[junit4:junit4]   2> 3967 T1329 oasc.SolrCore.registerSearcher [collection1] Registered new searcher Searcher@52f49bd4 main{StandardDirectoryReader(segments_4:28:nrt _0(5.0):C23 _1(5.0):C13 _2(5.0):C1 _3(5.0):C14 _4(5.0):C8 _6(5.0):C2 _5(5.0):C32 _7(5.0):C12 _8(5.0):C16 _a(5.0):C28 _9(5.0):C3 _b(5.0):C2)}
[junit4:junit4]   2> 3968 T1324 C127 oasu.DirectUpdateHandler2.commit end_commit_flush
[junit4:junit4]   2> 3968 T1324 C127 UPDATE [collection1] webapp=/solr path=/update params={waitSearcher=true&commit=true&wt=javabin&expungeDeletes=false&version=2&softCommit=false} {add=[27 (1413131415640342528), 28 (1413131415646633985), 30 (1413131415648731137), 32 (1413131415649779712), 33 (1413131415651876865), 36 (1413131415652925440), 37 (1413131415653974016), 39 (1413131415655022594), 40 (1413131415656071171), 41 (1413131415658168320)],commit=} 0 467
[junit4:junit4]   2> 3968 T1326 C127 oasu.DirectUpdateHandler2.commit start commit{flags=0,_version_=0,optimize=false,openSearcher=true,waitSearcher=true,expungeDeletes=false,softCommit=false}
[junit4:junit4]   2> 3973 T1316 C126 oasc.SolrDeletionPolicy.onCommit SolrDeletionPolicy.onCommit: commits:num=2
[junit4:junit4]   2> 		commit{dir=MockDirWrapper(org.apache.lucene.store.RAMDirectory@38d2c662 lockFactory=org.apache.lucene.store.NativeFSLockFactory@3cc4699c),segFN=segments_4,generation=4,filenames=[_5_nrm.cfe, _5_Memory_0.ram, _3.fdt, _9_TestBloomFilteredLucene40Postings_0.prx, _8_TestBloomFilteredLucene40Postings_0.prx, _7.fnm, _6_Block_0.pos, _5_Pulsing40_0.tip, _3_TestBloomFilteredLucene40Postings_0.frq, _5_Pulsing40_0.tim, _1_Block_0.pos, _3_TestBloomFilteredLucene40Postings_0.tim, _0_TestBloomFilteredLucene40Postings_0.blm, _0_Pulsing40_0.tim, _0_Memory_0.ram, _9.fdt, _3_TestBloomFilteredLucene40Postings_0.tip, _9.fdx, _5_TestBloomFilteredLucene40Postings_0.frq, _1.fdx, _5_nrm.cfs, _1.fdt, _8_Pulsing40_0.frq, _6.fdt, _3_Pulsing40_0.frq, _2.si, _2_Pulsing40_0.tim, _2_Block_0.tim, _2_Block_0.tip, _2_Pulsing40_0.tip, _6.fdx, _8_Block_0.doc, _5_Block_0.tim, _2_nrm.cfe, _1_Memory_0.ram, _5_Pulsing40_0.frq, _0_Pulsing40_0.tip, _2_nrm.cfs, _2_TestBloomFilteredLucene40Postings_0.frq, _4_TestBloomFilteredLucene40Postings_0.blm, _4_Block_0.tip, _8_Memory_0.ram, _2.fnm, _9_Block_0.pos, _3.fdx, _7_Pulsing40_0.tim, _4_Pulsing40_0.tip, _4_Pulsing40_0.tim, _1.si, _4_TestBloomFilteredLucene40Postings_0.tim, _4_TestBloomFilteredLucene40Postings_0.tip, _7_Pulsing40_0.tip, _3_nrm.cfe, _0_Block_0.tip, _8_nrm.cfe, _0_Block_0.tim, _4_nrm.cfe, _7_Block_0.tim, _0_Pulsing40_0.prx, _7_Block_0.tip, _4.fdx, _1_Pulsing40_0.prx, _9.si, _1_Block_0.doc, _2_TestBloomFilteredLucene40Postings_0.tim, _2_TestBloomFilteredLucene40Postings_0.tip, _1_TestBloomFilteredLucene40Postings_0.frq, _5.si, _8_nrm.cfs, _3_nrm.cfs, _8_Pulsing40_0.tip, _6_Pulsing40_0.prx, _4_nrm.cfs, _8_Pulsing40_0.tim, _5_Block_0.tip, _7_Block_0.doc, _0_TestBloomFilteredLucene40Postings_0.prx, _8_TestBloomFilteredLucene40Postings_0.blm, _9_TestBloomFilteredLucene40Postings_0.tip, _9_TestBloomFilteredLucene40Postings_0.tim, _6_nrm.cfs, _7_nrm.cfs, _5_Block_0.pos, _6_TestBloomFilteredLucene40Postings_0.tip, _3_Memory_0.ram, _6_TestBloomFilteredLucene40Postings_0.tim, _6_TestBloomFilteredLucene40Postings_0.frq, _1_nrm.cfs, _5.fnm, _1_TestBloomFilteredLucene40Postings_0.prx, _0_Block_0.doc, _7_nrm.cfe, _6_nrm.cfe, _7_TestBloomFilteredLucene40Postings_0.frq, _4.fdt, _4.si, _9_TestBloomFilteredLucene40Postings_0.frq, _7_TestBloomFilteredLucene40Postings_0.prx, _1_nrm.cfe, _4_Pulsing40_0.frq, _9_Pulsing40_0.prx, _6_Block_0.tip, _5_TestBloomFilteredLucene40Postings_0.tim, _6_Block_0.tim, _8.fdx, _5_TestBloomFilteredLucene40Postings_0.tip, _8.fdt, _4_TestBloomFilteredLucene40Postings_0.frq, _2_Block_0.pos, _3_TestBloomFilteredLucene40Postings_0.prx, _2_TestBloomFilteredLucene40Postings_0.blm, _7.si, _7_TestBloomFilteredLucene40Postings_0.tip, _0_Pulsing40_0.frq, _7_TestBloomFilteredLucene40Postings_0.tim, _7_Memory_0.ram, _8.si, _8_Block_0.pos, _0_TestBloomFilteredLucene40Postings_0.frq, _1_Block_0.tip, _1_Block_0.tim, _3_Pulsing40_0.tip, _2.fdt, _7.fdx, _2.fdx, _3_Pulsing40_0.tim, _7.fdt, _3_Block_0.pos, _3_Block_0.doc, _7_Pulsing40_0.frq, _3.si, _7_Block_0.pos, _3_TestBloomFilteredLucene40Postings_0.blm, _6_Memory_0.ram, _9_Block_0.tip, _9_Block_0.tim, _3.fnm, _4_TestBloomFilteredLucene40Postings_0.prx, _4_Pulsing40_0.prx, _5_TestBloomFilteredLucene40Postings_0.blm, _5_Block_0.doc, _4_Block_0.pos, _3_Block_0.tip, _8_TestBloomFilteredLucene40Postings_0.tip, _8_TestBloomFilteredLucene40Postings_0.tim, _9.fnm, _9_Memory_0.ram, _5_Pulsing40_0.prx, _6.fnm, _6.si, _5.fdt, _7_TestBloomFilteredLucene40Postings_0.blm, _1_Pulsing40_0.tip, _2_TestBloomFilteredLucene40Postings_0.prx, _6_Pulsing40_0.frq, _1_Pulsing40_0.tim, _4.fnm, _1.fnm, _7_Pulsing40_0.prx, _1_Pulsing40_0.frq, _3_Block_0.tim, _9_Pulsing40_0.tip, _9_Pulsing40_0.tim, _6_Pulsing40_0.tim, _9_nrm.cfs, _8_Pulsing40_0.prx, _5_TestBloomFilteredLucene40Postings_0.prx, _6_Pulsing40_0.tip, _2_Pulsing40_0.prx, _0_TestBloomFilteredLucene40Postings_0.tim, _0_TestBloomFilteredLucene40Postings_0.tip, _0.fnm, _4_Block_0.tim, _9_nrm.cfe, _6_Block_0.doc, _8_TestBloomFilteredLucene40Postings_0.frq, _2_Pulsing40_0.frq, _8.fnm, _4_Memory_0.ram, _9_Block_0.doc, _0_Block_0.pos, _1_TestBloomFilteredLucene40Postings_0.blm, _9_TestBloomFilteredLucene40Postings_0.blm, _4_Block_0.doc, _1_TestBloomFilteredLucene40Postings_0.tip, _8_Block_0.tip, _9_Pulsing40_0.frq, _8_Block_0.tim, _2_Memory_0.ram, _0.si, _1_TestBloomFilteredLucene40Postings_0.tim, _0_nrm.cfs, _3_Pulsing40_0.prx, _0_nrm.cfe, _5.fdx, _0.fdx, _6_TestBloomFilteredLucene40Postings_0.blm, _6_TestBloomFilteredLucene40Postings_0.prx, _2_Block_0.doc, _0.fdt, segments_4]
[junit4:junit4]   2> 		commit{dir=MockDirWrapper(org.apache.lucene.store.RAMDirectory@38d2c662 lockFactory=org.apache.lucene.store.NativeFSLockFactory@3cc4699c),segFN=segments_5,generation=5,filenames=[_a_Block_0.pos, _f_nrm.cfe, _c_Block_0.tip, _a_TestBloomFilteredLucene40Postings_0.blm, _c_Block_0.pos, _f_TestBloomFilteredLucene40Postings_0.tim, _f_TestBloomFilteredLucene40Postings_0.tip, _d_TestBloomFilteredLucene40Postings_0.blm, _f.si, _e_nrm.cfe, _f_Block_0.doc, _c.si, _b_TestBloomFilteredLucene40Postings_0.tim, _a_Pulsing40_0.tip, _e_Pulsing40_0.tip, _f_nrm.cfs, _a_Pulsing40_0.tim, _e_TestBloomFilteredLucene40Postings_0.blm, _e_Pulsing40_0.tim, _e_nrm.cfs, _b_TestBloomFilteredLucene40Postings_0.tip, _c_Block_0.tim, _d_Block_0.pos, _e_Block_0.doc, _f_TestBloomFilteredLucene40Postings_0.prx, _e_TestBloomFilteredLucene40Postings_0.frq, _c_Memory_0.ram, _f_TestBloomFilteredLucene40Postings_0.frq, _f.fdt, _f_Block_0.tim, _e_Pulsing40_0.frq, _f_Block_0.tip, _f.fdx, _d_TestBloomFilteredLucene40Postings_0.prx, _e.si, _b_Block_0.pos, _a.fnm, _f_Pulsing40_0.prx, _a_Memory_0.ram, _c_TestBloomFilteredLucene40Postings_0.frq, _d_Pulsing40_0.prx, _c_Pulsing40_0.prx, _e.fdx, _a_TestBloomFilteredLucene40Postings_0.prx, _c_TestBloomFilteredLucene40Postings_0.tim, _b.si, _b_Memory_0.ram, _e.fdt, _c_TestBloomFilteredLucene40Postings_0.tip, _e_TestBloomFilteredLucene40Postings_0.prx, _d_Pulsing40_0.tip, _c_Pulsing40_0.tip, _b_Pulsing40_0.tip, _c_Pulsing40_0.tim, _d_Pulsing40_0.tim, _d_nrm.cfs, _b_Pulsing40_0.tim, _d.fdx, _c_TestBloomFilteredLucene40Postings_0.prx, _d.fdt, _f_Block_0.pos, _c.fnm, _d_nrm.cfe, _a_Block_0.doc, _b_Pulsing40_0.frq, _d_Memory_0.ram, _d_TestBloomFilteredLucene40Postings_0.tip, _e_Pulsing40_0.prx, _e_Block_0.tim, _d_TestBloomFilteredLucene40Postings_0.tim, _d_Pulsing40_0.frq, _e_Block_0.pos, _c.fdx, _d_Block_0.doc, _c.fdt, _e_Memory_0.ram, _e_Block_0.tip, _e.fnm, _a_nrm.cfe, _b_TestBloomFilteredLucene40Postings_0.blm, _b_Pulsing40_0.prx, _d.fnm, _a.si, _a_nrm.cfs, _a_Pulsing40_0.prx, _f_Pulsing40_0.frq, _c_TestBloomFilteredLucene40Postings_0.blm, _d.si, _e_TestBloomFilteredLucene40Postings_0.tim, _a_TestBloomFilteredLucene40Postings_0.frq, _b_TestBloomFilteredLucene40Postings_0.frq, _b_TestBloomFilteredLucene40Postings_0.prx, _c_Pulsing40_0.frq, _e_TestBloomFilteredLucene40Postings_0.tip, _d_Block_0.tip, _a.fdt, _a_Block_0.tip, _a.fdx, _a_Block_0.tim, _f_Memory_0.ram, _b_Block_0.doc, _f_Pulsing40_0.tim, _d_Block_0.tim, _f_Pulsing40_0.tip, _d_TestBloomFilteredLucene40Postings_0.frq, _a_TestBloomFilteredLucene40Postings_0.tip, _c_nrm.cfe, _b_Block_0.tim, _b_Block_0.tip, _c_Block_0.doc, _a_TestBloomFilteredLucene40Postings_0.tim, _f.fnm, _b_nrm.cfe, _f_TestBloomFilteredLucene40Postings_0.blm, _c_nrm.cfs, _a_Pulsing40_0.frq, _b.fnm, _b.fdt, _b_nrm.cfs, segments_5, _b.fdx]
[junit4:junit4]   2> 3973 T1335 C128 oass.SolrIndexSearcher.<init> Opening Searcher@6ae59c4a main
[junit4:junit4]   2> 3973 T1316 C126 oasc.SolrDeletionPolicy.updateCommits newest commit = 5
[junit4:junit4]   2> 3974 T1335 C128 oass.SolrIndexSearcher.getIndexDir WARNING WARNING: Directory impl does not support setting indexDir: org.apache.lucene.store.MockDirectoryWrapper
[junit4:junit4]   2> 3974 T1339 oasc.SolrCore.registerSearcher [collection1] Registered new searcher Searcher@6ae59c4a main{StandardDirectoryReader(segments_3:27:nrt _0(5.0):C19 _2(5.0):C3 _1(5.0):C8 _3(5.0):C20 _4(5.0):C20 _5(5.0):C5 _6(5.0):C5 _7(5.0):C45 _8(5.0):C22 _9(5.0):C5 _b(5.0):C7 _a(5.0):C10)}
[junit4:junit4]   2> 3975 T1335 C128 oasu.DirectUpdateHandler2.commit end_commit_flush
[junit4:junit4]   2> 3975 T1335 C128 UPDATE [collection1] webapp=/solr path=/update params={waitSearcher=true&commit=true&wt=javabin&expungeDeletes=false&version=2&softCommit=false} {add=[42 (1413131415650828289), 43 (1413131415655022592), 46 (1413131415656071168), 48 (1413131415661314048), 51 (1413131415667605504), 54 (1413131415668654082), 56 (1413131415669702656), 57 (1413131415670751232), 58 (1413131415699062784), 59 (1413131415701159936)],commit=} 0 465
[junit4:junit4]   2> 3975 T1334 C128 oasu.DirectUpdateHandler2.commit start commit{flags=0,_version_=0,optimize=false,openSearcher=true,waitSearcher=true,expungeDeletes=false,softCommit=false}
[junit4:junit4]   2> 3976 T1326 C127 oasc.SolrDeletionPolicy.onCommit SolrDeletionPolicy.onCommit: commits:num=2
[junit4:junit4]   2> 		commit{dir=MockDirWrapper(org.apache.lucene.store.RAMDirectory@74834659 lockFactory=org.apache.lucene.store.NativeFSLockFactory@5b3ecdb4),segFN=segments_4,generation=4,filenames=[_5_nrm.cfe, _a_Block_0.pos, _5_Memory_0.ram, _a_TestBloomFilteredLucene40Postings_0.blm, _9_TestBloomFilteredLucene40Postings_0.prx, _3.fdt, _8_TestBloomFilteredLucene40Postings_0.prx, _7.fnm, _6_Block_0.pos, _5_Pulsing40_0.tip, _3_TestBloomFilteredLucene40Postings_0.frq, _5_Pulsing40_0.tim, _1_Block_0.pos, _3_TestBloomFilteredLucene40Postings_0.tim, _0_TestBloomFilteredLucene40Postings_0.blm, _0_Pulsing40_0.tim, _0_Memory_0.ram, _9.fdt, _3_TestBloomFilteredLucene40Postings_0.tip, _9.fdx, _5_TestBloomFilteredLucene40Postings_0.frq, _1.fdx, _1.fdt, _5_nrm.cfs, _8_Pulsing40_0.frq, _6.fdt, _a.fnm, _3_Pulsing40_0.frq, _2.si, _2_Pulsing40_0.tim, _2_Block_0.tim, _2_Block_0.tip, _2_Pulsing40_0.tip, _6.fdx, _8_Block_0.doc, _5_Block_0.tim, _a_TestBloomFilteredLucene40Postings_0.prx, _2_nrm.cfe, _1_Memory_0.ram, _5_Pulsing40_0.frq, _0_Pulsing40_0.tip, _2_nrm.cfs, _2_TestBloomFilteredLucene40Postings_0.frq, _4_TestBloomFilteredLucene40Postings_0.blm, _4_Block_0.tip, _8_Memory_0.ram, _9_Block_0.pos, _2.fnm, _3.fdx, _7_Pulsing40_0.tim, _4_Pulsing40_0.tip, _4_Pulsing40_0.tim, _1.si, _4_TestBloomFilteredLucene40Postings_0.tim, _4_TestBloomFilteredLucene40Postings_0.tip, _7_Pulsing40_0.tip, _3_nrm.cfe, _0_Block_0.tip, _8_nrm.cfe, _0_Block_0.tim, _4_nrm.cfe, _7_Block_0.tim, _0_Pulsing40_0.prx, _7_Block_0.tip, _4.fdx, _1_Pulsing40_0.prx, _9.si, _1_Block_0.doc, _2_TestBloomFilteredLucene40Postings_0.tim, _a_Pulsing40_0.prx, _2_TestBloomFilteredLucene40Postings_0.tip, _1_TestBloomFilteredLucene40Postings_0.frq, _5.si, _8_nrm.cfs, _3_nrm.cfs, _8_Pulsing40_0.tip, _6_Pulsing40_0.prx, _4_nrm.cfs, _a_TestBloomFilteredLucene40Postings_0.frq, _8_Pulsing40_0.tim, _5_Block_0.tip, _7_Block_0.doc, _0_TestBloomFilteredLucene40Postings_0.prx, _a.fdt, _8_TestBloomFilteredLucene40Postings_0.blm, _a.fdx, _9_TestBloomFilteredLucene40Postings_0.tip, _9_TestBloomFilteredLucene40Postings_0.tim, _6_nrm.cfs, _7_nrm.cfs, _5_Block_0.pos, _6_TestBloomFilteredLucene40Postings_0.tip, _3_Memory_0.ram, _6_TestBloomFilteredLucene40Postings_0.tim, _6_TestBloomFilteredLucene40Postings_0.frq, _1_nrm.cfs, _5.fnm, _1_TestBloomFilteredLucene40Postings_0.prx, _0_Block_0.doc, _7_nrm.cfe, _6_nrm.cfe, _7_TestBloomFilteredLucene40Postings_0.frq, _9_TestBloomFilteredLucene40Postings_0.frq, _4.si, _4.fdt, _7_TestBloomFilteredLucene40Postings_0.prx, _1_nrm.cfe, _4_Pulsing40_0.frq, _9_Pulsing40_0.prx, _a_Pulsing40_0.frq, _6_Block_0.tip, _6_Block_0.tim, _5_TestBloomFilteredLucene40Postings_0.tim, _8.fdx, _5_TestBloomFilteredLucene40Postings_0.tip, _8.fdt, _4_TestBloomFilteredLucene40Postings_0.frq, _2_Block_0.pos, _3_TestBloomFilteredLucene40Postings_0.prx, _2_TestBloomFilteredLucene40Postings_0.blm, _7.si, _7_TestBloomFilteredLucene40Postings_0.tip, _0_Pulsing40_0.frq, _7_TestBloomFilteredLucene40Postings_0.tim, _7_Memory_0.ram, _8.si, _8_Block_0.pos, _a_Pulsing40_0.tip, _a_Pulsing40_0.tim, _0_TestBloomFilteredLucene40Postings_0.frq, _1_Block_0.tip, _1_Block_0.tim, _3_Pulsing40_0.tip, _2.fdt, _7.fdx, _2.fdx, _3_Pulsing40_0.tim, _7.fdt, _3_Block_0.pos, _3_Block_0.doc, _7_Pulsing40_0.frq, _3.si, _7_Block_0.pos, _3_TestBloomFilteredLucene40Postings_0.blm, _6_Memory_0.ram, _9_Block_0.tip, _9_Block_0.tim, _a_Memory_0.ram, _3.fnm, _4_TestBloomFilteredLucene40Postings_0.prx, _4_Pulsing40_0.prx, _5_TestBloomFilteredLucene40Postings_0.blm, _5_Block_0.doc, _4_Block_0.pos, _3_Block_0.tip, _8_TestBloomFilteredLucene40Postings_0.tip, _8_TestBloomFilteredLucene40Postings_0.tim, _9_Memory_0.ram, _9.fnm, _5_Pulsing40_0.prx, _6.fnm, _6.si, _a_Block_0.doc, _5.fdt, _7_TestBloomFilteredLucene40Postings_0.blm, _1_Pulsing40_0.tip, _2_TestBloomFilteredLucene40Postings_0.prx, _6_Pulsing40_0.frq, _1_Pulsing40_0.tim, _4.fnm, _1.fnm, _7_Pulsing40_0.prx, _1_Pulsing40_0.frq, _3_Block_0.tim, _9_Pulsing40_0.tip, _9_Pulsing40_0.tim, _6_Pulsing40_0.tim, _9_nrm.cfs, _8_Pulsing40_0.prx, _6_Pulsing40_0.tip, _5_TestBloomFilteredLucene40Postings_0.prx, _2_Pulsing40_0.prx, _0_TestBloomFilteredLucene40Postings_0.tim, _0_TestBloomFilteredLucene40Postings_0.tip, _a_nrm.cfe, _4_Block_0.tim, _0.fnm, _9_nrm.cfe, _6_Block_0.doc, _8_TestBloomFilteredLucene40Postings_0.frq, _a.si, _a_nrm.cfs, _2_Pulsing40_0.frq, _8.fnm, _4_Memory_0.ram, _9_Block_0.doc, _0_Block_0.pos, _1_TestBloomFilteredLucene40Postings_0.blm, _a_Block_0.tip, _9_TestBloomFilteredLucene40Postings_0.blm, _a_Block_0.tim, _4_Block_0.doc, _1_TestBloomFilteredLucene40Postings_0.tip, _8_Block_0.tip, _9_Pulsing40_0.frq, _8_Block_0.tim, _2_Memory_0.ram, _0.si, _1_TestBloomFilteredLucene40Postings_0.tim, _a_TestBloomFilteredLucene40Postings_0.tip, _0_nrm.cfs, _a_TestBloomFilteredLucene40Postings_0.tim, _3_Pulsing40_0.prx, _0_nrm.cfe, _5.fdx, _0.fdx, _6_TestBloomFilteredLucene40Postings_0.blm, _6_TestBloomFilteredLucene40Postings_0.prx, _2_Block_0.doc, _0.fdt, segments_4]
[junit4:junit4]   2> 		commit{dir=MockDirWrapper(org.apache.lucene.store.RAMDirectory@74834659 lockFactory=org.apache.lucene.store.NativeFSLockFactory@5b3ecdb4),segFN=segments_5,generation=5,filenames=[_5_nrm.cfe, _a_Block_0.pos, _5_Memory_0.ram, _a_TestBloomFilteredLucene40Postings_0.blm, _9_TestBloomFilteredLucene40Postings_0.prx, _3.fdt, _d_TestBloomFilteredLucene40Postings_0.blm, _8_TestBloomFilteredLucene40Postings_0.prx, _7.fnm, _6_Block_0.pos, _e_Pulsing40_0.tip, _e_Pulsing40_0.tim, _e_TestBloomFilteredLucene40Postings_0.blm, _5_Pulsing40_0.tip, _3_TestBloomFilteredLucene40Postings_0.frq, _5_Pulsing40_0.tim, _1_Block_0.pos, _3_TestBloomFilteredLucene40Postings_0.tim, _0_TestBloomFilteredLucene40Postings_0.blm, _0_Pulsing40_0.tim, _0_Memory_0.ram, _9.fdt, _e_TestBloomFilteredLucene40Postings_0.frq, _3_TestBloomFilteredLucene40Postings_0.tip, _9.fdx, _5_TestBloomFilteredLucene40Postings_0.frq, _e_Pulsing40_0.frq, _1.fdx, _d_TestBloomFilteredLucene40Postings_0.prx, _1.fdt, _5_nrm.cfs, _8_Pulsing40_0.frq, _6.fdt, _a.fnm, _3_Pulsing40_0.frq, _2.si, _2_Pulsing40_0.tim, _2_Block_0.tim, _2_Block_0.tip, _2_Pulsing40_0.tip, _6.fdx, _8_Block_0.doc, _5_Block_0.tim, _a_TestBloomFilteredLucene40Postings_0.prx, _2_nrm.cfe, _1_Memory_0.ram, _5_Pulsing40_0.frq, _b_Memory_0.ram, _0_Pulsing40_0.tip, _2_nrm.cfs, _2_TestBloomFilteredLucene40Postings_0.frq, _4_TestBloomFilteredLucene40Postings_0.blm, _4_Block_0.tip, _8_Memory_0.ram, _d_Pulsing40_0.tip, _b_Pulsing40_0.tip, _d_Pulsing40_0.tim, _b_Pulsing40_0.tim, _9_Block_0.pos, _2.fnm, _3.fdx, _7_Pulsing40_0.tim, _4_Pulsing40_0.tip, _4_Pulsing40_0.tim, _1.si, _4_TestBloomFilteredLucene40Postings_0.tim, _4_TestBloomFilteredLucene40Postings_0.tip, _7_Pulsing40_0.tip, _3_nrm.cfe, _0_Block_0.tip, _8_nrm.cfe, _d_Memory_0.ram, _e_Pulsing40_0.prx, _e_Block_0.tim, _0_Block_0.tim, _4_nrm.cfe, _7_Block_0.tim, _0_Pulsing40_0.prx, _7_Block_0.tip, _d_Block_0.doc, _4.fdx, _1_Pulsing40_0.prx, _e_Block_0.tip, _9.si, _e.fnm, _1_Block_0.doc, _2_TestBloomFilteredLucene40Postings_0.tim, _b_TestBloomFilteredLucene40Postings_0.blm, _b_Pulsing40_0.prx, _a_Pulsing40_0.prx, _2_TestBloomFilteredLucene40Postings_0.tip, _1_TestBloomFilteredLucene40Postings_0.frq, _5.si, _8_nrm.cfs, _3_nrm.cfs, _8_Pulsing40_0.tip, _6_Pulsing40_0.prx, _4_nrm.cfs, _d.si, _a_TestBloomFilteredLucene40Postings_0.frq, _b_TestBloomFilteredLucene40Postings_0.frq, _8_Pulsing40_0.tim, _5_Block_0.tip, _7_Block_0.doc, _0_TestBloomFilteredLucene40Postings_0.prx, _a.fdt, _8_TestBloomFilteredLucene40Postings_0.blm, _a.fdx, _9_TestBloomFilteredLucene40Postings_0.tip, _b_Block_0.doc, _9_TestBloomFilteredLucene40Postings_0.tim, _6_nrm.cfs, _7_nrm.cfs, _5_Block_0.pos, _6_TestBloomFilteredLucene40Postings_0.tip, _d_TestBloomFilteredLucene40Postings_0.frq, _3_Memory_0.ram, _6_TestBloomFilteredLucene40Postings_0.tim, _6_TestBloomFilteredLucene40Postings_0.frq, _1_nrm.cfs, _5.fnm, _1_TestBloomFilteredLucene40Postings_0.prx, _0_Block_0.doc, _7_nrm.cfe, _6_nrm.cfe, _7_TestBloomFilteredLucene40Postings_0.frq, _9_TestBloomFilteredLucene40Postings_0.frq, _4.si, _4.fdt, _7_TestBloomFilteredLucene40Postings_0.prx, _1_nrm.cfe, _4_Pulsing40_0.frq, _9_Pulsing40_0.prx, _a_Pulsing40_0.frq, _6_Block_0.tip, _b.fnm, _b.fdt, _6_Block_0.tim, _5_TestBloomFilteredLucene40Postings_0.tim, _8.fdx, _b.fdx, _5_TestBloomFilteredLucene40Postings_0.tip, _8.fdt, _4_TestBloomFilteredLucene40Postings_0.frq, _2_Block_0.pos, _3_TestBloomFilteredLucene40Postings_0.prx, _2_TestBloomFilteredLucene40Postings_0.blm, _7.si, _7_TestBloomFilteredLucene40Postings_0.tip, _0_Pulsing40_0.frq, _e_nrm.cfe, _7_TestBloomFilteredLucene40Postings_0.tim, _7_Memory_0.ram, _8.si, _8_Block_0.pos, _b_TestBloomFilteredLucene40Postings_0.tim, _a_Pulsing40_0.tip, _a_Pulsing40_0.tim, _e_nrm.cfs, _0_TestBloomFilteredLucene40Postings_0.frq, _b_TestBloomFilteredLucene40Postings_0.tip, _1_Block_0.tip, _d_Block_0.pos, _1_Block_0.tim, _e_Block_0.doc, _3_Pulsing40_0.tip, _2.fdt, _7.fdx, _2.fdx, _3_Pulsing40_0.tim, _7.fdt, _3_Block_0.pos, _3_Block_0.doc, _e.si, _7_Pulsing40_0.frq, _b_Block_0.pos, _3.si, _7_Block_0.pos, _3_TestBloomFilteredLucene40Postings_0.blm, _6_Memory_0.ram, _9_Block_0.tip, _9_Block_0.tim, _a_Memory_0.ram, _e.fdx, _d_Pulsing40_0.prx, _3.fnm, _4_TestBloomFilteredLucene40Postings_0.prx, _4_Pulsing40_0.prx, _b.si, _e.fdt, _5_TestBloomFilteredLucene40Postings_0.blm, _5_Block_0.doc, _4_Block_0.pos, _3_Block_0.tip, _e_TestBloomFilteredLucene40Postings_0.prx, _8_TestBloomFilteredLucene40Postings_0.tip, _8_TestBloomFilteredLucene40Postings_0.tim, _9_Memory_0.ram, _9.fnm, _d_nrm.cfs, _d.fdx, _d.fdt, _5_Pulsing40_0.prx, _6.fnm, _6.si, _d_nrm.cfe, _a_Block_0.doc, _b_Pulsing40_0.frq, _5.fdt, _7_TestBloomFilteredLucene40Postings_0.blm, _d_TestBloomFilteredLucene40Postings_0.tip, _1_Pulsing40_0.tip, _2_TestBloomFilteredLucene40Postings_0.prx, _6_Pulsing40_0.frq, _d_TestBloomFilteredLucene40Postings_0.tim, _1_Pulsing40_0.tim, _d_Pulsing40_0.frq, _4.fnm, _e_Block_0.pos, _1.fnm, _7_Pulsing40_0.prx, _1_Pulsing40_0.frq, _3_Block_0.tim, _9_Pulsing40_0.tip, _9_Pulsing40_0.tim, _6_Pulsing40_0.tim, _e_Memory_0.ram, _9_nrm.cfs, _8_Pulsing40_0.prx, _6_Pulsing40_0.tip, _5_TestBloomFilteredLucene40Postings_0.prx, _2_Pulsing40_0.prx, _0_TestBloomFilteredLucene40Postings_0.tim, _0_TestBloomFilteredLucene40Postings_0.tip, _a_nrm.cfe, _4_Block_0.tim, _0.fnm, _9_nrm.cfe, _6_Block_0.doc, _8_TestBloomFilteredLucene40Postings_0.frq, _d.fnm, _a.si, _a_nrm.cfs, _2_Pulsing40_0.frq, _8.fnm, _4_Memory_0.ram, _e_TestBloomFilteredLucene40Postings_0.tim, _9_Block_0.doc, _b_TestBloomFilteredLucene40Postings_0.prx, _e_TestBloomFilteredLucene40Postings_0.tip, _0_Block_0.pos, _d_Block_0.tip, _1_TestBloomFilteredLucene40Postings_0.blm, _a_Block_0.tip, _9_TestBloomFilteredLucene40Postings_0.blm, _a_Block_0.tim, _4_Block_0.doc, _1_TestBloomFilteredLucene40Postings_0.tip, _8_Block_0.tip, _9_Pulsing40_0.frq, _8_Block_0.tim, _d_Block_0.tim, _2_Memory_0.ram, _0.si, _1_TestBloomFilteredLucene40Postings_0.tim, _a_TestBloomFilteredLucene40Postings_0.tip, _b_Block_0.tim, _b_Block_0.tip, _0_nrm.cfs, _a_TestBloomFilteredLucene40Postings_0.tim, _3_Pulsing40_0.prx, _b_nrm.cfe, _0_nrm.cfe, _5.fdx, _0.fdx, _6_TestBloomFilteredLucene40Postings_0.blm, _b_nrm.cfs, _6_TestBloomFilteredLucene40Postings_0.prx, _2_Block_0.doc, segments_5, _0.fdt]
[junit4:junit4]   2> 3978 T1326 C127 oasc.SolrDeletionPolicy.updateCommits newest commit = 5
[junit4:junit4]   2> 3978 T1334 C128 oasc.SolrDeletionPolicy.onCommit SolrDeletionPolicy.onCommit: commits:num=2
[junit4:junit4]   2> 		commit{dir=MockDirWrapper(org.apache.lucene.store.RAMDirectory@65440a34 lockFactory=org.apache.lucene.store.NativeFSLockFactory@1427609d),segFN=segments_3,generation=3,filenames=[_5_nrm.cfe, _5_Memory_0.ram, _3.fdt, _9_TestBloomFilteredLucene40Postings_0.prx, _8_TestBloomFilteredLucene40Postings_0.prx, _7.fnm, _6_Block_0.pos, _5_Pulsing40_0.tip, _3_TestBloomFilteredLucene40Postings_0.frq, _5_Pulsing40_0.tim, _1_Block_0.pos, _3_TestBloomFilteredLucene40Postings_0.tim, _0_TestBloomFilteredLucene40Postings_0.blm, _0_Pulsing40_0.tim, _0_Memory_0.ram, _9.fdt, _3_TestBloomFilteredLucene40Postings_0.tip, _9.fdx, _5_TestBloomFilteredLucene40Postings_0.frq, _1.fdx, _1.fdt, _5_nrm.cfs, _8_Pulsing40_0.frq, _6.fdt, _3_Pulsing40_0.frq, _2.si, _2_Pulsing40_0.tim, _2_Block_0.tim, _2_Pulsing40_0.tip, _2_Block_0.tip, _6.fdx, _8_Block_0.doc, _5_Block_0.tim, _1_Memory_0.ram, _2_nrm.cfe, _5_Pulsing40_0.frq, _0_Pulsing40_0.tip, _2_nrm.cfs, _2_TestBloomFilteredLucene40Postings_0.frq, _4_TestBloomFilteredLucene40Postings_0.blm, _4_Block_0.tip, _8_Memory_0.ram, _2.fnm, _9_Block_0.pos, _3.fdx, _7_Pulsing40_0.tim, _4_Pulsing40_0.tip, _4_Pulsing40_0.tim, _1.si, _4_TestBloomFilteredLucene40Postings_0.tim, _4_TestBloomFilteredLucene40Postings_0.tip, _7_Pulsing40_0.tip, _3_nrm.cfe, _0_Block_0.tip, _8_nrm.cfe, _0_Block_0.tim, _4_nrm.cfe, _7_Block_0.tim, _0_Pulsing40_0.prx, _7_Block_0.tip, _4.fdx, _1_Pulsing40_0.prx, _9.si, _1_Block_0.doc, _2_TestBloomFilteredLucene40Postings_0.tim, _1_TestBloomFilteredLucene40Postings_0.frq, _2_TestBloomFilteredLucene40Postings_0.tip, _5.si, _8_nrm.cfs, _3_nrm.cfs, _8_Pulsing40_0.tip, _6_Pulsing40_0.prx, _4_nrm.cfs, _8_Pulsing40_0.tim, _5_Block_0.tip, _7_Block_0.doc, _0_TestBloomFilteredLucene40Postings_0.prx, _8_TestBloomFilteredLucene40Postings_0.blm, _9_TestBloomFilteredLucene40Postings_0.tip, _9_TestBloomFilteredLucene40Postings_0.tim, _6_nrm.cfs, _7_nrm.cfs, _5_Block_0.pos, _6_TestBloomFilteredLucene40Postings_0.tip, _3_Memory_0.ram, _6_TestBloomFilteredLucene40Postings_0.tim, _6_TestBloomFilteredLucene40Postings_0.frq, _1_nrm.cfs, _5.fnm, _0_Block_0.doc, _1_TestBloomFilteredLucene40Postings_0.prx, _7_nrm.cfe, _6_nrm.cfe, _7_TestBloomFilteredLucene40Postings_0.frq, _4.si, _4.fdt, _9_TestBloomFilteredLucene40Postings_0.frq, _7_TestBloomFilteredLucene40Postings_0.prx, _1_nrm.cfe, _4_Pulsing40_0.frq, _9_Pulsing40_0.prx, _6_Block_0.tip, _5_TestBloomFilteredLucene40Postings_0.tim, _6_Block_0.tim, _8.fdx, _5_TestBloomFilteredLucene40Postings_0.tip, _8.fdt, _4_TestBloomFilteredLucene40Postings_0.frq, _2_Block_0.pos, _3_TestBloomFilteredLucene40Postings_0.prx, _2_TestBloomFilteredLucene40Postings_0.blm, _7.si, _7_TestBloomFilteredLucene40Postings_0.tip, _0_Pulsing40_0.frq, _7_TestBloomFilteredLucene40Postings_0.tim, _7_Memory_0.ram, _8.si, _8_Block_0.pos, _0_TestBloomFilteredLucene40Postings_0.frq, _1_Block_0.tip, _1_Block_0.tim, _3_Pulsing40_0.tip, _2.fdt, _7.fdx, _2.fdx, _3_Pulsing40_0.tim, _7.fdt, _3_Block_0.pos, _3_Block_0.doc, _7_Pulsing40_0.frq, _3.si, _7_Block_0.pos, _3_TestBloomFilteredLucene40Postings_0.blm, _6_Memory_0.ram, _9_Block_0.tip, _9_Block_0.tim, _3.fnm, _4_TestBloomFilteredLucene40Postings_0.prx, _4_Pulsing40_0.prx, _5_TestBloomFilteredLucene40Postings_0.blm, _5_Block_0.doc, _4_Block_0.pos, _3_Block_0.tip, _8_TestBloomFilteredLucene40Postings_0.tip, _8_TestBloomFilteredLucene40Postings_0.tim, _9.fnm, _9_Memory_0.ram, _5_Pulsing40_0.prx, _6.fnm, _6.si, _5.fdt, _7_TestBloomFilteredLucene40Postings_0.blm, _2_TestBloomFilteredLucene40Postings_0.prx, _1_Pulsing40_0.tip, _6_Pulsing40_0.frq, _1_Pulsing40_0.tim, _4.fnm, _1.fnm, _7_Pulsing40_0.prx, _1_Pulsing40_0.frq, _3_Block_0.tim, _9_Pulsing40_0.tip, _9_Pulsing40_0.tim, _6_Pulsing40_0.tim, _9_nrm.cfs, _8_Pulsing40_0.prx, _5_TestBloomFilteredLucene40Postings_0.prx, _6_Pulsing40_0.tip, _2_Pulsing40_0.prx, _0_TestBloomFilteredLucene40Postings_0.tim, _0_TestBloomFilteredLucene40Postings_0.tip, _4_Block_0.tim, _0.fnm, _9_nrm.cfe, _6_Block_0.doc, _8_TestBloomFilteredLucene40Postings_0.frq, _2_Pulsing40_0.frq, _8.fnm, _4_Memory_0.ram, _9_Block_0.doc, _0_Block_0.pos, _1_TestBloomFilteredLucene40Postings_0.blm, _9_TestBloomFilteredLucene40Postings_0.blm, _4_Block_0.doc, _1_TestBloomFilteredLucene40Postings_0.tip, _8_Block_0.tip, _9_Pulsing40_0.frq, _8_Block_0.tim, _2_Memory_0.ram, _1_TestBloomFilteredLucene40Postings_0.tim, _0.si, _0_nrm.cfs, _3_Pulsing40_0.prx, _0_nrm.cfe, _5.fdx, _0.fdx, _6_TestBloomFilteredLucene40Postings_0.blm, _6_TestBloomFilteredLucene40Postings_0.prx, _2_Block_0.doc, _0.fdt, segments_3]
[junit4:junit4]   2> 		commit{dir=MockDirWrapper(org.apache.lucene.store.RAMDirectory@65440a34 lockFactory=org.apache.lucene.store.NativeFSLockFactory@1427609d),segFN=segments_4,generation=4,filenames=[_a_Block_0.pos, _5_nrm.cfe, _5_Memory_0.ram, _a_TestBloomFilteredLucene40Postings_0.blm, _3.fdt, _9_TestBloomFilteredLucene40Postings_0.prx, _d_TestBloomFilteredLucene40Postings_0.blm, _8_TestBloomFilteredLucene40Postings_0.prx, _7.fnm, _6_Block_0.pos, _5_Pulsing40_0.tip, _3_TestBloomFilteredLucene40Postings_0.frq, _5_Pulsing40_0.tim, _1_Block_0.pos, _3_TestBloomFilteredLucene40Postings_0.tim, _0_TestBloomFilteredLucene40Postings_0.blm, _0_Pulsing40_0.tim, _0_Memory_0.ram, _9.fdt, _3_TestBloomFilteredLucene40Postings_0.tip, _9.fdx, _5_TestBloomFilteredLucene40Postings_0.frq, _1.fdx, _d_TestBloomFilteredLucene40Postings_0.prx, _1.fdt, _5_nrm.cfs, _8_Pulsing40_0.frq, _6.fdt, _a.fnm, _3_Pulsing40_0.frq, _2.si, _2_Pulsing40_0.tim, _2_Block_0.tim, _2_Pulsing40_0.tip, _2_Block_0.tip, _6.fdx, _8_Block_0.doc, _5_Block_0.tim, _a_TestBloomFilteredLucene40Postings_0.prx, _1_Memory_0.ram, _2_nrm.cfe, _5_Pulsing40_0.frq, _b_Memory_0.ram, _0_Pulsing40_0.tip, _2_nrm.cfs, _2_TestBloomFilteredLucene40Postings_0.frq, _4_TestBloomFilteredLucene40Postings_0.blm, _4_Block_0.tip, _8_Memory_0.ram, _d_Pulsing40_0.tip, _b_Pulsing40_0.tip, _d_Pulsing40_0.tim, _b_Pulsing40_0.tim, _2.fnm, _9_Block_0.pos, _3.fdx, _7_Pulsing40_0.tim, _4_Pulsing40_0.tip, _4_Pulsing40_0.tim, _1.si, _4_TestBloomFilteredLucene40Postings_0.tim, _4_TestBloomFilteredLucene40Postings_0.tip, _7_Pulsing40_0.tip, _3_nrm.cfe, _0_Block_0.tip, _8_nrm.cfe, _d_Memory_0.ram, _0_Block_0.tim, _4_nrm.cfe, _7_Block_0.tim, _0_Pulsing40_0.prx, _7_Block_0.tip, _d_Block_0.doc, _4.fdx, _1_Pulsing40_0.prx, _9.si, _1_Block_0.doc, _2_TestBloomFilteredLucene40Postings_0.tim, _b_TestBloomFilteredLucene40Postings_0.blm, _b_Pulsing40_0.prx, _a_Pulsing40_0.prx, _1_TestBloomFilteredLucene40Postings_0.frq, _2_TestBloomFilteredLucene40Postings_0.tip, _5.si, _8_nrm.cfs, _3_nrm.cfs, _8_Pulsing40_0.tip, _6_Pulsing40_0.prx, _4_nrm.cfs, _d.si, _a_TestBloomFilteredLucene40Postings_0.frq, _b_TestBloomFilteredLucene40Postings_0.frq, _8_Pulsing40_0.tim, _5_Block_0.tip, _7_Block_0.doc, _0_TestBloomFilteredLucene40Postings_0.prx, _a.fdt, _8_TestBloomFilteredLucene40Postings_0.blm, _a.fdx, _9_TestBloomFilteredLucene40Postings_0.tip, _b_Block_0.doc, _9_TestBloomFilteredLucene40Postings_0.tim, _6_nrm.cfs, _7_nrm.cfs, _5_Block_0.pos, _6_TestBloomFilteredLucene40Postings_0.tip, _d_TestBloomFilteredLucene40Postings_0.frq, _3_Memory_0.ram, _6_TestBloomFilteredLucene40Postings_0.tim, _6_TestBloomFilteredLucene40Postings_0.frq, _1_nrm.cfs, _5.fnm, _0_Block_0.doc, _1_TestBloomFilteredLucene40Postings_0.prx, _7_nrm.cfe, _6_nrm.cfe, _7_TestBloomFilteredLucene40Postings_0.frq, _4.si, _4.fdt, _9_TestBloomFilteredLucene40Postings_0.frq, _7_TestBloomFilteredLucene40Postings_0.prx, _1_nrm.cfe, _4_Pulsing40_0.frq, _a_Pulsing40_0.frq, _9_Pulsing40_0.prx, _6_Block_0.tip, _b.fnm, _b.fdt, _5_TestBloomFilteredLucene40Postings_0.tim, _6_Block_0.tim, _8.fdx, _b.fdx, _5_TestBloomFilteredLucene40Postings_0.tip, _8.fdt, _4_TestBloomFilteredLucene40Postings_0.frq, _2_Block_0.pos, _3_TestBloomFilteredLucene40Postings_0.prx, _2_TestBloomFilteredLucene40Postings_0.blm, _7.si, _7_TestBloomFilteredLucene40Postings_0.tip, _0_Pulsing40_0.frq, _7_TestBloomFilteredLucene40Postings_0.tim, _7_Memory_0.ram, _8.si, _8_Block_0.pos, _b_TestBloomFilteredLucene40Postings_0.tim, _a_Pulsing40_0.tip, _a_Pulsing40_0.tim, _0_TestBloomFilteredLucene40Postings_0.frq, _b_TestBloomFilteredLucene40Postings_0.tip, _1_Block_0.tip, _d_Block_0.pos, _1_Block_0.tim, _3_Pulsing40_0.tip, _2.fdt, _7.fdx, _2.fdx, _3_Pulsing40_0.tim, _7.fdt, _3_Block_0.pos, _3_Block_0.doc, _7_Pulsing40_0.frq, _b_Block_0.pos, _3.si, _7_Block_0.pos, _3_TestBloomFilteredLucene40Postings_0.blm, _6_Memory_0.ram, _9_Block_0.tip, _9_Block_0.tim, _a_Memory_0.ram, _d_Pulsing40_0.prx, _3.fnm, _4_TestBloomFilteredLucene40Postings_0.prx, _4_Pulsing40_0.prx, _b.si, _5_TestBloomFilteredLucene40Postings_0.blm, _5_Block_0.doc, _4_Block_0.pos, _3_Block_0.tip, _8_TestBloomFilteredLucene40Postings_0.tip, _8_TestBloomFilteredLucene40Postings_0.tim, _9.fnm, _9_Memory_0.ram, _d_nrm.cfs, _d.fdx, _d.fdt, _5_Pulsing40_0.prx, _6.fnm, _6.si, _d_nrm.cfe, _a_Block_0.doc, _b_Pulsing40_0.frq, _5.fdt, _7_TestBloomFilteredLucene40Postings_0.blm, _d_TestBloomFilteredLucene40Postings_0.tip, _2_TestBloomFilteredLucene40Postings_0.prx, _1_Pulsing40_0.tip, _6_Pulsing40_0.frq, _d_TestBloomFilteredLucene40Postings_0.tim, _1_Pulsing40_0.tim, _d_Pulsing40_0.frq, _4.fnm, _1.fnm, _7_Pulsing40_0.prx, _1_Pulsing40_0.frq, _3_Block_0.tim, _9_Pulsing40_0.tip, _9_Pulsing40_0.tim, _6_Pulsing40_0.tim, _9_nrm.cfs, _8_Pulsing40_0.prx, _5_TestBloomFilteredLucene40Postings_0.prx, _6_Pulsing40_0.tip, _2_Pulsing40_0.prx, _0_TestBloomFilteredLucene40Postings_0.tim, _a_nrm.cfe, _0_TestBloomFilteredLucene40Postings_0.tip, _4_Block_0.tim, _0.fnm, _9_nrm.cfe, _6_Block_0.doc, _8_TestBloomFilteredLucene40Postings_0.frq, _d.fnm, _a.si, _a_nrm.cfs, _2_Pulsing40_0.frq, _8.fnm, _4_Memory_0.ram, _9_Block_0.doc, _b_TestBloomFilteredLucene40Postings_0.prx, _0_Block_0.pos, _d_Block_0.tip, _1_TestBloomFilteredLucene40Postings_0.blm, _a_Block_0.tip, _a_Block_0.tim, _9_TestBloomFilteredLucene40Postings_0.blm, _4_Block_0.doc, _1_TestBloomFilteredLucene40Postings_0.tip, _8_Block_0.tip, _9_Pulsing40_0.frq, _8_Block_0.tim, _d_Block_0.tim, _2_Memory_0.ram, _1_TestBloomFilteredLucene40Postings_0.tim, _0.si, _a_TestBloomFilteredLucene40Postings_0.tip, _b_Block_0.tim, _b_Block_0.tip, _0_nrm.cfs, _a_TestBloomFilteredLucene40Postings_0.tim, _3_Pulsing40_0.prx, _b_nrm.cfe, _0_nrm.cfe, _5.fdx, _0.fdx, _6_TestBloomFilteredLucene40Postings_0.blm, _b_nrm.cfs, _6_TestBloomFilteredLucene40Postings_0.prx, _2_Block_0.doc, _0.fdt, segments_4]
[junit4:junit4]   2> 3979 T1316 C126 oass.SolrIndexSearcher.<init> Opening Searcher@159c5c22 main
[junit4:junit4]   2> 3980 T1316 C126 oass.SolrIndexSearcher.getIndexDir WARNING WARNING: Directory impl does not support setting indexDir: org.apache.lucene.store.MockDirectoryWrapper
[junit4:junit4]   2> 3980 T1334 C128 oasc.SolrDeletionPolicy.updateCommits newest commit = 4
[junit4:junit4]   2> 3980 T1319 oasc.SolrCore.registerSearcher [collection1] Registered new searcher Searcher@159c5c22 main{StandardDirectoryReader(segments_5:37:nrt _d(5.0):C123 _c(5.0):C1 _a(5.0):C14 _b(5.0):C3 _e(5.0):C12 _f(5.0):C7 _h(5.0):C15 _g(5.0):C5)}
[junit4:junit4]   2> 3981 T1316 C126 oasu.DirectUpdateHandler2.commit end_commit_flush
[junit4:junit4]   2> 3981 T1316 C126 UPDATE [collection1] webapp=/solr path=/update params={waitSearcher=true&commit=true&wt=javabin&expungeDeletes=false&version=2&softCommit=false} {add=[66 (1413131415655022593), 70 (1413131415661314048), 73 (1413131415662362625), 76 (1413131415663411201), 77 (1413131415664459776), 80 (1413131415668654080), 86 (1413131415668654081), 87 (1413131415668654082), 88 (1413131415669702657), 89 (1413131415669702659)],commit=} 0 466
[junit4:junit4]   2> 3981 T1318 C126 oasu.DirectUpdateHandler2.commit start commit{flags=0,_version_=0,optimize=false,openSearcher=true,waitSearcher=true,expungeDeletes=false,softCommit=false}
[junit4:junit4]   2> 3982 T1318 C126 oasc.SolrDeletionPolicy.onCommit SolrDeletionPolicy.onCommit: commits:num=2
[junit4:junit4]   2> 		commit{dir=MockDirWrapper(org.apache.lucene.store.RAMDirectory@38d2c662 lockFactory=org.apache.lucene.store.NativeFSLockFactory@3cc4699c),segFN=segments_5,generation=5,filenames=[_a_Block_0.pos, _f_nrm.cfe, _c_Block_0.tip, _a_TestBloomFilteredLucene40Postings_0.blm, _c_Block_0.pos, _f_TestBloomFilteredLucene40Postings_0.tim, _f_TestBloomFilteredLucene40Postings_0.tip, _d_TestBloomFilteredLucene40Postings_0.blm, _f.si, _e_nrm.cfe, _f_Block_0.doc, _c.si, _b_TestBloomFilteredLucene40Postings_0.tim, _a_Pulsing40_0.tip, _e_Pulsing40_0.tip, _f_nrm.cfs, _a_Pulsing40_0.tim, _e_TestBloomFilteredLucene40Postings_0.blm, _e_Pulsing40_0.tim, _e_nrm.cfs, _b_TestBloomFilteredLucene40Postings_0.tip, _c_Block_0.tim, _d_Block_0.pos, _e_Block_0.doc, _f_TestBloomFilteredLucene40Postings_0.prx, _e_TestBloomFilteredLucene40Postings_0.frq, _c_Memory_0.ram, _f_TestBloomFilteredLucene40Postings_0.frq, _f.fdt, _f_Block_0.tim, _e_Pulsing40_0.frq, _f_Block_0.tip, _f.fdx, _d_TestBloomFilteredLucene40Postings_0.prx, _e.si, _b_Block_0.pos, _a.fnm, _f_Pulsing40_0.prx, _a_Memory_0.ram, _c_TestBloomFilteredLucene40Postings_0.frq, _d_Pulsing40_0.prx, _c_Pulsing40_0.prx, _e.fdx, _a_TestBloomFilteredLucene40Postings_0.prx, _c_TestBloomFilteredLucene40Postings_0.tim, _b.si, _b_Memory_0.ram, _e.fdt, _c_TestBloomFilteredLucene40Postings_0.tip, _e_TestBloomFilteredLucene40Postings_0.prx, _d_Pulsing40_0.tip, _c_Pulsing40_0.tip, _b_Pulsing40_0.tip, _c_Pulsing40_0.tim, _d_Pulsing40_0.tim, _d_nrm.cfs, _b_Pulsing40_0.tim, _d.fdx, _c_TestBloomFilteredLucene40Postings_0.prx, _d.fdt, _f_Block_0.pos, _c.fnm, _d_nrm.cfe, _a_Block_0.doc, _b_Pulsing40_0.frq, _d_Memory_0.ram, _d_TestBloomFilteredLucene40Postings_0.tip, _e_Pulsing40_0.prx, _e_Block_0.tim, _d_TestBloomFilteredLucene40Postings_0.tim, _d_Pulsing40_0.frq, _e_Block_0.pos, _c.fdx, _d_Block_0.doc, _c.fdt, _e_Memory_0.ram, _e_Block_0.tip, _e.fnm, _a_nrm.cfe, _b_TestBloomFilteredLucene40Postings_0.blm, _b_Pulsing40_0.prx, _d.fnm, _a.si, _a_nrm.cfs, _a_Pulsing40_0.prx, _f_Pulsing40_0.frq, _c_TestBloomFilteredLucene40Postings_0.blm, _d.si, _e_TestBloomFilteredLucene40Postings_0.tim, _a_TestBloomFilteredLucene40Postings_0.frq, _b_TestBloomFilteredLucene40Postings_0.frq, _b_TestBloomFilteredLucene40Postings_0.prx, _c_Pulsing40_0.frq, _e_TestBloomFilteredLucene40Postings_0.tip, _d_Block_0.tip, _a.fdt, _a_Block_0.tip, _a.fdx, _a_Block_0.tim, _f_Memory_0.ram, _b_Block_0.doc, _f_Pulsing40_0.tim, _d_Block_0.tim, _f_Pulsing40_0.tip, _d_TestBloomFilteredLucene40Postings_0.frq, _a_TestBloomFilteredLucene40Postings_0.tip, _c_nrm.cfe, _b_Block_0.tim, _b_Block_0.tip, _c_Block_0.doc, _a_TestBloomFilteredLucene40Postings_0.tim, _f.fnm, _b_nrm.cfe, _f_TestBloomFilteredLucene40Postings_0.blm, _c_nrm.cfs, _a_Pulsing40_0.frq, _b.fnm, _b.fdt, _b_nrm.cfs, segments_5, _b.fdx]
[junit4:junit4]   2> 		commit{dir=MockDirWrapper(org.apache.lucene.store.RAMDirectory@38d2c662 lockFactory=org.apache.lucene.store.NativeFSLockFactory@3cc4699c),segFN=segments_6,generation=6,filenames=[_a_Block_0.pos, _f_nrm.cfe, _c_Block_0.tip, _a_TestBloomFilteredLucene40Postings_0.blm, _h_Memory_0.ram, _c_Block_0.pos, _g_TestBloomFilteredLucene40Postings_0.prx, _f_TestBloomFilteredLucene40Postings_0.tim, _f_TestBloomFilteredLucene40Postings_0.tip, _d_TestBloomFilteredLucene40Postings_0.blm, _f.si, _e_nrm.cfe, _f_Block_0.doc, _c.si, _h.fdt, _b_TestBloomFilteredLucene40Postings_0.tim, _a_Pulsing40_0.tip, _e_Pulsing40_0.tip, _f_nrm.cfs, _a_Pulsing40_0.tim, _e_TestBloomFilteredLucene40Postings_0.blm, _e_Pulsing40_0.tim, _h.fdx, _e_nrm.cfs, _g_TestBloomFilteredLucene40Postings_0.blm, _b_TestBloomFilteredLucene40Postings_0.tip, _c_Block_0.tim, _g.fdt, _d_Block_0.pos, _g.fdx, _e_Block_0.doc, _f_TestBloomFilteredLucene40Postings_0.prx, _e_TestBloomFilteredLucene40Postings_0.frq, _c_Memory_0.ram, _f_TestBloomFilteredLucene40Postings_0.frq, _f.fdt, _h_Pulsing40_0.tim, _f_Block_0.tim, _e_Pulsing40_0.frq, _f_Block_0.tip, _f.fdx, _d_TestBloomFilteredLucene40Postings_0.prx, _e.si, _h_Pulsing40_0.prx, _b_Block_0.pos, _h_Pulsing40_0.tip, _a.fnm, _h_TestBloomFilteredLucene40Postings_0.prx, _g_Block_0.doc, _f_Pulsing40_0.prx, _a_Memory_0.ram, _c_TestBloomFilteredLucene40Postings_0.frq, _d_Pulsing40_0.prx, _c_Pulsing40_0.prx, _e.fdx, _g_Block_0.tip, _a_TestBloomFilteredLucene40Postings_0.prx, _c_TestBloomFilteredLucene40Postings_0.tim, _b.si, _b_Memory_0.ram, _g_Block_0.tim, _e.fdt, _h_Block_0.doc, _h_TestBloomFilteredLucene40Postings_0.blm, _c_TestBloomFilteredLucene40Postings_0.tip, _e_TestBloomFilteredLucene40Postings_0.prx, _g_nrm.cfs, _d_Pulsing40_0.tip, _g_TestBloomFilteredLucene40Postings_0.tim, _c_Pulsing40_0.tip, _b_Pulsing40_0.tip, _c_Pulsing40_0.tim, _d_Pulsing40_0.tim, _g_TestBloomFilteredLucene40Postings_0.tip, _d_nrm.cfs, _b_Pulsing40_0.tim, _d.fdx, _c_TestBloomFilteredLucene40Postings_0.prx, _d.fdt, _h_TestBloomFilteredLucene40Postings_0.frq, _h_Block_0.tip, _h_Block_0.tim, _g_nrm.cfe, _f_Block_0.pos, _c.fnm, _d_nrm.cfe, _g_Block_0.pos, _a_Block_0.doc, _b_Pulsing40_0.frq, _d_Memory_0.ram, _g_Memory_0.ram, _d_TestBloomFilteredLucene40Postings_0.tip, _e_Pulsing40_0.prx, _e_Block_0.tim, _d_TestBloomFilteredLucene40Postings_0.tim, _d_Pulsing40_0.frq, _e_Block_0.pos, _c.fdx, _d_Block_0.doc, _c.fdt, _h.si, _h_Block_0.pos, _e_Memory_0.ram, _e_Block_0.tip, _e.fnm, _h.fnm, _a_nrm.cfe, _b_TestBloomFilteredLucene40Postings_0.blm, _b_Pulsing40_0.prx, _g_TestBloomFilteredLucene40Postings_0.frq, _d.fnm, _a.si, _a_nrm.cfs, _a_Pulsing40_0.prx, _f_Pulsing40_0.frq, _c_TestBloomFilteredLucene40Postings_0.blm, _d.si, _e_TestBloomFilteredLucene40Postings_0.tim, _a_TestBloomFilteredLucene40Postings_0.frq, _b_TestBloomFilteredLucene40Postings_0.frq, _b_TestBloomFilteredLucene40Postings_0.prx, _c_Pulsing40_0.frq, _e_TestBloomFilteredLucene40Postings_0.tip, _g.si, _h_Pulsing40_0.frq, _d_Block_0.tip, _h_nrm.cfe, _a.fdt, _a_Block_0.tip, _a.fdx, _a_Block_0.tim, _g_Pulsing40_0.frq, _f_Memory_0.ram, _g.fnm, _b_Block_0.doc, _f_Pulsing40_0.tim, _d_Block_0.tim, _h_nrm.cfs, _f_Pulsing40_0.tip, _d_TestBloomFilteredLucene40Postings_0.frq, _h_TestBloomFilteredLucene40Postings_0.tim, _h_TestBloomFilteredLucene40Postings_0.tip, _a_TestBloomFilteredLucene40Postings_0.tip, _c_nrm.cfe, _g_Pulsing40_0.tip, _g_Pulsing40_0.tim, _b_Block_0.tim, _b_Block_0.tip, _c_Block_0.doc, _a_TestBloomFilteredLucene40Postings_0.tim, _g_Pulsing40_0.prx, _f.fnm, _b_nrm.cfe, _f_TestBloomFilteredLucene40Postings_0.blm, _c_nrm.cfs, _a_Pulsing40_0.frq, _b.fnm, _b.fdt, _b_nrm.cfs, segments_6, _b.fdx]
[junit4:junit4]   2> 3982 T1334 C128 oass.SolrIndexSearcher.<init> Opening Searcher@4260f924 main
[junit4:junit4]   2> 3983 T1318 C126 oasc.SolrDeletionPolicy.updateCommits newest commit = 6
[junit4:junit4]   2> 3983 T1334 C128 oass.SolrIndexSearcher.getIndexDir WARNING WARNING: Directory impl does not support setting indexDir: org.apache.lucene.store.MockDirectoryWrapper
[junit4:junit4]   2> 3983 T1339 oasc.SolrCore.registerSearcher [collection1] Registered new searcher Searcher@4260f924 main{StandardDirectoryReader(segments_4:28:nrt _0(5.0):C19 _2(5.0):C3 _1(5.0):C8 _3(5.0):C20 _4(5.0):C20 _5(5.0):C5 _6(5.0):C5 _7(5.0):C45 _8(5.0):C22 _9(5.0):C5 _b(5.0):C7 _a(5.0):C10 _d(5.0):C1)}
[junit4:junit4]   2> 3984 T1334 C128 oasu.DirectUpdateHandler2.commit end_commit_flush
[junit4:junit4]   2> 3984 T1318 C126 oass.SolrIndexSearcher.<init> Opening Searcher@6b85572c main
[junit4:junit4]   2> 3984 T1334 C128 UPDATE [collection1] webapp=/solr path=/update params={waitSearcher=true&commit=true&wt=javabin&expungeDeletes=false&version=2&softCommit=false} {add=[17 (1413131415645585408), 19 (1413131415646633986), 21 (1413131415649779712), 26 (1413131415651876865), 27 (1413131415655022594), 28 (1413131415657119744), 29 (1413131415661314050), 33 (1413131415663411202), 36 (1413131415665508353), 37 (1413131415707451393)],commit=} 0 483
[junit4:junit4]   2> 3984 T1326 C127 oass.SolrIndexSearcher.<init> Opening Searcher@760feb96 main
[junit4:junit4]   2> 3984 T1318 C126 oass.SolrIndexSearcher.getIndexDir WARNING WARNING: Directory impl does not support setting indexDir: org.apache.lucene.store.MockDirectoryWrapper
[junit4:junit4]   2> 3984 T1337 C128 oasu.DirectUpdateHandler2.commit start commit{flags=0,_version_=0,optimize=false,openSearcher=true,waitSearcher=true,expungeDeletes=false,softCommit=false}
[junit4:junit4]   2> 3985 T1318 C126 oasu.DirectUpdateHandler2.commit end_commit_flush
[junit4:junit4]   2> 3985 T1319 oasc.SolrCore.registerSearcher [collection1] Registered new searcher Searcher@6b85572c main{StandardDirectoryReader(segments_5:37:nrt _d(5.0):C123 _c(5.0):C1 _a(5.0):C14 _b(5.0):C3 _e(5.0):C12 _f(5.0):C7 _h(5.0):C15 _g(5.0):C5)}
[junit4:junit4]   2> 3985 T1326 C127 oass.SolrIndexSearcher.getIndexDir WARNING WARNING: Directory impl does not support setting indexDir: org.apache.lucene.store.MockDirectoryWrapper
[junit4:junit4]   2> 3985 T1318 C126 UPDATE [collection1] webapp=/solr path=/update params={waitSearcher=true&commit=true&wt=javabin&expungeDeletes=false&version=2&softCommit=false} {add=[115 (1413131415669702656), 117 (1413131415669702658), 119 (1413131415669702660), 122 (1413131415670751232), 123 (1413131415692771328), 124 (1413131415692771329), 129 (1413131415692771330), 131 (1413131415699062784), 135 (1413131415700111360), 136 (1413131415701159936)],commit=} 0 457
[junit4:junit4]   2> 3985 T1317 C126 oasu.DirectUpdateHandler2.commit start commit{flags=0,_version_=0,optimize=false,openSearcher=true,waitSearcher=true,expungeDeletes=false,softCommit=false}
[junit4:junit4]   2> 3986 T1326 C127 oasu.DirectUpdateHandler2.commit end_commit_flush
[junit4:junit4]   2> 3986 T1329 oasc.SolrCore.registerSearcher [collection1] Registered new searcher Searcher@760feb96 main{StandardDirectoryReader(segments_5:33:nrt _c(5.0):C120 _5(5.0):C32 _b(5.0):C2 _d(5.0):C14 _e(5.0):C5 _f(5.0):C7)}
[junit4:junit4]   2> 3986 T1337 C128 oass.SolrIndexSearcher.<init> Opening Searcher@1f485aa4 main
[junit4:junit4]   2> 3986 T1317 C126 oass.SolrIndexSearcher.<init> Opening Searcher@2467f8d0 main
[junit4:junit4]   2> 3986 T1327 C127 oasu.DirectUpdateHandler2.commit start commit{flags=0,_version_=0,optimize=false,openSearcher=true,waitSearcher=true,expungeDeletes=false,softCommit=false}
[junit4:junit4]   2> 3987 T1317 C126 oass.SolrIndexSearcher.getIndexDir WARNING WARNING: Directory impl does not support setting indexDir: org.apache.lucene.store.MockDirectoryWrapper
[junit4:junit4]   2> 3987 T1326 C127 UPDATE [collection1] webapp=/solr path=/update params={waitSearcher=true&commit=true&wt=javabin&expungeDeletes=false&version=2&softCommit=false} {add=[72 (1413131415652925442), 73 (1413131415655022592), 75 (1413131415656071170), 76 (1413131415657119747), 77 (1413131415659216896), 78 (1413131415661314049), 80 (1413131415667605504), 81 (1413131415668654080), 83 (1413131415668654083), 86 (1413131415668654086)],commit=} 0 474
[junit4:junit4]   2> 3987 T1319 oasc.SolrCore.registerSearcher [collection1] Registered new searcher Searcher@2467f8d0 main{StandardDirectoryReader(segments_5:37:nrt _d(5.0):C123 _c(5.0):C1 _a(5.0):C14 _b(5.0):C3 _e(5.0):C12 _f(5.0):C7 _h(5.0):C15 _g(5.0):C5)}
[junit4:junit4]   2> 3987 T1337 C128 oass.SolrIndexSearcher.getIndexDir WARNING WARNING: Directory impl does not support setting indexDir: org.apache.lucene.store.MockDirectoryWrapper
[junit4:junit4]   2> 3987 T1317 C126 oasu.DirectUpdateHandler2.commit end_commit_flush
[junit4:junit4]   2> 3988 T1327 C127 oasc.SolrDeletionPolicy.onCommit SolrDeletionPolicy.onCommit: commits:num=2
[junit4:junit4]   2> 		commit{dir=MockDirWrapper(org.apache.lucene.store.RAMDirectory@74834659 lockFactory=org.apache.lucene.store.NativeFSLockFactory@5b3ecdb4),segFN=segments_5,generation=5,filenames=[_5_nrm.cfe, _a_Block_0.pos, _5_Memory_0.ram, _a_TestBloomFilteredLucene40Postings_0.blm, _9_TestBloomFilteredLucene40Postings_0.prx, _3.fdt, _d_TestBloomFilteredLucene40Postings_0.blm, _8_TestBloomFilteredLucene40Postings_0.prx, _7.fnm, _6_Block_0.pos, _e_Pulsing40_0.tip, _e_Pulsing40_0.tim, _e_TestBloomFilteredLucene40Postings_0.blm, _5_Pulsing40_0.tip, _3_TestBloomFilteredLucene40Postings_0.frq, _5_Pulsing40_0.tim, _1_Block_0.pos, _3_TestBloomFilteredLucene40Postings_0.tim, _0_TestBloomFilteredLucene40Postings_0.blm, _0_Pulsing40_0.tim, _0_Memory_0.ram, _9.fdt, _e_TestBloomFilteredLucene40Postings_0.frq, _3_TestBloomFilteredLucene40Postings_0.tip, _9.fdx, _5_TestBloomFilteredLucene40Postings_0.frq, _e_Pulsing40_0.frq, _1.fdx, _d_TestBloomFilteredLucene40Postings_0.prx, _1.fdt, _5_nrm.cfs, _8_Pulsing40_0.frq, _6.fdt, _a.fnm, _3_Pulsing40_0.frq, _2.si, _2_Pulsing40_0.tim, _2_Block_0.tim, _2_Block_0.tip, _2_Pulsing40_0.tip, _6.fdx, _8_Block_0.doc, _5_Block_0.tim, _a_TestBloomFilteredLucene40Postings_0.prx, _2_nrm.cfe, _1_Memory_0.ram, _5_Pulsing40_0.frq, _b_Memory_0.ram, _0_Pulsing40_0.tip, _2_nrm.cfs, _2_TestBloomFilteredLucene40Postings_0.frq, _4_TestBloomFilteredLucene40Postings_0.blm, _4_Block_0.tip, _8_Memory_0.ram, _d_Pulsing40_0.tip, _b_Pulsing40_0.tip, _d_Pulsing40_0.tim, _b_Pulsing40_0.tim, _9_Block_0.pos, _2.fnm, _3.fdx, _7_Pulsing40_0.tim, _4_Pulsing40_0.tip, _4_Pulsing40_0.tim, _1.si, _4_TestBloomFilteredLucene40Postings_0.tim, _4_TestBloomFilteredLucene40Postings_0.tip, _7_Pulsing40_0.tip, _3_nrm.cfe, _0_Block_0.tip, _8_nrm.cfe, _d_Memory_0.ram, _e_Pulsing40_0.prx, _e_Block_0.tim, _0_Block_0.tim, _4_nrm.cfe, _7_Block_0.tim, _0_Pulsing40_0.prx, _7_Block_0.tip, _d_Block_0.doc, _4.fdx, _1_Pulsing40_0.prx, _e_Block_0.tip, _9.si, _e.fnm, _1_Block_0.doc, _2_TestBloomFilteredLucene40Postings_0.tim, _b_TestBloomFilteredLucene40Postings_0.blm, _b_Pulsing40_0.prx, _a_Pulsing40_0.prx, _2_TestBloomFilteredLucene40Postings_0.tip, _1_TestBloomFilteredLucene40Postings_0.frq, _5.si, _8_nrm.cfs, _3_nrm.cfs, _8_Pulsing40_0.tip, _6_Pulsing40_0.prx, _4_nrm.cfs, _d.si, _a_TestBloomFilteredLucene40Postings_0.frq, _b_TestBloomFilteredLucene40Postings_0.frq, _8_Pulsing40_0.tim, _5_Block_0.tip, _7_Block_0.doc, _0_TestBloomFilteredLucene40Postings_0.prx, _a.fdt, _8_TestBloomFilteredLucene40Postings_0.blm, _a.fdx, _9_TestBloomFilteredLucene40Postings_0.tip, _b_Block_0.doc, _9_TestBloomFilteredLucene40Postings_0.tim, _6_nrm.cfs, _7_nrm.cfs, _5_Block_0.pos, _6_TestBloomFilteredLucene40Postings_0.tip, _d_TestBloomFilteredLucene40Postings_0.frq, _3_Memory_0.ram, _6_TestBloomFilteredLucene40Postings_0.tim, _6_TestBloomFilteredLucene40Postings_0.frq, _1_nrm.cfs, _5.fnm, _1_TestBloomFilteredLucene40Postings_0.prx, _0_Block_0.doc, _7_nrm.cfe, _6_nrm.cfe, _7_TestBloomFilteredLucene40Postings_0.frq, _9_TestBloomFilteredLucene40Postings_0.frq, _4.si, _4.fdt, _7_TestBloomFilteredLucene40Postings_0.prx, _1_nrm.cfe, _4_Pulsing40_0.frq, _9_Pulsing40_0.prx, _a_Pulsing40_0.frq, _6_Block_0.tip, _b.fnm, _b.fdt, _6_Block_0.tim, _5_TestBloomFilteredLucene40Postings_0.tim, _8.fdx, _b.fdx, _5_TestBloomFilteredLucene40Postings_0.tip, _8.fdt, _4_TestBloomFilteredLucene40Postings_0.frq, _2_Block_0.pos, _3_TestBloomFilteredLucene40Postings_0.prx, _2_TestBloomFilteredLucene40Postings_0.blm, _7.si, _7_TestBloomFilteredLucene40Postings_0.tip, _0_Pulsing40_0.frq, _e_nrm.cfe, _7_TestBloomFilteredLucene40Postings_0.tim, _7_Memory_0.ram, _8.si, _8_Block_0.pos, _b_TestBloomFilteredLucene40Postings_0.tim, _a_Pulsing40_0.tip, _a_Pulsing40_0.tim, _e_nrm.cfs, _0_TestBloomFilteredLucene40Postings_0.frq, _b_TestBloomFilteredLucene40Postings_0.tip, _1_Block_0.tip, _d_Block_0.pos, _1_Block_0.tim, _e_Block_0.doc, _3_Pulsing40_0.tip, _2.fdt, _7.fdx, _2.fdx, _3_Pulsing40_0.tim, _7.fdt, _3_Block_0.pos, _3_Block_0.doc, _e.si, _7_Pulsing40_0.frq, _b_Block_0.pos, _3.si, _7_Block_0.pos, _3_TestBloomFilteredLucene40Postings_0.blm, _6_Memory_0.ram, _9_Block_0.tip, _9_Block_0.tim, _a_Memory_0.ram, _e.fdx, _d_Pulsing40_0.prx, _3.fnm, _4_TestBloomFilteredLucene40Postings_0.prx, _4_Pulsing40_0.prx, _b.si, _e.fdt, _5_TestBloomFilteredLucene40Postings_0.blm, _5_Block_0.doc, _4_Block_0.pos, _3_Block_0.tip, _e_TestBloomFilteredLucene40Postings_0.prx, _8_TestBloomFilteredLucene40Postings_0.tip, _8_TestBloomFilteredLucene40Postings_0.tim, _9_Memory_0.ram, _9.fnm, _d_nrm.cfs, _d.fdx, _d.fdt, _5_Pulsing40_0.prx, _6.fnm, _6.si, _d_nrm.cfe, _a_Block_0.doc, _b_Pulsing40_0.frq, _5.fdt, _7_TestBloomFilteredLucene40Postings_0.blm, _d_TestBloomFilteredLucene40Postings_0.tip, _1_Pulsing40_0.tip, _2_TestBloomFilteredLucene40Postings_0.prx, _6_Pulsing40_0.frq, _d_TestBloomFilteredLucene40Postings_0.tim, _1_Pulsing40_0.tim, _d_Pulsing40_0.frq, _4.fnm, _e_Block_0.pos, _1.fnm, _7_Pulsing40_0.prx, _1_Pulsing40_0.frq, _3_Block_0.tim, _9_Pulsing40_0.tip, _9_Pulsing40_0.tim, _6_Pulsing40_0.tim, _e_Memory_0.ram, _9_nrm.cfs, _8_Pulsing40_0.prx, _6_Pulsing40_0.tip, _5_TestBloomFilteredLucene40Postings_0.prx, _2_Pulsing40_0.prx, _0_TestBloomFilteredLucene40Postings_0.tim, _0_TestBloomFilteredLucene40Postings_0.tip, _a_nrm.cfe, _4_Block_0.tim, _0.fnm, _9_nrm.cfe, _6_Block_0.doc, _8_TestBloomFilteredLucene40Postings_0.frq, _d.fnm, _a.si, _a_nrm.cfs, _2_Pulsing40_0.frq, _8.fnm, _4_Memory_0.ram, _e_TestBloomFilteredLucene40Postings_0.tim, _9_Block_0.doc, _b_TestBloomFilteredLucene40Postings_0.prx, _e_TestBloomFilteredLucene40Postings_0.tip, _0_Block_0.pos, _d_Block_0.tip, _1_TestBloomFilteredLucene40Postings_0.blm, _a_Block_0.tip, _9_TestBloomFilteredLucene40Postings_0.blm, _a_Block_0.tim, _4_Block_0.doc, _1_TestBloomFilteredLucene40Postings_0.tip, _8_Block_0.tip, _9_Pulsing40_0.frq, _8_Block_0.tim, _d_Block_0.tim, _2_Memory_0.ram, _0.si, _1_TestBloomFilteredLucene40Postings_0.tim, _a_TestBloomFilteredLucene40Postings_0.tip, _b_Block_0.tim, _b_Block_0.tip, _0_nrm.cfs, _a_TestBloomFilteredLucene40Postings_0.tim, _3_Pulsing40_0.prx, _b_nrm.cfe, _0_nrm.cfe, _5.fdx, _0.fdx, _6_TestBloomFilteredLucene40Postings_0.blm, _b_nrm.cfs, _6_TestBloomFilteredLucene40Postings_0.prx, _2_Block_0.doc, segments_5, _0.fdt]
[junit4:junit4]   2> 		commit{dir=MockDirWrapper(org.apache.lucene.store.RAMDirectory@74834659 lockFactory=org.apache.lucene.store.NativeFSLockFactory@5b3ecdb4),segFN=segments_6,generation=6,filenames=[_5_nrm.cfe, _f_nrm.cfe, _c_Block_0.tip, _5_Memory_0.ram, _c_Block_0.pos, _f_TestBloomFilteredLucene40Postings_0.tim, _f_TestBloomFilteredLucene40Postings_0.tip, _d_TestBloomFilteredLucene40Postings_0.blm, _f.si, _e_nrm.cfe, _f_Block_0.doc, _c.si, _b_TestBloomFilteredLucene40Postings_0.tim, _e_Pulsing40_0.tip, _f_nrm.cfs, _e_TestBloomFilteredLucene40Postings_0.blm, _e_Pulsing40_0.tim, _e_nrm.cfs, _5_Pulsing40_0.tip, _b_TestBloomFilteredLucene40Postings_0.tip, _c_Block_0.tim, _5_Pulsing40_0.tim, _d_Block_0.pos, _e_Block_0.doc, _f_TestBloomFilteredLucene40Postings_0.prx, _e_TestBloomFilteredLucene40Postings_0.frq, _c_Memory_0.ram, _f_TestBloomFilteredLucene40Postings_0.frq, _f.fdt, _5_TestBloomFilteredLucene40Postings_0.frq, _f_Block_0.tim, _e_Pulsing40_0.frq, _f_Block_0.tip, _f.fdx, _d_TestBloomFilteredLucene40Postings_0.prx, _e.si, _5_nrm.cfs, _b_Block_0.pos, _f_Pulsing40_0.prx, _c_TestBloomFilteredLucene40Postings_0.frq, _c_Pulsing40_0.prx, _d_Pulsing40_0.prx, _e.fdx, _5_Block_0.tim, _5_Pulsing40_0.frq, _c_TestBloomFilteredLucene40Postings_0.tim, _b.si, _b_Memory_0.ram, _e.fdt, _5_TestBloomFilteredLucene40Postings_0.blm, _5_Block_0.doc, _c_TestBloomFilteredLucene40Postings_0.tip, _e_TestBloomFilteredLucene40Postings_0.prx, _d_Pulsing40_0.tip, _b_Pulsing40_0.tip, _c_Pulsing40_0.tip, _c_Pulsing40_0.tim, _d_Pulsing40_0.tim, _b_Pulsing40_0.tim, _d_nrm.cfs, _d.fdx, _c_TestBloomFilteredLucene40Postings_0.prx, _d.fdt, _5_Pulsing40_0.prx, _f_Block_0.pos, _c.fnm, _d_nrm.cfe, _b_Pulsing40_0.frq, _5.fdt, _d_Memory_0.ram, _d_TestBloomFilteredLucene40Postings_0.tip, _e_Pulsing40_0.prx, _e_Block_0.tim, _d_TestBloomFilteredLucene40Postings_0.tim, _d_Pulsing40_0.frq, _e_Block_0.pos, _c.fdx, _d_Block_0.doc, _c.fdt, _e_Memory_0.ram, _e_Block_0.tip, _5_TestBloomFilteredLucene40Postings_0.prx, _e.fnm, _b_TestBloomFilteredLucene40Postings_0.blm, _b_Pulsing40_0.prx, _d.fnm, _f_Pulsing40_0.frq, _5.si, _c_TestBloomFilteredLucene40Postings_0.blm, _d.si, _e_TestBloomFilteredLucene40Postings_0.tim, _b_TestBloomFilteredLucene40Postings_0.frq, _b_TestBloomFilteredLucene40Postings_0.prx, _c_Pulsing40_0.frq, _5_Block_0.tip, _e_TestBloomFilteredLucene40Postings_0.tip, _d_Block_0.tip, _f_Memory_0.ram, _b_Block_0.doc, _f_Pulsing40_0.tim, _5_Block_0.pos, _d_Block_0.tim, _f_Pulsing40_0.tip, _d_TestBloomFilteredLucene40Postings_0.frq, _5.fnm, _c_nrm.cfe, _b_Block_0.tim, _b_Block_0.tip, _c_Block_0.doc, _f.fnm, _b_nrm.cfe, _f_TestBloomFilteredLucene40Postings_0.blm, _c_nrm.cfs, _5.fdx, _b.fnm, _b.fdt, _5_TestBloomFilteredLucene40Postings_0.tim, _b_nrm.cfs, segments_6, _5_TestBloomFilteredLucene40Postings_0.tip, _b.fdx]
[junit4:junit4]   2> 3988 T1337 C128 oasu.DirectUpdateHandler2.commit end_commit_flush
[junit4:junit4]   2> 3988 T1317 C126 UPDATE [collection1] webapp=/solr path=/update params={waitSearcher=true&commit=true&wt=javabin&expungeDeletes=false&version=2&softCommit=false} {add=[90 (1413131415660265472), 91 (1413131415662362624), 94 (1413131415663411200), 98 (1413131415663411202), 99 (1413131415664459777), 101 (1413131415665508352), 107 (1413131415704305665), 108 (1413131415705354241), 112 (1413131415705354243), 113 (1413131415708499970)],commit=} 0 469
[junit4:junit4]   2> 3988 T1376 C126 oasu.DirectUpdateHandler2.commit start commit{flags=0,_version_=0,optimize=false,openSearcher=true,waitSearcher=true,expungeDeletes=false,softCommit=false}
[junit4:junit4]   2> 3988 T1339 oasc.SolrCore.registerSearcher [collection1] Registered new searcher Searcher@1f485aa4 main{StandardDirectoryReader(segments_4:28:nrt _0(5.0):C19 _2(5.0):C3 _1(5.0):C8 _3(5.0):C20 _4(5.0):C20 _5(5.0):C5 _6(5.0):C5 _7(5.0):C45 _8(5.0):C22 _9(5.0):C5 _b(5.0):C7 _a(5.0):C10 _d(5.0):C1)}
[junit4:junit4]   2> 3990 T1336 C128 oasu.DirectUpdateHandler2.commit start commit{flags=0,_version_=0,optimize=false,openSearcher=true,waitSearcher=true,expungeDeletes=false,softCommit=false}
[junit4:junit4]   2> 3989 T1327 C127 oasc.SolrDeletionPolicy.updateCommits newest commit = 6
[junit4:junit4]   2> 3990 T1376 C126 oass.SolrIndexSearcher.<init> Opening Searcher@17f43407 main
[junit4:junit4]   2> 3990 T1337 C128 UPDATE [collection1] webapp=/solr path=/update params={waitSearcher=true&commit=true&wt=javabin&expungeDeletes=false&version=2&softCommit=false} {add=[75 (1413131415653974016), 76 (1413131415656071169), 78 (1413131415658168320), 80 (1413131415661314049), 81 (1413131415662362624), 82 (1413131415664459776), 83 (1413131415665508352), 84 (1413131415707451395), 85 (1413131415708499969), 86 (1413131415708499971)],commit=} 0 476
[junit4:junit4]   2> 3991 T1376 C126 oass.SolrIndexSearcher.getIndexDir WARNING WARNING: Directory impl does not support setting indexDir: org.apache.lucene.store.MockDirectoryWrapper
[junit4:junit4]   2> 3991 T1336 C128 oass.SolrIndexSearcher.<init> Opening Searcher@440f546f main
[junit4:junit4]   2> 3991 T1376 C126 oasu.DirectUpdateHandler2.commit end_commit_flush
[junit4:junit4]   2> 3991 T1319 oasc.SolrCore.registerSearcher [collection1] Registered new searcher Searcher@17f43407 main{StandardDirectoryReader(segments_5:37:nrt _d(5.0):C123 _c(5.0):C1 _a(5.0):C14 _b(5.0):C3 _e(5.0):C12 _f(5.0):C7 _h(5.0):C15 _g(5.0):C5)}
[junit4:junit4]   2> 3991 T1336 C128 oass.SolrIndexSearcher.getIndexDir WARNING WARNING: Directory impl does not support setting indexDir: org.apache.lucene.store.MockDirectoryWrapper
[junit4:junit4]   2> 3992 T1314 C126 oasu.DirectUpdateHandler2.commit start commit{flags=0,_version_=0,optimize=false,openSearcher=true,waitSearcher=true,expungeDeletes=false,softCommit=false}
[junit4:junit4]   2> 3992 T1376 C126 UPDATE [collection1] webapp=/solr path=/update params={waitSearcher=true&commit=true&wt=javabin&expungeDeletes=false&version=2&softCommit=false} {add=[137 (1413131415702208512), 139 (1413131415702208513), 141 (1413131415703257088), 142 (1413131415704305664), 143 (1413131415705354240), 144 (1413131415705354242), 145 (1413131415708499968), 146 (1413131415708499971), 147 (1413131415710597120), 148 (1413131415710597122)],commit=} 0 433
[junit4:junit4]   2> 3992 T1327 C127 oass.SolrIndexSearcher.<init> Opening Searcher@4ea5cdaa main
[junit4:junit4]   2> 3992 T1327 C127 oass.SolrIndexSearcher.getIndexDir WARNING WARNING: Directory impl does not support setting indexDir: org.apache.lucene.store.MockDirectoryWrapper
[junit4:junit4]   2> 3992 T1339 oasc.SolrCore.registerSearcher [collection1] Registered new searcher Searcher@440f546f main{StandardDirectoryReader(segments_4:28:nrt _0(5.0):C19 _2(5.0):C3 _1(5.0):C8 _3(5.0):C20 _4(5.0):C20 _5(5.0):C5 _6(5.0):C5 _7(5.0):C45 _8(5.0):C22 _9(5.0):C5 _b(5.0):C7 _a(5.0):C10 _d(5.0):C1)}
[junit4:junit4]   2> 3992 T1336 C128 oasu.DirectUpdateHandler2.commit end_commit_flush
[junit4:junit4]   2> 3992 T1314 C126 oass.SolrIndexSearcher.<init> Opening Searcher@31237c2a main
[junit4:junit4]   2> 3993 T1329 oasc.SolrCore.registerSearcher [collection1] Registered new searcher Searcher@4ea5cdaa main{StandardDirectoryReader(segments_5:33:nrt _c(5.0):C120 _5(5.0):C32 _b(5.0):C2 _d(5.0):C14 _e(5.0):C5 _f(5.0):C7)}
[junit4:junit4]   2> 3993 T1365 C128 oasu.DirectUpdateHandler2.commit start commit{flags=0,_version_=0,optimize=false,openSearcher=true,waitSearcher=true,expungeDeletes=false,softCommit=false}
[junit4:junit4]   2> 3993 T1336 C128 UPDATE [collection1] webapp=/solr path=/update params={waitSearcher=true&commit=true&wt=javabin&expungeDeletes=false&version=2&softCommit=false} {add=[60 (1413131415651876864), 62 (1413131415652925440), 64 (1413131415655022593), 65 (1413131415656071170), 67 (1413131415659216896), 69 (1413131415663411201), 70 (1413131416071307264), 72 (1413131416072355841), 73 (1413131416072355846), 74 (1413131416073404417)],commit=} 0 482
[junit4:junit4]   2> 3993 T1327 C127 oasu.DirectUpdateHandler2.commit end_commit_flush
[junit4:junit4]   2> 3993 T1314 C126 oass.SolrIndexSearcher.getIndexDir WARNING WARNING: Directory impl does not support setting indexDir: org.apache.lucene.store.MockDirectoryWrapper
[junit4:junit4]   2> 3994 T1327 C127 UPDATE [collection1] webapp=/solr path=/update params={waitSearcher=true&commit=true&wt=javabin&expungeDeletes=false&version=2&softCommit=false} {add=[87 (1413131415655022595), 88 (1413131415657119744), 90 (1413131415661314048), 92 (1413131415667605505), 93 (1413131415668654081), 94 (1413131415668654082), 97 (1413131415668654085), 98 (1413131415668654087), 101 (1413131415669702657), 102 (1413131415669702658)],commit=} 0 479
[junit4:junit4]   2> 3994 T1319 oasc.SolrCore.registerSearcher [collection1] Registered new searcher Searcher@31237c2a main{StandardDirectoryReader(segments_5:37:nrt _d(5.0):C123 _c(5.0):C1 _a(5.0):C14 _b(5.0):C3 _e(5.0):C12 _f(5.0):C7 _h(5.0):C15 _g(5.0):C5)}
[junit4:junit4]   2> 3994 T1371 C127 oasu.DirectUpdateHandler2.commit start commit{flags=0,_version_=0,optimize=false,openSearcher=true,waitSearcher=true,expungeDeletes=false,softCommit=false}
[junit4:junit4]   2> 3994 T1365 C128 oasc.SolrDeletionPolicy.onCommit SolrDeletionPolicy.onCommit: commits:num=2
[junit4:junit4]   2> 		commit{dir=MockDirWrapper(org.apache.lucene.store.RAMDirectory@65440a34 lockFactory=org.apache.lucene.store.NativeFSLockFactory@1427609d),segFN=segments_4,generation=4,filenames=[_a_Block_0.pos, _5_nrm.cfe, _5_Memory_0.ram, _a_TestBloomFilteredLucene40Postings_0.blm, _3.fdt, _9_TestBloomFilteredLucene40Postings_0.prx, _d_TestBloomFilteredLucene40Postings_0.blm, _8_TestBloomFilteredLucene40Postings_0.prx, _7.fnm, _6_Block_0.pos, _5_Pulsing40_0.tip, _3_TestBloomFilteredLucene40Postings_0.frq, _5_Pulsing40_0.tim, _1_Block_0.pos, _3_TestBloomFilteredLucene40Postings_0.tim, _0_TestBloomFilteredLucene40Postings_0.blm, _0_Pulsing40_0.tim, _0_Memory_0.ram, _9.fdt, _3_TestBloomFilteredLucene40Postings_0.tip, _9.fdx, _5_TestBloomFilteredLucene40Postings_0.frq, _1.fdx, _d_TestBloomFilteredLucene40Postings_0.prx, _1.fdt, _5_nrm.cfs, _8_Pulsing40_0.frq, _6.fdt, _a.fnm, _3_Pulsing40_0.frq, _2.si, _2_Pulsing40_0.tim, _2_Block_0.tim, _2_Pulsing40_0.tip, _2_Block_0.tip, _6.fdx, _8_Block_0.doc, _5_Block_0.tim, _a_TestBloomFilteredLucene40Postings_0.prx, _1_Memory_0.ram, _2_nrm.cfe, _5_Pulsing40_0.frq, _b_Memory_0.ram, _0_Pulsing40_0.tip, _2_nrm.cfs, _2_TestBloomFilteredLucene40Postings_0.frq, _4_TestBloomFilteredLucene40Postings_0.blm, _4_Block_0.tip, _8_Memory_0.ram, _d_Pulsing40_0.tip, _b_Pulsing40_0.tip, _d_Pulsing40_0.tim, _b_Pulsing40_0.tim, _2.fnm, _9_Block_0.pos, _3.fdx, _7_Pulsing40_0.tim, _4_Pulsing40_0.tip, _4_Pulsing40_0.tim, _1.si, _4_TestBloomFilteredLucene40Postings_0.tim, _4_TestBloomFilteredLucene40Postings_0.tip, _7_Pulsing40_0.tip, _3_nrm.cfe, _0_Block_0.tip, _8_nrm.cfe, _d_Memory_0.ram, _0_Block_0.tim, _4_nrm.cfe, _7_Block_0.tim, _0_Pulsing40_0.prx, _7_Block_0.tip, _d_Block_0.doc, _4.fdx, _1_Pulsing40_0.prx, _9.si, _1_Block_0.doc, _2_TestBloomFilteredLucene40Postings_0.tim, _b_TestBloomFilteredLucene40Postings_0.blm, _b_Pulsing40_0.prx, _a_Pulsing40_0.prx, _1_TestBloomFilteredLucene40Postings_0.frq, _2_TestBloomFilteredLucene40Postings_0.tip, _5.si, _8_nrm.cfs, _3_nrm.cfs, _8_Pulsing40_0.tip, _6_Pulsing40_0.prx, _4_nrm.cfs, _d.si, _a_TestBloomFilteredLucene40Postings_0.frq, _b_TestBloomFilteredLucene40Postings_0.frq, _8_Pulsing40_0.tim, _5_Block_0.tip, _7_Block_0.doc, _0_TestBloomFilteredLucene40Postings_0.prx, _a.fdt, _8_TestBloomFilteredLucene40Postings_0.blm, _a.fdx, _9_TestBloomFilteredLucene40Postings_0.tip, _b_Block_0.doc, _9_TestBloo

[...truncated too long message...]

ert.fail(Assert.java:93)
[junit4:junit4]    > 	at org.apache.solr.cloud.AbstractDistribZkTestBase.waitForRecoveriesToFinish(AbstractDistribZkTestBase.java:153)
[junit4:junit4]    > 	at org.apache.solr.cloud.AbstractFullDistribZkTestBase.waitForRecoveriesToFinish(AbstractFullDistribZkTestBase.java:555)
[junit4:junit4]    > 	at org.apache.solr.cloud.AbstractFullDistribZkTestBase.waitForThingsToLevelOut(AbstractFullDistribZkTestBase.java:1130)
[junit4:junit4]    > 	at org.apache.solr.cloud.SyncSliceTest.doTest(SyncSliceTest.java:162)
[junit4:junit4]    > 	at org.apache.solr.BaseDistributedSearchTestCase.testDistribSearch(BaseDistributedSearchTestCase.java:691)
[junit4:junit4]    > 	at sun.reflect.NativeMethodAccessorImpl.invoke0(Native Method)
[junit4:junit4]    > 	at sun.reflect.NativeMethodAccessorImpl.invoke(NativeMethodAccessorImpl.java:57)
[junit4:junit4]    > 	at sun.reflect.DelegatingMethodAccessorImpl.invoke(DelegatingMethodAccessorImpl.java:43)
[junit4:junit4]    > 	at java.lang.reflect.Method.invoke(Method.java:616)
[junit4:junit4]    > 	at com.carrotsearch.randomizedtesting.RandomizedRunner.invoke(RandomizedRunner.java:1559)
[junit4:junit4]    > 	at com.carrotsearch.randomizedtesting.RandomizedRunner.access$600(RandomizedRunner.java:79)
[junit4:junit4]    > 	at com.carrotsearch.randomizedtesting.RandomizedRunner$6.evaluate(RandomizedRunner.java:737)
[junit4:junit4]    > 	at com.carrotsearch.randomizedtesting.RandomizedRunner$7.evaluate(RandomizedRunner.java:773)
[junit4:junit4]    > 	at com.carrotsearch.randomizedtesting.RandomizedRunner$8.evaluate(RandomizedRunner.java:787)
[junit4:junit4]    > 	at com.carrotsearch.randomizedtesting.rules.SystemPropertiesRestoreRule$1.evaluate(SystemPropertiesRestoreRule.java:53)
[junit4:junit4]    > 	at org.apache.lucene.util.TestRuleSetupTeardownChained$1.evaluate(TestRuleSetupTeardownChained.java:50)
[junit4:junit4]    > 	at org.apache.lucene.util.TestRuleFieldCacheSanity$1.evaluate(TestRuleFieldCacheSanity.java:51)
[junit4:junit4]    > 	at org.apache.lucene.util.AbstractBeforeAfterRule$1.evaluate(AbstractBeforeAfterRule.java:45)
[junit4:junit4]    > 	at com.carrotsearch.randomizedtesting.rules.SystemPropertiesInvariantRule$1.evaluate(SystemPropertiesInvariantRule.java:55)
[junit4:junit4]    > 	at org.apache.lucene.util.TestRuleThreadAndTestName$1.evaluate(TestRuleThreadAndTestName.java:48)
[junit4:junit4]    > 	at org.apache.lucene.util.TestRuleIgnoreAfterMaxFailures$1.evaluate(TestRuleIgnoreAfterMaxFailures.java:70)
[junit4:junit4]    > 	at org.apache.lucene.util.TestRuleMarkFailure$1.evaluate(TestRuleMarkFailure.java:48)
[junit4:junit4]    > 	at com.carrotsearch.randomizedtesting.rules.StatementAdapter.evaluate(StatementAdapter.java:36)
[junit4:junit4]    > 	at com.carrotsearch.randomizedtesting.ThreadLeakControl$StatementRunner.run(ThreadLeakControl.java:358)
[junit4:junit4]    > 	at com.carrotsearch.randomizedtesting.ThreadLeakControl.forkTimeoutingTask(ThreadLeakControl.java:782)
[junit4:junit4]    > 	at com.carrotsearch.randomizedtesting.ThreadLeakControl$3.evaluate(ThreadLeakControl.java:442)
[junit4:junit4]    > 	at com.carrotsearch.randomizedtesting.RandomizedRunner.runSingleTest(RandomizedRunner.java:746)
[junit4:junit4]    > 	at com.carrotsearch.randomizedtesting.RandomizedRunner$3.evaluate(RandomizedRunner.java:648)
[junit4:junit4]    > 	at com.carrotsearch.randomizedtesting.RandomizedRunner$4.evaluate(RandomizedRunner.java:682)
[junit4:junit4]    > 	at com.carrotsearch.randomizedtesting.RandomizedRunner$5.evaluate(RandomizedRunner.java:693)
[junit4:junit4]    > 	at com.carrotsearch.randomizedtesting.rules.StatementAdapter.evaluate(StatementAdapter.java:36)
[junit4:junit4]    > 	at com.carrotsearch.randomizedtesting.rules.SystemPropertiesRestoreRule$1.evaluate(SystemPropertiesRestoreRule.java:53)
[junit4:junit4]    > 	at org.apache.lucene.util.AbstractBeforeAfterRule$1.evaluate(AbstractBeforeAfterRule.java:45)
[junit4:junit4]    > 	at org.apache.lucene.util.TestRuleStoreClassName$1.evaluate(TestRuleStoreClassName.java:42)
[junit4:junit4]    > 	at com.carrotsearch.randomizedtesting.rules.SystemPropertiesInvariantRule$1.evaluate(SystemPropertiesInvariantRule.java:55)
[junit4:junit4]    > 	at com.carrotsearch.randomizedtesting.rules.NoShadowingOrOverridesOnMethodsRule$1.evaluate(NoShadowingOrOverridesOnMethodsRule.java:39)
[junit4:junit4]    > 	at com.carrotsearch.randomizedtesting.rules.NoShadowingOrOverridesOnMethodsRule$1.evaluate(NoShadowingOrOverridesOnMethodsRule.java:39)
[junit4:junit4]    > 	at com.carrotsearch.randomizedtesting.rules.StatementAdapter.evaluate(StatementAdapter.java:36)
[junit4:junit4]    > 	at org.apache.lucene.util.TestRuleAssertionsRequired$1.evaluate(TestRuleAssertionsRequired.java:43)
[junit4:junit4]    > 	at org.apache.lucene.util.TestRuleMarkFailure$1.evaluate(TestRuleMarkFailure.java:48)
[junit4:junit4]    > 	at org.apache.lucene.util.TestRuleIgnoreAfterMaxFailures$1.evaluate(TestRuleIgnoreAfterMaxFailures.java:70)
[junit4:junit4]    > 	at org.apache.lucene.util.TestRuleIgnoreTestSuites$1.evaluate(TestRuleIgnoreTestSuites.java:55)
[junit4:junit4]    > 	at com.carrotsearch.randomizedtesting.rules.StatementAdapter.evaluate(StatementAdapter.java:36)
[junit4:junit4]    > 	at com.carrotsearch.randomizedtesting.ThreadLeakControl$StatementRunner.run(ThreadLeakControl.java:358)
[junit4:junit4]    > 	at java.lang.Thread.run(Thread.java:679)
[junit4:junit4]   2> 144689 T2137 oas.SolrTestCaseJ4.deleteCore ###deleteCore
[junit4:junit4]   2> NOTE: test params are: codec=Lucene40: {range_facet_l=PostingsFormat(name=NestedPulsing), text=PostingsFormat(name=SimpleText), _version_=PostingsFormat(name=NestedPulsing), rnd_b=MockVariableIntBlock(baseBlockSize=62), intDefault=PostingsFormat(name=NestedPulsing), id=MockVariableIntBlock(baseBlockSize=62), timestamp=PostingsFormat(name=NestedPulsing), a_t=PostingsFormat(name=NestedPulsing), range_facet_sl=PostingsFormat(name=SimpleText), range_facet_si=Lucene40(minBlockSize=52 maxBlockSize=198), other_tl1=PostingsFormat(name=NestedPulsing), multiDefault=Lucene40(minBlockSize=52 maxBlockSize=198), a_si=Lucene40(minBlockSize=52 maxBlockSize=198)}, sim=DefaultSimilarity, locale=th_TH_TH, timezone=America/Kentucky/Louisville
[junit4:junit4]   2> NOTE: FreeBSD 9.0-RELEASE amd64/Sun Microsystems Inc. 1.6.0_32 (64-bit)/cpus=16,threads=1,free=95615856,total=188547072
[junit4:junit4]   2> NOTE: All tests run in this JVM: [TestDocSet, XsltUpdateRequestHandlerTest, TestFoldingMultitermQuery, IndexSchemaRuntimeFieldTest, TestDocumentBuilder, PingRequestHandlerTest, SignatureUpdateProcessorFactoryTest, TestSort, ZkNodePropsTest, OutputWriterTest, ShowFileRequestHandlerTest, DirectSolrSpellCheckerTest, BasicFunctionalityTest, TermVectorComponentTest, PrimUtilsTest, QueryEqualityTest, TestMultiCoreConfBootstrap, ConvertedLegacyTest, FieldMutatingUpdateProcessorTest, TestPropInject, BadIndexSchemaTest, BasicZkTest, HighlighterTest, PeerSyncTest, SoftAutoCommitTest, TestReload, FullSolrCloudDistribCmdsTest, OpenExchangeRatesOrgProviderTest, TestPhraseSuggestions, LegacyHTMLStripCharFilterTest, EchoParamsTest, TestUpdate, TestQuerySenderListener, RecoveryZkTest, TestFastWriter, TestSolrDeletionPolicy2, XmlUpdateRequestHandlerTest, TestRemoteStreaming, SpellingQueryConverterTest, TestBinaryField, TestMergePolicyConfig, LukeRequestHandlerTest, QueryParsingTest, TestRTGBase, ClusterStateUpdateTest, TestBM25SimilarityFactory, ReturnFieldsTest, TestCodecSupport, TimeZoneUtilsTest, SuggesterTest, SuggesterTSTTest, StatsComponentTest, DistributedQueryElevationComponentTest, DirectUpdateHandlerTest, PathHierarchyTokenizerFactoryTest, DOMUtilTest, OverseerTest, SpellCheckComponentTest, TestReplicationHandler, LeaderElectionTest, ZkControllerTest, TestDistributedGrouping, SpellCheckCollatorTest, AutoCommitTest, ZkSolrClientTest, TestHashPartitioner, DistributedTermsComponentTest, TestRecovery, TestJoin, SortByFunctionTest, TestJmxIntegration, SampleTest, TestFunctionQuery, TestTrie, SolrRequestParserTest, CacheHeaderTest, TestWordDelimiterFilterFactory, TestCSVLoader, PolyFieldTest, SpatialFilterTest, DocumentBuilderTest, IndexSchemaTest, TermsComponentTest, MinimalSchemaTest, StandardRequestHandlerTest, TestPHPSerializedResponseWriter, JsonLoaderTest, TestSurroundQueryParser, SolrPluginUtilsTest, FastVectorHighlighterTest, DebugComponentTest, RequestHandlersTest, TestOmitPositions, TestQueryUtils, UniqFieldsUpdateProcessorFactoryTest, UpdateParamsTest, NotRequiredUniqueKeyTest, SolrCoreCheckLockOnStartupTest, TestSolrDeletionPolicy1, NoCacheHeaderTest, AlternateDirectoryTest, SOLR749Test, DefaultValueUpdateProcessorTest, SolrIndexConfigTest, NumericFieldsTest, MultiTermTest, TestJmxMonitoredMap, TestPluginEnable, TestDFRSimilarityFactory, DateMathParserTest, FileUtilsTest, TestSolrXMLSerializer, RAMDirectoryFactoryTest, AnalysisAfterCoreReloadTest, SyncSliceTest]
[junit4:junit4] Completed on J1 in 144.71s, 1 test, 1 failure <<< FAILURES!

[...truncated 5 lines...]
BUILD FAILED
/usr/home/hudson/hudson-slave/workspace/Lucene-Solr-Tests-trunk-Java6/build.xml:29: The following error occurred while executing this line:
/usr/home/hudson/hudson-slave/workspace/Lucene-Solr-Tests-trunk-Java6/solr/build.xml:146: The following error occurred while executing this line:
/usr/home/hudson/hudson-slave/workspace/Lucene-Solr-Tests-trunk-Java6/lucene/module-build.xml:63: The following error occurred while executing this line:
/usr/home/hudson/hudson-slave/workspace/Lucene-Solr-Tests-trunk-Java6/lucene/common-build.xml:1133: The following error occurred while executing this line:
/usr/home/hudson/hudson-slave/workspace/Lucene-Solr-Tests-trunk-Java6/lucene/common-build.xml:810: There were test failures: 228 suites, 923 tests, 1 error, 1 failure, 6 ignored (1 assumption)

Total time: 25 minutes 50 seconds
Build step 'Invoke Ant' marked build as failure
Recording test results
Email was triggered for: Failure
Sending email for trigger: Failure



Mime
View raw message