lucene-dev mailing list archives

Site index · List index
Message view « Date » · « Thread »
Top « Date » · « Thread »
From Apache Jenkins Server <jenk...@builds.apache.org>
Subject [JENKINS] Lucene-Solr-Tests-trunk-Java6 - Build # 15254 - Still Failing
Date Mon, 17 Sep 2012 18:45:53 GMT
Build: https://builds.apache.org/job/Lucene-Solr-Tests-trunk-Java6/15254/

1 tests failed.
FAILED:  org.apache.solr.cloud.BasicDistributedZk2Test.testDistribSearch

Error Message:
Shard still reported as live in zk

Stack Trace:
java.lang.AssertionError: Shard still reported as live in zk
	at __randomizedtesting.SeedInfo.seed([CBC1FFAE15322969:4A2771B6626D4955]:0)
	at org.junit.Assert.fail(Assert.java:93)
	at org.apache.solr.cloud.AbstractFullDistribZkTestBase.waitToSeeNotLive(AbstractFullDistribZkTestBase.java:1220)
	at org.apache.solr.cloud.BasicDistributedZk2Test.brindDownShardIndexSomeDocsAndRecover(BasicDistributedZk2Test.java:190)
	at org.apache.solr.cloud.BasicDistributedZk2Test.doTest(BasicDistributedZk2Test.java:83)
	at org.apache.solr.BaseDistributedSearchTestCase.testDistribSearch(BaseDistributedSearchTestCase.java:695)
	at sun.reflect.NativeMethodAccessorImpl.invoke0(Native Method)
	at sun.reflect.NativeMethodAccessorImpl.invoke(NativeMethodAccessorImpl.java:57)
	at sun.reflect.DelegatingMethodAccessorImpl.invoke(DelegatingMethodAccessorImpl.java:43)
	at java.lang.reflect.Method.invoke(Method.java:616)
	at com.carrotsearch.randomizedtesting.RandomizedRunner.invoke(RandomizedRunner.java:1559)
	at com.carrotsearch.randomizedtesting.RandomizedRunner.access$600(RandomizedRunner.java:79)
	at com.carrotsearch.randomizedtesting.RandomizedRunner$6.evaluate(RandomizedRunner.java:737)
	at com.carrotsearch.randomizedtesting.RandomizedRunner$7.evaluate(RandomizedRunner.java:773)
	at com.carrotsearch.randomizedtesting.RandomizedRunner$8.evaluate(RandomizedRunner.java:787)
	at com.carrotsearch.randomizedtesting.rules.SystemPropertiesRestoreRule$1.evaluate(SystemPropertiesRestoreRule.java:53)
	at org.apache.lucene.util.TestRuleSetupTeardownChained$1.evaluate(TestRuleSetupTeardownChained.java:50)
	at org.apache.lucene.util.TestRuleFieldCacheSanity$1.evaluate(TestRuleFieldCacheSanity.java:51)
	at org.apache.lucene.util.AbstractBeforeAfterRule$1.evaluate(AbstractBeforeAfterRule.java:45)
	at com.carrotsearch.randomizedtesting.rules.SystemPropertiesInvariantRule$1.evaluate(SystemPropertiesInvariantRule.java:55)
	at org.apache.lucene.util.TestRuleThreadAndTestName$1.evaluate(TestRuleThreadAndTestName.java:48)
	at org.apache.lucene.util.TestRuleIgnoreAfterMaxFailures$1.evaluate(TestRuleIgnoreAfterMaxFailures.java:70)
	at org.apache.lucene.util.TestRuleMarkFailure$1.evaluate(TestRuleMarkFailure.java:48)
	at com.carrotsearch.randomizedtesting.rules.StatementAdapter.evaluate(StatementAdapter.java:36)
	at com.carrotsearch.randomizedtesting.ThreadLeakControl$StatementRunner.run(ThreadLeakControl.java:358)
	at com.carrotsearch.randomizedtesting.ThreadLeakControl.forkTimeoutingTask(ThreadLeakControl.java:782)
	at com.carrotsearch.randomizedtesting.ThreadLeakControl$3.evaluate(ThreadLeakControl.java:442)
	at com.carrotsearch.randomizedtesting.RandomizedRunner.runSingleTest(RandomizedRunner.java:746)
	at com.carrotsearch.randomizedtesting.RandomizedRunner$3.evaluate(RandomizedRunner.java:648)
	at com.carrotsearch.randomizedtesting.RandomizedRunner$4.evaluate(RandomizedRunner.java:682)
	at com.carrotsearch.randomizedtesting.RandomizedRunner$5.evaluate(RandomizedRunner.java:693)
	at com.carrotsearch.randomizedtesting.rules.StatementAdapter.evaluate(StatementAdapter.java:36)
	at com.carrotsearch.randomizedtesting.rules.SystemPropertiesRestoreRule$1.evaluate(SystemPropertiesRestoreRule.java:53)
	at org.apache.lucene.util.AbstractBeforeAfterRule$1.evaluate(AbstractBeforeAfterRule.java:45)
	at org.apache.lucene.util.TestRuleStoreClassName$1.evaluate(TestRuleStoreClassName.java:42)
	at com.carrotsearch.randomizedtesting.rules.SystemPropertiesInvariantRule$1.evaluate(SystemPropertiesInvariantRule.java:55)
	at com.carrotsearch.randomizedtesting.rules.NoShadowingOrOverridesOnMethodsRule$1.evaluate(NoShadowingOrOverridesOnMethodsRule.java:39)
	at com.carrotsearch.randomizedtesting.rules.NoShadowingOrOverridesOnMethodsRule$1.evaluate(NoShadowingOrOverridesOnMethodsRule.java:39)
	at com.carrotsearch.randomizedtesting.rules.StatementAdapter.evaluate(StatementAdapter.java:36)
	at org.apache.lucene.util.TestRuleAssertionsRequired$1.evaluate(TestRuleAssertionsRequired.java:43)
	at org.apache.lucene.util.TestRuleMarkFailure$1.evaluate(TestRuleMarkFailure.java:48)
	at org.apache.lucene.util.TestRuleIgnoreAfterMaxFailures$1.evaluate(TestRuleIgnoreAfterMaxFailures.java:70)
	at org.apache.lucene.util.TestRuleIgnoreTestSuites$1.evaluate(TestRuleIgnoreTestSuites.java:55)
	at com.carrotsearch.randomizedtesting.rules.StatementAdapter.evaluate(StatementAdapter.java:36)
	at com.carrotsearch.randomizedtesting.ThreadLeakControl$StatementRunner.run(ThreadLeakControl.java:358)
	at java.lang.Thread.run(Thread.java:679)




Build Log:
[...truncated 7820 lines...]
[junit4:junit4] Suite: org.apache.solr.cloud.BasicDistributedZk2Test
[junit4:junit4]   2> 3 T1694 oas.SolrTestCaseJ4.setUp ###Starting testDistribSearch
[junit4:junit4]   2> Creating dataDir: /usr/home/hudson/hudson-slave/workspace/Lucene-Solr-Tests-trunk-Java6/solr/build/solr-core/test/J0/./solrtest-BasicDistributedZk2Test-1347907239725
[junit4:junit4]   2> 4 T1694 oasc.ZkTestServer.run STARTING ZK TEST SERVER
[junit4:junit4]   2> 7 T1695 oazs.ZooKeeperServer.setTickTime tickTime set to 1000
[junit4:junit4]   2> 7 T1695 oazs.NIOServerCnxn$Factory.<init> binding to port 0.0.0.0/0.0.0.0:0
[junit4:junit4]   2> 8 T1695 oazsp.FileTxnSnapLog.save Snapshotting: 0
[junit4:junit4]   2> 106 T1694 oasc.ZkTestServer.run start zk server on port:27198
[junit4:junit4]   2> 106 T1694 oaz.ZooKeeper.<init> Initiating client connection, connectString=127.0.0.1:27198 sessionTimeout=10000 watcher=org.apache.solr.common.cloud.ConnectionManager@38355629
[junit4:junit4]   2> 107 T1700 oaz.ClientCnxn$SendThread.startConnect Opening socket connection to server /127.0.0.1:27198
[junit4:junit4]   2> 107 T1694 oascc.ConnectionManager.waitForConnected Waiting for client to connect to ZooKeeper
[junit4:junit4]   2> 108 T1700 oaz.ClientCnxn$SendThread.primeConnection Socket connection established to localhost/127.0.0.1:27198, initiating session
[junit4:junit4]   2> 109 T1696 oazs.NIOServerCnxn$Factory.run Accepted socket connection from /140.211.11.196:27199
[junit4:junit4]   2> 109 T1696 oazs.NIOServerCnxn.readConnectRequest Client attempting to establish new session at /140.211.11.196:27199
[junit4:junit4]   2> 109 T1698 oazsp.FileTxnLog.append Creating new log file: log.1
[junit4:junit4]   2> 112 T1698 oazs.NIOServerCnxn.finishSessionInit Established session 0x139d5883f320000 with negotiated timeout 10000 for client /140.211.11.196:27199
[junit4:junit4]   2> 112 T1700 oaz.ClientCnxn$SendThread.readConnectResult Session establishment complete on server localhost/127.0.0.1:27198, sessionid = 0x139d5883f320000, negotiated timeout = 10000
[junit4:junit4]   2> 113 T1701 oascc.ConnectionManager.process Watcher org.apache.solr.common.cloud.ConnectionManager@38355629 name:ZooKeeperConnection Watcher:127.0.0.1:27198 got event WatchedEvent state:SyncConnected type:None path:null path:null type:None
[junit4:junit4]   2> 113 T1694 oascc.ConnectionManager.waitForConnected Client is connected to ZooKeeper
[junit4:junit4]   2> 113 T1694 oascc.SolrZkClient.makePath makePath: /solr
[junit4:junit4]   2> 116 T1699 oazs.PrepRequestProcessor.pRequest Processed session termination for sessionid: 0x139d5883f320000
[junit4:junit4]   2> 125 T1701 oaz.ClientCnxn$EventThread.run EventThread shut down
[junit4:junit4]   2> 125 T1696 oazs.NIOServerCnxn.closeSock Closed socket connection for client /140.211.11.196:27199 which had sessionid 0x139d5883f320000
[junit4:junit4]   2> 125 T1694 oaz.ZooKeeper.close Session: 0x139d5883f320000 closed
[junit4:junit4]   2> 126 T1694 oaz.ZooKeeper.<init> Initiating client connection, connectString=127.0.0.1:27198/solr sessionTimeout=10000 watcher=org.apache.solr.common.cloud.ConnectionManager@53e47c22
[junit4:junit4]   2> 126 T1702 oaz.ClientCnxn$SendThread.startConnect Opening socket connection to server /127.0.0.1:27198
[junit4:junit4]   2> 126 T1694 oascc.ConnectionManager.waitForConnected Waiting for client to connect to ZooKeeper
[junit4:junit4]   2> 127 T1702 oaz.ClientCnxn$SendThread.primeConnection Socket connection established to localhost/127.0.0.1:27198, initiating session
[junit4:junit4]   2> 127 T1696 oazs.NIOServerCnxn$Factory.run Accepted socket connection from /140.211.11.196:27200
[junit4:junit4]   2> 128 T1696 oazs.NIOServerCnxn.readConnectRequest Client attempting to establish new session at /140.211.11.196:27200
[junit4:junit4]   2> 129 T1698 oazs.NIOServerCnxn.finishSessionInit Established session 0x139d5883f320001 with negotiated timeout 10000 for client /140.211.11.196:27200
[junit4:junit4]   2> 129 T1702 oaz.ClientCnxn$SendThread.readConnectResult Session establishment complete on server localhost/127.0.0.1:27198, sessionid = 0x139d5883f320001, negotiated timeout = 10000
[junit4:junit4]   2> 129 T1703 oascc.ConnectionManager.process Watcher org.apache.solr.common.cloud.ConnectionManager@53e47c22 name:ZooKeeperConnection Watcher:127.0.0.1:27198/solr got event WatchedEvent state:SyncConnected type:None path:null path:null type:None
[junit4:junit4]   2> 130 T1694 oascc.ConnectionManager.waitForConnected Client is connected to ZooKeeper
[junit4:junit4]   2> 130 T1694 oascc.SolrZkClient.makePath makePath: /collections/collection1
[junit4:junit4]   2> 140 T1694 oascc.SolrZkClient.makePath makePath: /collections/collection1/shards
[junit4:junit4]   2> 143 T1694 oascc.SolrZkClient.makePath makePath: /collections/control_collection
[junit4:junit4]   2> 145 T1694 oascc.SolrZkClient.makePath makePath: /collections/control_collection/shards
[junit4:junit4]   2> 154 T1694 oasc.AbstractZkTestCase.putConfig put /usr/home/hudson/hudson-slave/workspace/Lucene-Solr-Tests-trunk-Java6/solr/build/solr-core/test-files/solr/collection1/conf/solrconfig.xml to /configs/conf1/solrconfig.xml
[junit4:junit4]   2> 155 T1694 oascc.SolrZkClient.makePath makePath: /configs/conf1/solrconfig.xml
[junit4:junit4]   2> 167 T1694 oasc.AbstractZkTestCase.putConfig put /usr/home/hudson/hudson-slave/workspace/Lucene-Solr-Tests-trunk-Java6/solr/build/solr-core/test-files/solr/collection1/conf/schema.xml to /configs/conf1/schema.xml
[junit4:junit4]   2> 168 T1694 oascc.SolrZkClient.makePath makePath: /configs/conf1/schema.xml
[junit4:junit4]   2> 271 T1694 oasc.AbstractZkTestCase.putConfig put /usr/home/hudson/hudson-slave/workspace/Lucene-Solr-Tests-trunk-Java6/solr/build/solr-core/test-files/solr/collection1/conf/solrconfig.xml to /configs/conf1/solrconfig.xml
[junit4:junit4]   2> 272 T1694 oascc.SolrZkClient.makePath makePath: /configs/conf1/solrconfig.xml
[junit4:junit4]   2> 275 T1694 oasc.AbstractZkTestCase.putConfig put /usr/home/hudson/hudson-slave/workspace/Lucene-Solr-Tests-trunk-Java6/solr/build/solr-core/test-files/solr/collection1/conf/stopwords.txt to /configs/conf1/stopwords.txt
[junit4:junit4]   2> 276 T1694 oascc.SolrZkClient.makePath makePath: /configs/conf1/stopwords.txt
[junit4:junit4]   2> 286 T1694 oasc.AbstractZkTestCase.putConfig put /usr/home/hudson/hudson-slave/workspace/Lucene-Solr-Tests-trunk-Java6/solr/build/solr-core/test-files/solr/collection1/conf/protwords.txt to /configs/conf1/protwords.txt
[junit4:junit4]   2> 286 T1694 oascc.SolrZkClient.makePath makePath: /configs/conf1/protwords.txt
[junit4:junit4]   2> 289 T1694 oasc.AbstractZkTestCase.putConfig put /usr/home/hudson/hudson-slave/workspace/Lucene-Solr-Tests-trunk-Java6/solr/build/solr-core/test-files/solr/collection1/conf/currency.xml to /configs/conf1/currency.xml
[junit4:junit4]   2> 290 T1694 oascc.SolrZkClient.makePath makePath: /configs/conf1/currency.xml
[junit4:junit4]   2> 292 T1694 oasc.AbstractZkTestCase.putConfig put /usr/home/hudson/hudson-slave/workspace/Lucene-Solr-Tests-trunk-Java6/solr/build/solr-core/test-files/solr/collection1/conf/open-exchange-rates.json to /configs/conf1/open-exchange-rates.json
[junit4:junit4]   2> 293 T1694 oascc.SolrZkClient.makePath makePath: /configs/conf1/open-exchange-rates.json
[junit4:junit4]   2> 295 T1694 oasc.AbstractZkTestCase.putConfig put /usr/home/hudson/hudson-slave/workspace/Lucene-Solr-Tests-trunk-Java6/solr/build/solr-core/test-files/solr/collection1/conf/mapping-ISOLatin1Accent.txt to /configs/conf1/mapping-ISOLatin1Accent.txt
[junit4:junit4]   2> 296 T1694 oascc.SolrZkClient.makePath makePath: /configs/conf1/mapping-ISOLatin1Accent.txt
[junit4:junit4]   2> 303 T1694 oasc.AbstractZkTestCase.putConfig put /usr/home/hudson/hudson-slave/workspace/Lucene-Solr-Tests-trunk-Java6/solr/build/solr-core/test-files/solr/collection1/conf/old_synonyms.txt to /configs/conf1/old_synonyms.txt
[junit4:junit4]   2> 304 T1694 oascc.SolrZkClient.makePath makePath: /configs/conf1/old_synonyms.txt
[junit4:junit4]   2> 306 T1694 oasc.AbstractZkTestCase.putConfig put /usr/home/hudson/hudson-slave/workspace/Lucene-Solr-Tests-trunk-Java6/solr/build/solr-core/test-files/solr/collection1/conf/synonyms.txt to /configs/conf1/synonyms.txt
[junit4:junit4]   2> 307 T1694 oascc.SolrZkClient.makePath makePath: /configs/conf1/synonyms.txt
[junit4:junit4]   2> 309 T1699 oazs.PrepRequestProcessor.pRequest Processed session termination for sessionid: 0x139d5883f320001
[junit4:junit4]   2> 317 T1703 oaz.ClientCnxn$EventThread.run EventThread shut down
[junit4:junit4]   2> 317 T1694 oaz.ZooKeeper.close Session: 0x139d5883f320001 closed
[junit4:junit4]   2> 317 T1696 oazs.NIOServerCnxn.closeSock Closed socket connection for client /140.211.11.196:27200 which had sessionid 0x139d5883f320001
[junit4:junit4]   2> 319 T1694 oejs.Server.doStart jetty-8.1.2.v20120308
[junit4:junit4]   2> 322 T1694 oejs.AbstractConnector.doStart Started SocketConnector@0.0.0.0:27201
[junit4:junit4]   2> 323 T1694 oasc.SolrResourceLoader.locateSolrHome JNDI not configured for solr (NoInitialContextEx)
[junit4:junit4]   2> 323 T1694 oasc.SolrResourceLoader.locateSolrHome using system property solr.solr.home: /usr/home/hudson/hudson-slave/workspace/Lucene-Solr-Tests-trunk-Java6/solr/build/solr-core/test-files/solr
[junit4:junit4]   2> 324 T1694 oasc.SolrResourceLoader.<init> new SolrResourceLoader for deduced Solr Home: '/usr/home/hudson/hudson-slave/workspace/Lucene-Solr-Tests-trunk-Java6/solr/build/solr-core/test-files/solr/'
[junit4:junit4]   2> 358 T1694 oass.SolrDispatchFilter.init SolrDispatchFilter.init()
[junit4:junit4]   2> 359 T1694 oasc.SolrResourceLoader.locateSolrHome JNDI not configured for solr (NoInitialContextEx)
[junit4:junit4]   2> 359 T1694 oasc.SolrResourceLoader.locateSolrHome using system property solr.solr.home: /usr/home/hudson/hudson-slave/workspace/Lucene-Solr-Tests-trunk-Java6/solr/build/solr-core/test-files/solr
[junit4:junit4]   2> 360 T1694 oasc.CoreContainer$Initializer.initialize looking for solr.xml: /usr/home/hudson/hudson-slave/workspace/Lucene-Solr-Tests-trunk-Java6/solr/build/solr-core/test-files/solr/solr.xml
[junit4:junit4]   2> 360 T1694 oasc.CoreContainer.<init> New CoreContainer 1914397702
[junit4:junit4]   2> 361 T1694 oasc.CoreContainer.load Loading CoreContainer using Solr Home: '/usr/home/hudson/hudson-slave/workspace/Lucene-Solr-Tests-trunk-Java6/solr/build/solr-core/test-files/solr/'
[junit4:junit4]   2> 361 T1694 oasc.SolrResourceLoader.<init> new SolrResourceLoader for directory: '/usr/home/hudson/hudson-slave/workspace/Lucene-Solr-Tests-trunk-Java6/solr/build/solr-core/test-files/solr/'
[junit4:junit4]   2> 386 T1694 oasc.CoreContainer.load Registering Log Listener
[junit4:junit4]   2> 402 T1694 oasc.CoreContainer.initZooKeeper Zookeeper client=127.0.0.1:27198/solr
[junit4:junit4]   2> 403 T1694 oaz.ZooKeeper.<init> Initiating client connection, connectString=127.0.0.1:27198/solr sessionTimeout=5000 watcher=org.apache.solr.common.cloud.ConnectionManager@36ee195a
[junit4:junit4]   2> 404 T1713 oaz.ClientCnxn$SendThread.startConnect Opening socket connection to server /127.0.0.1:27198
[junit4:junit4]   2> 404 T1694 oascc.ConnectionManager.waitForConnected Waiting for client to connect to ZooKeeper
[junit4:junit4]   2> 405 T1713 oaz.ClientCnxn$SendThread.primeConnection Socket connection established to localhost/127.0.0.1:27198, initiating session
[junit4:junit4]   2> 405 T1696 oazs.NIOServerCnxn$Factory.run Accepted socket connection from /140.211.11.196:27202
[junit4:junit4]   2> 406 T1696 oazs.NIOServerCnxn.readConnectRequest Client attempting to establish new session at /140.211.11.196:27202
[junit4:junit4]   2> 407 T1698 oazs.NIOServerCnxn.finishSessionInit Established session 0x139d5883f320002 with negotiated timeout 5000 for client /140.211.11.196:27202
[junit4:junit4]   2> 407 T1713 oaz.ClientCnxn$SendThread.readConnectResult Session establishment complete on server localhost/127.0.0.1:27198, sessionid = 0x139d5883f320002, negotiated timeout = 5000
[junit4:junit4]   2> 407 T1714 oascc.ConnectionManager.process Watcher org.apache.solr.common.cloud.ConnectionManager@36ee195a name:ZooKeeperConnection Watcher:127.0.0.1:27198/solr got event WatchedEvent state:SyncConnected type:None path:null path:null type:None
[junit4:junit4]   2> 408 T1694 oascc.ConnectionManager.waitForConnected Client is connected to ZooKeeper
[junit4:junit4]   2> 409 T1699 oazs.PrepRequestProcessor.pRequest Got user-level KeeperException when processing sessionid:0x139d5883f320002 type:create cxid:0x2 zxid:0xfffffffffffffffe txntype:unknown reqpath:n/a Error Path:/solr/overseer Error:KeeperErrorCode = NodeExists for /solr/overseer
[junit4:junit4]   2> 419 T1694 oascc.SolrZkClient.makePath makePath: /live_nodes
[junit4:junit4]   2> 421 T1694 oasc.ZkController.createEphemeralLiveNode Register node as live in ZooKeeper:/live_nodes/127.0.0.1:27201_solr
[junit4:junit4]   2> 422 T1699 oazs.PrepRequestProcessor.pRequest Got user-level KeeperException when processing sessionid:0x139d5883f320002 type:delete cxid:0x7 zxid:0xfffffffffffffffe txntype:unknown reqpath:n/a Error Path:/solr/live_nodes/127.0.0.1:27201_solr Error:KeeperErrorCode = NoNode for /solr/live_nodes/127.0.0.1:27201_solr
[junit4:junit4]   2> 423 T1694 oascc.SolrZkClient.makePath makePath: /live_nodes/127.0.0.1:27201_solr
[junit4:junit4]   2> 432 T1694 oashc.HttpShardHandlerFactory.getParameter Setting socketTimeout to: 0
[junit4:junit4]   2> 433 T1694 oashc.HttpShardHandlerFactory.getParameter Setting urlScheme to: http://
[junit4:junit4]   2> 433 T1694 oashc.HttpShardHandlerFactory.getParameter Setting connTimeout to: 0
[junit4:junit4]   2> 433 T1694 oashc.HttpShardHandlerFactory.getParameter Setting maxConnectionsPerHost to: 20
[junit4:junit4]   2> 434 T1694 oashc.HttpShardHandlerFactory.getParameter Setting corePoolSize to: 0
[junit4:junit4]   2> 434 T1694 oashc.HttpShardHandlerFactory.getParameter Setting maximumPoolSize to: 2147483647
[junit4:junit4]   2> 435 T1694 oashc.HttpShardHandlerFactory.getParameter Setting maxThreadIdleTime to: 5
[junit4:junit4]   2> 435 T1694 oashc.HttpShardHandlerFactory.getParameter Setting sizeOfQueue to: -1
[junit4:junit4]   2> 436 T1694 oashc.HttpShardHandlerFactory.getParameter Setting fairnessPolicy to: false
[junit4:junit4]   2> 436 T1694 oascsi.HttpClientUtil.createClient Creating new http client, config:maxConnectionsPerHost=20&maxConnections=10000&socketTimeout=0&connTimeout=0&retry=false
[junit4:junit4]   2> 449 T1694 oascc.SolrZkClient.makePath makePath: /overseer_elect/election
[junit4:junit4]   2> 460 T1699 oazs.PrepRequestProcessor.pRequest Got user-level KeeperException when processing sessionid:0x139d5883f320002 type:delete cxid:0x15 zxid:0xfffffffffffffffe txntype:unknown reqpath:n/a Error Path:/solr/overseer_elect/leader Error:KeeperErrorCode = NoNode for /solr/overseer_elect/leader
[junit4:junit4]   2> 461 T1694 oascc.SolrZkClient.makePath makePath: /overseer_elect/leader
[junit4:junit4]   2> 472 T1694 oasc.Overseer.start Overseer (id=88336448862945282-127.0.0.1:27201_solr-n_0000000000) starting
[junit4:junit4]   2> 473 T1699 oazs.PrepRequestProcessor.pRequest Got user-level KeeperException when processing sessionid:0x139d5883f320002 type:create cxid:0x1a zxid:0xfffffffffffffffe txntype:unknown reqpath:n/a Error Path:/solr/overseer Error:KeeperErrorCode = NodeExists for /solr/overseer
[junit4:junit4]   2> 474 T1699 oazs.PrepRequestProcessor.pRequest Got user-level KeeperException when processing sessionid:0x139d5883f320002 type:create cxid:0x1b zxid:0xfffffffffffffffe txntype:unknown reqpath:n/a Error Path:/solr/overseer Error:KeeperErrorCode = NodeExists for /solr/overseer
[junit4:junit4]   2> 475 T1699 oazs.PrepRequestProcessor.pRequest Got user-level KeeperException when processing sessionid:0x139d5883f320002 type:create cxid:0x1c zxid:0xfffffffffffffffe txntype:unknown reqpath:n/a Error Path:/solr/overseer Error:KeeperErrorCode = NodeExists for /solr/overseer
[junit4:junit4]   2> 486 T1699 oazs.PrepRequestProcessor.pRequest Got user-level KeeperException when processing sessionid:0x139d5883f320002 type:create cxid:0x1d zxid:0xfffffffffffffffe txntype:unknown reqpath:n/a Error Path:/solr/overseer Error:KeeperErrorCode = NodeExists for /solr/overseer
[junit4:junit4]   2> 487 T1716 oasc.OverseerCollectionProcessor.run Process current queue of collection creations
[junit4:junit4]   2> 488 T1694 oascc.SolrZkClient.makePath makePath: /clusterstate.json
[junit4:junit4]   2> 497 T1694 oascc.ZkStateReader.createClusterStateWatchersAndUpdate Updating cluster state from ZooKeeper... 
[junit4:junit4]   2> 499 T1715 oasc.Overseer$ClusterStateUpdater.run Starting to work on the main queue
[junit4:junit4]   2> 504 T1694 oasc.CoreContainer.create Creating SolrCore 'collection1' using instanceDir: /usr/home/hudson/hudson-slave/workspace/Lucene-Solr-Tests-trunk-Java6/solr/build/solr-core/test-files/solr/collection1
[junit4:junit4]   2> 504 T1694 oasc.ZkController.createCollectionZkNode Check for collection zkNode:control_collection
[junit4:junit4]   2> 505 T1694 oasc.ZkController.createCollectionZkNode Collection zkNode exists
[junit4:junit4]   2> 505 T1694 oasc.ZkController.readConfigName Load collection config from:/collections/control_collection
[junit4:junit4]   2> 507 T1694 oasc.SolrResourceLoader.<init> new SolrResourceLoader for directory: '/usr/home/hudson/hudson-slave/workspace/Lucene-Solr-Tests-trunk-Java6/solr/build/solr-core/test-files/solr/collection1/'
[junit4:junit4]   2> 508 T1694 oasc.SolrResourceLoader.replaceClassLoader Adding 'file:/usr/home/hudson/hudson-slave/workspace/Lucene-Solr-Tests-trunk-Java6/solr/build/solr-core/test-files/solr/collection1/lib/classes/' to classloader
[junit4:junit4]   2> 509 T1694 oasc.SolrResourceLoader.replaceClassLoader Adding 'file:/usr/home/hudson/hudson-slave/workspace/Lucene-Solr-Tests-trunk-Java6/solr/build/solr-core/test-files/solr/collection1/lib/README' to classloader
[junit4:junit4]   2> 560 T1694 oasc.SolrConfig.<init> Using Lucene MatchVersion: LUCENE_50
[junit4:junit4]   2> 635 T1694 oasc.SolrConfig.<init> Loaded SolrConfig: solrconfig.xml
[junit4:junit4]   2> 736 T1694 oass.IndexSchema.readSchema Reading Solr Schema
[junit4:junit4]   2> 747 T1694 oass.IndexSchema.readSchema Schema name=test
[junit4:junit4]   2> 1408 T1694 oass.OpenExchangeRatesOrgProvider.init Initialized with rates=open-exchange-rates.json, refreshInterval=1440.
[junit4:junit4]   2> 1420 T1694 oass.IndexSchema.readSchema default search field in schema is text
[junit4:junit4]   2> 1424 T1694 oass.IndexSchema.readSchema unique key field: id
[junit4:junit4]   2> 1437 T1694 oass.FileExchangeRateProvider.reload Reloading exchange rates from file currency.xml
[junit4:junit4]   2> 1442 T1694 oass.FileExchangeRateProvider.reload Reloading exchange rates from file currency.xml
[junit4:junit4]   2> 1447 T1694 oass.OpenExchangeRatesOrgProvider.reload Reloading exchange rates from open-exchange-rates.json
[junit4:junit4]   2> 1449 T1694 oass.OpenExchangeRatesOrgProvider.reload Reloading exchange rates from open-exchange-rates.json
[junit4:junit4]   2> 1450 T1694 oasc.SolrCore.<init> [collection1] Opening new SolrCore at /usr/home/hudson/hudson-slave/workspace/Lucene-Solr-Tests-trunk-Java6/solr/build/solr-core/test-files/solr/collection1/, dataDir=./org.apache.solr.cloud.BasicDistributedZk2Test-1347907239725/control/data/
[junit4:junit4]   2> 1451 T1694 oasc.JmxMonitoredMap.<init> JMX monitoring is enabled. Adding Solr mbeans to JMX Server: com.sun.jmx.mbeanserver.JmxMBeanServer@bdccedd
[junit4:junit4]   2> 1452 T1694 oasc.SolrCore.getNewIndexDir WARNING New index directory detected: old=null new=./org.apache.solr.cloud.BasicDistributedZk2Test-1347907239725/control/data/index/
[junit4:junit4]   2> 1453 T1694 oasc.SolrCore.initIndex WARNING [collection1] Solr index directory './org.apache.solr.cloud.BasicDistributedZk2Test-1347907239725/control/data/index' doesn't exist. Creating new index...
[junit4:junit4]   2> 1455 T1694 oasc.CachingDirectoryFactory.get return new directory for /usr/home/hudson/hudson-slave/workspace/Lucene-Solr-Tests-trunk-Java6/solr/build/solr-core/test/J0/./org.apache.solr.cloud.BasicDistributedZk2Test-1347907239725/control/data/index forceNew:false
[junit4:junit4]   2> 1467 T1694 oasc.SolrDeletionPolicy.onCommit SolrDeletionPolicy.onCommit: commits:num=1
[junit4:junit4]   2> 		commit{dir=NRTCachingDirectory(org.apache.lucene.store.NIOFSDirectory@/usr/home/hudson/hudson-slave/workspace/Lucene-Solr-Tests-trunk-Java6/solr/build/solr-core/test/J0/org.apache.solr.cloud.BasicDistributedZk2Test-1347907239725/control/data/index lockFactory=org.apache.lucene.store.NativeFSLockFactory@c767c97; maxCacheMB=48.0 maxMergeSizeMB=4.0),segFN=segments_1,generation=1,filenames=[segments_1]
[junit4:junit4]   2> 1467 T1694 oasc.SolrDeletionPolicy.updateCommits newest commit = 1
[junit4:junit4]   2> 1469 T1694 oasc.SolrCore.initWriters created xml: solr.XMLResponseWriter
[junit4:junit4]   2> 1471 T1694 oasup.UpdateRequestProcessorChain.init inserting DistributedUpdateProcessorFactory into updateRequestProcessorChain "dedupe"
[junit4:junit4]   2> 1471 T1694 oasup.UpdateRequestProcessorChain.init inserting DistributedUpdateProcessorFactory into updateRequestProcessorChain "dedupe-allfields"
[junit4:junit4]   2> 1472 T1694 oasup.UpdateRequestProcessorChain.init inserting DistributedUpdateProcessorFactory into updateRequestProcessorChain "stored_sig"
[junit4:junit4]   2> 1472 T1694 oasup.UpdateRequestProcessorChain.init inserting DistributedUpdateProcessorFactory into updateRequestProcessorChain "uniq-fields"
[junit4:junit4]   2> 1473 T1694 oasup.UpdateRequestProcessorChain.init inserting DistributedUpdateProcessorFactory into updateRequestProcessorChain "distrib-dup-test-chain-implicit"
[junit4:junit4]   2> 1474 T1694 oasc.RequestHandlers.initHandlersFromConfig adding lazy requestHandler: solr.ReplicationHandler
[junit4:junit4]   2> 1474 T1694 oasc.RequestHandlers.initHandlersFromConfig created /replication: solr.ReplicationHandler
[junit4:junit4]   2> 1475 T1694 oasc.RequestHandlers.initHandlersFromConfig created standard: solr.StandardRequestHandler
[junit4:junit4]   2> 1476 T1694 oasc.RequestHandlers.initHandlersFromConfig created /get: solr.RealTimeGetHandler
[junit4:junit4]   2> 1477 T1694 oasc.RequestHandlers.initHandlersFromConfig created dismax: solr.SearchHandler
[junit4:junit4]   2> 1477 T1694 oasc.RequestHandlers.initHandlersFromConfig created mock: org.apache.solr.core.MockQuerySenderListenerReqHandler
[junit4:junit4]   2> 1478 T1694 oasc.RequestHandlers.initHandlersFromConfig created /admin/: org.apache.solr.handler.admin.AdminHandlers
[junit4:junit4]   2> 1479 T1694 oasc.RequestHandlers.initHandlersFromConfig created defaults: solr.StandardRequestHandler
[junit4:junit4]   2> 1479 T1694 oasc.RequestHandlers.initHandlersFromConfig adding lazy requestHandler: solr.StandardRequestHandler
[junit4:junit4]   2> 1480 T1694 oasc.RequestHandlers.initHandlersFromConfig created lazy: solr.StandardRequestHandler
[junit4:junit4]   2> 1480 T1694 oasc.RequestHandlers.initHandlersFromConfig created /update: solr.UpdateRequestHandler
[junit4:junit4]   2> 1481 T1694 oasc.RequestHandlers.initHandlersFromConfig created /terms: org.apache.solr.handler.component.SearchHandler
[junit4:junit4]   2> 1482 T1694 oasc.RequestHandlers.initHandlersFromConfig created spellCheckCompRH: org.apache.solr.handler.component.SearchHandler
[junit4:junit4]   2> 1482 T1694 oasc.RequestHandlers.initHandlersFromConfig created spellCheckCompRH_Direct: org.apache.solr.handler.component.SearchHandler
[junit4:junit4]   2> 1483 T1694 oasc.RequestHandlers.initHandlersFromConfig created spellCheckWithWordbreak: org.apache.solr.handler.component.SearchHandler
[junit4:junit4]   2> 1484 T1694 oasc.RequestHandlers.initHandlersFromConfig created spellCheckWithWordbreak_Direct: org.apache.solr.handler.component.SearchHandler
[junit4:junit4]   2> 1485 T1694 oasc.RequestHandlers.initHandlersFromConfig created spellCheckCompRH1: org.apache.solr.handler.component.SearchHandler
[junit4:junit4]   2> 1485 T1694 oasc.RequestHandlers.initHandlersFromConfig created tvrh: org.apache.solr.handler.component.SearchHandler
[junit4:junit4]   2> 1486 T1694 oasc.RequestHandlers.initHandlersFromConfig created /mlt: solr.MoreLikeThisHandler
[junit4:junit4]   2> 1487 T1694 oasc.RequestHandlers.initHandlersFromConfig created /debug/dump: solr.DumpRequestHandler
[junit4:junit4]   2> 1491 T1694 oashl.XMLLoader.init xsltCacheLifetimeSeconds=60
[junit4:junit4]   2> 1496 T1694 oasc.SolrCore.initDeprecatedSupport WARNING solrconfig.xml uses deprecated <admin/gettableFiles>, Please update your config to use the ShowFileRequestHandler.
[junit4:junit4]   2> 1498 T1694 oasc.SolrCore.initDeprecatedSupport WARNING adding ShowFileRequestHandler with hidden files: [SCHEMA.XML, OLD_SYNONYMS.TXT, STOPWORDS.TXT, PROTWORDS.TXT, OPEN-EXCHANGE-RATES.JSON, SYNONYMS.TXT, CURRENCY.XML, MAPPING-ISOLATIN1ACCENT.TXT]
[junit4:junit4]   2> 1503 T1694 oass.SolrIndexSearcher.<init> Opening Searcher@1e35010f main
[junit4:junit4]   2> 1505 T1694 oasu.CommitTracker.<init> Hard AutoCommit: disabled
[junit4:junit4]   2> 1505 T1694 oasu.CommitTracker.<init> Soft AutoCommit: disabled
[junit4:junit4]   2> 1506 T1694 oashc.SpellCheckComponent.inform Initializing spell checkers
[junit4:junit4]   2> 1520 T1694 oass.DirectSolrSpellChecker.init init: {name=direct,classname=DirectSolrSpellChecker,field=lowerfilt,minQueryLength=3}
[junit4:junit4]   2> 1584 T1717 oasc.SolrCore.registerSearcher [collection1] Registered new searcher Searcher@1e35010f main{StandardDirectoryReader(segments_1:1)}
[junit4:junit4]   2> 1590 T1699 oazs.PrepRequestProcessor.pRequest Got user-level KeeperException when processing sessionid:0x139d5883f320002 type:create cxid:0x56 zxid:0xfffffffffffffffe txntype:unknown reqpath:n/a Error Path:/solr/overseer/queue Error:KeeperErrorCode = NoNode for /solr/overseer/queue
[junit4:junit4]   2> 1594 T1694 oasc.CoreContainer.register registering core: collection1
[junit4:junit4]   2> 1594 T1694 oasc.ZkController.register Register shard - core:collection1 address:http://127.0.0.1:27201/solr shardId:control_shard
[junit4:junit4]   2> 1595 T1694 oascc.SolrZkClient.makePath makePath: /collections/control_collection/leader_elect/control_shard/election
[junit4:junit4]   2> 1618 T1699 oazs.PrepRequestProcessor.pRequest Got user-level KeeperException when processing sessionid:0x139d5883f320002 type:delete cxid:0x65 zxid:0xfffffffffffffffe txntype:unknown reqpath:n/a Error Path:/solr/collections/control_collection/leaders Error:KeeperErrorCode = NoNode for /solr/collections/control_collection/leaders
[junit4:junit4]   2> 1619 T1694 oasc.ShardLeaderElectionContext.runLeaderProcess Running the leader process.
[junit4:junit4]   2> 1620 T1699 oazs.PrepRequestProcessor.pRequest Got user-level KeeperException when processing sessionid:0x139d5883f320002 type:create cxid:0x66 zxid:0xfffffffffffffffe txntype:unknown reqpath:n/a Error Path:/solr/overseer Error:KeeperErrorCode = NodeExists for /solr/overseer
[junit4:junit4]   2> 2006 T1715 oascc.ZkStateReader.updateClusterState Updating cloud state from ZooKeeper... 
[junit4:junit4]   2> 2007 T1699 oazs.PrepRequestProcessor.pRequest Got user-level KeeperException when processing sessionid:0x139d5883f320002 type:create cxid:0x6d zxid:0xfffffffffffffffe txntype:unknown reqpath:n/a Error Path:/solr/overseer/queue-work Error:KeeperErrorCode = NoNode for /solr/overseer/queue-work
[junit4:junit4]   2> 2026 T1714 oascc.ZkStateReader$2.process A cluster state change has occurred - updating...
[junit4:junit4]   2> 2123 T1694 oasc.ShardLeaderElectionContext.waitForReplicasToComeUp Enough replicas found to continue.
[junit4:junit4]   2> 2124 T1694 oasc.ShardLeaderElectionContext.runLeaderProcess I may be the new leader - try and sync
[junit4:junit4]   2> 2124 T1694 oasc.SyncStrategy.sync Sync replicas to http://127.0.0.1:27201/solr/collection1/
[junit4:junit4]   2> 2125 T1694 oasc.SyncStrategy.syncReplicas Sync Success - now sync replicas to me
[junit4:junit4]   2> 2125 T1694 oasc.SyncStrategy.syncToMe http://127.0.0.1:27201/solr/collection1/ has no replicas
[junit4:junit4]   2> 2126 T1694 oasc.ShardLeaderElectionContext.runLeaderProcess I am the new leader: http://127.0.0.1:27201/solr/collection1/
[junit4:junit4]   2> 2126 T1694 oascc.SolrZkClient.makePath makePath: /collections/control_collection/leaders/control_shard
[junit4:junit4]   2> 2139 T1699 oazs.PrepRequestProcessor.pRequest Got user-level KeeperException when processing sessionid:0x139d5883f320002 type:create cxid:0x8b zxid:0xfffffffffffffffe txntype:unknown reqpath:n/a Error Path:/solr/overseer Error:KeeperErrorCode = NodeExists for /solr/overseer
[junit4:junit4]   2> 2530 T1715 oascc.ZkStateReader.updateClusterState Updating cloud state from ZooKeeper... 
[junit4:junit4]   2> 2541 T1714 oascc.ZkStateReader$2.process A cluster state change has occurred - updating...
[junit4:junit4]   2> 2548 T1694 oasc.ZkController.register We are http://127.0.0.1:27201/solr/collection1/ and leader is http://127.0.0.1:27201/solr/collection1/
[junit4:junit4]   2> 2548 T1694 oasc.ZkController.register No LogReplay needed for core=collection1 baseURL=http://127.0.0.1:27201/solr
[junit4:junit4]   2> 2549 T1694 oasc.ZkController.checkRecovery I am the leader, no recovery necessary
[junit4:junit4]   2> 2550 T1694 oascc.ZkStateReader.updateClusterState Updating cloud state from ZooKeeper... 
[junit4:junit4]   2> 2551 T1694 oass.SolrDispatchFilter.init user.dir=/usr/home/hudson/hudson-slave/workspace/Lucene-Solr-Tests-trunk-Java6/solr/build/solr-core/test/J0
[junit4:junit4]   2> 2552 T1694 oass.SolrDispatchFilter.init SolrDispatchFilter.init() done
[junit4:junit4]   2> 2552 T1694 oascsi.HttpClientUtil.createClient Creating new http client, config:maxConnections=128&maxConnectionsPerHost=32&followRedirects=false
[junit4:junit4]   2> 2990 T1694 oejs.Server.doStart jetty-8.1.2.v20120308
[junit4:junit4]   2> 2993 T1694 oejs.AbstractConnector.doStart Started SocketConnector@0.0.0.0:27209
[junit4:junit4]   2> 2994 T1694 oasc.SolrResourceLoader.locateSolrHome JNDI not configured for solr (NoInitialContextEx)
[junit4:junit4]   2> 2994 T1694 oasc.SolrResourceLoader.locateSolrHome using system property solr.solr.home: /usr/home/hudson/hudson-slave/workspace/Lucene-Solr-Tests-trunk-Java6/solr/build/solr-core/test/J0/./solrtest-jetty1-1347907242286
[junit4:junit4]   2> 2995 T1694 oasc.SolrResourceLoader.<init> new SolrResourceLoader for deduced Solr Home: '/usr/home/hudson/hudson-slave/workspace/Lucene-Solr-Tests-trunk-Java6/solr/build/solr-core/test/J0/./solrtest-jetty1-1347907242286/'
[junit4:junit4]   2> 3029 T1694 oass.SolrDispatchFilter.init SolrDispatchFilter.init()
[junit4:junit4]   2> 3030 T1694 oasc.SolrResourceLoader.locateSolrHome JNDI not configured for solr (NoInitialContextEx)
[junit4:junit4]   2> 3031 T1694 oasc.SolrResourceLoader.locateSolrHome using system property solr.solr.home: /usr/home/hudson/hudson-slave/workspace/Lucene-Solr-Tests-trunk-Java6/solr/build/solr-core/test/J0/./solrtest-jetty1-1347907242286
[junit4:junit4]   2> 3031 T1694 oasc.CoreContainer$Initializer.initialize looking for solr.xml: /usr/home/hudson/hudson-slave/workspace/Lucene-Solr-Tests-trunk-Java6/solr/build/solr-core/test/J0/./solrtest-jetty1-1347907242286/solr.xml
[junit4:junit4]   2> 3031 T1694 oasc.CoreContainer.<init> New CoreContainer 1917771729
[junit4:junit4]   2> 3032 T1694 oasc.CoreContainer.load Loading CoreContainer using Solr Home: '/usr/home/hudson/hudson-slave/workspace/Lucene-Solr-Tests-trunk-Java6/solr/build/solr-core/test/J0/./solrtest-jetty1-1347907242286/'
[junit4:junit4]   2> 3033 T1694 oasc.SolrResourceLoader.<init> new SolrResourceLoader for directory: '/usr/home/hudson/hudson-slave/workspace/Lucene-Solr-Tests-trunk-Java6/solr/build/solr-core/test/J0/./solrtest-jetty1-1347907242286/'
[junit4:junit4]   2> 3045 T1715 oascc.ZkStateReader.updateClusterState Updating cloud state from ZooKeeper... 
[junit4:junit4]   2> 3058 T1714 oascc.ZkStateReader$2.process A cluster state change has occurred - updating...
[junit4:junit4]   2> 3057 T1694 oasc.CoreContainer.load Registering Log Listener
[junit4:junit4]   2> 3073 T1694 oasc.CoreContainer.initZooKeeper Zookeeper client=127.0.0.1:27198/solr
[junit4:junit4]   2> 3074 T1694 oaz.ZooKeeper.<init> Initiating client connection, connectString=127.0.0.1:27198/solr sessionTimeout=5000 watcher=org.apache.solr.common.cloud.ConnectionManager@32b53a3c
[junit4:junit4]   2> 3075 T1727 oaz.ClientCnxn$SendThread.startConnect Opening socket connection to server /127.0.0.1:27198
[junit4:junit4]   2> 3075 T1694 oascc.ConnectionManager.waitForConnected Waiting for client to connect to ZooKeeper
[junit4:junit4]   2> 3076 T1727 oaz.ClientCnxn$SendThread.primeConnection Socket connection established to localhost/127.0.0.1:27198, initiating session
[junit4:junit4]   2> 3076 T1696 oazs.NIOServerCnxn$Factory.run Accepted socket connection from /140.211.11.196:27210
[junit4:junit4]   2> 3077 T1696 oazs.NIOServerCnxn.readConnectRequest Client attempting to establish new session at /140.211.11.196:27210
[junit4:junit4]   2> 3078 T1698 oazs.NIOServerCnxn.finishSessionInit Established session 0x139d5883f320003 with negotiated timeout 5000 for client /140.211.11.196:27210
[junit4:junit4]   2> 3078 T1727 oaz.ClientCnxn$SendThread.readConnectResult Session establishment complete on server localhost/127.0.0.1:27198, sessionid = 0x139d5883f320003, negotiated timeout = 5000
[junit4:junit4]   2> 3078 T1728 oascc.ConnectionManager.process Watcher org.apache.solr.common.cloud.ConnectionManager@32b53a3c name:ZooKeeperConnection Watcher:127.0.0.1:27198/solr got event WatchedEvent state:SyncConnected type:None path:null path:null type:None
[junit4:junit4]   2> 3079 T1694 oascc.ConnectionManager.waitForConnected Client is connected to ZooKeeper
[junit4:junit4]   2> 3079 T1699 oazs.PrepRequestProcessor.pRequest Got user-level KeeperException when processing sessionid:0x139d5883f320003 type:create cxid:0x1 zxid:0xfffffffffffffffe txntype:unknown reqpath:n/a Error Path:/solr/overseer Error:KeeperErrorCode = NodeExists for /solr/overseer
[junit4:junit4]   2> 3080 T1699 oazs.PrepRequestProcessor.pRequest Got user-level KeeperException when processing sessionid:0x139d5883f320003 type:create cxid:0x2 zxid:0xfffffffffffffffe txntype:unknown reqpath:n/a Error Path:/solr/overseer Error:KeeperErrorCode = NodeExists for /solr/overseer
[junit4:junit4]   2> 3089 T1694 oasc.ZkController.createEphemeralLiveNode Register node as live in ZooKeeper:/live_nodes/127.0.0.1:27209_solr
[junit4:junit4]   2> 3089 T1699 oazs.PrepRequestProcessor.pRequest Got user-level KeeperException when processing sessionid:0x139d5883f320003 type:delete cxid:0x4 zxid:0xfffffffffffffffe txntype:unknown reqpath:n/a Error Path:/solr/live_nodes/127.0.0.1:27209_solr Error:KeeperErrorCode = NoNode for /solr/live_nodes/127.0.0.1:27209_solr
[junit4:junit4]   2> 3090 T1694 oascc.SolrZkClient.makePath makePath: /live_nodes/127.0.0.1:27209_solr
[junit4:junit4]   2> 3093 T1714 oascc.ZkStateReader$3.process Updating live nodes
[junit4:junit4]   2> 3093 T1694 oashc.HttpShardHandlerFactory.getParameter Setting socketTimeout to: 0
[junit4:junit4]   2> 3094 T1694 oashc.HttpShardHandlerFactory.getParameter Setting urlScheme to: http://
[junit4:junit4]   2> 3094 T1694 oashc.HttpShardHandlerFactory.getParameter Setting connTimeout to: 0
[junit4:junit4]   2> 3095 T1694 oashc.HttpShardHandlerFactory.getParameter Setting maxConnectionsPerHost to: 20
[junit4:junit4]   2> 3095 T1694 oashc.HttpShardHandlerFactory.getParameter Setting corePoolSize to: 0
[junit4:junit4]   2> 3096 T1694 oashc.HttpShardHandlerFactory.getParameter Setting maximumPoolSize to: 2147483647
[junit4:junit4]   2> 3096 T1694 oashc.HttpShardHandlerFactory.getParameter Setting maxThreadIdleTime to: 5
[junit4:junit4]   2> 3097 T1694 oashc.HttpShardHandlerFactory.getParameter Setting sizeOfQueue to: -1
[junit4:junit4]   2> 3097 T1694 oashc.HttpShardHandlerFactory.getParameter Setting fairnessPolicy to: false
[junit4:junit4]   2> 3098 T1694 oascsi.HttpClientUtil.createClient Creating new http client, config:maxConnectionsPerHost=20&maxConnections=10000&socketTimeout=0&connTimeout=0&retry=false
[junit4:junit4]   2> 3113 T1694 oascc.ZkStateReader.createClusterStateWatchersAndUpdate Updating cluster state from ZooKeeper... 
[junit4:junit4]   2> 3119 T1694 oasc.CoreContainer.create Creating SolrCore 'collection1' using instanceDir: /usr/home/hudson/hudson-slave/workspace/Lucene-Solr-Tests-trunk-Java6/solr/build/solr-core/test/J0/./solrtest-jetty1-1347907242286/collection1
[junit4:junit4]   2> 3120 T1694 oasc.ZkController.createCollectionZkNode Check for collection zkNode:collection1
[junit4:junit4]   2> 3120 T1694 oasc.ZkController.createCollectionZkNode Collection zkNode exists
[junit4:junit4]   2> 3121 T1694 oasc.ZkController.readConfigName Load collection config from:/collections/collection1
[junit4:junit4]   2> 3122 T1694 oasc.SolrResourceLoader.<init> new SolrResourceLoader for directory: '/usr/home/hudson/hudson-slave/workspace/Lucene-Solr-Tests-trunk-Java6/solr/build/solr-core/test/J0/./solrtest-jetty1-1347907242286/collection1/'
[junit4:junit4]   2> 3123 T1694 oasc.SolrResourceLoader.replaceClassLoader Adding 'file:/usr/home/hudson/hudson-slave/workspace/Lucene-Solr-Tests-trunk-Java6/solr/build/solr-core/test/J0/solrtest-jetty1-1347907242286/collection1/lib/README' to classloader
[junit4:junit4]   2> 3124 T1694 oasc.SolrResourceLoader.replaceClassLoader Adding 'file:/usr/home/hudson/hudson-slave/workspace/Lucene-Solr-Tests-trunk-Java6/solr/build/solr-core/test/J0/solrtest-jetty1-1347907242286/collection1/lib/classes/' to classloader
[junit4:junit4]   2> 3176 T1694 oasc.SolrConfig.<init> Using Lucene MatchVersion: LUCENE_50
[junit4:junit4]   2> 3252 T1694 oasc.SolrConfig.<init> Loaded SolrConfig: solrconfig.xml
[junit4:junit4]   2> 3353 T1694 oass.IndexSchema.readSchema Reading Solr Schema
[junit4:junit4]   2> 3362 T1694 oass.IndexSchema.readSchema Schema name=test
[junit4:junit4]   2> 4062 T1694 oass.OpenExchangeRatesOrgProvider.init Initialized with rates=open-exchange-rates.json, refreshInterval=1440.
[junit4:junit4]   2> 4077 T1694 oass.IndexSchema.readSchema default search field in schema is text
[junit4:junit4]   2> 4081 T1694 oass.IndexSchema.readSchema unique key field: id
[junit4:junit4]   2> 4093 T1694 oass.FileExchangeRateProvider.reload Reloading exchange rates from file currency.xml
[junit4:junit4]   2> 4099 T1694 oass.FileExchangeRateProvider.reload Reloading exchange rates from file currency.xml
[junit4:junit4]   2> 4104 T1694 oass.OpenExchangeRatesOrgProvider.reload Reloading exchange rates from open-exchange-rates.json
[junit4:junit4]   2> 4105 T1694 oass.OpenExchangeRatesOrgProvider.reload Reloading exchange rates from open-exchange-rates.json
[junit4:junit4]   2> 4106 T1694 oasc.SolrCore.<init> [collection1] Opening new SolrCore at /usr/home/hudson/hudson-slave/workspace/Lucene-Solr-Tests-trunk-Java6/solr/build/solr-core/test/J0/./solrtest-jetty1-1347907242286/collection1/, dataDir=./org.apache.solr.cloud.BasicDistributedZk2Test-1347907239725/jetty1/
[junit4:junit4]   2> 4107 T1694 oasc.JmxMonitoredMap.<init> JMX monitoring is enabled. Adding Solr mbeans to JMX Server: com.sun.jmx.mbeanserver.JmxMBeanServer@bdccedd
[junit4:junit4]   2> 4108 T1694 oasc.SolrCore.getNewIndexDir WARNING New index directory detected: old=null new=./org.apache.solr.cloud.BasicDistributedZk2Test-1347907239725/jetty1/index/
[junit4:junit4]   2> 4109 T1694 oasc.SolrCore.initIndex WARNING [collection1] Solr index directory './org.apache.solr.cloud.BasicDistributedZk2Test-1347907239725/jetty1/index' doesn't exist. Creating new index...
[junit4:junit4]   2> 4110 T1694 oasc.CachingDirectoryFactory.get return new directory for /usr/home/hudson/hudson-slave/workspace/Lucene-Solr-Tests-trunk-Java6/solr/build/solr-core/test/J0/./org.apache.solr.cloud.BasicDistributedZk2Test-1347907239725/jetty1/index forceNew:false
[junit4:junit4]   2> 4117 T1694 oasc.SolrDeletionPolicy.onCommit SolrDeletionPolicy.onCommit: commits:num=1
[junit4:junit4]   2> 		commit{dir=NRTCachingDirectory(org.apache.lucene.store.NIOFSDirectory@/usr/home/hudson/hudson-slave/workspace/Lucene-Solr-Tests-trunk-Java6/solr/build/solr-core/test/J0/org.apache.solr.cloud.BasicDistributedZk2Test-1347907239725/jetty1/index lockFactory=org.apache.lucene.store.NativeFSLockFactory@3e50db26; maxCacheMB=48.0 maxMergeSizeMB=4.0),segFN=segments_1,generation=1,filenames=[segments_1]
[junit4:junit4]   2> 4117 T1694 oasc.SolrDeletionPolicy.updateCommits newest commit = 1
[junit4:junit4]   2> 4118 T1694 oasc.SolrCore.initWriters created xml: solr.XMLResponseWriter
[junit4:junit4]   2> 4121 T1694 oasup.UpdateRequestProcessorChain.init inserting DistributedUpdateProcessorFactory into updateRequestProcessorChain "dedupe"
[junit4:junit4]   2> 4121 T1694 oasup.UpdateRequestProcessorChain.init inserting DistributedUpdateProcessorFactory into updateRequestProcessorChain "dedupe-allfields"
[junit4:junit4]   2> 4122 T1694 oasup.UpdateRequestProcessorChain.init inserting DistributedUpdateProcessorFactory into updateRequestProcessorChain "stored_sig"
[junit4:junit4]   2> 4122 T1694 oasup.UpdateRequestProcessorChain.init inserting DistributedUpdateProcessorFactory into updateRequestProcessorChain "uniq-fields"
[junit4:junit4]   2> 4123 T1694 oasup.UpdateRequestProcessorChain.init inserting DistributedUpdateProcessorFactory into updateRequestProcessorChain "distrib-dup-test-chain-implicit"
[junit4:junit4]   2> 4124 T1694 oasc.RequestHandlers.initHandlersFromConfig adding lazy requestHandler: solr.ReplicationHandler
[junit4:junit4]   2> 4124 T1694 oasc.RequestHandlers.initHandlersFromConfig created /replication: solr.ReplicationHandler
[junit4:junit4]   2> 4125 T1694 oasc.RequestHandlers.initHandlersFromConfig created standard: solr.StandardRequestHandler
[junit4:junit4]   2> 4126 T1694 oasc.RequestHandlers.initHandlersFromConfig created /get: solr.RealTimeGetHandler
[junit4:junit4]   2> 4127 T1694 oasc.RequestHandlers.initHandlersFromConfig created dismax: solr.SearchHandler
[junit4:junit4]   2> 4128 T1694 oasc.RequestHandlers.initHandlersFromConfig created mock: org.apache.solr.core.MockQuerySenderListenerReqHandler
[junit4:junit4]   2> 4129 T1694 oasc.RequestHandlers.initHandlersFromConfig created /admin/: org.apache.solr.handler.admin.AdminHandlers
[junit4:junit4]   2> 4129 T1694 oasc.RequestHandlers.initHandlersFromConfig created defaults: solr.StandardRequestHandler
[junit4:junit4]   2> 4130 T1694 oasc.RequestHandlers.initHandlersFromConfig adding lazy requestHandler: solr.StandardRequestHandler
[junit4:junit4]   2> 4130 T1694 oasc.RequestHandlers.initHandlersFromConfig created lazy: solr.StandardRequestHandler
[junit4:junit4]   2> 4131 T1694 oasc.RequestHandlers.initHandlersFromConfig created /update: solr.UpdateRequestHandler
[junit4:junit4]   2> 4132 T1694 oasc.RequestHandlers.initHandlersFromConfig created /terms: org.apache.solr.handler.component.SearchHandler
[junit4:junit4]   2> 4133 T1694 oasc.RequestHandlers.initHandlersFromConfig created spellCheckCompRH: org.apache.solr.handler.component.SearchHandler
[junit4:junit4]   2> 4134 T1694 oasc.RequestHandlers.initHandlersFromConfig created spellCheckCompRH_Direct: org.apache.solr.handler.component.SearchHandler
[junit4:junit4]   2> 4135 T1694 oasc.RequestHandlers.initHandlersFromConfig created spellCheckWithWordbreak: org.apache.solr.handler.component.SearchHandler
[junit4:junit4]   2> 4135 T1694 oasc.RequestHandlers.initHandlersFromConfig created spellCheckWithWordbreak_Direct: org.apache.solr.handler.component.SearchHandler
[junit4:junit4]   2> 4136 T1694 oasc.RequestHandlers.initHandlersFromConfig created spellCheckCompRH1: org.apache.solr.handler.component.SearchHandler
[junit4:junit4]   2> 4137 T1694 oasc.RequestHandlers.initHandlersFromConfig created tvrh: org.apache.solr.handler.component.SearchHandler
[junit4:junit4]   2> 4138 T1694 oasc.RequestHandlers.initHandlersFromConfig created /mlt: solr.MoreLikeThisHandler
[junit4:junit4]   2> 4139 T1694 oasc.RequestHandlers.initHandlersFromConfig created /debug/dump: solr.DumpRequestHandler
[junit4:junit4]   2> 4143 T1694 oashl.XMLLoader.init xsltCacheLifetimeSeconds=60
[junit4:junit4]   2> 4148 T1694 oasc.SolrCore.initDeprecatedSupport WARNING solrconfig.xml uses deprecated <admin/gettableFiles>, Please update your config to use the ShowFileRequestHandler.
[junit4:junit4]   2> 4149 T1694 oasc.SolrCore.initDeprecatedSupport WARNING adding ShowFileRequestHandler with hidden files: [SCHEMA.XML, OLD_SYNONYMS.TXT, STOPWORDS.TXT, PROTWORDS.TXT, OPEN-EXCHANGE-RATES.JSON, SYNONYMS.TXT, CURRENCY.XML, MAPPING-ISOLATIN1ACCENT.TXT]
[junit4:junit4]   2> 4153 T1694 oass.SolrIndexSearcher.<init> Opening Searcher@e1d0853 main
[junit4:junit4]   2> 4154 T1694 oasu.CommitTracker.<init> Hard AutoCommit: disabled
[junit4:junit4]   2> 4155 T1694 oasu.CommitTracker.<init> Soft AutoCommit: disabled
[junit4:junit4]   2> 4156 T1694 oashc.SpellCheckComponent.inform Initializing spell checkers
[junit4:junit4]   2> 4163 T1694 oass.DirectSolrSpellChecker.init init: {name=direct,classname=DirectSolrSpellChecker,field=lowerfilt,minQueryLength=3}
[junit4:junit4]   2> 4226 T1729 oasc.SolrCore.registerSearcher [collection1] Registered new searcher Searcher@e1d0853 main{StandardDirectoryReader(segments_1:1)}
[junit4:junit4]   2> 4565 T1715 oascc.ZkStateReader.updateClusterState Updating cloud state from ZooKeeper... 
[junit4:junit4]   2> 4569 T1728 oascc.ZkStateReader$2.process A cluster state change has occurred - updating...
[junit4:junit4]   2> 4569 T1714 oascc.ZkStateReader$2.process A cluster state change has occurred - updating...
[junit4:junit4]   2> 4734 T1694 oasc.CoreContainer.register registering core: collection1
[junit4:junit4]   2> 4734 T1694 oasc.ZkController.register Register shard - core:collection1 address:http://127.0.0.1:27209/solr shardId:shard1
[junit4:junit4]   2> 4735 T1694 oascc.SolrZkClient.makePath makePath: /collections/collection1/leader_elect/shard1/election
[junit4:junit4]   2> 4748 T1699 oazs.PrepRequestProcessor.pRequest Got user-level KeeperException when processing sessionid:0x139d5883f320003 type:delete cxid:0x42 zxid:0xfffffffffffffffe txntype:unknown reqpath:n/a Error Path:/solr/collections/collection1/leaders Error:KeeperErrorCode = NoNode for /solr/collections/collection1/leaders
[junit4:junit4]   2> 4755 T1694 oasc.ShardLeaderElectionContext.runLeaderProcess Running the leader process.
[junit4:junit4]   2> 4755 T1699 oazs.PrepRequestProcessor.pRequest Got user-level KeeperException when processing sessionid:0x139d5883f320003 type:create cxid:0x43 zxid:0xfffffffffffffffe txntype:unknown reqpath:n/a Error Path:/solr/overseer Error:KeeperErrorCode = NodeExists for /solr/overseer
[junit4:junit4]   2> 4758 T1694 oasc.ShardLeaderElectionContext.waitForReplicasToComeUp Enough replicas found to continue.
[junit4:junit4]   2> 4758 T1694 oasc.ShardLeaderElectionContext.runLeaderProcess I may be the new leader - try and sync
[junit4:junit4]   2> 4758 T1694 oasc.SyncStrategy.sync Sync replicas to http://127.0.0.1:27209/solr/collection1/
[junit4:junit4]   2> 4759 T1694 oasc.SyncStrategy.syncReplicas Sync Success - now sync replicas to me
[junit4:junit4]   2> 4759 T1694 oasc.SyncStrategy.syncToMe http://127.0.0.1:27209/solr/collection1/ has no replicas
[junit4:junit4]   2> 4759 T1694 oasc.ShardLeaderElectionContext.runLeaderProcess I am the new leader: http://127.0.0.1:27209/solr/collection1/
[junit4:junit4]   2> 4760 T1694 oascc.SolrZkClient.makePath makePath: /collections/collection1/leaders/shard1
[junit4:junit4]   2> 4775 T1699 oazs.PrepRequestProcessor.pRequest Got user-level KeeperException when processing sessionid:0x139d5883f320003 type:create cxid:0x4d zxid:0xfffffffffffffffe txntype:unknown reqpath:n/a Error Path:/solr/overseer Error:KeeperErrorCode = NodeExists for /solr/overseer
[junit4:junit4]   2> 5073 T1715 oascc.ZkStateReader.updateClusterState Updating cloud state from ZooKeeper... 
[junit4:junit4]   2> 5088 T1728 oascc.ZkStateReader$2.process A cluster state change has occurred - updating...
[junit4:junit4]   2> 5088 T1714 oascc.ZkStateReader$2.process A cluster state change has occurred - updating...
[junit4:junit4]   2> 5094 T1694 oasc.ZkController.register We are http://127.0.0.1:27209/solr/collection1/ and leader is http://127.0.0.1:27209/solr/collection1/
[junit4:junit4]   2> 5094 T1694 oasc.ZkController.register No LogReplay needed for core=collection1 baseURL=http://127.0.0.1:27209/solr
[junit4:junit4]   2> 5095 T1694 oasc.ZkController.checkRecovery I am the leader, no recovery necessary
[junit4:junit4]   2> 5096 T1694 oascc.ZkStateReader.updateClusterState Updating cloud state from ZooKeeper... 
[junit4:junit4]   2> 5097 T1694 oass.SolrDispatchFilter.init user.dir=/usr/home/hudson/hudson-slave/workspace/Lucene-Solr-Tests-trunk-Java6/solr/build/solr-core/test/J0
[junit4:junit4]   2> 5097 T1694 oass.SolrDispatchFilter.init SolrDispatchFilter.init() done
[junit4:junit4]   2> 5098 T1694 oascsi.HttpClientUtil.createClient Creating new http client, config:maxConnections=128&maxConnectionsPerHost=32&followRedirects=false
[junit4:junit4]   2> 5562 T1694 oejs.Server.doStart jetty-8.1.2.v20120308
[junit4:junit4]   2> 5566 T1694 oejs.AbstractConnector.doStart Started SocketConnector@0.0.0.0:27215
[junit4:junit4]   2> 5566 T1694 oasc.SolrResourceLoader.locateSolrHome JNDI not configured for solr (NoInitialContextEx)
[junit4:junit4]   2> 5567 T1694 oasc.SolrResourceLoader.locateSolrHome using system property solr.solr.home: /usr/home/hudson/hudson-slave/workspace/Lucene-Solr-Tests-trunk-Java6/solr/build/solr-core/test/J0/./solrtest-jetty2-1347907244833
[junit4:junit4]   2> 5567 T1694 oasc.SolrResourceLoader.<init> new SolrResourceLoader for deduced Solr Home: '/usr/home/hudson/hudson-slave/workspace/Lucene-Solr-Tests-trunk-Java6/solr/build/solr-core/test/J0/./solrtest-jetty2-1347907244833/'
[junit4:junit4]   2> 5593 T1715 oascc.ZkStateReader.updateClusterState Updating cloud state from ZooKeeper... 
[junit4:junit4]   2> 5605 T1694 oass.SolrDispatchFilter.init SolrDispatchFilter.init()
[junit4:junit4]   2> 5606 T1694 oasc.SolrResourceLoader.locateSolrHome JNDI not configured for solr (NoInitialContextEx)
[junit4:junit4]   2> 5606 T1694 oasc.SolrResourceLoader.locateSolrHome using system property solr.solr.home: /usr/home/hudson/hudson-slave/workspace/Lucene-Solr-Tests-trunk-Java6/solr/build/solr-core/test/J0/./solrtest-jetty2-1347907244833
[junit4:junit4]   2> 5607 T1694 oasc.CoreContainer$Initializer.initialize looking for solr.xml: /usr/home/hudson/hudson-slave/workspace/Lucene-Solr-Tests-trunk-Java6/solr/build/solr-core/test/J0/./solrtest-jetty2-1347907244833/solr.xml
[junit4:junit4]   2> 5607 T1694 oasc.CoreContainer.<init> New CoreContainer 1010798902
[junit4:junit4]   2> 5608 T1694 oasc.CoreContainer.load Loading CoreContainer using Solr Home: '/usr/home/hudson/hudson-slave/workspace/Lucene-Solr-Tests-trunk-Java6/solr/build/solr-core/test/J0/./solrtest-jetty2-1347907244833/'
[junit4:junit4]   2> 5608 T1694 oasc.SolrResourceLoader.<init> new SolrResourceLoader for directory: '/usr/home/hudson/hudson-slave/workspace/Lucene-Solr-Tests-trunk-Java6/solr/build/solr-core/test/J0/./solrtest-jetty2-1347907244833/'
[junit4:junit4]   2> 5613 T1728 oascc.ZkStateReader$2.process A cluster state change has occurred - updating...
[junit4:junit4]   2> 5613 T1714 oascc.ZkStateReader$2.process A cluster state change has occurred - updating...
[junit4:junit4]   2> 5635 T1694 oasc.CoreContainer.load Registering Log Listener
[junit4:junit4]   2> 5652 T1694 oasc.CoreContainer.initZooKeeper Zookeeper client=127.0.0.1:27198/solr
[junit4:junit4]   2> 5653 T1694 oaz.ZooKeeper.<init> Initiating client connection, connectString=127.0.0.1:27198/solr sessionTimeout=5000 watcher=org.apache.solr.common.cloud.ConnectionManager@69ceb801
[junit4:junit4]   2> 5654 T1739 oaz.ClientCnxn$SendThread.startConnect Opening socket connection to server /127.0.0.1:27198
[junit4:junit4]   2> 5654 T1694 oascc.ConnectionManager.waitForConnected Waiting for client to connect to ZooKeeper
[junit4:junit4]   2> 5654 T1739 oaz.ClientCnxn$SendThread.primeConnection Socket connection established to localhost/127.0.0.1:27198, initiating session
[junit4:junit4]   2> 5655 T1696 oazs.NIOServerCnxn$Factory.run Accepted socket connection from /140.211.11.196:27216
[junit4:junit4]   2> 5655 T1696 oazs.NIOServerCnxn.readConnectRequest Client attempting to establish new session at /140.211.11.196:27216
[junit4:junit4]   2> 5656 T1698 oazs.NIOServerCnxn.finishSessionInit Established session 0x139d5883f320004 with negotiated timeout 5000 for client /140.211.11.196:27216
[junit4:junit4]   2> 5656 T1739 oaz.ClientCnxn$SendThread.readConnectResult Session establishment complete on server localhost/127.0.0.1:27198, sessionid = 0x139d5883f320004, negotiated timeout = 5000
[junit4:junit4]   2> 5656 T1740 oascc.ConnectionManager.process Watcher org.apache.solr.common.cloud.ConnectionManager@69ceb801 name:ZooKeeperConnection Watcher:127.0.0.1:27198/solr got event WatchedEvent state:SyncConnected type:None path:null path:null type:None
[junit4:junit4]   2> 5657 T1694 oascc.ConnectionManager.waitForConnected Client is connected to ZooKeeper
[junit4:junit4]   2> 5657 T1699 oazs.PrepRequestProcessor.pRequest Got user-level KeeperException when processing sessionid:0x139d5883f320004 type:create cxid:0x1 zxid:0xfffffffffffffffe txntype:unknown reqpath:n/a Error Path:/solr/overseer Error:KeeperErrorCode = NodeExists for /solr/overseer
[junit4:junit4]   2> 5660 T1699 oazs.PrepRequestProcessor.pRequest Got user-level KeeperException when processing sessionid:0x139d5883f320004 type:create cxid:0x2 zxid:0xfffffffffffffffe txntype:unknown reqpath:n/a Error Path:/solr/overseer Error:KeeperErrorCode = NodeExists for /solr/overseer
[junit4:junit4]   2> 5669 T1694 oasc.ZkController.createEphemeralLiveNode Register node as live in ZooKeeper:/live_nodes/127.0.0.1:27215_solr
[junit4:junit4]   2> 5670 T1699 oazs.PrepRequestProcessor.pRequest Got user-level KeeperException when processing sessionid:0x139d5883f320004 type:delete cxid:0x4 zxid:0xfffffffffffffffe txntype:unknown reqpath:n/a Error Path:/solr/live_nodes/127.0.0.1:27215_solr Error:KeeperErrorCode = NoNode for /solr/live_nodes/127.0.0.1:27215_solr
[junit4:junit4]   2> 5671 T1694 oascc.SolrZkClient.makePath makePath: /live_nodes/127.0.0.1:27215_solr
[junit4:junit4]   2> 5672 T1728 oascc.ZkStateReader$3.process Updating live nodes
[junit4:junit4]   2> 5672 T1714 oascc.ZkStateReader$3.process Updating live nodes
[junit4:junit4]   2> 5673 T1694 oashc.HttpShardHandlerFactory.getParameter Setting socketTimeout to: 0
[junit4:junit4]   2> 5674 T1694 oashc.HttpShardHandlerFactory.getParameter Setting urlScheme to: http://
[junit4:junit4]   2> 5674 T1694 oashc.HttpShardHandlerFactory.getParameter Setting connTimeout to: 0
[junit4:junit4]   2> 5675 T1694 oashc.HttpShardHandlerFactory.getParameter Setting maxConnectionsPerHost to: 20
[junit4:junit4]   2> 5675 T1694 oashc.HttpShardHandlerFactory.getParameter Setting corePoolSize to: 0
[junit4:junit4]   2> 5675 T1694 oashc.HttpShardHandlerFactory.getParameter Setting maximumPoolSize to: 2147483647
[junit4:junit4]   2> 5676 T1694 oashc.HttpShardHandlerFactory.getParameter Setting maxThreadIdleTime to: 5
[junit4:junit4]   2> 5676 T1694 oashc.HttpShardHandlerFactory.getParameter Setting sizeOfQueue to: -1
[junit4:junit4]   2> 5676 T1694 oashc.HttpShardHandlerFactory.getParameter Setting fairnessPolicy to: false
[junit4:junit4]   2> 5677 T1694 oascsi.HttpClientUtil.createClient Creating new http client, config:maxConnectionsPerHost=20&maxConnections=10000&socketTimeout=0&connTimeout=0&retry=false
[junit4:junit4]   2> 5689 T1694 oascc.ZkStateReader.createClusterStateWatchersAndUpdate Updating cluster state from ZooKeeper... 
[junit4:junit4]   2> 5694 T1694 oasc.CoreContainer.create Creating SolrCore 'collection1' using instanceDir: /usr/home/hudson/hudson-slave/workspace/Lucene-Solr-Tests-trunk-Java6/solr/build/solr-core/test/J0/./solrtest-jetty2-1347907244833/collection1
[junit4:junit4]   2> 5694 T1694 oasc.ZkController.createCollectionZkNode Check for collection zkNode:collection1
[junit4:junit4]   2> 5695 T1694 oasc.ZkController.createCollectionZkNode Collection zkNode exists
[junit4:junit4]   2> 5695 T1694 oasc.ZkController.readConfigName Load collection config from:/collections/collection1
[junit4:junit4]   2> 5696 T1694 oasc.SolrResourceLoader.<init> new SolrResourceLoader for directory: '/usr/home/hudson/hudson-slave/workspace/Lucene-Solr-Tests-trunk-Java6/solr/build/solr-core/test/J0/./solrtest-jetty2-1347907244833/collection1/'
[junit4:junit4]   2> 5697 T1694 oasc.SolrResourceLoader.replaceClassLoader Adding 'file:/usr/home/hudson/hudson-slave/workspace/Lucene-Solr-Tests-trunk-Java6/solr/build/solr-core/test/J0/solrtest-jetty2-1347907244833/collection1/lib/README' to classloader
[junit4:junit4]   2> 5698 T1694 oasc.SolrResourceLoader.replaceClassLoader Adding 'file:/usr/home/hudson/hudson-slave/workspace/Lucene-Solr-Tests-trunk-Java6/solr/build/solr-core/test/J0/solrtest-jetty2-1347907244833/collection1/lib/classes/' to classloader
[junit4:junit4]   2> 5733 T1694 oasc.SolrConfig.<init> Using Lucene MatchVersion: LUCENE_50
[junit4:junit4]   2> 5781 T1694 oasc.SolrConfig.<init> Loaded SolrConfig: solrconfig.xml
[junit4:junit4]   2> 5882 T1694 oass.IndexSchema.readSchema Reading Solr Schema
[junit4:junit4]   2> 5887 T1694 oass.IndexSchema.readSchema Schema name=test
[junit4:junit4]   2> 6330 T1694 oass.OpenExchangeRatesOrgProvider.init Initialized with rates=open-exchange-rates.json, refreshInterval=1440.
[junit4:junit4]   2> 6339 T1694 oass.IndexSchema.readSchema default search field in schema is text
[junit4:junit4]   2> 6342 T1694 oass.IndexSchema.readSchema unique key field: id
[junit4:junit4]   2> 6351 T1694 oass.FileExchangeRateProvider.reload Reloading exchange rates from file currency.xml
[junit4:junit4]   2> 6355 T1694 oass.FileExchangeRateProvider.reload Reloading exchange rates from file currency.xml
[junit4:junit4]   2> 6359 T1694 oass.OpenExchangeRatesOrgProvider.reload Reloading exchange rates from open-exchange-rates.json
[junit4:junit4]   2> 6360 T1694 oass.OpenExchangeRatesOrgProvider.reload Reloading exchange rates from open-exchange-rates.json
[junit4:junit4]   2> 6361 T1694 oasc.SolrCore.<init> [collection1] Opening new SolrCore at /usr/home/hudson/hudson-slave/workspace/Lucene-Solr-Tests-trunk-Java6/solr/build/solr-core/test/J0/./solrtest-jetty2-1347907244833/collection1/, dataDir=./org.apache.solr.cloud.BasicDistributedZk2Test-1347907239725/jetty2/
[junit4:junit4]   2> 6362 T1694 oasc.JmxMonitoredMap.<init> JMX monitoring is enabled. Adding Solr mbeans to JMX Server: com.sun.jmx.mbeanserver.JmxMBeanServer@bdccedd
[junit4:junit4]   2> 6363 T1694 oasc.SolrCore.getNewIndexDir WARNING New index directory detected: old=null new=./org.apache.solr.cloud.BasicDistributedZk2Test-1347907239725/jetty2/index/
[junit4:junit4]   2> 6364 T1694 oasc.SolrCore.initIndex WARNING [collection1] Solr index directory './org.apache.solr.cloud.BasicDistributedZk2Test-1347907239725/jetty2/index' doesn't exist. Creating new index...
[junit4:junit4]   2> 6365 T1694 oasc.CachingDirectoryFactory.get return new directory for /usr/home/hudson/hudson-slave/workspace/Lucene-Solr-Tests-trunk-Java6/solr/build/solr-core/test/J0/./org.apache.solr.cloud.BasicDistributedZk2Test-1347907239725/jetty2/index forceNew:false
[junit4:junit4]   2> 6391 T1694 oasc.SolrDeletionPolicy.onCommit SolrDeletionPolicy.onCommit: commits:num=1
[junit4:junit4]   2> 		commit{dir=NRTCachingDirectory(org.apache.lucene.store.NIOFSDirectory@/usr/home/hudson/hudson-slave/workspace/Lucene-Solr-Tests-trunk-Java6/solr/build/solr-core/test/J0/org.apache.solr.cloud.BasicDistributedZk2Test-1347907239725/jetty2/index lockFactory=org.apache.lucene.store.NativeFSLockFactory@6ed86a75; maxCacheMB=48.0 maxMergeSizeMB=4.0),segFN=segments_1,generation=1,filenames=[segments_1]
[junit4:junit4]   2> 6391 T1694 oasc.SolrDeletionPolicy.updateCommits newest commit = 1
[junit4:junit4]   2> 6392 T1694 oasc.SolrCore.initWriters created xml: solr.XMLResponseWriter
[junit4:junit4]   2> 6394 T1694 oasup.UpdateRequestProcessorChain.init inserting DistributedUpdateProcessorFactory into updateRequestProcessorChain "dedupe"
[junit4:junit4]   2> 6394 T1694 oasup.UpdateRequestProcessorChain.init inserting DistributedUpdateProcessorFactory into updateRequestProcessorChain "dedupe-allfields"
[junit4:junit4]   2> 6395 T1694 oasup.UpdateRequestProcessorChain.init inserting DistributedUpdateProcessorFactory into updateRequestProcessorChain "stored_sig"
[junit4:junit4]   2> 6395 T1694 oasup.UpdateRequestProcessorChain.init inserting DistributedUpdateProcessorFactory into updateRequestProcessorChain "uniq-fields"
[junit4:junit4]   2> 6396 T1694 oasup.UpdateRequestProcessorChain.init inserting DistributedUpdateProcessorFactory into updateRequestProcessorChain "distrib-dup-test-chain-implicit"
[junit4:junit4]   2> 6396 T1694 oasc.RequestHandlers.initHandlersFromConfig adding lazy requestHandler: solr.ReplicationHandler
[junit4:junit4]   2> 6396 T1694 oasc.RequestHandlers.initHandlersFromConfig created /replication: solr.ReplicationHandler
[junit4:junit4]   2> 6397 T1694 oasc.RequestHandlers.initHandlersFromConfig created standard: solr.StandardRequestHandler
[junit4:junit4]   2> 6397 T1694 oasc.RequestHandlers.initHandlersFromConfig created /get: solr.RealTimeGetHandler
[junit4:junit4]   2> 6398 T1694 oasc.RequestHandlers.initHandlersFromConfig created dismax: solr.SearchHandler
[junit4:junit4]   2> 6398 T1694 oasc.RequestHandlers.initHandlersFromConfig created mock: org.apache.solr.core.MockQuerySenderListenerReqHandler
[junit4:junit4]   2> 6399 T1694 oasc.RequestHandlers.initHandlersFromConfig created /admin/: org.apache.solr.handler.admin.AdminHandlers
[junit4:junit4]   2> 6399 T1694 oasc.RequestHandlers.initHandlersFromConfig created defaults: solr.StandardRequestHandler
[junit4:junit4]   2> 6400 T1694 oasc.RequestHandlers.initHandlersFromConfig adding lazy requestHandler: solr.StandardRequestHandler
[junit4:junit4]   2> 6400 T1694 oasc.RequestHandlers.initHandlersFromConfig created lazy: solr.StandardRequestHandler
[junit4:junit4]   2> 6400 T1694 oasc.RequestHandlers.initHandlersFromConfig created /update: solr.UpdateRequestHandler
[junit4:junit4]   2> 6401 T1694 oasc.RequestHandlers.initHandlersFromConfig created /terms: org.apache.solr.handler.component.SearchHandler
[junit4:junit4]   2> 6401 T1694 oasc.RequestHandlers.initHandlersFromConfig created spellCheckCompRH: org.apache.solr.handler.component.SearchHandler
[junit4:junit4]   2> 6402 T1694 oasc.RequestHandlers.initHandlersFromConfig created spellCheckCompRH_Direct: org.apache.solr.handler.component.SearchHandler
[junit4:junit4]   2> 6402 T1694 oasc.RequestHandlers.initHandlersFromConfig created spellCheckWithWordbreak: org.apache.solr.handler.component.SearchHandler
[junit4:junit4]   2> 6403 T1694 oasc.RequestHandlers.initHandlersFromConfig created spellCheckWithWordbreak_Direct: org.apache.solr.handler.component.SearchHandler
[junit4:junit4]   2> 6403 T1694 oasc.RequestHandlers.initHandlersFromConfig created spellCheckCompRH1: org.apache.solr.handler.component.SearchHandler
[junit4:junit4]   2> 6404 T1694 oasc.RequestHandlers.initHandlersFromConfig created tvrh: org.apache.solr.handler.component.SearchHandler
[junit4:junit4]   2> 6404 T1694 oasc.RequestHandlers.initHandlersFromConfig created /mlt: solr.MoreLikeThisHandler
[junit4:junit4]   2> 6405 T1694 oasc.RequestHandlers.initHandlersFromConfig created /debug/dump: solr.DumpRequestHandler
[junit4:junit4]   2> 6408 T1694 oashl.XMLLoader.init xsltCacheLifetimeSeconds=60
[junit4:junit4]   2> 6411 T1694 oasc.SolrCore.initDeprecatedSupport WARNING solrconfig.xml uses deprecated <admin/gettableFiles>, Please update your config to use the ShowFileRequestHandler.
[junit4:junit4]   2> 6412 T1694 oasc.SolrCore.initDeprecatedSupport WARNING adding ShowFileRequestHandler with hidden files: [SCHEMA.XML, OLD_SYNONYMS.TXT, STOPWORDS.TXT, PROTWORDS.TXT, OPEN-EXCHANGE-RATES.JSON, SYNONYMS.TXT, CURRENCY.XML, MAPPING-ISOLATIN1ACCENT.TXT]
[junit4:junit4]   2> 6416 T1694 oass.SolrIndexSearcher.<init> Opening Searcher@71220f39 main
[junit4:junit4]   2> 6416 T1694 oasu.CommitTracker.<init> Hard AutoCommit: disabled
[junit4:junit4]   2> 6417 T1694 oasu.CommitTracker.<init> Soft AutoCommit: disabled
[junit4:junit4]   2> 6417 T1694 oashc.SpellCheckComponent.inform Initializing spell checkers
[junit4:junit4]   2> 6424 T1694 oass.DirectSolrSpellChecker.init init: {name=direct,classname=DirectSolrSpellChecker,field=lowerfilt,minQueryLength=3}
[junit4:junit4]   2> 6475 T1741 oasc.SolrCore.registerSearcher [collection1] Registered new searcher Searcher@71220f39 main{StandardDirectoryReader(segments_1:1)}
[junit4:junit4]   2> 6619 T1715 oascc.ZkStateReader.updateClusterState Updating cloud state from ZooKeeper... 
[junit4:junit4]   2> 6634 T1740 oascc.ZkStateReader$2.process A cluster state change has occurred - updating...
[junit4:junit4]   2> 6634 T1728 oascc.ZkStateReader$2.process A cluster state change has occurred - updating...
[junit4:junit4]   2> 6634 T1714 oascc.ZkStateReader$2.process A cluster state change has occurred - updating...
[junit4:junit4]   2> 6979 T1694 oasc.CoreContainer.register registering core: collection1
[junit4:junit4]   2> 6979 T1694 oasc.ZkController.register Register shard - core:collection1 address:http://127.0.0.1:27215/solr shardId:shard2
[junit4:junit4]   2> 6981 T1694 oascc.SolrZkClient.makePath makePath: /collections/collection1/leader_elect/shard2/election
[junit4:junit4]   2> 7001 T1699 oazs.PrepRequestProcessor.pRequest Got user-level KeeperException when processing sessionid:0x139d5883f320004 type:delete cxid:0x41 zxid:0xfffffffffffffffe txntype:unknown reqpath:n/a Error Path:/solr/collections/collection1/leaders/shard2 Error:KeeperErrorCode = NoNode for /solr/collections/collection1/leaders/shard2
[junit4:junit4]   2> 7002 T1694 oasc.ShardLeaderElectionContext.runLeaderProcess Running the leader process.
[junit4:junit4]   2> 7003 T1699 oazs.PrepRequestProcessor.pRequest Got user-level KeeperException when processing sessionid:0x139d5883f320004 type:create cxid:0x42 zxid:0xfffffffffffffffe txntype:unknown reqpath:n/a Error Path:/solr/overseer Error:KeeperErrorCode = NodeExists for /solr/overseer
[junit4:junit4]   2> 7014 T1694 oasc.ShardLeaderElectionContext.waitForReplicasToComeUp Enough replicas found to continue.
[junit4:junit4]   2> 7014 T1694 oasc.ShardLeaderElectionContext.runLeaderProcess I may be the new leader - try and sync
[junit4:junit4]   2> 7015 T1694 oasc.SyncStrategy.sync Sync replicas to http://127.0.0.1:27215/solr/collection1/
[junit4:junit4]   2> 7015 T1694 oasc.SyncStrategy.syncReplicas Sync Success - now sync replicas to me
[junit4:junit4]   2> 7016 T1694 oasc.SyncStrategy.syncToMe http://127.0.0.1:27215/solr/collection1/ has no replicas
[junit4:junit4]   2> 7016 T1694 oasc.ShardLeaderElectionContext.runLeaderProcess I am the new leader: http://127.0.0.1:27215/solr/collection1/
[junit4:junit4]   2> 7017 T1694 oascc.SolrZkClient.makePath makePath: /collections/collection1/leaders/shard2
[junit4:junit4]   2> 7019 T1699 oazs.PrepRequestProcessor.pRequest Got user-level KeeperException when processing sessionid:0x139d5883f320004 type:create cxid:0x4b zxid:0xfffffffffffffffe txntype:unknown reqpath:n/a Error Path:/solr/overseer Error:KeeperErrorCode = NodeExists for /solr/overseer
[junit4:junit4]   2> 7140 T1715 oascc.ZkStateReader.updateClusterState Updating cloud state from ZooKeeper... 
[junit4:junit4]   2> 7156 T1740 oascc.ZkStateReader$2.process A cluster state change has occurred - updating...
[junit4:junit4]   2> 7156 T1728 oascc.ZkStateReader$2.process A cluster state change has occurred - updating...
[junit4:junit4]   2> 7156 T1714 oascc.ZkStateReader$2.process A cluster state change has occurred - updating...
[junit4:junit4]   2> 7174 T1694 oasc.ZkController.register We are http://127.0.0.1:27215/solr/collection1/ and leader is http://127.0.0.1:27215/solr/collection1/
[junit4:junit4]   2> 7174 T1694 oasc.ZkController.register No LogReplay needed for core=collection1 baseURL=http://127.0.0.1:27215/solr
[junit4:junit4]   2> 7175 T1694 oasc.ZkController.checkRecovery I am the leader, no recovery necessary
[junit4:junit4]   2> 7177 T1694 oascc.ZkStateReader.updateClusterState Updating cloud state from ZooKeeper... 
[junit4:junit4]   2> 7178 T1694 oass.SolrDispatchFilter.init user.dir=/usr/home/hudson/hudson-slave/workspace/Lucene-Solr-Tests-trunk-Java6/solr/build/solr-core/test/J0
[junit4:junit4]   2> 7178 T1694 oass.SolrDispatchFilter.init SolrDispatchFilter.init() done
[junit4:junit4]   2> 7179 T1694 oascsi.HttpClientUtil.createClient Creating new http client, config:maxConnections=128&maxConnectionsPerHost=32&followRedirects=false
[junit4:junit4]   2> 7478 T1694 oejs.Server.doStart jetty-8.1.2.v20120308
[junit4:junit4]   2> 7481 T1694 oejs.AbstractConnector.doStart Started SocketConnector@0.0.0.0:27218
[junit4:junit4]   2> 7481 T1694 oasc.SolrResourceLoader.locateSolrHome JNDI not configured for solr (NoInitialContextEx)
[junit4:junit4]   2> 7481 T1694 oasc.SolrResourceLoader.locateSolrHome using system property solr.solr.home: /usr/home/hudson/hudson-slave/workspace/Lucene-Solr-Tests-trunk-Java6/solr/build/solr-core/test/J0/./solrtest-jetty3-1347907246910
[junit4:junit4]   2> 7482 T1694 oasc.SolrResourceLoader.<init> new SolrResourceLoader for deduced Solr Home: '/usr/home/hudson/hudson-slave/workspace/Lucene-Solr-Tests-trunk-Java6/solr/build/solr-core/test/J0/./solrtest-jetty3-1347907246910/'
[junit4:junit4]   2> 7505 T1694 oass.SolrDispatchFilter.init SolrDispatchFilter.init()
[junit4:junit4]   2> 7505 T1694 oasc.SolrResourceLoader.locateSolrHome JNDI not configured for solr (NoInitialContextEx)
[junit4:junit4]   2> 7506 T1694 oasc.SolrResourceLoader.locateSolrHome using system property solr.solr.home: /usr/home/hudson/hudson-slave/workspace/Lucene-Solr-Tests-trunk-Java6/solr/build/solr-core/test/J0/./solrtest-jetty3-1347907246910
[junit4:junit4]   2> 7506 T1694 oasc.CoreContainer$Initializer.initialize looking for solr.xml: /usr/home/hudson/hudson-slave/workspace/Lucene-Solr-Tests-trunk-Java6/solr/build/solr-core/test/J0/./solrtest-jetty3-1347907246910/solr.xml
[junit4:junit4]   2> 7506 T1694 oasc.CoreContainer.<init> New CoreContainer 2086937571
[junit4:junit4]   2> 7507 T1694 oasc.CoreContainer.load Loading CoreContainer using Solr Home: '/usr/home/hudson/hudson-slave/workspace/Lucene-Solr-Tests-trunk-Java6/solr/build/solr-core/test/J0/./solrtest-jetty3-1347907246910/'
[junit4:junit4]   2> 7507 T1694 oasc.SolrResourceLoader.<init> new SolrResourceLoader for directory: '/usr/home/hudson/hudson-slave/workspace/Lucene-Solr-Tests-trunk-Java6/solr/build/solr-core/test/J0/./solrtest-jetty3-1347907246910/'
[junit4:junit4]   2> 7523 T1694 oasc.CoreContainer.load Registering Log Listener
[junit4:junit4]   2> 7534 T1694 oasc.CoreContainer.initZooKeeper Zookeeper client=127.0.0.1:27198/solr
[junit4:junit4]   2> 7534 T1694 oaz.ZooKeeper.<init> Initiating client connection, connectString=127.0.0.1:27198/solr sessionTimeout=5000 watcher=org.apache.solr.common.cloud.ConnectionManager@a85ebe3
[junit4:junit4]   2> 7535 T1751 oaz.ClientCnxn$SendThread.startConnect Opening socket connection to server /127.0.0.1:27198
[junit4:junit4]   2> 7535 T1694 oascc.ConnectionManager.waitForConnected Waiting for client to connect to ZooKeeper
[junit4:junit4]   2> 7536 T1751 oaz.ClientCnxn$SendThread.primeConnection Socket connection established to localhost/127.0.0.1:27198, initiating session
[junit4:junit4]   2> 7536 T1696 oazs.NIOServerCnxn$Factory.run Accepted socket connection from /140.211.11.196:27219
[junit4:junit4]   2> 7536 T1696 oazs.NIOServerCnxn.readConnectRequest Client attempting to establish new session at /140.211.11.196:27219
[junit4:junit4]   2> 7537 T1698 oazs.NIOServerCnxn.finishSessionInit Established session 0x139d5883f320005 with negotiated timeout 5000 for client /140.211.11.196:27219
[junit4:junit4]   2> 7538 T1751 oaz.ClientCnxn$SendThread.readConnectResult Session establishment complete on server localhost/127.0.0.1:27198, sessionid = 0x139d5883f320005, negotiated timeout = 5000
[junit4:junit4]   2> 7538 T1752 oascc.ConnectionManager.process Watcher org.apache.solr.common.cloud.ConnectionManager@a85ebe3 name:ZooKeeperConnection Watcher:127.0.0.1:27198/solr got event WatchedEvent state:SyncConnected type:None path:null path:null type:None
[junit4:junit4]   2> 7538 T1694 oascc.ConnectionManager.waitForConnected Client is connected to ZooKeeper
[junit4:junit4]   2> 7539 T1699 oazs.PrepRequestProcessor.pRequest Got user-level KeeperException when processing sessionid:0x139d5883f320005 type:create cxid:0x1 zxid:0xfffffffffffffffe txntype:unknown reqpath:n/a Error Path:/solr/overseer Error:KeeperErrorCode = NodeExists for /solr/overseer
[junit4:junit4]   2> 7540 T1699 oazs.PrepRequestProcessor.pRequest Got user-level KeeperException when processing sessionid:0x139d5883f320005 type:create cxid:0x2 zxid:0xfffffffffffffffe txntype:unknown reqpath:n/a Error Path:/solr/overseer Error:KeeperErrorCode = NodeExists for /solr/overseer
[junit4:junit4]   2> 7549 T1694 oasc.ZkController.createEphemeralLiveNode Register node as live in ZooKeeper:/live_nodes/127.0.0.1:27218_solr
[junit4:junit4]   2> 7549 T1699 oazs.PrepRequestProcessor.pRequest Got user-level KeeperException when processing sessionid:0x139d5883f320005 type:delete cxid:0x4 zxid:0xfffffffffffffffe txntype:unknown reqpath:n/a Error Path:/solr/live_nodes/127.0.0.1:27218_solr Error:KeeperErrorCode = NoNode for /solr/live_nodes/127.0.0.1:27218_solr
[junit4:junit4]   2> 7550 T1694 oascc.SolrZkClient.makePath makePath: /live_nodes/127.0.0.1:27218_solr
[junit4:junit4]   2> 7552 T1740 oascc.ZkStateReader$3.process Updating live nodes
[junit4:junit4]   2> 7552 T1728 oascc.ZkStateReader$3.process Updating live nodes
[junit4:junit4]   2> 7552 T1714 oascc.ZkStateReader$3.process Updating live nodes
[junit4:junit4]   2> 7553 T1694 oashc.HttpShardHandlerFactory.getParameter Setting socketTimeout to: 0
[junit4:junit4]   2> 7553 T1694 oashc.HttpShardHandlerFactory.getParameter Setting urlScheme to: http://
[junit4:junit4]   2> 7554 T1694 oashc.HttpShardHandlerFactory.getParameter Setting connTimeout to: 0
[junit4:junit4]   2> 7554 T1694 oashc.HttpShardHandlerFactory.getParameter Setting maxConnectionsPerHost to: 20
[junit4:junit4]   2> 7554 T1694 oashc.HttpShardHandlerFactory.getParameter Setting corePoolSize to: 0
[junit4:junit4]   2> 7555 T1694 oashc.HttpShardHandlerFactory.getParameter Setting maximumPoolSize to: 2147483647
[junit4:junit4]   2> 7555 T1694 oashc.HttpShardHandlerFactory.getParameter Setting maxThreadIdleTime to: 5
[junit4:junit4]   2> 7555 T1694 oashc.HttpShardHandlerFactory.getParameter Setting sizeOfQueue to: -1
[junit4:junit4]   2> 7556 T1694 oashc.HttpShardHandlerFactory.getParameter Setting fairnessPolicy to: false
[junit4:junit4]   2> 7556 T1694 oascsi.HttpClientUtil.createClient Creating new http client, config:maxConnectionsPerHost=20&maxConnections=10000&socketTimeout=0&connTimeout=0&retry=false
[junit4:junit4]   2> 7568 T1694 oascc.ZkStateReader.createClusterStateWatchersAndUpdate Updating cluster state from ZooKeeper... 
[junit4:junit4]   2> 7572 T1694 oasc.CoreContainer.create Creating SolrCore 'collection1' using instanceDir: /usr/home/hudson/hudson-slave/workspace/Lucene-Solr-Tests-trunk-Java6/solr/build/solr-core/test/J0/./solrtest-jetty3-1347907246910/collection1
[junit4:junit4]   2> 7573 T1694 oasc.ZkController.createCollectionZkNode Check for collection zkNode:collection1
[junit4:junit4]   2> 7573 T1694 oasc.ZkController.createCollectionZkNode Collection zkNode exists
[junit4:junit4]   2> 7573 T1694 oasc.ZkController.readConfigName Load collection config from:/collections/collection1
[junit4:junit4]   2> 7574 T1694 oasc.SolrResourceLoader.<init> new SolrResourceLoader for directory: '/usr/home/hudson/hudson-slave/workspace/Lucene-Solr-Tests-trunk-Java6/solr/build/solr-core/test/J0/./solrtest-jetty3-1347907246910/collection1/'
[junit4:junit4]   2> 7575 T1694 oasc.SolrResourceLoader.replaceClassLoader Adding 'file:/usr/home/hudson/hudson-slave/workspace/Lucene-Solr-Tests-trunk-Java6/solr/build/solr-core/test/J0/solrtest-jetty3-1347907246910/collection1/lib/classes/' to classloader
[junit4:junit4]   2> 7576 T1694 oasc.SolrResourceLoader.replaceClassLoader Adding 'file:/usr/home/hudson/hudson-slave/workspace/Lucene-Solr-Tests-trunk-Java6/solr/build/solr-core/test/J0/solrtest-jetty3-1347907246910/collection1/lib/README' to classloader
[junit4:junit4]   2> 7611 T1694 oasc.SolrConfig.<init> Using Lucene MatchVersion: LUCENE_50
[junit4:junit4]   2> 7661 T1715 oascc.ZkStateReader.updateClusterState Updating cloud state from ZooKeeper... 
[junit4:junit4]   2> 7661 T1694 oasc.SolrConfig.<init> Loaded SolrConfig: solrconfig.xml
[junit4:junit4]   2> 7665 T1740 oascc.ZkStateReader$2.process A cluster state change has occurred - updating...
[junit4:junit4]   2> 7665 T1714 oascc.ZkStateReader$2.process A cluster state change has occurred - updating...
[junit4:junit4]   2> 7665 T1728 oascc.ZkStateReader$2.process A cluster state change has occurred - updating...
[junit4:junit4]   2> 7761 T1752 oascc.ZkStateReader$2.process A cluster state change has occurred - updating...
[junit4:junit4]   2> 7761 T1694 oass.IndexSchema.readSchema Reading Solr Schema
[junit4:junit4]   2> 7767 T1694 oass.IndexSchema.readSchema Schema name=test
[junit4:junit4]   2> 8205 T1694 oass.OpenExchangeRatesOrgProvider.init Initialized with rates=open-exchange-rates.json, refreshInterval=1440.
[junit4:junit4]   2> 8214 T1694 oass.IndexSchema.readSchema default search field in schema is text
[junit4:junit4]   2> 8217 T1694 oass.IndexSchema.readSchema unique key field: id
[junit4:junit4]   2> 8227 T1694 oass.FileExchangeRateProvider.reload Reloading exchange rates from file currency.xml
[junit4:junit4]   2> 8231 T1694 oass.FileExchangeRateProvider.reload Reloading exchange rates from file currency.xml
[junit4:junit4]   2> 8234 T1694 oass.OpenExchangeRatesOrgProvider.reload Reloading exchange rates from open-exchange-rates.json
[junit4:junit4]   2> 8235 T1694 oass.OpenExchangeRatesOrgProvider.reload Reloading exchange rates from open-exchange-rates.json
[junit4:junit4]   2> 8236 T1694 oasc.SolrCore.<init> [collection1] Opening new SolrCore at /usr/home/hudson/hudson-slave/workspace/Lucene-Solr-Tests-trunk-Java6/solr/build/solr-core/test/J0/./solrtest-jetty3-1347907246910/collection1/, dataDir=./org.apache.solr.cloud.BasicDistributedZk2Test-1347907239725/jetty3/
[junit4:junit4]   2> 8237 T1694 oasc.JmxMonitoredMap.<init> JMX monitoring is enabled. Adding Solr mbeans to JMX Server: com.sun.jmx.mbeanserver.JmxMBeanServer@bdccedd
[junit4:junit4]   2> 8238 T1694 oasc.SolrCore.getNewIndexDir WARNING New index directory detected: old=null new=./org.apache.solr.cloud.BasicDistributedZk2Test-1347907239725/jetty3/index/
[junit4:junit4]   2> 8238 T1694 oasc.SolrCore.initIndex WARNING [collection1] Solr index directory './org.apache.solr.cloud.BasicDistributedZk2Test-1347907239725/jetty3/index' doesn't exist. Creating new index...
[junit4:junit4]   2> 8239 T1694 oasc.CachingDirectoryFactory.get return new directory for /usr/home/hudson/hudson-slave/workspace/Lucene-Solr-Tests-trunk-Java6/solr/build/solr-core/test/J0/./org.apache.solr.cloud.BasicDistributedZk2Test-1347907239725/jetty3/index forceNew:false
[junit4:junit4]   2> 8249 T1694 oasc.SolrDeletionPolicy.onCommit SolrDeletionPolicy.onCommit: commits:num=1
[junit4:junit4]   2> 		commit{dir=NRTCachingDirectory(org.apache.lucene.store.NIOFSDirectory@/usr/home/hudson/hudson-slave/workspace/Lucene-Solr-Tests-trunk-Java6/solr/build/solr-core/test/J0/org.apache.solr.cloud.BasicDistributedZk2Test-1347907239725/jetty3/index lockFactory=org.apache.lucene.store.NativeFSLockFactory@60edfdb8; maxCacheMB=48.0 maxMergeSizeMB=4.0),segFN=segments_1,generation=1,filenames=[segments_1]
[junit4:junit4]   2> 8250 T1694 oasc.SolrDeletionPolicy.updateCommits newest commit = 1
[junit4:junit4]   2> 8251 T1694 oasc.SolrCore.initWriters created xml: solr.XMLResponseWriter
[junit4:junit4]   2> 8253 T1694 oasup.UpdateRequestProcessorChain.init inserting DistributedUpdateProcessorFactory into updateRequestProcessorChain "dedupe"
[junit4:junit4]   2> 8253 T1694 oasup.UpdateRequestProcessorChain.init inserting DistributedUpdateProcessorFactory into updateRequestProcessorChain "dedupe-allfields"
[junit4:junit4]   2> 8253 T1694 oasup.UpdateRequestProcessorChain.init inserting DistributedUpdateProcessorFactory into updateRequestProcessorChain "stored_sig"
[junit4:junit4]   2> 8254 T1694 oasup.UpdateRequestProcessorChain.init inserting DistributedUpdateProcessorFactory into updateRequestProcessorChain "uniq-fields"
[junit4:junit4]   2> 8254 T1694 oasup.UpdateRequestProcessorChain.init inserting DistributedUpdateProcessorFactory into updateRequestProcessorChain "distrib-dup-test-chain-implicit"
[junit4:junit4]   2> 8255 T1694 oasc.RequestHandlers.initHandlersFromConfig adding lazy requestHandler: solr.ReplicationHandler
[junit4:junit4]   2> 8255 T1694 oasc.RequestHandlers.initHandlersFromConfig created /replication: solr.ReplicationHandler
[junit4:junit4]   2> 8256 T1694 oasc.RequestHandlers.initHandlersFromConfig created standard: solr.StandardRequestHandler
[junit4:junit4]   2> 8256 T1694 oasc.RequestHandlers.initHandlersFromConfig created /get: solr.RealTimeGetHandler
[junit4:junit4]   2> 8257 T1694 oasc.RequestHandlers.initHandlersFromConfig created dismax: solr.SearchHandler
[junit4:junit4]   2> 8258 T1694 oasc.RequestHandlers.initHandlersFromConfig created mock: org.apache.solr.core.MockQuerySenderListenerReqHandler
[junit4:junit4]   2> 8258 T1694 oasc.RequestHandlers.initHandlersFromConfig created /admin/: org.apache.solr.handler.admin.AdminHandlers
[junit4:junit4]   2> 8259 T1694 oasc.RequestHandlers.initHandlersFromConfig created defaults: solr.StandardRequestHandler
[junit4:junit4]   2> 8259 T1694 oasc.RequestHandlers.initHandlersFromConfig adding lazy requestHandler: solr.StandardRequestHandler
[junit4:junit4]   2> 8260 T1694 oasc.RequestHandlers.initHandlersFromConfig created lazy: solr.StandardRequestHandler
[junit4:junit4]   2> 8260 T1694 oasc.RequestHandlers.initHandlersFromConfig created /update: solr.UpdateRequestHandler
[junit4:junit4]   2> 8261 T1694 oasc.RequestHandlers.initHandlersFromConfig created /terms: org.apache.solr.handler.component.SearchHandler
[junit4:junit4]   2> 8261 T1694 oasc.RequestHandlers.initHandlersFromConfig created spellCheckCompRH: org.apache.solr.handler.component.SearchHandler
[junit4:junit4]   2> 8262 T1694 oasc.RequestHandlers.initHandlersFromConfig created spellCheckCompRH_Direct: org.apache.solr.handler.component.SearchHandler
[junit4:junit4]   2> 8262 T1694 oasc.RequestHandlers.initHandlersFromConfig created spellCheckWithWordbreak: org.apache.solr.handler.component.SearchHandler
[junit4:junit4]   2> 8263 T1694 oasc.RequestHandlers.initHandlersFromConfig created spellCheckWithWordbreak_Direct: org.apache.solr.handler.component.SearchHandler
[junit4:junit4]   2> 8263 T1694 oasc.RequestHandlers.initHandlersFromConfig created spellCheckCompRH1: org.apache.solr.handler.component.SearchHandler
[junit4:junit4]   2> 8264 T1694 oasc.RequestHandlers.initHandlersFromConfig created tvrh: org.apache.solr.handler.component.SearchHandler
[junit4:junit4]   2> 8264 T1694 oasc.RequestHandlers.initHandlersFromConfig created /mlt: solr.MoreLikeThisHandler
[junit4:junit4]   2> 8265 T1694 oasc.RequestHandlers.initHandlersFromConfig created /debug/dump: solr.DumpRequestHandler
[junit4:junit4]   2> 8268 T1694 oashl.XMLLoader.init xsltCacheLifetimeSeconds=60
[junit4:junit4]   2> 8271 T1694 oasc.SolrCore.initDeprecatedSupport WARNING solrconfig.xml uses deprecated <admin/gettableFiles>, Please update your config to use the ShowFileRequestHandler.
[junit4:junit4]   2> 8272 T1694 oasc.SolrCore.initDeprecatedSupport WARNING adding ShowFileRequestHandler with hidden files: [SCHEMA.XML, OLD_SYNONYMS.TXT, STOPWORDS.TXT, PROTWORDS.TXT, OPEN-EXCHANGE-RATES.JSON, SYNONYMS.TXT, CURRENCY.XML, MAPPING-ISOLATIN1ACCENT.TXT]
[junit4:junit4]   2> 8275 T1694 oass.SolrIndexSearcher.<init> Opening Searcher@48d8b45f main
[junit4:junit4]   2> 8276 T1694 oasu.CommitTracker.<init> Hard AutoCommit: disabled
[junit4:junit4]   2> 8277 T1694 oasu.CommitTracker.<init> Soft AutoCommit: disabled
[junit4:junit4]   2> 8277 T1694 oashc.SpellCheckComponent.inform Initializing spell checkers
[junit4:junit4]   2> 8283 T1694 oass.DirectSolrSpellChecker.init init: {name=direct,classname=DirectSolrSpellChecker,field=lowerfilt,minQueryLength=3}
[junit4:junit4]   2> 8337 T1753 oasc.SolrCore.registerSearcher [collection1] Registered new searcher Searcher@48d8b45f main{StandardDirectoryReader(segments_1:1)}
[junit4:junit4]   2> 8671 T1715 oascc.ZkStateReader.updateClusterState Updating cloud state from ZooKeeper... 
[junit4:junit4]   2> 8684 T1740 oascc.ZkStateReader$2.process A cluster state change has occurred - updating...
[junit4:junit4]   2> 8684 T1714 oascc.ZkStateReader$2.process A cluster state change has occurred - updating...
[junit4:junit4]   2> 8684 T1728 oascc.ZkStateReader$2.process A cluster state change has occurred - updating...
[junit4:junit4]   2> 8684 T1752 oascc.ZkStateReader$2.process A cluster state change has occurred - updating...
[junit4:junit4]   2> 8842 T1694 oasc.CoreContainer.register registering core: collection1
[junit4:junit4]   2> 8842 T1694 oasc.ZkController.register Register shard - core:collection1 address:http://127.0.0.1:27218/solr shardId:shard1
[junit4:junit4]   2> 8844 T1694 oasc.ZkController.register We are http://127.0.0.1:27218/solr/collection1/ and leader is http://127.0.0.1:27209/solr/collection1/
[junit4:junit4]   2> 8845 T1694 oasc.ZkController.register No LogReplay needed for core=collection1 baseURL=http://127.0.0.1:27218/solr
[junit4:junit4]   2> 8845 T1694 oasc.ZkController.checkRecovery Core needs to recover:collection1
[junit4:junit4]   2> 8845 T1694 oasu.DefaultSolrCoreState.doRecovery Running recovery - first canceling any ongoing recovery
[junit4:junit4]   2> ASYNC  NEW_CORE C180 name=collection1 org.apache.solr.core.SolrCore@69f938a8 url=http://127.0.0.1:27218/solr/collection1 node=127.0.0.1:27218_solr
[junit4:junit4]   2> 8847 T1754 C180 P27218 oasc.RecoveryStrategy.run Starting recovery process.  core=collection1 recoveringAfterStartup=true
[junit4:junit4]   2> 8847 T1694 oascc.ZkStateReader.updateClusterState Updating cloud state from ZooKeeper... 
[junit4:junit4]   2> 8847 T1754 C180 P27218 oasc.RecoveryStrategy.doRecovery ###### startupVersions=[]
[junit4:junit4]   2> 8848 T1694 oass.SolrDispatchFilter.init user.dir=/usr/home/hudson/hudson-slave/workspace/Lucene-Solr-Tests-trunk-Java6/solr/build/solr-core/test/J0
[junit4:junit4]   2> 8848 T1694 oass.SolrDispatchFilter.init SolrDispatchFilter.init() done
[junit4:junit4]   2> 8848 T1754 C180 P27218 oasc.RecoveryStrategy.doRecovery Attempting to PeerSync from http://127.0.0.1:27209/solr/collection1/ core=collection1 - recoveringAfterStartup=true
[junit4:junit4]   2> 8848 T1694 oascsi.HttpClientUtil.createClient Creating new http client, config:maxConnections=128&maxConnectionsPerHost=32&followRedirects=false
[junit4:junit4]   2> 8848 T1754 C180 P27218 oasu.PeerSync.sync PeerSync: core=collection1 url=http://127.0.0.1:27218/solr START replicas=[http://127.0.0.1:27209/solr/collection1/] nUpdates=100
[junit4:junit4]   2> 8849 T1754 C180 P27218 oasu.PeerSync.sync WARNING no frame of reference to tell of we've missed updates
[junit4:junit4]   2> 8849 T1754 C180 P27218 oasc.RecoveryStrategy.doRecovery PeerSync Recovery was not successful - trying replication. core=collection1
[junit4:junit4]   2> 8849 T1754 C180 P27218 oasc.RecoveryStrategy.doRecovery Starting Replication Recovery. core=collection1
[junit4:junit4]   2> 8849 T1754 C180 P27218 oascsi.HttpClientUtil.createClient Creating new http client, config:maxConnections=128&maxConnectionsPerHost=32&followRedirects=false
[junit4:junit4]   2> ASYNC  NEW_CORE C181 name=collection1 org.apache.solr.core.SolrCore@435028a url=http://127.0.0.1:27209/solr/collection1 node=127.0.0.1:27209_solr
[junit4:junit4]   2> 8859 T1720 C181 P27209 REQ /get {distrib=false&qt=/get&wt=javabin&version=2&getVersions=100} status=0 QTime=0 
[junit4:junit4]   2> 9162 T1694 oejs.Server.doStart jetty-8.1.2.v20120308
[junit4:junit4]   2> 9165 T1694 oejs.AbstractConnector.doStart Started SocketConnector@0.0.0.0:27225
[junit4:junit4]   2> 9165 T1694 oasc.SolrResourceLoader.locateSolrHome JNDI not configured for solr (NoInitialContextEx)
[junit4:junit4]   2> 9166 T1694 oasc.SolrResourceLoader.locateSolrHome using system property solr.solr.home: /usr/home/hudson/hudson-slave/workspace/Lucene-Solr-Tests-trunk-Java6/solr/build/solr-core/test/J0/./solrtest-jetty4-1347907248585
[junit4:junit4]   2> 9166 T1694 oasc.SolrResourceLoader.<init> new SolrResourceLoader for deduced Solr Home: '/usr/home/hudson/hudson-slave/workspace/Lucene-Solr-Tests-trunk-Java6/solr/build/solr-core/test/J0/./solrtest-jetty4-1347907248585/'
[junit4:junit4]   2> 9187 T1715 oascc.ZkStateReader.updateClusterState Updating cloud state from ZooKeeper... 
[junit4:junit4]   2> 9190 T1694 oass.SolrDispatchFilter.init SolrDispatchFilter.init()
[junit4:junit4]   2> 9190 T1694 oasc.SolrResourceLoader.locateSolrHome JNDI not configured for solr (NoInitialContextEx)
[junit4:junit4]   2> 9190 T1694 oasc.SolrResourceLoader.locateSolrHome using system property solr.solr.home: /usr/home/hudson/hudson-slave/workspace/Lucene-Solr-Tests-trunk-Java6/solr/build/solr-core/test/J0/./solrtest-jetty4-1347907248585
[junit4:junit4]   2> 9191 T1694 oasc.CoreContainer$Initializer.initialize looking for solr.xml: /usr/home/hudson/hudson-slave/workspace/Lucene-Solr-Tests-trunk-Java6/solr/build/solr-core/test/J0/./solrtest-jetty4-1347907248585/solr.xml
[junit4:junit4]   2> 9191 T1694 oasc.CoreContainer.<init> New CoreContainer 2129914075
[junit4:junit4]   2> 9191 T1694 oasc.CoreContainer.load Loading CoreContainer using Solr Home: '/usr/home/hudson/hudson-slave/workspace/Lucene-Solr-Tests-trunk-Java6/solr/build/solr-core/test/J0/./solrtest-jetty4-1347907248585/'
[junit4:junit4]   2> 9192 T1694 oasc.SolrResourceLoader.<init> new SolrResourceLoader for directory: '/usr/home/hudson/hudson-slave/workspace/Lucene-Solr-Tests-trunk-Java6/solr/build/solr-core/test/J0/./solrtest-jetty4-1347907248585/'
[junit4:junit4]   2> 9200 T1740 oascc.ZkStateReader$2.process A cluster state change has occurred - updating...
[junit4:junit4]   2> 9200 T1728 oascc.ZkStateReader$2.process A cluster state change has occurred - updating...
[junit4:junit4]   2> 9200 T1752 oascc.ZkStateReader$2.process A cluster state change has occurred - updating...
[junit4:junit4]   2> 9200 T1714 oascc.ZkStateReader$2.process A cluster state change has occurred - updating...
[junit4:junit4]   2> 9209 T1694 oasc.CoreContainer.load Registering Log Listener
[junit4:junit4]   2> 9219 T1694 oasc.CoreContainer.initZooKeeper Zookeeper client=127.0.0.1:27198/solr
[junit4:junit4]   2> 9220 T1694 oaz.ZooKeeper.<init> Initiating client connection, connectString=127.0.0.1:27198/solr sessionTimeout=5000 watcher=org.apache.solr.common.cloud.ConnectionManager@2e24cb85
[junit4:junit4]   2> 9221 T1765 oaz.ClientCnxn$SendThread.startConnect Opening socket connection to server /127.0.0.1:27198
[junit4:junit4]   2> 9221 T1694 oascc.ConnectionManager.waitForConnected Waiting for client to connect to ZooKeeper
[junit4:junit4]   2> 9221 T1765 oaz.ClientCnxn$SendThread.primeConnection Socket connection established to localhost/127.0.0.1:27198, initiating session
[junit4:junit4]   2> 9221 T1696 oazs.NIOServerCnxn$Factory.run Accepted socket connection from /140.211.11.196:27226
[junit4:junit4]   2> 9222 T1696 oazs.NIOServerCnxn.readConnectRequest Client attempting to establish new session at /140.211.11.196:27226
[junit4:junit4]   2> 9223 T1698 oazs.NIOServerCnxn.finishSessionInit Established session 0x139d5883f320006 with negotiated timeout 5000 for client /140.211.11.196:27226
[junit4:junit4]   2> 9223 T1765 oaz.ClientCnxn$SendThread.readConnectResult Session establishment complete on server localhost/127.0.0.1:27198, sessionid = 0x139d5883f320006, negotiated timeout = 5000
[junit4:junit4]   2> 9224 T1766 oascc.ConnectionManager.process Watcher org.apache.solr.common.cloud.ConnectionManager@2e24cb85 name:ZooKeeperConnection Watcher:127.0.0.1:27198/solr got event WatchedEvent state:SyncConnected type:None path:null path:null type:None
[junit4:junit4]   2> 9224 T1694 oascc.ConnectionManager.waitForConnected Client is connected to ZooKeeper
[junit4:junit4]   2> 9224 T1699 oazs.PrepRequestProcessor.pRequest Got user-level KeeperException when processing sessionid:0x139d5883f320006 type:create cxid:0x1 zxid:0xfffffffffffffffe txntype:unknown reqpath:n/a Error Path:/solr/overseer Error:KeeperErrorCode = NodeExists for /solr/overseer
[junit4:junit4]   2> 9225 T1699 oazs.PrepRequestProcessor.pRequest Got user-level KeeperException when processing sessionid:0x139d5883f320006 type:create cxid:0x2 zxid:0xfffffffffffffffe txntype:unknown reqpath:n/a Error Path:/solr/overseer Error:KeeperErrorCode = NodeExists for /solr/overseer
[junit4:junit4]   2> 9234 T1694 oasc.ZkController.createEphemeralLiveNode Register node as live in ZooKeeper:/live_nodes/127.0.0.1:27225_solr
[junit4:junit4]   2> 9235 T1699 oazs.PrepRequestProcessor.pRequest Got user-level KeeperException when processing sessionid:0x139d5883f320006 type:delete cxid:0x4 zxid:0xfffffffffffffffe txntype:unknown reqpath:n/a Error Path:/solr/live_nodes/127.0.0.1:27225_solr Error:KeeperErrorCode = NoNode for /solr/live_nodes/127.0.0.1:27225_solr
[junit4:junit4]   2> 9235 T1694 oascc.SolrZkClient.makePath makePath: /live_nodes/127.0.0.1:27225_solr
[junit4:junit4]   2> 9238 T1728 oascc.ZkStateReader$3.process Updating live nodes
[junit4:junit4]   2> 9238 T1714 oascc.ZkStateReader$3.process Updating live nodes
[junit4:junit4]   2> 9238 T1740 oascc.ZkStateReader$3.process Updating live nodes
[junit4:junit4]   2> 9238 T1752 oascc.ZkStateReader$3.process Updating live nodes
[junit4:junit4]   2> 9238 T1694 oashc.HttpShardHandlerFactory.getParameter Setting socketTimeout to: 0
[junit4:junit4]   2> 9239 T1694 oashc.HttpShardHandlerFactory.getParameter Setting urlScheme to: http://
[junit4:junit4]   2> 9239 T1694 oashc.HttpShardHandlerFactory.getParameter Setting connTimeout to: 0
[junit4:junit4]   2> 9239 T1694 oashc.HttpShardHandlerFactory.getParameter Setting maxConnectionsPerHost to: 20
[junit4:junit4]   2> 9240 T1694 oashc.HttpShardHandlerFactory.getParameter Setting corePoolSize to: 0
[junit4:junit4]   2> 9240 T1694 oashc.HttpShardHandlerFactory.getParameter Setting maximumPoolSize to: 2147483647
[junit4:junit4]   2> 9241 T1694 oashc.HttpShardHandlerFactory.getParameter Setting maxThreadIdleTime to: 5
[junit4:junit4]   2> 9241 T1694 oashc.HttpShardHandlerFactory.getParameter Setting sizeOfQueue to: -1
[junit4:junit4]   2> 9241 T1694 oashc.HttpShardHandlerFactory.getParameter Setting fairnessPolicy to: false
[junit4:junit4]   2> 9242 T1694 oascsi.HttpClientUtil.createClient Creating new http client, config:maxConnectionsPerHost=20&maxConnections=10000&socketTimeout=0&connTimeout=0&retry=false
[junit4:junit4]   2> 9255 T1694 oascc.ZkStateReader.createClusterStateWatchersAndUpdate Updating cluster state from ZooKeeper... 
[junit4:junit4]   2> 9260 T1694 oasc.CoreContainer.create Creating SolrCore 'collection1' using instanceDir: /usr/home/hudson/hudson-slave/workspace/Lucene-Solr-Tests-trunk-Java6/solr/build/solr-core/test/J0/./solrtest-jetty4-1347907248585/collection1
[junit4:junit4]   2> 9261 T1694 oasc.ZkController.createCollectionZkNode Check for collection zkNode:collection1
[junit4:junit4]   2> 9261 T1694 oasc.ZkController.createCollectionZkNode Collection zkNode exists
[junit4:junit4]   2> 9262 T1694 oasc.ZkController.readConfigName Load collection config from:/collections/collection1
[junit4:junit4]   2> 9263 T1694 oasc.SolrResourceLoader.<init> new SolrResourceLoader for directory: '/usr/home/hudson/hudson-slave/workspace/Lucene-Solr-Tests-trunk-Java6/solr/build/solr-core/test/J0/./solrtest-jetty4-1347907248585/collection1/'
[junit4:junit4]   2> 9264 T1694 oasc.SolrResourceLoader.replaceClassLoader Adding 'file:/usr/home/hudson/hudson-slave/workspace/Lucene-Solr-Tests-trunk-Java6/solr/build/solr-core/test/J0/solrtest-jetty4-1347907248585/collection1/lib/README' to classloader
[junit4:junit4]   2> 9264 T1694 oasc.SolrResourceLoader.replaceClassLoader Adding 'file:/usr/home/hudson/hudson-slave/workspace/Lucene-Solr-Tests-trunk-Java6/solr/build/solr-core/test/J0/solrtest-jetty4-1347907248585/collection1/lib/classes/' to classloader
[junit4:junit4]   2> 9307 T1694 oasc.SolrConfig.<init> Using Lucene MatchVersion: LUCENE_50
[junit4:junit4]   2> 9366 T1694 oasc.SolrConfig.<init> Loaded SolrConfig: solrconfig.xml
[junit4:junit4]   2> 9467 T1694 oass.IndexSchema.readSchema Reading Solr Schema
[junit4:junit4]   2> 9472 T1694 oass.IndexSchema.readSchema Schema name=test
[junit4:junit4]   2> 10067 T1694 oass.OpenExchangeRatesOrgProvider.init Initialized with rates=open-exchange-rates.json, refreshInterval=1440.
[junit4:junit4]   2> 10079 T1694 oass.IndexSchema.readSchema default search field in schema is text
[junit4:junit4]   2> 10084 T1694 oass.IndexSchema.readSchema unique key field: id
[junit4:junit4]   2> 10094 T1694 oass.FileExchangeRateProvider.reload Reloading exchange rates from file currency.xml
[junit4:junit4]   2> 10099 T1694 oass.FileExchangeRateProvider.reload Reloading exchange rates from file currency.xml
[junit4:junit4]   2> 10104 T1694 oass.OpenExchangeRatesOrgProvider.reload Reloading exchange rates from open-exchange-rates.json
[junit4:junit4]   2> 10105 T1694 oass.OpenExchangeRatesOrgProvider.reload Reloading exchange rates from open-exchange-rates.json
[junit4:junit4]   2> 10106 T1694 oasc.SolrCore.<init> [collection1] Opening new SolrCore at /usr/home/hudson/hudson-slave/workspace/Lucene-Solr-Tests-trunk-Java6/solr/build/solr-core/test/J0/./solrtest-jetty4-1347907248585/collection1/, dataDir=./org.apache.solr.cloud.BasicDistributedZk2Test-1347907239725/jetty4/
[junit4:junit4]   2> 10106 T1694 oasc.JmxMonitoredMap.<init> JMX monitoring is enabled. Adding Solr mbeans to JMX Server: com.sun.jmx.mbeanserver.JmxMBeanServer@bdccedd
[junit4:junit4]   2> 10108 T1694 oasc.SolrCore.getNewIndexDir WARNING New index directory detected: old=null new=./org.apache.solr.cloud.BasicDistributedZk2Test-1347907239725/jetty4/index/
[junit4:junit4]   2> 10108 T1694 oasc.SolrCore.initIndex WARNING [collection1] Solr index directory './org.apache.solr.cloud.BasicDistributedZk2Test-1347907239725/jetty4/index' doesn't exist. Creating new index...
[junit4:junit4]   2> 10109 T1694 oasc.CachingDirectoryFactory.get return new directory for /usr/home/hudson/hudson-slave/workspace/Lucene-Solr-Tests-trunk-Java6/solr/build/solr-core/test/J0/./org.apache.solr.cloud.BasicDistributedZk2Test-1347907239725/jetty4/index forceNew:false
[junit4:junit4]   2> 10116 T1694 oasc.SolrDeletionPolicy.onCommit SolrDeletionPolicy.onCommit: commits:num=1
[junit4:junit4]   2> 		commit{dir=NRTCachingDirectory(org.apache.lucene.store.NIOFSDirectory@/usr/home/hudson/hudson-slave/workspace/Lucene-Solr-Tests-trunk-Java6/solr/build/solr-core/test/J0/org.apache.solr.cloud.BasicDistributedZk2Test-1347907239725/jetty4/index lockFactory=org.apache.lucene.store.NativeFSLockFactory@419e4f14; maxCacheMB=48.0 maxMergeSizeMB=4.0),segFN=segments_1,generation=1,filenames=[segments_1]
[junit4:junit4]   2> 10117 T1694 oasc.SolrDeletionPolicy.updateCommits newest commit = 1
[junit4:junit4]   2> 10118 T1694 oasc.SolrCore.initWriters created xml: solr.XMLResponseWriter
[junit4:junit4]   2> 10120 T1694 oasup.UpdateRequestProcessorChain.init inserting DistributedUpdateProcessorFactory into updateRequestProcessorChain "dedupe"
[junit4:junit4]   2> 10121 T1694 oasup.UpdateRequestProcessorChain.init inserting DistributedUpdateProcessorFactory into updateRequestProcessorChain "dedupe-allfields"
[junit4:junit4]   2> 10121 T1694 oasup.UpdateRequestProcessorChain.init inserting DistributedUpdateProcessorFactory into updateRequestProcessorChain "stored_sig"
[junit4:junit4]   2> 10122 T1694 oasup.UpdateRequestProcessorChain.init inserting DistributedUpdateProcessorFactory into updateRequestProcessorChain "uniq-fields"
[junit4:junit4]   2> 10123 T1694 oasup.UpdateRequestProcessorChain.init inserting DistributedUpdateProcessorFactory into updateRequestProcessorChain "distrib-dup-test-chain-implicit"
[junit4:junit4]   2> 10123 T1694 oasc.RequestHandlers.initHandlersFromConfig adding lazy requestHandler: solr.ReplicationHandler
[junit4:junit4]   2> 10124 T1694 oasc.RequestHandlers.initHandlersFromConfig created /replication: solr.ReplicationHandler
[junit4:junit4]   2> 10124 T1694 oasc.RequestHandlers.initHandlersFromConfig created standard: solr.StandardRequestHandler
[junit4:junit4]   2> 10125 T1694 oasc.RequestHandlers.initHandlersFromConfig created /get: solr.RealTimeGetHandler
[junit4:junit4]   2> 10126 T1694 oasc.RequestHandlers.initHandlersFromConfig created dismax: solr.SearchHandler
[junit4:junit4]   2> 10127 T1694 oasc.RequestHandlers.initHandlersFromConfig created mock: org.apache.solr.core.MockQuerySenderListenerReqHandler
[junit4:junit4]   2> 10127 T1694 oasc.RequestHandlers.initHandlersFromConfig created /admin/: org.apache.solr.handler.admin.AdminHandlers
[junit4:junit4]   2> 10128 T1694 oasc.RequestHandlers.initHandlersFromConfig created defaults: solr.StandardRequestHandler
[junit4:junit4]   2> 10128 T1694 oasc.RequestHandlers.initHandlersFromConfig adding lazy requestHandler: solr.StandardRequestHandler
[junit4:junit4]   2> 10129 T1694 oasc.RequestHandlers.initHandlersFromConfig created lazy: solr.StandardRequestHandler
[junit4:junit4]   2> 10130 T1694 oasc.RequestHandlers.initHandlersFromConfig created /update: solr.UpdateRequestHandler
[junit4:junit4]   2> 10130 T1694 oasc.RequestHandlers.initHandlersFromConfig created /terms: org.apache.solr.handler.component.SearchHandler
[junit4:junit4]   2> 10131 T1694 oasc.RequestHandlers.initHandlersFromConfig created spellCheckCompRH: org.apache.solr.handler.component.SearchHandler
[junit4:junit4]   2> 10132 T1694 oasc.RequestHandlers.initHandlersFromConfig created spellCheckCompRH_Direct: org.apache.solr.handler.component.SearchHandler
[junit4:junit4]   2> 10133 T1694 oasc.RequestHandlers.initHandlersFromConfig created spellCheckWithWordbreak: org.apache.solr.handler.component.SearchHandler
[junit4:junit4]   2> 10133 T1694 oasc.RequestHandlers.initHandlersFromConfig created spellCheckWithWordbreak_Direct: org.apache.solr.handler.component.SearchHandler
[junit4:junit4]   2> 10134 T1694 oasc.RequestHandlers.initHandlersFromConfig created spellCheckCompRH1: org.apache.solr.handler.component.SearchHandler
[junit4:junit4]   2> 10135 T1694 oasc.RequestHandlers.initHandlersFromConfig created tvrh: org.apache.solr.handler.component.SearchHandler
[junit4:junit4]   2> 10135 T1694 oasc.RequestHandlers.initHandlersFromConfig created /mlt: solr.MoreLikeThisHandler
[junit4:junit4]   2> 10136 T1694 oasc.RequestHandlers.initHandlersFromConfig created /debug/dump: solr.DumpRequestHandler
[junit4:junit4]   2> 10140 T1694 oashl.XMLLoader.init xsltCacheLifetimeSeconds=60
[junit4:junit4]   2> 10145 T1694 oasc.SolrCore.initDeprecatedSupport WARNING solrconfig.xml uses deprecated <admin/gettableFiles>, Please update your config to use the ShowFileRequestHandler.
[junit4:junit4]   2> 10146 T1694 oasc.SolrCore.initDeprecatedSupport WARNING adding ShowFileRequestHandler with hidden files: [SCHEMA.XML, OLD_SYNONYMS.TXT, STOPWORDS.TXT, PROTWORDS.TXT, OPEN-EXCHANGE-RATES.JSON, SYNONYMS.TXT, CURRENCY.XML, MAPPING-ISOLATIN1ACCENT.TXT]
[junit4:junit4]   2> 10150 T1694 oass.SolrIndexSearcher.<init> Opening Searcher@2ff529dc main
[junit4:junit4]   2> 10152 T1694 oasu.CommitTracker.<init> Hard AutoCommit: disabled
[junit4:junit4]   2> 10152 T1694 oasu.CommitTracker.<init> Soft AutoCommit: disabled
[junit4:junit4]   2> 10153 T1694 oashc.SpellCheckComponent.inform Initializing spell checkers
[junit4:junit4]   2> 10160 T1694 oass.DirectSolrSpellChecker.init init: {name=direct,classname=DirectSolrSpellChecker,field=lowerfilt,minQueryLength=3}
[junit4:junit4]   2> 10211 T1767 oasc.SolrCore.registerSearcher [collection1] Registered new searcher Searcher@2ff529dc main{StandardDirectoryReader(segments_1:1)}
[junit4:junit4]   2> 10707 T1715 oascc.ZkStateReader.updateClusterState Updating cloud state from ZooKeeper... 
[junit4:junit4]   2> 10712 T1740 oascc.ZkStateReader$2.process A cluster state change has occurred - updating...
[junit4:junit4]   2> 10712 T1728 oascc.ZkStateReader$2.process A cluster state change has occurred - updating...
[junit4:junit4]   2> 10712 T1714 oascc.ZkStateReader$2.process A cluster state change has occurred - updating...
[junit4:junit4]   2> 10712 T1752 oascc.ZkStateReader$2.process A cluster state change has occurred - updating...
[junit4:junit4]   2> 10712 T1766 oascc.ZkStateReader$2.process A cluster state change has occurred - updating...
[junit4:junit4]   2> 10718 T1694 oasc.CoreContainer.register registering core: collection1
[junit4:junit4]   2> 10718 T1694 oasc.ZkController.register Register shard - core:collection1 address:http://127.0.0.1:27225/solr shardId:shard2
[junit4:junit4]   2> 10721 T1694 oasc.ZkController.register We are http://127.0.0.1:27225/solr/collection1/ and leader is http://127.0.0.1:27215/solr/collection1/
[junit4:junit4]   2> 10721 T1694 oasc.ZkController.register No LogReplay needed for core=collection1 baseURL=http://127.0.0.1:27225/solr
[junit4:junit4]   2> 10722 T1694 oasc.ZkController.checkRecovery Core needs to recover:collection1
[junit4:junit4]   2> 10722 T1694 oasu.DefaultSolrCoreState.doRecovery Running recovery - first canceling any ongoing recovery
[junit4:junit4]   2> ASYNC  NEW_CORE C182 name=collection1 org.apache.solr.core.SolrCore@10d5be1f url=http://127.0.0.1:27225/solr/collection1 node=127.0.0.1:27225_solr
[junit4:junit4]   2> 10723 T1768 C182 P27225 oasc.RecoveryStrategy.run Starting recovery process.  core=collection1 recoveringAfterStartup=true
[junit4:junit4]   2> 10723 T1768 C182 P27225 oasc.RecoveryStrategy.doRecovery ###### startupVersions=[]
[junit4:junit4]   2> 10723 T1694 oascc.ZkStateReader.updateClusterState Updating cloud state from ZooKeeper... 
[junit4:junit4]   2> 10724 T1768 C182 P27225 oasc.RecoveryStrategy.doRecovery Attempting to PeerSync from http://127.0.0.1:27215/solr/collection1/ core=collection1 - recoveringAfterStartup=true
[junit4:junit4]   2> 10725 T1768 C182 P27225 oasu.PeerSync.sync PeerSync: core=collection1 url=http://127.0.0.1:27225/solr START replicas=[http://127.0.0.1:27215/solr/collection1/] nUpdates=100
[junit4:junit4]   2> 10725 T1694 oass.SolrDispatchFilter.init user.dir=/usr/home/hudson/hudson-slave/workspace/Lucene-Solr-Tests-trunk-Java6/solr/build/solr-core/test/J0
[junit4:junit4]   2> 10725 T1768 C182 P27225 oasu.PeerSync.sync WARNING no frame of reference to tell of we've missed updates
[junit4:junit4]   2> 10725 T1694 oass.SolrDispatchFilter.init SolrDispatchFilter.init() done
[junit4:junit4]   2> 10725 T1768 C182 P27225 oasc.RecoveryStrategy.doRecovery PeerSync Recovery was not successful - trying replication. core=collection1
[junit4:junit4]   2> 10726 T1768 C182 P27225 oasc.RecoveryStrategy.doRecovery Starting Replication Recovery. core=collection1
[junit4:junit4]   2> 10726 T1694 oascsi.HttpClientUtil.createClient Creating new http client, config:maxConnections=128&maxConnectionsPerHost=32&followRedirects=false
[junit4:junit4]   2> 10726 T1768 C182 P27225 oascsi.HttpClientUtil.createClient Creating new http client, config:maxConnections=128&maxConnectionsPerHost=32&followRedirects=false
[junit4:junit4]   2> ASYNC  NEW_CORE C183 name=collection1 org.apache.solr.core.SolrCore@42ccce07 url=http://127.0.0.1:27215/solr/collection1 node=127.0.0.1:27215_solr
[junit4:junit4]   2> 10732 T1732 C183 P27215 REQ /get {distrib=false&qt=/get&wt=javabin&version=2&getVersions=100} status=0 QTime=0 
[junit4:junit4]   2> 10741 T1694 oaz.ZooKeeper.<init> Initiating client connection, connectString=127.0.0.1:27198/solr sessionTimeout=10000 watcher=org.apache.solr.common.cloud.ConnectionManager@1ffbffde
[junit4:junit4]   2> 10742 T1770 oaz.ClientCnxn$SendThread.startConnect Opening socket connection to server /127.0.0.1:27198
[junit4:junit4]   2> 10742 T1694 oascc.ConnectionManager.waitForConnected Waiting for client to connect to ZooKeeper
[junit4:junit4]   2> 10743 T1770 oaz.ClientCnxn$SendThread.primeConnection Socket connection established to localhost/127.0.0.1:27198, initiating session
[junit4:junit4]   2> 10743 T1696 oazs.NIOServerCnxn$Factory.run Accepted socket connection from /140.211.11.196:27233
[junit4:junit4]   2> 10743 T1696 oazs.NIOServerCnxn.readConnectRequest Client attempting to establish new session at /140.211.11.196:27233
[junit4:junit4]   2> 10744 T1698 oazs.NIOServerCnxn.finishSessionInit Established session 0x139d5883f320007 with negotiated timeout 10000 for client /140.211.11.196:27233
[junit4:junit4]   2> 10744 T1770 oaz.ClientCnxn$SendThread.readConnectResult Session establishment complete on server localhost/127.0.0.1:27198, sessionid = 0x139d5883f320007, negotiated timeout = 10000
[junit4:junit4]   2> 10745 T1771 oascc.ConnectionManager.process Watcher org.apache.solr.common.cloud.ConnectionManager@1ffbffde name:ZooKeeperConnection Watcher:127.0.0.1:27198/solr got event WatchedEvent state:SyncConnected type:None path:null path:null type:None
[junit4:junit4]   2> 10745 T1694 oascc.ConnectionManager.waitForConnected Client is connected to ZooKeeper
[junit4:junit4]   2> 10746 T1694 oascc.ZkStateReader.createClusterStateWatchersAndUpdate Updating cluster state from ZooKeeper... 
[junit4:junit4]   2> 10747 T1694 oasc.ChaosMonkey.monkeyLog monkey: init - expire sessions:true cause connection loss:true
[junit4:junit4]   2> 10748 T1694 oascsi.HttpClientUtil.createClient Creating new http client, config:
[junit4:junit4]   2> 10757 T1694 oascc.ZkStateReader.updateClusterState Updating cloud state from ZooKeeper... 
[junit4:junit4]   2> ASYNC  NEW_CORE C184 name=collection1 org.apache.solr.core.SolrCore@71a2524f url=http://127.0.0.1:27201/solr/collection1 node=127.0.0.1:27201_solr
[junit4:junit4]   2> 10769 T1706 C184 P27201 oasc.SolrDeletionPolicy.onInit SolrDeletionPolicy.onInit: commits:num=1
[junit4:junit4]   2> 		commit{dir=NRTCachingDirectory(org.apache.lucene.store.NIOFSDirectory@/usr/home/hudson/hudson-slave/workspace/Lucene-Solr-Tests-trunk-Java6/solr/build/solr-core/test/J0/org.apache.solr.cloud.BasicDistributedZk2Test-1347907239725/control/data/index lockFactory=org.apache.lucene.store.NativeFSLockFactory@c767c97; maxCacheMB=48.0 maxMergeSizeMB=4.0),segFN=segments_1,generation=1,filenames=[segments_1]
[junit4:junit4]   2> 10770 T1706 C184 P27201 oasc.SolrDeletionPolicy.updateCommits newest commit = 1
[junit4:junit4]   2> 10774 T1706 C184 P27201 /update {wt=javabin&version=2} {add=[1 (1413383193085607936)]} 0 9
[junit4:junit4]   2> 10775 T1694 oaz.ZooKeeper.<init> Initiating client connection, connectString=127.0.0.1:27198/solr sessionTimeout=10000 watcher=org.apache.solr.common.cloud.ConnectionManager@7a7a641f
[junit4:junit4]   2> 10776 T1772 oaz.ClientCnxn$SendThread.startConnect Opening socket connection to server /127.0.0.1:27198
[junit4:junit4]   2> 10776 T1694 oascc.ConnectionManager.waitForConnected Waiting for client to connect to ZooKeeper
[junit4:junit4]   2> 10776 T1772 oaz.ClientCnxn$SendThread.primeConnection Socket connection established to localhost/127.0.0.1:27198, initiating session
[junit4:junit4]   2> 10777 T1696 oazs.NIOServerCnxn$Factory.run Accepted socket connection from /140.211.11.196:27235
[junit4:junit4]   2> 10777 T1696 oazs.NIOServerCnxn.readConnectRequest Client attempting to establish new session at /140.211.11.196:27235
[junit4:junit4]   2> 10784 T1698 oazs.NIOServerCnxn.finishSessionInit Established session 0x139d5883f320008 with negotiated timeout 10000 for client /140.211.11.196:27235
[junit4:junit4]   2> 10784 T1772 oaz.ClientCnxn$SendThread.readConnectResult Session establishment complete on server localhost/127.0.0.1:27198, sessionid = 0x139d5883f320008, negotiated timeout = 10000
[junit4:junit4]   2> 10784 T1773 oascc.ConnectionManager.process Watcher org.apache.solr.common.cloud.ConnectionManager@7a7a641f name:ZooKeeperConnection Watcher:127.0.0.1:27198/solr got event WatchedEvent state:SyncConnected type:None path:null path:null type:None
[junit4:junit4]   2> 10784 T1694 oascc.ConnectionManager.waitForConnected Client is connected to ZooKeeper
[junit4:junit4]   2> 10785 T1694 oascc.ZkStateReader.createClusterStateWatchersAndUpdate Updating cluster state from ZooKeeper... 
[junit4:junit4]   2> 10792 T1722 C181 P27209 oasc.SolrDeletionPolicy.onInit SolrDeletionPolicy.onInit: commits:num=1
[junit4:junit4]   2> 		commit{dir=NRTCachingDirectory(org.apache.lucene.store.NIOFSDirectory@/usr/home/hudson/hudson-slave/workspace/Lucene-Solr-Tests-trunk-Java6/solr/build/solr-core/test/J0/org.apache.solr.cloud.BasicDistributedZk2Test-1347907239725/jetty1/index lockFactory=org.apache.lucene.store.NativeFSLockFactory@3e50db26; maxCacheMB=48.0 maxMergeSizeMB=4.0),segFN=segments_1,generation=1,filenames=[segments_1]
[junit4:junit4]   2> 10793 T1722 C181 P27209 oasc.SolrDeletionPolicy.updateCommits newest commit = 1
[junit4:junit4]   2>  C180_STATE=coll:collection1 core:collection1 props:{shard=shard1, roles=null, state=recovering, core=collection1, collection=collection1, node_name=127.0.0.1:27218_solr, base_url=http://127.0.0.1:27218/solr}
[junit4:junit4]   2> 10811 T1744 C180 P27218 oasc.SolrDeletionPolicy.onInit SolrDeletionPolicy.onInit: commits:num=1
[junit4:junit4]   2> 		commit{dir=NRTCachingDirectory(org.apache.lucene.store.NIOFSDirectory@/usr/home/hudson/hudson-slave/workspace/Lucene-Solr-Tests-trunk-Java6/solr/build/solr-core/test/J0/org.apache.solr.cloud.BasicDistributedZk2Test-1347907239725/jetty3/index lockFactory=org.apache.lucene.store.NativeFSLockFactory@60edfdb8; maxCacheMB=48.0 maxMergeSizeMB=4.0),segFN=segments_1,generation=1,filenames=[segments_1]
[junit4:junit4]   2> 10812 T1744 C180 P27218 oasc.SolrDeletionPolicy.updateCommits newest commit = 1
[junit4:junit4]   2> 10816 T1744 C180 P27218 REQ /update {distrib.from=http://127.0.0.1:27209/solr/collection1/&update.distrib=FROMLEADER&wt=javabin&version=2} status=0 QTime=9 
[junit4:junit4]   2> 10816 T1722 C181 P27209 /update {wt=javabin&version=2} {add=[1 (1413383193109725184)]} 0 28
[junit4:junit4]   2> 10817 T1694 oasc.AbstractDistribZkTestBase.waitForRecoveriesToFinish Wait for recoveries to finish - collection: collection1 failOnTimeout:true timeout (sec):1800
[junit4:junit4]   2> 10818 T1694 oascc.ZkStateReader.updateClusterState Updating cloud state from ZooKeeper... 
[junit4:junit4]   2> 11217 T1715 oascc.ZkStateReader.updateClusterState Updating cloud state from ZooKeeper... 
[junit4:junit4]   2> 11272 T1752 oascc.ZkStateReader$2.process A cluster state change has occurred - updating...
[junit4:junit4]   2> 11272 T1740 oascc.ZkStateReader$2.process A cluster state change has occurred - updating...
[junit4:junit4]   2> 11272 T1766 oascc.ZkStateReader$2.process A cluster state change has occurred - updating...
[junit4:junit4]   2> 11272 T1714 oascc.ZkStateReader$2.process A cluster state change has occurred - updating...
[junit4:junit4]   2> 11272 T1773 oascc.ZkStateReader$2.process A cluster state change has occurred - updating...
[junit4:junit4]   2> 11272 T1771 oascc.ZkStateReader$2.process A cluster state change has occurred - updating...
[junit4:junit4]   2> 11272 T1728 oascc.ZkStateReader$2.process A cluster state change has occurred - updating...
[junit4:junit4]   2> 11820 T1694 oascc.ZkStateReader.updateClusterState Updating cloud state from ZooKeeper... 
[junit4:junit4]   2> 11867 T1754 C180 P27218 oasc.RecoveryStrategy.doRecovery Begin buffering updates. core=collection1
[junit4:junit4]   2> 11867 T1754 C180 P27218 oasu.UpdateLog.bufferUpdates Starting to buffer updates. FSUpdateLog{state=ACTIVE, tlog=tlog{file=./org.apache.solr.cloud.BasicDistributedZk2Test-1347907239725/jetty3/tlog/tlog.0000000000000000000 refcount=1}}
[junit4:junit4]   2> 11867 T1754 C180 P27218 oasc.RecoveryStrategy.replicate Attempting to replicate from http://127.0.0.1:27209/solr/collection1/. core=collection1
[junit4:junit4]   2> 11867 T1754 C180 P27218 oascsi.HttpClientUtil.createClient Creating new http client, config:maxConnections=128&maxConnectionsPerHost=32&followRedirects=false
[junit4:junit4]   2> 11886 T1723 C181 P27209 oasu.DirectUpdateHandler2.commit start commit{flags=0,_version_=0,optimize=false,openSearcher=true,waitSearcher=true,expungeDeletes=false,softCommit=false}
[junit4:junit4]   2> 11985 T1723 C181 P27209 oasc.SolrDeletionPolicy.onCommit SolrDeletionPolicy.onCommit: commits:num=2
[junit4:junit4]   2> 		commit{dir=NRTCachingDirectory(org.apache.lucene.store.NIOFSDirectory@/usr/home/hudson/hudson-slave/workspace/Lucene-Solr-Tests-trunk-Java6/solr/build/solr-core/test/J0/org.apache.solr.cloud.BasicDistributedZk2Test-1347907239725/jetty1/index lockFactory=org.apache.lucene.store.NativeFSLockFactory@3e50db26; maxCacheMB=48.0 maxMergeSizeMB=4.0),segFN=segments_1,generation=1,filenames=[segments_1]
[junit4:junit4]   2> 		commit{dir=NRTCachingDirectory(org.apache.lucene.store.NIOFSDirectory@/usr/home/hudson/hudson-slave/workspace/Lucene-Solr-Tests-trunk-Java6/solr/build/solr-core/test/J0/org.apache.solr.cloud.BasicDistributedZk2Test-1347907239725/jetty1/index lockFactory=org.apache.lucene.store.NativeFSLockFactory@3e50db26; maxCacheMB=48.0 maxMergeSizeMB=4.0),segFN=segments_2,generation=2,filenames=[_0.fnm, _0_Pulsing40_0.tim, _0_Memory_0.ram, _0_MockVariableIntBlock_0.doc, _0_nrm.cfs, _0_MockVariableIntBlock_0.skp, _0_Pulsing40_0.prx, _0_Direct_0.frq, _0_Pulsing40_0.frq, _0_MockVariableIntBlock_0.pyl, _0_MockVariableIntBlock_0.tib, _0_MockVariableIntBlock_0.frq, _0_nrm.cfe, _0_MockVariableIntBlock_0.pos, _0_Pulsing40_0.tip, segments_2, _0_Direct_0.tip, _0.fdx, _0_Direct_0.prx, _0.si, _0_Direct_0.tim, _0_MockVariableIntBlock_0.tii, _0.fdt]
[junit4:junit4]   2> 11986 T1723 C181 P27209 oasc.SolrDeletionPolicy.updateCommits newest commit = 2
[junit4:junit4]   2> 12001 T1723 C181 P27209 oass.SolrIndexSearcher.<init> Opening Searcher@597167d4 main
[junit4:junit4]   2> 12001 T1723 C181 P27209 oasu.DirectUpdateHandler2.commit end_commit_flush
[junit4:junit4]   2> 12002 T1729 oasc.SolrCore.registerSearcher [collection1] Registered new searcher Searcher@597167d4 main{StandardDirectoryReader(segments_2:3 _0(5.0):C1)}
[junit4:junit4]   2> 12003 T1723 C181 P27209 /update {waitSearcher=true&commit=true&commit_end_point=true&wt=javabin&softCommit=false&version=2} {commit=} 0 117
[junit4:junit4]   2> 12004 T1754 C180 P27218 oash.ReplicationHandler.inform Commits will be reserved for  10000
[junit4:junit4]   2> 12004 T1754 C180 P27218 oash.SnapPuller.<init>  No value set for 'pollInterval'. Timer Task not started.
[junit4:junit4]   2> 12006 T1724 C181 P27209 oash.ReplicationHandler.inform Commits will be reserved for  10000
[junit4:junit4]   2> 12006 T1724 C181 P27209 REQ /replication {command=indexversion&wt=javabin&qt=/replication&version=2} status=0 QTime=1 
[junit4:junit4]   2> 12007 T1754 C180 P27218 oash.SnapPuller.fetchLatestIndex Master's generation: 2
[junit4:junit4]   2> 12007 T1754 C180 P27218 oash.SnapPuller.fetchLatestIndex Slave's generation: 1
[junit4:junit4]   2> 12007 T1754 C180 P27218 oash.SnapPuller.fetchLatestIndex Starting replication process
[junit4:junit4]   2> 12011 T1724 C181 P27209 REQ /replication {command=filelist&generation=2&wt=javabin&qt=/replication&version=2} status=0 QTime=2 
[junit4:junit4]   2> 12012 T1754 C180 P27218 oash.SnapPuller.fetchLatestIndex Number of files in latest index in master: 23
[junit4:junit4]   2> 12018 T1754 C180 P27218 oash.SnapPuller.fetchLatestIndex Starting download to ./org.apache.solr.cloud.BasicDistributedZk2Test-1347907239725/jetty3/index.20120917124051733 fullCopy=true
[junit4:junit4]   2> 12021 T1724 C181 P27209 REQ /replication {file=_0_Pulsing40_0.tim&command=filecontent&checksum=true&generation=2&qt=/replication&wt=filestream} status=0 QTime=0 
[junit4:junit4]   2> 12026 T1724 C181 P27209 REQ /replication {file=_0.fnm&command=filecontent&checksum=true&generation=2&qt=/replication&wt=filestream} status=0 QTime=0 
[junit4:junit4]   2> 12030 T1724 C181 P27209 REQ /replication {file=_0_MockVariableIntBlock_0.doc&command=filecontent&checksum=true&generation=2&qt=/replication&wt=filestream} status=0 QTime=0 
[junit4:junit4]   2> 12034 T1724 C181 P27209 REQ /replication {file=_0_Memory_0.ram&command=filecontent&checksum=true&generation=2&qt=/replication&wt=filestream} status=0 QTime=0 
[junit4:junit4]   2> 12038 T1724 C181 P27209 REQ /replication {file=_0_MockVariableIntBlock_0.skp&command=filecontent&checksum=true&generation=2&qt=/replication&wt=filestream} status=0 QTime=0 
[junit4:junit4]   2> 12039 T1754 C180 P27218 oash.SnapPuller$FileFetcher.fetchPackets WARNING No content recieved for file: {name=_0_MockVariableIntBlock_0.skp, lastmodified=1347907251000, size=0}
[junit4:junit4]   2> 12042 T1724 C181 P27209 REQ /replication {file=_0_nrm.cfs&command=filecontent&checksum=true&generation=2&qt=/replication&wt=filestream} status=0 QTime=0 
[junit4:junit4]   2> 12046 T1724 C181 P27209 REQ /replication {file=_0_Direct_0.frq&command=filecontent&checksum=true&generation=2&qt=/replication&wt=filestream} status=0 QTime=0 
[junit4:junit4]   2> 12050 T1724 C181 P27209 REQ /replication {file=_0_Pulsing40_0.prx&command=filecontent&checksum=true&generation=2&qt=/replication&wt=filestream} status=0 QTime=0 
[junit4:junit4]   2> 12054 T1724 C181 P27209 REQ /replication {file=_0_Pulsing40_0.frq&command=filecontent&checksum=true&generation=2&qt=/replication&wt=filestream} status=0 QTime=0 
[junit4:junit4]   2> 12058 T1724 C181 P27209 REQ /replication {file=_0_MockVariableIntBlock_0.pyl&command=filecontent&checksum=true&generation=2&qt=/replication&wt=filestream} status=0 QTime=0 
[junit4:junit4]   2> 12059 T1754 C180 P27218 oash.SnapPuller$FileFetcher.fetchPackets WARNING No content recieved for file: {name=_0_MockVariableIntBlock_0.pyl, lastmodified=1347907251000, size=0}
[junit4:junit4]   2> 12062 T1724 C181 P27209 REQ /replication {file=_0_MockVariableIntBlock_0.tib&command=filecontent&checksum=true&generation=2&qt=/replication&wt=filestream} status=0 QTime=0 
[junit4:junit4]   2> 12066 T1724 C181 P27209 REQ /replication {file=_0_nrm.cfe&command=filecontent&checksum=true&generation=2&qt=/replication&wt=filestream} status=0 QTime=0 
[junit4:junit4]   2> 12070 T1724 C181 P27209 REQ /replication {file=_0_MockVariableIntBlock_0.frq&command=filecontent&checksum=true&generation=2&qt=/replication&wt=filestream} status=0 QTime=0 
[junit4:junit4]   2> 12074 T1724 C181 P27209 REQ /replication {file=segments_2&command=filecontent&checksum=true&generation=2&qt=/replication&wt=filestream} status=0 QTime=0 
[junit4:junit4]   2> 12078 T1724 C181 P27209 REQ /replication {file=_0_Pulsing40_0.tip&command=filecontent&checksum=true&generation=2&qt=/replication&wt=filestream} status=0 QTime=0 
[junit4:junit4]   2> 12082 T1724 C181 P27209 REQ /replication {file=_0_MockVariableIntBlock_0.pos&command=filecontent&checksum=true&generation=2&qt=/replication&wt=filestream} status=0 QTime=0 
[junit4:junit4]   2> 12086 T1724 C181 P27209 REQ /replication {file=_0.fdx&command=filecontent&checksum=true&generation=2&qt=/replication&wt=filestream} status=0 QTime=0 
[junit4:junit4]   2> 12090 T1724 C181 P27209 REQ /replication {file=_0_Direct_0.tip&command=filecontent&checksum=true&generation=2&qt=/replication&wt=filestream} status=0 QTime=0 
[junit4:junit4]   2> 12094 T1724 C181 P27209 REQ /replication {file=_0_Direct_0.prx&command=filecontent&checksum=true&generation=2&qt=/replication&wt=filestream} status=0 QTime=0 
[junit4:junit4]   2> 12098 T1724 C181 P27209 REQ /replication {file=_0.si&command=filecontent&checksum=true&generation=2&qt=/replication&wt=filestream} status=0 QTime=0 
[junit4:junit4]   2> 12102 T1724 C181 P27209 REQ /replication {file=_0_Direct_0.tim&command=filecontent&checksum=true&generation=2&qt=/replication&wt=filestream} status=0 QTime=0 
[junit4:junit4]   2> 12106 T1724 C181 P27209 REQ /replication {file=_0.fdt&command=filecontent&checksum=true&generation=2&qt=/replication&wt=filestream} status=0 QTime=0 
[junit4:junit4]   2> 12110 T1724 C181 P27209 REQ /replication {file=_0_MockVariableIntBlock_0.tii&command=filecontent&checksum=true&generation=2&qt=/replication&wt=filestream} status=0 QTime=0 
[junit4:junit4]   2> 12111 T1754 C180 P27218 oash.SnapPuller.fetchLatestIndex Total time taken for download : 0 secs
[junit4:junit4]   2> 12111 T1754 C180 P27218 oash.SnapPuller.modifyIndexProps New index installed. Updating index properties... index=index.20120917124051733
[junit4:junit4]   2> 12113 T1754 C180 P27218 oasu.DefaultSolrCoreState.newIndexWriter Creating new IndexWriter...
[junit4:junit4]   2> 12113 T1754 C180 P27218 oasu.DefaultSolrCoreState.newIndexWriter Waiting until IndexWriter is unused... core=collection1
[junit4:junit4]   2> 12113 T1754 C180 P27218 oasu.DefaultSolrCoreState.newIndexWriter Rollback old IndexWriter... core=collection1
[junit4:junit4]   2> 12117 T1754 C180 P27218 oasc.SolrCore.getNewIndexDir WARNING New index directory detected: old=./org.apache.solr.cloud.BasicDistributedZk2Test-1347907239725/jetty3/index/ new=./org.apache.solr.cloud.BasicDistributedZk2Test-1347907239725/jetty3/index.20120917124051733
[junit4:junit4]   2> 12118 T1754 C180 P27218 oasc.CachingDirectoryFactory.get return new directory for /usr/home/hudson/hudson-slave/workspace/Lucene-Solr-Tests-trunk-Java6/solr/build/solr-core/test/J0/./org.apache.solr.cloud.BasicDistributedZk2Test-1347907239725/jetty3/index.20120917124051733 forceNew:true
[junit4:junit4]   2> 12128 T1754 C180 P27218 oasc.SolrDeletionPolicy.onInit SolrDeletionPolicy.onInit: commits:num=1
[junit4:junit4]   2> 		commit{dir=NRTCachingDirectory(org.apache.lucene.store.NIOFSDirectory@/usr/home/hudson/hudson-slave/workspace/Lucene-Solr-Tests-trunk-Java6/solr/build/solr-core/test/J0/org.apache.solr.cloud.BasicDistributedZk2Test-1347907239725/jetty3/index.20120917124051733 lockFactory=org.apache.lucene.store.NativeFSLockFactory@2da8a347; maxCacheMB=48.0 maxMergeSizeMB=4.0),segFN=segments_2,generation=2,filenames=[_0.fnm, _0_Pulsing40_0.tim, _0_Memory_0.ram, _0_MockVariableIntBlock_0.doc, _0_nrm.cfs, _0_MockVariableIntBlock_0.skp, _0_Pulsing40_0.prx, _0_Direct_0.frq, _0_Pulsing40_0.frq, _0_MockVariableIntBlock_0.pyl, _0_MockVariableIntBlock_0.tib, _0_MockVariableIntBlock_0.frq, _0_nrm.cfe, _0_Pulsing40_0.tip, _0_MockVariableIntBlock_0.pos, segments_2, _0.fdx, _0_Direct_0.tip, _0_Direct_0.prx, _0.si, _0_Direct_0.tim, _0.fdt, _0_MockVariableIntBlock_0.tii]
[junit4:junit4]   2> 12128 T1754 C180 P27218 oasc.SolrDeletionPolicy.updateCommits newest commit = 2
[junit4:junit4]   2> 12128 T1754 C180 P27218 oasu.DefaultSolrCoreState.newIndexWriter New IndexWriter is ready to be used.
[junit4:junit4]   2> 12133 T1754 C180 P27218 oass.SolrIndexSearcher.<init> Opening Searcher@3070232f main
[junit4:junit4]   2> 12134 T1753 oasc.SolrCore.registerSearcher [collection1] Registered new searcher Searcher@3070232f main{StandardDirectoryReader(segments_2:3:nrt _0(5.0):C1)}
[junit4:junit4]   2> 12134 T1753 oasc.CachingDirectoryFactory.close Closing directory:/usr/home/hudson/hudson-slave/workspace/Lucene-Solr-Tests-trunk-Java6/solr/build/solr-core/test/J0/./org.apache.solr.cloud.BasicDistributedZk2Test-1347907239725/jetty3/index
[junit4:junit4]   2> 12135 T1753 oash.SnapPuller$2.onClose removing old index directory ./org.apache.solr.cloud.BasicDistributedZk2Test-1347907239725/jetty3/index
[junit4:junit4]   2> 12136 T1754 C180 P27218 oasu.DirectUpdateHandler2.commit start commit{flags=0,_version_=0,optimize=false,openSearcher=false,waitSearcher=false,expungeDeletes=false,softCommit=false}
[junit4:junit4]   2> 12137 T1754 C180 P27218 oasu.DirectUpdateHandler2.commit end_commit_flush
[junit4:junit4]   2> 12138 T1754 C180 P27218 oasc.RecoveryStrategy.replay Replaying buffered documents. core=collection1
[junit4:junit4]   2> 12138 T1776 C180 P27218 oasu.UpdateLog$LogReplayer.doReplay WARNING Starting log replay tlog{file=./org.apache.solr.cloud.BasicDistributedZk2Test-1347907239725/jetty3/tlog/tlog.0000000000000000000 refcount=2} active=true starting pos=434
[junit4:junit4]   2> 12138 T1776 C180 P27218 oasu.DirectUpdateHandler2.commit start commit{flags=2,_version_=0,optimize=false,openSearcher=true,waitSearcher=true,expungeDeletes=false,softCommit=false}
[junit4:junit4]   2> 12139 T1776 C180 P27218 oass.SolrIndexSearcher.<init> Opening Searcher@5e541dbd main
[junit4:junit4]   2> 12140 T1776 C180 P27218 oasu.DirectUpdateHandler2.commit end_commit_flush
[junit4:junit4]   2> 12141 T1753 oasc.SolrCore.registerSearcher [collection1] Registered new searcher Searcher@5e541dbd main{StandardDirectoryReader(segments_2:3:nrt _0(5.0):C1)}
[junit4:junit4]   2> 12141 T1776 C180 P27218 oasu.UpdateLog$LogReplayer.run WARNING Log replay finished. recoveryInfo=RecoveryInfo{adds=0 deletes=0 deleteByQuery=0 errors=0 positionOfStart=434}
[junit4:junit4]   2> 12141 T1754 C180 P27218 oasc.RecoveryStrategy.doRecovery Replication Recovery was successful - registering as Active. core=collection1
[junit4:junit4]   2> 12143 T1754 C180 P27218 oasc.RecoveryStrategy.doRecovery Finished recovery process. core=collection1
[junit4:junit4]   2> 12302 T1715 oascc.ZkStateReader.updateClusterState Updating cloud state from ZooKeeper... 
[junit4:junit4]   2> 12316 T1740 oascc.ZkStateReader$2.process A cluster state change has occurred - updating...
[junit4:junit4]   2> 12316 T1728 oascc.ZkStateReader$2.process A cluster state change has occurred - updating...
[junit4:junit4]   2> 12316 T1773 oascc.ZkStateReader$2.process A cluster state change has occurred - updating...
[junit4:junit4]   2> 12316 T1771 oascc.ZkStateReader$2.process A cluster state change has occurred - updating...
[junit4:junit4]   2> 12316 T1714 oascc.ZkStateReader$2.process A cluster state change has occurred - updating...
[junit4:junit4]   2> 12316 T1766 oascc.ZkStateReader$2.process A cluster state change has occurred - updating...
[junit4:junit4]   2> 12316 T1752 oascc.ZkStateReader$2.process A cluster state change has occurred - updating...
[junit4:junit4]   2> 12822 T1694 oascc.ZkStateReader.updateClusterState Updating cloud state from ZooKeeper... 
[junit4:junit4]   2>  C182_STATE=coll:collection1 core:collection1 props:{shard=shard2, roles=null, state=recovering, core=collection1, collection=collection1, node_name=127.0.0.1:27225_solr, base_url=http://127.0.0.1:27225/solr}
[junit4:junit4]   2> 13744 T1768 C182 P27225 oasc.RecoveryStrategy.doRecovery Begin buffering updates. core=collection1
[junit4:junit4]   2> 13744 T1768 C182 P27225 oasu.UpdateLog.bufferUpdates Starting to buffer updates. FSUpdateLog{state=ACTIVE, tlog=null}
[junit4:junit4]   2> 13744 T1768 C182 P27225 oasc.RecoveryStrategy.replicate Attempting to replicate from http://127.0.0.1:27215/solr/collection1/. core=collection1
[junit4:junit4]   2> 13744 T1768 C182 P27225 oascsi.HttpClientUtil.createClient Creating new http client, config:maxConnections=128&maxConnectionsPerHost=32&followRedirects=false
[junit4:junit4]   2> 13754 T1734 C183 P27215 oasu.DirectUpdateHandler2.commit start commit{flags=0,_version_=0,optimize=false,openSearcher=true,waitSearcher=true,expungeDeletes=false,softCommit=false}
[junit4:junit4]   2> 13758 T1734 C183 P27215 oasc.SolrDeletionPolicy.onInit SolrDeletionPolicy.onInit: commits:num=1
[junit4:junit4]   2> 		commit{dir=NRTCachingDirectory(org.apache.lucene.store.NIOFSDirectory@/usr/home/hudson/hudson-slave/workspace/Lucene-Solr-Tests-trunk-Java6/solr/build/solr-core/test/J0/org.apache.solr.cloud.BasicDistributedZk2Test-1347907239725/jetty2/index lockFactory=org.apache.lucene.store.NativeFSLockFactory@6ed86a75; maxCacheMB=48.0 maxMergeSizeMB=4.0),segFN=segments_1,generation=1,filenames=[segments_1]
[junit4:junit4]   2> 13759 T1734 C183 P27215 oasc.SolrDeletionPolicy.updateCommits newest commit = 1
[junit4:junit4]   2> 13760 T1734 C183 P27215 oass.SolrIndexSearcher.<init> Opening Searcher@461fa155 main
[junit4:junit4]   2> 13761 T1734 C183 P27215 oasu.DirectUpdateHandler2.commit end_commit_flush
[junit4:junit4]   2> 13762 T1741 oasc.SolrCore.registerSearcher [collection1] Registered new searcher Searcher@461fa155 main{StandardDirectoryReader(segments_1:1)}
[junit4:junit4]   2> 13762 T1734 C183 P27215 /update {waitSearcher=true&commit=true&commit_end_point=true&wt=javabin&softCommit=false&version=2} {commit=} 0 8
[junit4:junit4]   2> 13763 T1768 C182 P27225 oash.ReplicationHandler.inform Commits will be reserved for  10000
[junit4:junit4]   2> 13763 T1768 C182 P27225 oash.SnapPuller.<init>  No value set for 'pollInterval'. Timer Task not started.
[junit4:junit4]   2> 13764 T1735 C183 P27215 oash.ReplicationHandler.inform Commits will be reserved for  10000
[junit4:junit4]   2> 13765 T1735 C183 P27215 REQ /replication {command=indexversion&wt=javabin&qt=/replication&version=2} status=0 QTime=1 
[junit4:junit4]   2> 13768 T1768 C182 P27225 oasc.SolrDeletionPolicy.onInit SolrDeletionPolicy.onInit: commits:num=1
[junit4:junit4]   2> 		commit{dir=NRTCachingDirectory(org.apache.lucene.store.NIOFSDirectory@/usr/home/hudson/hudson-slave/workspace/Lucene-Solr-Tests-trunk-Java6/solr/build/solr-core/test/J0/org.apache.solr.cloud.BasicDistributedZk2Test-1347907239725/jetty4/index lockFactory=org.apache.lucene.store.NativeFSLockFactory@419e4f14; maxCacheMB=48.0 maxMergeSizeMB=4.0),segFN=segments_1,generation=1,filenames=[segments_1]
[junit4:junit4]   2> 13769 T1768 C182 P27225 oasc.SolrDeletionPolicy.updateCommits newest commit = 1
[junit4:junit4]   2> 13770 T1768 C182 P27225 oasu.DirectUpdateHandler2.commit start commit{flags=0,_version_=0,optimize=false,openSearcher=true,waitSearcher=true,expungeDeletes=false,softCommit=false}
[junit4:junit4]   2> 13773 T1768 C182 P27225 oasc.SolrDeletionPolicy.onCommit SolrDeletionPolicy.onCommit: commits:num=2
[junit4:junit4]   2> 		commit{dir=NRTCachingDirectory(org.apache.lucene.store.NIOFSDirectory@/usr/home/hudson/hudson-slave/workspace/Lucene-Solr-Tests-trunk-Java6/solr/build/solr-core/test/J0/org.apache.solr.cloud.BasicDistributedZk2Test-1347907239725/jetty4/index lockFactory=org.apache.lucene.store.NativeFSLockFactory@419e4f14; maxCacheMB=48.0 maxMergeSizeMB=4.0),segFN=segments_1,generation=1,filenames=[segments_1]
[junit4:junit4]   2> 		commit{dir=NRTCachingDirectory(org.apache.lucene.store.NIOFSDirectory@/usr/home/hudson/hudson-slave/workspace/Lucene-Solr-Tests-trunk-Java6/solr/build/solr-core/test/J0/org.apache.solr.cloud.BasicDistributedZk2Test-1347907239725/jetty4/index lockFactory=org.apache.lucene.store.NativeFSLockFactory@419e4f14; maxCacheMB=48.0 maxMergeSizeMB=4.0),segFN=segments_2,generation=2,filenames=[segments_2]
[junit4:junit4]   2> 13774 T1768 C182 P27225 oasc.SolrDeletionPolicy.updateCommits newest commit = 2
[junit4:junit4]   2> 13777 T1768 C182 P27225 oass.SolrIndexSearcher.<init> Opening Searcher@5304ba83 main
[junit4:junit4]   2> 13777 T1768 C182 P27225 oasu.DirectUpdateHandler2.commit end_commit_flush
[junit4:junit4]   2> 13778 T1767 oasc.SolrCore.registerSearcher [collection1] Registered new searcher Searcher@5304ba83 main{StandardDirectoryReader(segments_2:2)}
[junit4:junit4]   2> 13778 T1768 C182 P27225 oasc.RecoveryStrategy.replay No replay needed. core=collection1
[junit4:junit4]   2> 13778 T1768 C182 P27225 oasc.RecoveryStrategy.doRecovery Replication Recovery was successful - registering as Active. core=collection1
[junit4:junit4]   2> 13780 T1768 C182 P27225 oasc.RecoveryStrategy.doRecovery Finished recovery process. core=collection1
[junit4:junit4]   2> 13828 T1715 oascc.ZkStateReader.updateClusterState Updating cloud state from ZooKeeper... 
[junit4:junit4]   2> 13828 T1694 oascc.ZkStateReader.updateClusterState Updating cloud state from ZooKeeper... 
[junit4:junit4]   2> 14061 T1773 oascc.ZkStateReader$2.process A cluster state change has occurred - updating...
[junit4:junit4]   2> 14061 T1752 oascc.ZkStateReader$2.process A cluster state change has occurred - updating...
[junit4:junit4]   2> 14061 T1728 oascc.ZkStateReader$2.process A cluster state change has occurred - updating...
[junit4:junit4]   2> 14061 T1771 oascc.ZkStateReader$2.process A cluster state change has occurred - updating...
[junit4:junit4]   2> 14061 T1740 oascc.ZkStateReader$2.process A cluster state change has occurred - updating...
[junit4:junit4]   2> 14061 T1714 oascc.ZkStateReader$2.process A cluster state change has occurred - updating...
[junit4:junit4]   2> 14061 T1766 oascc.ZkStateReader$2.process A cluster state change has occurred - updating...
[junit4:junit4]   2> 14873 T1694 oascc.ZkStateReader.updateClusterState Updating cloud state from ZooKeeper... 
[junit4:junit4]   2> 14876 T1706 C184 P27201 oasu.DirectUpdateHandler2.commit start commit{flags=0,_version_=0,optimize=false,openSearcher=true,waitSearcher=true,expungeDeletes=false,softCommit=false}
[junit4:junit4]   2> 14935 T1706 C184 P27201 oasc.SolrDeletionPolicy.onCommit SolrDeletionPolicy.onCommit: commits:num=2
[junit4:junit4]   2> 		commit{dir=NRTCachingDirectory(org.apache.lucene.store.NIOFSDirectory@/usr/home/hudson/hudson-slave/workspace/Lucene-Solr-Tests-trunk-Java6/solr/build/solr-core/test/J0/org.apache.solr.cloud.BasicDistributedZk2Test-1347907239725/control/data/index lockFactory=org.apache.lucene.store.NativeFSLockFactory@c767c97; maxCacheMB=48.0 maxMergeSizeMB=4.0),segFN=segments_1,generation=1,filenames=[segments_1]
[junit4:junit4]   2> 		commit{dir=NRTCachingDirectory(org.apache.lucene.store.NIOFSDirectory@/usr/home/hudson/hudson-slave/workspace/Lucene-Solr-Tests-trunk-Java6/solr/build/solr-core/test/J0/org.apache.solr.cloud.BasicDistributedZk2Test-1347907239725/control/data/index lockFactory=org.apache.lucene.store.NativeFSLockFactory@c767c97; maxCacheMB=48.0 maxMergeSizeMB=4.0),segFN=segments_2,generation=2,filenames=[_0.fnm, _0_Pulsing40_0.tim, _0_Memory_0.ram, _0_MockVariableIntBlock_0.doc, _0_nrm.cfs, _0_MockVariableIntBlock_0.skp, _0_Pulsing40_0.prx, _0_Direct_0.frq, _0_Pulsing40_0.frq, _0_MockVariableIntBlock_0.pyl, _0_MockVariableIntBlock_0.tib, _0_MockVariableIntBlock_0.frq, _0_nrm.cfe, _0_MockVariableIntBlock_0.pos, _0_Pulsing40_0.tip, segments_2, _0_Direct_0.tip, _0.fdx, _0_Direct_0.prx, _0.si, _0_Direct_0.tim, _0_MockVariableIntBlock_0.tii, _0.fdt]
[junit4:junit4]   2> 14936 T1706 C184 P27201 oasc.SolrDeletionPolicy.updateCommits newest commit = 2
[junit4:junit4]   2> 14952 T1706 C184 P27201 oass.SolrIndexSearcher.<init> Opening Searcher@71cc5eb5 main
[junit4:junit4]   2> 14953 T1706 C184 P27201 oasu.DirectUpdateHandler2.commit end_commit_flush
[junit4:junit4]   2> 14953 T1717 oasc.SolrCore.registerSearcher [collection1] Registered new searcher Searcher@71cc5eb5 main{StandardDirectoryReader(segments_2:3 _0(5.0):C1)}
[junit4:junit4]   2> 14954 T1706 C184 P27201 /update {waitSearcher=true&wt=javabin&commit=true&softCommit=false&version=2} {commit=} 0 78
[junit4:junit4]   2> 14957 T1722 C181 P27209 oasu.DirectUpdateHandler2.commit start commit{flags=0,_version_=0,optimize=false,openSearcher=true,waitSearcher=true,expungeDeletes=false,softCommit=false}
[junit4:junit4]   2> 14967 T1722 C181 P27209 oass.SolrIndexSearcher.<init> Opening Searcher@7ddbd422 main
[junit4:junit4]   2> 14968 T1722 C181 P27209 oasu.DirectUpdateHandler2.commit end_commit_flush
[junit4:junit4]   2> 14969 T1729 oasc.SolrCore.registerSearcher [collection1] Registered new searcher Searcher@7ddbd422 main{StandardDirectoryReader(segments_2:3 _0(5.0):C1)}
[junit4:junit4]   2> 14969 T1722 C181 P27209 oasu.SolrCmdDistributor.distribCommit Distrib commit to:[StdNode: http://127.0.0.1:27218/solr/collection1/, StdNode: http://127.0.0.1:27215/solr/collection1/, StdNode: http://127.0.0.1:27225/solr/collection1/]
[junit4:junit4]   2> 14971 T1736 C183 P27215 oasu.DirectUpdateHandler2.commit start commit{flags=0,_version_=0,optimize=false,openSearcher=true,waitSearcher=true,expungeDeletes=false,softCommit=false}
[junit4:junit4]   2>  C180_STATE=coll:collection1 core:collection1 props:{shard=shard1, roles=null, state=active, core=collection1, collection=collection1, node_name=127.0.0.1:27218_solr, base_url=http://127.0.0.1:27218/solr}
[junit4:junit4]   2> 14973 T1744 C180 P27218 oasu.DirectUpdateHandler2.commit start commit{flags=0,_version_=0,optimize=false,openSearcher=true,waitSearcher=true,expungeDeletes=false,softCommit=false}
[junit4:junit4]   2> 14975 T1744 C180 P27218 oass.SolrIndexSearcher.<init> Opening Searcher@1bcfbe96 main
[junit4:junit4]   2> 14976 T1744 C180 P27218 oasu.DirectUpdateHandler2.commit end_commit_flush
[junit4:junit4]   2> 14976 T1736 C183 P27215 oass.SolrIndexSearcher.<init> Opening Searcher@74cceb29 main
[junit4:junit4]   2> 14976 T1736 C183 P27215 oasu.DirectUpdateHandler2.commit end_commit_flush
[junit4:junit4]   2> 14977 T1753 oasc.SolrCore.registerSearcher [collection1] Registered new searcher Searcher@1bcfbe96 main{StandardDirectoryReader(segments_2:3:nrt _0(5.0):C1)}
[junit4:junit4]   2> 14977 T1741 oasc.SolrCore.registerSearcher [collection1] Registered new searcher Searcher@74cceb29 main{StandardDirectoryReader(segments_1:1)}
[junit4:junit4]   2> 14977 T1744 C180 P27218 /update {waitSearcher=true&commit=true&wt=javabin&commit_end_point=true&expungeDeletes=false&softCommit=false&version=2} {commit=} 0 4
[junit4:junit4]   2> 14977 T1736 C183 P27215 /update {waitSearcher=true&commit=true&wt=javabin&commit_end_point=true&expungeDeletes=false&softCommit=false&version=2} {commit=} 0 6
[junit4:junit4]   2>  C182_STATE=coll:collection1 core:collection1 props:{shard=shard2, roles=null, state=active, core=collection1, collection=collection1, node_name=127.0.0.1:27225_solr, base_url=http://127.0.0.1:27225/solr}
[junit4:junit4]   2> 14981 T1758 C182 P27225 oasu.DirectUpdateHandler2.commit start commit{flags=0,_version_=0,optimize=false,openSearcher=true,waitSearcher=true,expungeDeletes=false,softCommit=false}
[junit4:junit4]   2> 14985 T1758 C182 P27225 oass.SolrIndexSearcher.<init> Opening Searcher@88d7169 main
[junit4:junit4]   2> 14985 T1758 C182 P27225 oasu.DirectUpdateHandler2.commit end_commit_flush
[junit4:junit4]   2> 14986 T1767 oasc.SolrCore.registerSearcher [collection1] Registered new searcher Searcher@88d7169 main{StandardDirectoryReader(segments_2:2)}
[junit4:junit4]   2> 14986 T1758 C182 P27225 /update {waitSearcher=true&commit=true&wt=javabin&commit_end_point=true&expungeDeletes=false&softCommit=false&version=2} {commit=} 0 5
[junit4:junit4]   2> 14987 T1722 C181 P27209 /update {waitSearcher=true&wt=javabin&commit=true&softCommit=false&version=2} {commit=} 0 30
[junit4:junit4]   2> 14992 T1707 C184 P27201 REQ /select {fl=id,score&shard.url=127.0.0.1:27201/solr/collection1/&NOW=1347907254711&start=0&q=*:*&distrib=false&isShard=true&wt=javabin&fsv=true&rows=10&version=2} hits=1 status=0 QTime=0 
[junit4:junit4]   2> 14996 T1707 C184 P27201 REQ /select {shard.url=127.0.0.1:27201/solr/collection1/&NOW=1347907254711&q=*:*&ids=1&distrib=false&isShard=true&wt=javabin&version=2} status=0 QTime=0 
[junit4:junit4]   2> 14997 T1706 C184 P27201 REQ /select {wt=javabin&q=*:*&version=2} hits=1 status=0 QTime=7 
[junit4:junit4]   2> 14998 T1694 oaz.ZooKeeper.<init> Initiating client connection, connectString=127.0.0.1:27198/solr sessionTimeout=10000 watcher=org.apache.solr.common.cloud.ConnectionManager@46933587
[junit4:junit4]   2> 14998 T1780 oaz.ClientCnxn$SendThread.startConnect Opening socket connection to server /127.0.0.1:27198
[junit4:junit4]   2> 14998 T1694 oascc.ConnectionManager.waitForConnected Waiting for client to connect to ZooKeeper
[junit4:junit4]   2> 14999 T1780 oaz.ClientCnxn$SendThread.primeConnection Socket connection established to localhost/127.0.0.1:27198, initiating session
[junit4:junit4]   2> 14999 T1696 oazs.NIOServerCnxn$Factory.run Accepted socket connection from /140.211.11.196:27252
[junit4:junit4]   2> 15000 T1696 oazs.NIOServerCnxn.readConnectRequest Client attempting to establish new session at /140.211.11.196:27252
[junit4:junit4]   2> 15001 T1698 oazs.NIOServerCnxn.finishSessionInit Established session 0x139d5883f320009 with negotiated timeout 10000 for client /140.211.11.196:27252
[junit4:junit4]   2> 15001 T1780 oaz.ClientCnxn$SendThread.readConnectResult Session establishment complete on server localhost/127.0.0.1:27198, sessionid = 0x139d5883f320009, negotiated timeout = 10000
[junit4:junit4]   2> 15001 T1781 oascc.ConnectionManager.process Watcher org.apache.solr.common.cloud.ConnectionManager@46933587 name:ZooKeeperConnection Watcher:127.0.0.1:27198/solr got event WatchedEvent state:SyncConnected type:None path:null path:null type:None
[junit4:junit4]   2> 15002 T1694 oascc.ConnectionManager.waitForConnected Client is connected to ZooKeeper
[junit4:junit4]   2> 15002 T1694 oascc.ZkStateReader.createClusterStateWatchersAndUpdate Updating cluster state from ZooKeeper... 
[junit4:junit4]   2> 15003 T1699 oazs.PrepRequestProcessor.pRequest Processed session termination for sessionid: 0x139d5883f320009
[junit4:junit4]   2> 15005 T1781 oaz.ClientCnxn$EventThread.run EventThread shut down
[junit4:junit4]   2> 15005 T1696 oazs.NIOServerCnxn.closeSock Closed socket connection for client /140.211.11.196:27252 which had sessionid 0x139d5883f320009
[junit4:junit4]   2> 15005 T1694 oaz.ZooKeeper.close Session: 0x139d5883f320009 closed
[junit4:junit4]   2> 15007 T1725 C181 P27209 REQ /select {distrib=false&wt=javabin&q=*:*&version=2} hits=1 status=0 QTime=1 
[junit4:junit4]   2> 15008 T1737 C183 P27215 REQ /select {distrib=false&wt=javabin&q=*:*&version=2} hits=0 status=0 QTime=0 
[junit4:junit4]   2> 15012 T1745 C180 P27218 REQ /select {fl=id,score&shard.url=127.0.0.1:27209/solr/collection1/|127.0.0.1:27218/solr/collection1/&NOW=1347907254731&start=0&q=*:*&distrib=false&isShard=true&wt=javabin&fsv=true&rows=10&version=2} hits=1 status=0 QTime=0 
[junit4:junit4]   2> 15012 T1759 C182 P27225 REQ /select {fl=id,score&shard.url=127.0.0.1:27215/solr/collection1/|127.0.0.1:27225/solr/collection1/&NOW=1347907254731&start=0&q=*:*&distrib=false&isShard=true&wt=javabin&fsv=true&rows=10&version=2} hits=0 status=0 QTime=0 
[junit4:junit4]   2> 15015 T1745 C180 P27218 REQ /select {shard.url=127.0.0.1:27209/solr/collection1/|127.0.0.1:27218/solr/collection1/&NOW=1347907254731&q=*:*&ids=1&distrib=false&isShard=true&wt=javabin&version=2} status=0 QTime=0 
[junit4:junit4]   2> 15016 T1738 C183 P27215 REQ /select {wt=javabin&q=*:*&version=2} hits=1 status=0 QTime=6 
[junit4:junit4]   2> 15023 T1706 C184 P27201 /update {wt=javabin&version=2} {add=[2 (1413383197546250240)]} 0 4
[junit4:junit4]   2> 15035 T1758 C182 P27225 REQ /update {update.distrib=FROMLEADER&distrib.from=http://127.0.0.1:27215/solr/collection1/&wt=javabin&version=2} status=0 QTime=3 
[junit4:junit4]   2> 15036 T1736 C183 P27215 REQ /update {distrib.from=http://127.0.0.1:27209/solr/collection1/&update.distrib=TOLEADER&wt=javabin&version=2} status=0 QTime=9 
[junit4:junit4]   2> 15036 T1722 C181 P27209 /update {wt=javabin&version=2} {add=[2]} 0 11
[junit4:junit4]   2> 15040 T1706 C184 P27201 /update {wt=javabin&version=2} {add=[3 (1413383197567221760)]} 0 1
[junit4:junit4]   2> 15048 T1758 C182 P27225 REQ /update {distrib.from=http://127.0.0.1:27215/solr/collection1/&update.distrib=FROMLEADER&wt=javabin&version=2} status=0 QTime=2 
[junit4:junit4]   2> 15048 T1738 C183 P27215 /update {wt=javabin&version=2} {add=[3 (1413383197571416064)]} 0 5
[junit4:junit4]   2> 15053 T1706 C184 P27201 /update {wt=javabin&version=2} {add=[4 (1413383197579804672)]} 0 1
[junit4:junit4]   2> 15061 T1744 C180 P27218 REQ /update {distrib.from=http://127.0.0.1:27209/solr/collection1/&update.distrib=FROMLEADER&wt=javabin&version=2} status=0 QTime=2 
[junit4:junit4]   2> 15062 T1722 C181 P27209 /update {wt=javabin&version=2} {add=[4 (1413383197583998976)]} 0 7
[junit4:junit4]   2> 15066 T1706 C184 P27201 /update {wt=javabin&version=2} {add=[5 (1413383197593436160)]} 0 2
[junit4:junit4]   2> 15075 T1758 C182 P27225 REQ /update {update.distrib=FROMLEADER&distrib.from=http://127.0.0.1:27215/solr/collection1/&wt=javabin&version=2} status=0 QTime=2 
[junit4:junit4]   2> 15075 T1736 C183 P27215 REQ /update {distrib.from=http://127.0.0.1:27209/solr/collection1/&update.distrib=TOLEADER&wt=javabin&version=2} status=0 QTime=5 
[junit4:junit4]   2> 15076 T1722 C181 P27209 /update {wt=javabin&version=2} {add=[5]} 0 8
[junit4:junit4]   2> 15080 T1706 C184 P27201 /update {wt=javabin&version=2} {add=[6 (1413383197608116224)]} 0 2
[junit4:junit4]   2> 15087 T1758 C182 P27225 REQ /update {distrib.from=http://127.0.0.1:27215/solr/collection1/&update.distrib=FROMLEADER&wt=javabin&version=2} status=0 QTime=2 
[junit4:junit4]   2> 15087 T1738 C183 P27215 /update {wt=javabin&version=2} {add=[6 (1413383197612310528)]} 0 5
[junit4:junit4]   2> 15091 T1706 C184 P27201 /update {wt=javabin&version=2} {add=[7 (1413383197620699136)]} 0 1
[junit4:junit4]   2> 15099 T1758 C182 P27225 REQ /update {distrib.from=http://127.0.0.1:27215/solr/collection1/&update.distrib=FROMLEADER&wt=javabin&version=2} status=0 QTime=2 
[junit4:junit4]   2> 15100 T1738 C183 P27215 /update {wt=javabin&version=2} {add=[7 (1413383197624893440)]} 0 6
[junit4:junit4]   2> 15105 T1706 C184 P27201 /update {wt=javabin&version=2} {add=[8 (1413383197634330624)]} 0 2
[junit4:junit4]   2> 15114 T1744 C180 P27218 REQ /update {update.distrib=FROMLEADER&distrib.from=http://127.0.0.1:27209/solr/collection1/&wt=javabin&version=2} status=0 QTime=1 
[junit4:junit4]   2> 15115 T1726 C181 P27209 REQ /update {distrib.from=http://127.0.0.1:27215/solr/collection1/&update.distrib=TOLEADER&wt=javabin&version=2} status=0 QTime=6 
[junit4:junit4]   2> 15115 T1738 C183 P27215 /update {wt=javabin&version=2} {add=[8]} 0 7
[junit4:junit4]   2> 15120 T1706 C184 P27201 /update {wt=javabin&version=2} {add=[9 (1413383197650059264)]} 0 2
[junit4:junit4]   2> 15128 T1758 C182 P27225 REQ /update {distrib.from=http://127.0.0.1:27215/solr/collection1/&update.distrib=FROMLEADER&wt=javabin&version=2} status=0 QTime=2 
[junit4:junit4]   2> 15129 T1738 C183 P27215 /update {wt=javabin&version=2} {add=[9 (1413383197655302144)]} 0 6
[junit4:junit4]   2> 15133 T1706 C184 P27201 /update {wt=javabin&version=2} {add=[10 (1413383197664739328)]} 0 1
[junit4:junit4]   2> 15140 T1744 C180 P27218 REQ /update {distrib.from=http://127.0.0.1:27209/solr/collection1/&update.distrib=FROMLEADER&wt=javabin&version=2} status=0 QTime=1 
[junit4:junit4]   2> 15140 T1722 C181 P27209 /update {wt=javabin&version=2} {add=[10 (1413383197668933632)]} 0 4
[junit4:junit4]   2> 15157 T1706 C184 P27201 /update {wt=javabin&version=2} {add=[11 (1413383197676273664)]} 0 14
[junit4:junit4]   2> 15164 T1744 C180 P27218 REQ /update {distrib.from=http://127.0.0.1:27209/solr/collection1/&update.distrib=FROMLEADER&wt=javabin&version=2} status=0 QTime=1 
[junit4:junit4]   2> 15164 T1722 C181 P27209 /update {wt=javabin&version=2} {add=[11 (1413383197694099456)]} 0 4
[junit4:junit4]   2> 15170 T1706 C184 P27201 /update {wt=javabin&version=2} {add=[12 (1413383197701439488)]} 0 3
[junit4:junit4]   2> 15179 T1744 C180 P27218 REQ /update {update.distrib=FROMLEADER&distrib.from=http://127.0.0.1:27209/solr/collection1/&wt=javabin&version=2} status=0 QTime=1 
[junit4:junit4]   2> 15179 T1726 C181 P27209 REQ /update {distrib.from=http://127.0.0.1:27215/solr/collection1/&update.distrib=TOLEADER&wt=javabin&version=2} status=0 QTime=4 
[junit4:junit4]   2> 15180 T1738 C183 P27215 /update {wt=javabin&version=2} {add=[12]} 0 7
[junit4:junit4]   2> 15185 T1706 C184 P27201 /update {wt=javabin&version=2} {add=[13 (1413383197718216704)]} 0 2
[junit4:junit4]   2> 15191 T1744 C180 P27218 REQ /update {distrib.from=http://127.0.0.1:27209/solr/collection1/&update.distrib=FROMLEADER&wt=javabin&version=2} status=0 QTime=1 
[junit4:junit4]   2> 15191 T1722 C181 P27209 /update {wt=javabin&version=2} {add=[13 (1413383197722411008)]} 0 4
[junit4:junit4]   2> 15195 T1706 C184 P27201 /update {wt=javabin&version=2} {add=[14 (1413383197729751040)]} 0 1
[junit4:junit4]   2> 15204 T1744 C180 P27218 REQ /update {update.distrib=FROMLEADER&distrib.from=http://127.0.0.1:27209/solr/collection1/&wt=javabin&version=2} status=0 QTime=1 
[junit4:junit4]   2> 15204 T1726 C181 P27209 REQ /update {distrib.from=http://127.0.0.1:27215/solr/collection1/&update.distrib=TOLEADER&wt=javabin&version=2} status=0 QTime=4 
[junit4:junit4]   2> 15205 T1738 C183 P27215 /update {wt=javabin&version=2} {add=[14]} 0 7
[junit4:junit4]   2> 15208 T1706 C184 P27201 /update {wt=javabin&version=2} {add=[15 (1413383197743382528)]} 0 1
[junit4:junit4]   2> 15218 T1744 C180 P27218 REQ /update {update.distrib=FROMLEADER&distrib.from=http://127.0.0.1:27209/solr/collection1/&wt=javabin&version=2} status=0 QTime=1 
[junit4:junit4]   2> 15218 T1726 C181 P27209 REQ /update {distrib.from=http://127.0.0.1:27215/solr/collection1/&update.distrib=TOLEADER&wt=javabin&version=2} status=0 QTime=4 
[junit4:junit4]   2> 15219 T1738 C183 P27215 /update {wt=javabin&version=2} {add=[15]} 0 8
[junit4:junit4]   2> 15223 T1706 C184 P27201 /update {wt=javabin&version=2} {add=[16 (1413383197758062592)]} 0 2
[junit4:junit4]   2> 15231 T1744 C180 P27218 REQ /update {update.distrib=FROMLEADER&distrib.from=http://127.0.0.1:27209/solr/collection1/&wt=javabin&version=2} status=0 QTime=1 
[junit4:junit4]   2> 15231 T1726 C181 P27209 REQ /update {distrib.from=http://127.0.0.1:27215/solr/collection1/&update.distrib=TOLEADER&wt=javabin&version=2} status=0 QTime=4 
[junit4:junit4]   2> 15232 T1738 C183 P27215 /update {wt=javabin&version=2} {add=[16]} 0 7
[junit4:junit4]   2> 15241 T1706 C184 P27201 /update {wt=javabin&version=2} {add=[17 (1413383197774839808)]} 0 6
[junit4:junit4]   2> 15260 T1758 C182 P27225 REQ /update {update.distrib=FROMLEADER&distrib.from=http://127.0.0.1:27215/solr/collection1/&wt=javabin&version=2} status=0 QTime=7 
[junit4:junit4]   2> 15261 T1736 C183 P27215 REQ /update {distrib.from=http://127.0.0.1:27209/solr/collection1/&update.distrib=TOLEADER&wt=javabin&version=2} status=0 QTime=13 
[junit4:junit4]   2> 15261 T1722 C181 P27209 /update {wt=javabin&version=2} {add=[17]} 0 16
[junit4:junit4]   2> 15266 T1706 C184 P27201 /update {wt=javabin&version=2} {add=[100 (1413383197804199936)]} 0 2
[junit4:junit4]   2> 15290 T1744 C180 P27218 REQ /update {distrib.from=http://127.0.0.1:27209/solr/collection1/&update.distrib=FROMLEADER&wt=javabin&version=2} status=0 QTime=9 
[junit4:junit4]   2> 15290 T1722 C181 P27209 /update {wt=javabin&version=2} {add=[100 (1413383197808394240)]} 0 21
[junit4:junit4]   2> 15295 T1706 C184 P27201 /update {wt=javabin&version=2} {add=[101 (1413383197833560064)]} 0 2
[junit4:junit4]   2> 15302 T1744 C180 P27218 REQ /update {distrib.from=http://127.0.0.1:27209/solr/collection1/&update.distrib=FROMLEADER&wt=javabin&version=2} status=0 QTime=1 
[junit4:junit4]   2> 15303 T1722 C181 P27209 /update {wt=javabin&version=2} {add=[101 (1413383197837754368)]} 0 6
[junit4:junit4]   2> 15306 T1706 C184 P27201 /update {wt=javabin&version=2} {add=[102 (1413383197846142976)]} 0 1
[junit4:junit4]   2> 15316 T1744 C180 P27218 REQ /update {update.distrib=FROMLEADER&distrib.from=http://127.0.0.1:27209/solr/collection1/&wt=javabin&version=2} status=0 QTime=1 
[junit4:junit4]   2> 15316 T1726 C181 P27209 REQ /update {distrib.from=http://127.0.0.1:27215/solr/collection1/&update.distrib=TOLEADER&wt=javabin&version=2} status=0 QTime=4 
[junit4:junit4]   2> 15317 T1738 C183 P27215 /update {wt=javabin&version=2} {add=[102]} 0 8
[junit4:junit4]   2> 15334 T1706 C184 P27201 /update {wt=javabin&version=2} {add=[103 (1413383197860823040)]} 0 15
[junit4:junit4]   2> 15343 T1758 C182 P27225 REQ /update {distrib.from=http://127.0.0.1:27215/solr/collection1/&update.distrib=FROMLEADER&wt=javabin&version=2} status=0 QTime=2 
[junit4:junit4]   2> 15344 T1738 C183 P27215 /update {wt=javabin&version=2} {add=[103 (1413383197879697408)]} 0 7
[junit4:junit4]   2> 15349 T1706 C184 P27201 /update {wt=javabin&version=2} {add=[104 (1413383197890183168)]} 0 2
[junit4:junit4]   2> 15360 T1758 C182 P27225 REQ /update {update.distrib=FROMLEADER&distrib.from=http://127.0.0.1:27215/solr/collection1/&wt=javabin&version=2} status=0 QTime=2 
[junit4:junit4]   2> 15361 T1736 C183 P27215 REQ /update {distrib.from=http://127.0.0.1:27209/solr/collection1/&update.distrib=TOLEADER&wt=javabin&version=2} status=0 QTime=6 
[junit4:junit4]   2> 15362 T1722 C181 P27209 /update {wt=javabin&version=2} {add=[104]} 0 10
[junit4:junit4]   2> 15365 T1706 C184 P27201 /update {wt=javabin&version=2} {add=[105 (1413383197908008960)]} 0 1
[junit4:junit4]   2> 15401 T1758 C182 P27225 REQ /update {update.distrib=FROMLEADER&distrib.from=http://127.0.0.1:27215/solr/collection1/&wt=javabin&version=2} status=0 QTime=19 
[junit4:junit4]   2> 15402 T1736 C183 P27215 REQ /update {distrib.from=http://127.0.0.1:27209/solr/collection1/&update.distrib=TOLEADER&wt=javabin&version=2} status=0 QTime=32 
[junit4:junit4]   2> 15403 T1722 C181 P27209 /update {wt=javabin&version=2} {add=[105]} 0 35
[junit4:junit4]   2> 15407 T1706 C184 P27201 /update {wt=javabin&version=2} {add=[106 (1413383197952049152)]} 0 1
[junit4:junit4]   2> 15417 T1758 C182 P27225 REQ /update {distrib.from=http://127.0.0.1:27215/solr/collection1/&update.distrib=FROMLEADER&wt=javabin&version=2} status=0 QTime=3 
[junit4:junit4]   2> 15418 T1738 C183 P27215 /update {wt=javabin&version=2} {add=[106 (1413383197956243456)]} 0 8
[junit4:junit4]   2> 15422 T1706 C184 P27201 /update {wt=javabin&version=2} {add=[107 (1413383197967777792)]} 0 1
[junit4:junit4]   2> 15428 T1744 C180 P27218 REQ /update {distrib.from=http://127.0.0.1:27209/solr/collection1/&update.distrib=FROMLEADER&wt=javabin&version=2} status=0 QTime=1 
[junit4:junit4]   2> 15428 T1722 C181 P27209 /update {wt=javabin&version=2} {add=[107 (1413383197970923520)]} 0 4
[junit4:junit4]   2> 15432 T1706 C184 P27201 /update {wt=javabin&version=2} {add=[108 (1413383197978263552)]} 0 1
[junit4:junit4]   2> 15441 T1744 C180 P27218 REQ /update {update.distrib=FROMLEADER&distrib.from=http://127.0.0.1:27209/solr/collection1/&wt=javabin&version=2} status=0 QTime=1 
[junit4:junit4]   2> 15441 T1726 C181 P27209 REQ /update {distrib.from=http://127.0.0.1:27215/solr/collection1/&update.distrib=TOLEADER&wt=javabin&version=2} status=0 QTime=4 
[junit4:junit4]   2> 15442 T1738 C183 P27215 /update {wt=javabin&version=2} {add=[108]} 0 7
[junit4:junit4]   2> 15446 T1706 C184 P27201 /update {wt=javabin&version=2} {add=[109 (1413383197992943616)]} 0 1
[junit4:junit4]   2> 15453 T1744 C180 P27218 REQ /update {distrib.from=http://127.0.0.1:27209/solr/collection1/&update.distrib=FROMLEADER&wt=javabin&version=2} status=0 QTime=1 
[junit4:junit4]   2> 15453 T1722 C181 P27209 /update {wt=javabin&version=2} {add=[109 (1413383197997137920)]} 0 4
[junit4:junit4]   2> 15457 T1706 C184 P27201 /update {wt=javabin&version=2} {add=[110 (1413383198004477952)]} 0 1
[junit4:junit4]   2> 15463 T1744 C180 P27218 REQ /update {distrib.from=http://127.0.0.1:27209/solr/collection1/&update.distrib=FROMLEADER&wt=javabin&version=2} status=0 QTime=1 
[junit4:junit4]   2> 15463 T1722 C181 P27209 /update {wt=javabin&version=2} {add=[110 (1413383198007623680)]} 0 4
[junit4:junit4]   2> 15467 T1706 C184 P27201 /update {wt=javabin&version=2} {add=[111 (1413383198014963712)]} 0 1
[junit4:junit4]   2> 15475 T1744 C180 P27218 REQ /update {update.distrib=FROMLEADER&distrib.from=http://127.0.0.1:27209/solr/collection1/&wt=javabin&version=2} status=0 QTime=1 
[junit4:junit4]   2> 15475 T1726 C181 P27209 REQ /update {distrib.from=http://127.0.0.1:27215/solr/collection1/&update.distrib=TOLEADER&wt=javabin&version=2} status=0 QTime=4 
[junit4:junit4]   2> 15476 T1738 C183 P27215 /update {wt=javabin&version=2} {add=[111]} 0 7
[junit4:junit4]   2> 15478 T1706 C184 P27201 /update {wt=javabin&version=2} {add=[112 (1413383198026498048)]} 0 1
[junit4:junit4]   2> 15488 T1758 C182 P27225 REQ /update {update.distrib=FROMLEADER&distrib.from=http://127.0.0.1:27215/solr/collection1/&wt=javabin&version=2} status=0 QTime=3 
[junit4:junit4]   2> 15489 T1736 C183 P27215 REQ /update {distrib.from=http://127.0.0.1:27209/solr/collection1/&update.distrib=TOLEADER&wt=javabin&version=2} status=0 QTime=7 
[junit4:junit4]   2> 15490 T1722 C181 P27209 /update {wt=javabin&version=2} {add=[112]} 0 10
[junit4:junit4]   2> 15500 T1706 C184 P27201 /update {wt=javabin&version=2} {add=[113 (1413383198042226688)]} 0 8
[junit4:junit4]   2> 15508 T1744 C180 P27218 REQ /update {distrib.from=http://127.0.0.1:27209/solr/collection1/&update.distrib=FROMLEADER&wt=javabin&version=2} status=0 QTime=1 
[junit4:junit4]   2> 15508 T1722 C181 P27209 /update {wt=javabin&version=2} {add=[113 (1413383198054809600)]} 0 5
[junit4:junit4]   2> 15513 T1706 C184 P27201 /update {wt=javabin&version=2} {add=[114 (1413383198062149632)]} 0 2
[junit4:junit4]   2> 15519 T1744 C180 P27218 REQ /update {distrib.from=http://127.0.0.1:27209/solr/collection1/&update.distrib=FROMLEADER&wt=javabin&version=2} status=0 QTime=1 
[junit4:junit4]   2> 15519 T1722 C181 P27209 /update {wt=javabin&version=2} {add=[114 (1413383198066343936)]} 0 4
[junit4:junit4]   2> 15523 T1706 C184 P27201 /update {wt=javabin&version=2} {add=[115 (1413383198073683968)]} 0 1
[junit4:junit4]   2> 15534 T1758 C182 P27225 REQ /update {update.distrib=FROMLEADER&distrib.from=http://127.0.0.1:27215/solr/collection1/&wt=javabin&version=2} status=0 QTime=3 
[junit4:junit4]   2> 15535 T1736 C183 P27215 REQ /update {distrib.from=http://127.0.0.1:27209/solr/collection1/&update.distrib=TOLEADER&wt=javabin&version=2} status=0 QTime=7 
[junit4:junit4]   2> 15535 T1722 C181 P27209 /update {wt=javabin&version=2} {add=[115]} 0 9
[junit4:junit4]   2> 15539 T1706 C184 P27201 /update {wt=javabin&version=2} {add=[116 (1413383198090461184)]} 0 1
[junit4:junit4]   2> 15547 T1758 C182 P27225 REQ /update {distrib.from=http://127.0.0.1:27215/solr/collection1/&update.distrib=FROMLEADER&wt=javabin&version=2} status=0 QTime=2 
[junit4:junit4]   2> 15548 T1738 C183 P27215 /update {wt=javabin&version=2} {add=[116 (1413383198094655488)]} 0 6
[junit4:junit4]   2> 15552 T1706 C184 P27201 /update {wt=javabin&version=2} {add=[117 (1413383198104092672)]} 0 1
[junit4:junit4]   2> 15560 T1758 C182 P27225 REQ /update {distrib.from=http://127.0.0.1:27215/solr/collection1/&update.distrib=FROMLEADER&wt=javabin&version=2} status=0 QTime=2 
[junit4:junit4]   2> 15561 T1738 C183 P27215 /update {wt=javabin&version=2} {add=[117 (1413383198108286976)]} 0 6
[junit4:junit4]   2> 15565 T1706 C184 P27201 /update {wt=javabin&version=2} {add=[118 (1413383198117724160)]} 0 1
[junit4:junit4]   2> 15586 T1744 C180 P27218 REQ /update {distrib.from=http://127.0.0.1:27209/solr/collection1/&update.distrib=FROMLEADER&wt=javabin&version=2} status=0 QTime=7 
[junit4:junit4]   2> 15586 T1722 C181 P27209 /update {wt=javabin&version=2} {add=[118 (1413383198121918464)]} 0 18
[junit4:junit4]   2> 15591 T1706 C184 P27201 /update {wt=javabin&version=2} {add=[119 (1413383198144987136)]} 0 2
[junit4:junit4]   2> 15599 T1758 C182 P27225 REQ /update {distrib.from=http://127.0.0.1:27215/solr/collection1/&update.distrib=FROMLEADER&wt=javabin&version=2} status=0 QTime=2 
[junit4:junit4]   2> 15601 T1738 C183 P27215 /update {wt=javabin&version=2} {add=[119 (1413383198149181440)]} 0 7
[junit4:junit4]   2> 15605 T1706 C184 P27201 /update {wt=javabin&version=2} {add=[120 (1413383198159667200)]} 0 2
[junit4:junit4]   2> 15613 T1758 C182 P27225 REQ /update {distrib.from=http://127.0.0.1:27215/solr/collection1/&update.distrib=FROMLEADER&wt=javabin&version=2} status=0 QTime=2 
[junit4:junit4]   2> 15614 T1738 C183 P27215 /update {wt=javabin&version=2} {add=[120 (1413383198163861504)]} 0 6
[junit4:junit4]   2> 15618 T1706 C184 P27201 /update {wt=javabin&version=2} {add=[121 (1413383198173298688)]} 0 1
[junit4:junit4]   2> 15627 T1758 C182 P27225 REQ /update {distrib.from=http://127.0.0.1:27215/solr/collection1/&update.distrib=FROMLEADER&wt=javabin&version=2} status=0 QTime=3 
[junit4:junit4]   2> 15627 T1738 C183 P27215 /update {wt=javabin&version=2} {add=[121 (1413383198177492992)]} 0 6
[junit4:junit4]   2> 15632 T1706 C184 P27201 /update {wt=javabin&version=2} {add=[122 (1413383198186930176)]} 0 2
[junit4:junit4]   2> 15642 T1744 C180 P27218 REQ /update {distrib.from=http://127.0.0.1:27209/solr/collection1/&update.distrib=FROMLEADER&wt=javabin&version=2} status=0 QTime=2 
[junit4:junit4]   2> 15642 T1722 C181 P27209 /update {wt=javabin&version=2} {add=[122 (1413383198192173056)]} 0 7
[junit4:junit4]   2> 15654 T1706 C184 P27201 /update {wt=javabin&version=2} {add=[123 (1413383198202658816)]} 0 9
[junit4:junit4]   2> 15662 T1744 C180 P27218 REQ /update {distrib.from=http://127.0.0.1:27209/solr/collection1/&update.distrib=FROMLEADER&wt=javabin&version=2} status=0 QTime=1 
[junit4:junit4]   2> 15663 T1722 C181 P27209 /update {wt=javabin&version=2} {add=[123 (1413383198215241728)]} 0 6
[junit4:junit4]   2> 15668 T1706 C184 P27201 /update {wt=javabin&version=2} {add=[124 (1413383198224678912)]} 0 2
[junit4:junit4]   2> 15677 T1744 C180 P27218 REQ /update {update.distrib=FROMLEADER&distrib.from=http://127.0.0.1:27209/solr/collection1/&wt=javabin&version=2} status=0 QTime=1 
[junit4:junit4]   2> 15677 T1726 C181 P27209 REQ /update {distrib.from=http://127.0.0.1:27215/solr/collection1/&update.distrib=TOLEADER&wt=javabin&version=2} status=0 QTime=4 
[junit4:junit4]   2> 15678 T1738 C183 P27215 /update {wt=javabin&version=2} {add=[124]} 0 7
[junit4:junit4]   2> 15682 T1706 C184 P27201 /update {wt=javabin&version=2} {add=[125 (1413383198240407552)]} 0 1
[junit4:junit4]   2> 15690 T1744 C180 P27218 REQ /update {distrib.from=http://127.0.0.1:27209/solr/collection1/&update.distrib=FROMLEADER&wt=javabin&version=2} status=0 QTime=1 
[junit4:junit4]   2> 15691 T1722 C181 P27209 /update {wt=javabin&version=2} {add=[125 (1413383198244601856)]} 0 6
[junit4:junit4]   2> 15695 T1706 C184 P27201 /update {wt=javabin&version=2} {add=[126 (1413383198254039040)]} 0 1
[junit4:junit4]   2> 15702 T1758 C182 P27225 REQ /update {distrib.from=http://127.0.0.1:27215/solr/collection1/&update.distrib=FROMLEADER&wt=javabin&version=2} status=0 QTime=1 
[junit4:junit4]   2> 15703 T1738 C183 P27215 /update {wt=javabin&version=2} {add=[126 (1413383198258233344)]} 0 5
[junit4:junit4]   2> 15707 T1706 C184 P27201 /update {wt=javabin&version=2} {add=[127 (1413383198266621952)]} 0 1
[junit4:junit4]   2> 15733 T1758 C182 P27225 REQ /update {distrib.from=http://127.0.0.1:27215/solr/collection1/&update.distrib=FROMLEADER&wt=javabin&version=2} status=0 QTime=11 
[junit4:junit4]   2> 15733 T1738 C183 P27215 /update {wt=javabin&version=2} {add=[127 (1413383198270816256)]} 0 23
[junit4:junit4]   2> 15737 T1706 C184 P27201 /update {wt=javabin&version=2} {add=[128 (1413383198298079232)]} 0 1
[junit4:junit4]   2> 15746 T1758 C182 P27225 REQ /update {update.distrib=FROMLEADER&distrib.from=http://127.0.0.1:27215/solr/collection1/&wt=javabin&version=2} status=0 QTime=2 
[junit4:junit4]   2> 15746 T1736 C183 P27215 REQ /update {distrib.from=http://127.0.0.1:27209/solr/collection1/&update.distrib=TOLEADER&wt=javabin&version=2} status=0 QTime=6 
[junit4:junit4]   2> 15747 T1722 C181 P27209 /update {wt=javabin&version=2} {add=[128]} 0 8
[junit4:junit4]   2> 15751 T1706 C184 P27201 /update {wt=javabin&version=2} {add=[129 (1413383198312759296)]} 0 1
[junit4:junit4]   2> 15759 T1744 C180 P27218 REQ /update {update.distrib=FROMLEADER&distrib.from=http://127.0.0.1:27209/solr/collection1/&wt=javabin&version=2} status=0 QTime=1 
[junit4:junit4]   2> 15759 T1726 C181 P27209 REQ /update {distrib.from=http://127.0.0.1:27215/solr/collection1/&update.distrib=TOLEADER&wt=javabin&version=2} status=0 QTime=4 
[junit4:junit4]   2> 15759 T1738 C183 P27215 /update {wt=javabin&version=2} {add=[129]} 0 6
[junit4:junit4]   2> 15762 T1706 C184 P27201 /update {wt=javabin&version=2} {add=[130 (1413383198325342208)]} 0 0
[junit4:junit4]   2> 15769 T1758 C182 P27225 REQ /update {distrib.from=http://127.0.0.1:27215/solr/collection1/&update.distrib=FROMLEADER&wt=javabin&version=2} status=0 QTime=1 
[junit4:junit4]   2> 15770 T1738 C183 P27215 /update {wt=javabin&version=2} {add=[130 (1413383198328487936)]} 0 5
[junit4:junit4]   2> 15773 T1706 C184 P27201 /update {wt=javabin&version=2} {add=[131 (1413383198335827968)]} 0 1
[junit4:junit4]   2> 15781 T1758 C182 P27225 REQ /update {update.distrib=FROMLEADER&distrib.from=http://127.0.0.1:27215/solr/collection1/&wt=javabin&version=2} status=0 QTime=1 
[junit4:junit4]   2> 15782 T1736 C183 P27215 REQ /update {distrib.from=http://127.0.0.1:27209/solr/collection1/&update.distrib=TOLEADER&wt=javabin&version=2} status=0 QTime=5 
[junit4:junit4]   2> 15782 T1722 C181 P27209 /update {wt=javabin&version=2} {add=[131]} 0 7
[junit4:junit4]   2> 15786 T1706 C184 P27201 /update {wt=javabin&version=2} {add=[132 (1413383198349459456)]} 0 1
[junit4:junit4]   2> 15795 T1744 C180 P27218 REQ /update {update.distrib=FROMLEADER&distrib.from=http://127.0.0.1:27209/solr/collection1/&wt=javabin&version=2} status=0 QTime=1 
[junit4:junit4]   2> 15795 T1726 C181 P27209 REQ /update {distrib.from=http://127.0.0.1:27215/solr/collection1/&update.distrib=TOLEADER&wt=javabin&version=2} status=0 QTime=4 
[junit4:junit4]   2> 15795 T1738 C183 P27215 /update {wt=javabin&version=2} {add=[132]} 0 6
[junit4:junit4]   2> 15809 T1706 C184 P27201 /update {wt=javabin&version=2} {add=[133 (1413383198363090944)]} 0 11
[junit4:junit4]   2> 15818 T1744 C180 P27218 REQ /update {update.distrib=FROMLEADER&distrib.from=http://127.0.0.1:27209/solr/collection1/&wt=javabin&version=2} status=0 QTime=1 
[junit4:junit4]   2> 15818 T1726 C181 P27209 REQ /update {distrib.from=http://127.0.0.1:27215/solr/collection1/&update.distrib=TOLEADER&wt=javabin&version=2} status=0 QTime=4 
[junit4:junit4]   2> 15818 T1738 C183 P27215 /update {wt=javabin&version=2} {add=[133]} 0 6
[junit4:junit4]   2> 15823 T1706 C184 P27201 /update {wt=javabin&version=2} {add=[134 (1413383198387208192)]} 0 2
[junit4:junit4]   2> 15830 T1758 C182 P27225 REQ /update {distrib.from=http://127.0.0.1:27215/solr/collection1/&update.distrib=FROMLEADER&wt=javabin&version=2} status=0 QTime=1 
[junit4:junit4]   2> 15831 T1738 C183 P27215 /update {wt=javabin&version=2} {add=[134 (1413383198392451072)]} 0 5
[junit4:junit4]   2> 15834 T1706 C184 P27201 /update {wt=javabin&version=2} {add=[135 (1413383198399791104)]} 0 1
[junit4:junit4]   2> 15841 T1744 C180 P27218 REQ /update {update.distrib=FROMLEADER&distrib.from=http://127.0.0.1:27209/solr/collection1/&wt=javabin&version=2} status=0 QTime=0 
[junit4:junit4]   2> 15842 T1726 C181 P27209 REQ /update {distrib.from=http://127.0.0.1:27215/solr/collection1/&update.distrib=TOLEADER&wt=javabin&version=2} status=0 QTime=3 
[junit4:junit4]   2> 15842 T1738 C183 P27215 /update {wt=javabin&version=2} {add=[135]} 0 6
[junit4:junit4]   2> 15846 T1706 C184 P27201 /update {wt=javabin&version=2} {add=[136 (1413383198412374016)]} 0 1
[junit4:junit4]   2> 15854 T1758 C182 P27225 REQ /update {update.distrib=FROMLEADER&distrib.from=http://127.0.0.1:27215/solr/collection1/&wt=javabin&version=2} status=0 QTime=1 
[junit4:junit4]   2> 15855 T1736 C183 P27215 REQ /update {distrib.from=http://127.0.0.1:27209/solr/collection1/&update.distrib=TOLEADER&wt=javabin&version=2} status=0 QTime=5 
[junit4:junit4]   2> 15855 T1722 C181 P27209 /update {wt=javabin&version=2} {add=[136]} 0 7
[junit4:junit4]   2> 15859 T1706 C184 P27201 /update {wt=javabin&version=2} {add=[137 (1413383198426005504)]} 0 1
[junit4:junit4]   2> 15867 T1758 C182 P27225 REQ /update {update.distrib=FROMLEADER&distrib.from=http://127.0.0.1:27215/solr/collection1/&wt=javabin&version=2} status=0 QTime=1 
[junit4:junit4]   2> 15867 T1736 C183 P27215 REQ /update {distrib.from=http://127.0.0.1:27209/solr/collection1/&update.distrib=TOLEADER&wt=javabin&version=2} status=0 QTime=4 
[junit4:junit4]   2> 15868 T1722 C181 P27209 /update {wt=javabin&version=2} {add=[137]} 0 7
[junit4:junit4]   2> 15872 T1706 C184 P27201 /update {wt=javabin&version=2} {add=[138 (1413383198439636992)]} 0 1
[junit4:junit4]   2> 15880 T1744 C180 P27218 REQ /update {update.distrib=FROMLEADER&distrib.from=http://127.0.0.1:27209/solr/collection1/&wt=javabin&version=2} status=0 QTime=1 
[junit4:junit4]   2> 15880 T1726 C181 P27209 REQ /update {distrib.from=http://127.0.0.1:27215/solr/collection1/&update.distrib=TOLEADER&wt=javabin&version=2} status=0 QTime=4 
[junit4:junit4]   2> 15880 T1738 C183 P27215 /update {wt=javabin&version=2} {add=[138]} 0 6
[junit4:junit4]   2> 15883 T1706 C184 P27201 /update {wt=javabin&version=2} {add=[139 (1413383198452219904)]} 0 0
[junit4:junit4]   2> 15891 T1758 C182 P27225 REQ /update {distrib.from=http://127.0.0.1:27215/solr/collection1/&update.distrib=FROMLEADER&wt=javabin&version=2} status=0 QTime=1 
[junit4:junit4]   2> 15891 T1738 C183 P27215 /update {wt=javabin&version=2} {add=[139 (1413383198456414208)]} 0 4
[junit4:junit4]   2> 15895 T1706 C184 P27201 /update {wt=javabin&version=2} {add=[140 (1413383198463754240)]} 0 1
[junit4:junit4]   2> 15903 T1758 C182 P27225 REQ /update {update.distrib=FROMLEADER&distrib.from=http://127.0.0.1:27215/solr/collection1/&wt=javabin&version=2} status=0 QTime=1 
[junit4:junit4]   2> 15904 T1736 C183 P27215 REQ /update {distrib.from=http://127.0.0.1:27209/solr/collection1/&update.distrib=TOLEADER&wt=javabin&version=2} status=0 QTime=5 
[junit4:junit4]   2> 15904 T1722 C181 P27209 /update {wt=javabin&version=2} {add=[140]} 0 7
[junit4:junit4]   2> 15908 T1706 C184 P27201 /update {wt=javabin&version=2} {add=[141 (1413383198477385728)]} 0 1
[junit4:junit4]   2> 15915 T1758 C182 P27225 REQ /update {distrib.from=http://127.0.0.1:27215/solr/collection1/&update.distrib=FROMLEADER&wt=javabin&version=2} status=0 QTime=1 
[junit4:junit4]   2> 15915 T1738 C183 P27215 /update {wt=javabin&version=2} {add=[141 (1413383198481580032)]} 0 4
[junit4:junit4]   2> 15919 T1706 C184 P27201 /update {wt=javabin&version=2} {add=[142 (1413383198488920064)]} 0 1
[junit4:junit4]   2> 15944 T1758 C182 P27225 REQ /update {update.distrib=FROMLEADER&distrib.from=http://127.0.0.1:27215/solr/collection1/&wt=javabin&version=2} status=0 QTime=11 
[junit4:junit4]   2> 15944 T1736 C183 P27215 REQ /update {distrib.from=http://127.0.0.1:27209/solr/collection1/&update.distrib=TOLEADER&wt=javabin&version=2} status=0 QTime=21 
[junit4:junit4]   2> 15945 T1722 C181 P27209 /update {wt=javabin&version=2} {add=[142]} 0 24
[junit4:junit4]   2> 15958 T1706 C184 P27201 /update {wt=javabin&version=2} {add=[143 (1413383198519328768)]} 0 11
[junit4:junit4]   2> 15969 T1758 C182 P27225 REQ /update {update.distrib=FROMLEADER&distrib.from=http://127.0.0.1:27215/solr/collection1/&wt=javabin&version=2} status=0 QTime=2 
[junit4:junit4]   2> 15970 T1736 C183 P27215 REQ /update {distrib.from=http://127.0.0.1:27209/solr/collection1/&update.distrib=TOLEADER&wt=javabin&version=2} status=0 QTime=6 
[junit4:junit4]   2> 15970 T1722 C181 P27209 /update {wt=javabin&version=2} {add=[143]} 0 9
[junit4:junit4]   2> 15975 T1706 C184 P27201 /update {wt=javabin&version=2} {add=[144 (1413383198546591744)]} 0 2
[junit4:junit4]   2> 15981 T1758 C182 P27225 REQ /update {distrib.from=http://127.0.0.1:27215/solr/collection1/&update.distrib=FROMLEADER&wt=javabin&version=2} status=0 QTime=1 
[junit4:junit4]   2> 15981 T1738 C183 P27215 /update {wt=javabin&version=2} {add=[144 (1413383198550786048)]} 0 4
[junit4:junit4]   2> 15985 T1706 C184 P27201 /update {wt=javabin&version=2} {add=[145 (1413383198558126080)]} 0 1
[junit4:junit4]   2> 15994 T1758 C182 P27225 REQ /update {update.distrib=FROMLEADER&distrib.from=http://127.0.0.1:27215/solr/collection1/&wt=javabin&version=2} status=0 QTime=1 
[junit4:junit4]   2> 15995 T1736 C183 P27215 REQ /update {distrib.from=http://127.0.0.1:27209/solr/collection1/&update.distrib=TOLEADER&wt=javabin&version=2} status=0 QTime=4 
[junit4:junit4]   2> 15995 T1722 C181 P27209 /update {wt=javabin&version=2} {add=[145]} 0 7
[junit4:junit4]   2> 15999 T1706 C184 P27201 /update {wt=javabin&version=2} {add=[146 (1413383198572806144)]} 0 1
[junit4:junit4]   2> 16025 T1744 C180 P27218 REQ /update {distrib.from=http://127.0.0.1:27209/solr/collection1/&update.distrib=FROMLEADER&wt=javabin&version=2} status=0 QTime=11 
[junit4:junit4]   2> 16025 T1722 C181 P27209 /update {wt=javabin&version=2} {add=[146 (1413383198575951872)]} 0 24
[junit4:junit4]   2> 16029 T1706 C184 P27201 /update {wt=javabin&version=2} {add=[147 (1413383198604263424)]} 0 1
[junit4:junit4]   2> 16038 T1758 C182 P27225 REQ /update {update.distrib=FROMLEADER&distrib.from=http://127.0.0.1:27215/solr/collection1/&wt=javabin&version=2} status=0 QTime=1 
[junit4:junit4]   2> 16039 T1736 C183 P27215 REQ /update {distrib.from=http://127.0.0.1:27209/solr/collection1/&update.distrib=TOLEADER&wt=javabin&version=2} status=0 QTime=5 
[junit4:junit4]   2> 16040 T1722 C181 P27209 /update {wt=javabin&version=2} {add=[147]} 0 8
[junit4:junit4]   2> 16043 T1706 C184 P27201 /update {wt=javabin&version=2} {add=[148 (1413383198618943488)]} 0 1
[junit4:junit4]   2> 16052 T1744 C180 P27218 REQ /update {distrib.from=http://127.0.0.1:27209/solr/collection1/&update.distrib=FROMLEADER&wt=javabin&version=2} status=0 QTime=2 
[junit4:junit4]   2> 16052 T1722 C181 P27209 /update {wt=javabin&version=2} {add=[148 (1413383198623137792)]} 0 6
[junit4:junit4]   2> 16056 T1706 C184 P27201 /update {wt=javabin&version=2} {add=[149 (1413383198632574976)]} 0 1
[junit4:junit4]   2> 16066 T1758 C182 P27225 REQ /update {update.distrib=FROMLEADER&distrib.from=http://127.0.0.1:27215/solr/collection1/&wt=javabin&version=2} status=0 QTime=2 
[junit4:junit4]   2> 16066 T1736 C183 P27215 REQ /update {distrib.from=http://127.0.0.1:27209/solr/collection1/&update.distrib=TOLEADER&wt=javabin&version=2} status=0 QTime=5 
[junit4:junit4]   2> 16067 T1722 C181 P27209 /update {wt=javabin&version=2} {add=[149]} 0 8
[junit4:junit4]   2> 16067 T1694 oasc.AbstractDistribZkTestBase.waitForRecoveriesToFinish Wait for recoveries to finish - collection: collection1 failOnTimeout:true timeout (sec):1800
[junit4:junit4]   2> 16068 T1694 oascc.ZkStateReader.updateClusterState Updating cloud state from ZooKeeper... 
[junit4:junit4]   2> 16071 T1706 C184 P27201 oasu.DirectUpdateHandler2.commit start commit{flags=0,_version_=0,optimize=false,openSearcher=true,waitSearcher=true,expungeDeletes=false,softCommit=false}
[junit4:junit4]   2> 16721 T1706 C184 P27201 oasc.SolrDeletionPolicy.onCommit SolrDeletionPolicy.onCommit: commits:num=2
[junit4:junit4]   2> 		commit{dir=NRTCachingDirectory(org.apache.lucene.store.NIOFSDirectory@/usr/home/hudson/hudson-slave/workspace/Lucene-Solr-Tests-trunk-Java6/solr/build/solr-core/test/J0/org.apache.solr.cloud.BasicDistributedZk2Test-1347907239725/control/data/index lockFactory=org.apache.lucene.store.NativeFSLockFactory@c767c97; maxCacheMB=48.0 maxMergeSizeMB=4.0),segFN=segments_2,generation=2,filenames=[_0.fnm, _0_Pulsing40_0.tim, _0_Memory_0.ram, _0_MockVariableIntBlock_0.doc, _0_nrm.cfs, _0_MockVariableIntBlock_0.skp, _0_Pulsing40_0.prx, _0_Direct_0.frq, _0_Pulsing40_0.frq, _0_MockVariableIntBlock_0.pyl, _0_MockVariableIntBlock_0.tib, _0_MockVariableIntBlock_0.frq, _0_nrm.cfe, _0_MockVariableIntBlock_0.pos, _0_Pulsing40_0.tip, segments_2, _0_Direct_0.tip, _0.fdx, _0_Direct_0.prx, _0.si, _0_Direct_0.tim, _0_MockVariableIntBlock_0.tii, _0.fdt]
[junit4:junit4]   2> 		commit{dir=NRTCachingDirectory(org.apache.lucene.store.NIOFSDirectory@/usr/home/hudson/hudson-slave/workspace/Lucene-Solr-Tests-trunk-Java6/solr/build/solr-core/test/J0/org.apache.solr.cloud.BasicDistributedZk2Test-1347907239725/control/data/index lockFactory=org.apache.lucene.store.NativeFSLockFactory@c767c97; maxCacheMB=48.0 maxMergeSizeMB=4.0),segFN=segments_3,generation=3,filenames=[_5_nrm.cfe, _2_Direct_0.tip, _5_Memory_0.ram, _2_Direct_0.tim, _3_MockVariableIntBlock_0.frq, _7.si, _6_Direct_0.tip, _6_Direct_0.tim, _3.fdt, _4_MockVariableIntBlock_0.tii, _0_Pulsing40_0.frq, _7_Memory_0.ram, _7.fnm, _5_MockVariableIntBlock_0.tii, _6_MockVariableIntBlock_0.tii, _5_Direct_0.prx, _6_MockVariableIntBlock_0.tib, _0_Pulsing40_0.tim, _1_MockVariableIntBlock_0.tii, _0_Memory_0.ram, _4_MockVariableIntBlock_0.doc, _2.fdt, _7.fdx, _7_MockVariableIntBlock_0.frq, _2.fdx, _7.fdt, _1_MockVariableIntBlock_0.tib, _1.fdx, _4_MockVariableIntBlock_0.tib, _5_nrm.cfs, _1.fdt, _0_MockVariableIntBlock_0.frq, _3.si, _6.fdt, _2_MockVariableIntBlock_0.skp, _6_Memory_0.ram, _2.si, _1_MockVariableIntBlock_0.skp, _5_Direct_0.tim, _2_Pulsing40_0.tim, _7_MockVariableIntBlock_0.pos, _2_MockVariableIntBlock_0.pyl, _0_MockVariableIntBlock_0.doc, _6.fdx, _2_Pulsing40_0.tip, _1_MockVariableIntBlock_0.pyl, _3.fnm, _2_MockVariableIntBlock_0.doc, _3_MockVariableIntBlock_0.tii, _0_MockVariableIntBlock_0.pyl, _1_Memory_0.ram, _2_nrm.cfe, _1_MockVariableIntBlock_0.doc, _0_Pulsing40_0.tip, _0_MockVariableIntBlock_0.pos, _7_MockVariableIntBlock_0.skp, _2_nrm.cfs, _5_Direct_0.tip, _7_MockVariableIntBlock_0.pyl, _2_MockVariableIntBlock_0.tii, _5_MockVariableIntBlock_0.tib, _2_MockVariableIntBlock_0.tib, _1_MockVariableIntBlock_0.pos, _4_MockVariableIntBlock_0.frq, _1_Direct_0.prx, _6_Direct_0.prx, _5_MockVariableIntBlock_0.frq, _2.fnm, _3.fdx, _1.si, _3_MockVariableIntBlock_0.pyl, _6.si, _6.fnm, _0_Direct_0.tip, _0_Direct_0.prx, _7_MockVariableIntBlock_0.tib, _0_Direct_0.tim, _1_Direct_0.frq, _3_MockVariableIntBlock_0.pos, _3_nrm.cfe, _3_Direct_0.frq, _5.fdt, _1_Pulsing40_0.tip, _5_MockVariableIntBlock_0.pyl, _1_Pulsing40_0.tim, _4.fnm, _4_nrm.cfe, _0_MockVariableIntBlock_0.skp, _0_Pulsing40_0.prx, _7_MockVariableIntBlock_0.doc, _1.fnm, _1_Pulsing40_0.frq, _4.fdx, _4_Direct_0.frq, _1_Pulsing40_0.prx, _7_Direct_0.tim, _7_MockVariableIntBlock_0.tii, _1_Direct_0.tim, _3_Direct_0.prx, _7_Direct_0.tip, _6_MockVariableIntBlock_0.frq, _6_MockVariableIntBlock_0.doc, _1_Direct_0.tip, _2_Pulsing40_0.prx, _2_MockVariableIntBlock_0.pos, _3_Direct_0.tip, _5_MockVariableIntBlock_0.pos, _0.fnm, _4_Direct_0.tim, _3_MockVariableIntBlock_0.doc, _5_Direct_0.frq, _0_Direct_0.frq, _2_Pulsing40_0.frq, _5.si, _3_nrm.cfs, _4_MockVariableIntBlock_0.pyl, _4_Direct_0.prx, _4_Memory_0.ram, _7_Direct_0.frq, _4_nrm.cfs, _4_Direct_0.tip, _3_MockVariableIntBlock_0.tib, _3_Direct_0.tim, _5_MockVariableIntBlock_0.doc, _6_MockVariableIntBlock_0.pyl, _2_MockVariableIntBlock_0.frq, _6_nrm.cfs, _4_MockVariableIntBlock_0.skp, _7_nrm.cfs, _0_MockVariableIntBlock_0.tib, _5_MockVariableIntBlock_0.skp, _6_MockVariableIntBlock_0.pos, _4_MockVariableIntBlock_0.pos, _2_Memory_0.ram, _0.si, _3_Memory_0.ram, _0_MockVariableIntBlock_0.tii, _1_nrm.cfs, _5.fnm, _7_nrm.cfe, _6_nrm.cfe, _0_nrm.cfs, _4.fdt, _4.si, _6_MockVariableIntBlock_0.skp, _1_nrm.cfe, _1_MockVariableIntBlock_0.frq, _2_Direct_0.prx, _7_Direct_0.prx, _0_nrm.cfe, _5.fdx, _0.fdx, _2_Direct_0.frq, _6_Direct_0.frq, _3_MockVariableIntBlock_0.skp, segments_3, _0.fdt]
[junit4:junit4]   2> 16722 T1706 C184 P27201 oasc.SolrDeletionPolicy.updateCommits newest commit = 3
[junit4:junit4]   2> 16788 T1706 C184 P27201 oass.SolrIndexSearcher.<init> Opening Searcher@1d545074 main
[junit4:junit4]   2> 16789 T1706 C184 P27201 oasu.DirectUpdateHandler2.commit end_commit_flush
[junit4:junit4]   2> 16789 T1717 oasc.SolrCore.registerSearcher [collection1] Registered new searcher Searcher@1d545074 main{StandardDirectoryReader(segments_3:17 _0(5.0):C1 _1(5.0):C10 _2(5.0):C10 _3(5.0):C10 _4(5.0):C10 _5(5.0):C10 _6(5.0):C10 _7(5.0):C6)}
[junit4:junit4]   2> 16790 T1706 C184 P27201 /update {waitSearcher=true&wt=javabin&commit=true&softCommit=false&version=2} {commit=} 0 719
[junit4:junit4]   2> 16792 T1722 C181 P27209 oasu.DirectUpdateHandler2.commit start commit{flags=0,_version_=0,optimize=false,openSearcher=true,waitSearcher=true,expungeDeletes=false,softCommit=false}
[junit4:junit4]   2> 17080 T1722 C181 P27209 oas

[...truncated too long message...]

lectionContext.java:213)
[junit4:junit4]   2> 	at org.apache.solr.cloud.LeaderElector.runIamLeaderProcess(LeaderElector.java:158)
[junit4:junit4]   2> 	at org.apache.solr.cloud.LeaderElector.checkIfIamLeader(LeaderElector.java:102)
[junit4:junit4]   2> 	at org.apache.solr.cloud.LeaderElector.access$000(LeaderElector.java:56)
[junit4:junit4]   2> 	at org.apache.solr.cloud.LeaderElector$1.process(LeaderElector.java:131)
[junit4:junit4]   2> 	at org.apache.zookeeper.ClientCnxn$EventThread.processEvent(ClientCnxn.java:526)
[junit4:junit4]   2> 	at org.apache.zookeeper.ClientCnxn$EventThread.run(ClientCnxn.java:502)
[junit4:junit4]   2> 
[junit4:junit4]   2> 306574 T1766 oasc.JmxMonitoredMap$SolrDynamicMBean.getMBeanInfo WARNING Could not getStatistics on info bean Lazy[solr.ReplicationHandler] java.lang.IllegalArgumentException: /usr/home/hudson/hudson-slave/workspace/Lucene-Solr-Tests-trunk-Java6/solr/build/solr-core/test/J0/org.apache.solr.cloud.BasicDistributedZk2Test-1347907239725/jetty4/index does not exist
[junit4:junit4]   2> 	at org.apache.commons.io.FileUtils.sizeOfDirectory(FileUtils.java:2074)
[junit4:junit4]   2> 	at org.apache.solr.handler.ReplicationHandler.getIndexSize(ReplicationHandler.java:477)
[junit4:junit4]   2> 	at org.apache.solr.handler.ReplicationHandler.getStatistics(ReplicationHandler.java:525)
[junit4:junit4]   2> 	at org.apache.solr.core.RequestHandlers$LazyRequestHandlerWrapper.getStatistics(RequestHandlers.java:310)
[junit4:junit4]   2> 	at org.apache.solr.core.JmxMonitoredMap$SolrDynamicMBean.getMBeanInfo(JmxMonitoredMap.java:231)
[junit4:junit4]   2> 	at com.sun.jmx.interceptor.DefaultMBeanServerInterceptor.getClassName(DefaultMBeanServerInterceptor.java:1824)
[junit4:junit4]   2> 	at com.sun.jmx.interceptor.DefaultMBeanServerInterceptor.safeGetClassName(DefaultMBeanServerInterceptor.java:1661)
[junit4:junit4]   2> 	at com.sun.jmx.interceptor.DefaultMBeanServerInterceptor.checkMBeanPermission(DefaultMBeanServerInterceptor.java:1833)
[junit4:junit4]   2> 	at com.sun.jmx.interceptor.DefaultMBeanServerInterceptor.exclusiveUnregisterMBean(DefaultMBeanServerInterceptor.java:436)
[junit4:junit4]   2> 	at com.sun.jmx.interceptor.DefaultMBeanServerInterceptor.unregisterMBean(DefaultMBeanServerInterceptor.java:421)
[junit4:junit4]   2> 	at com.sun.jmx.mbeanserver.JmxMBeanServer.unregisterMBean(JmxMBeanServer.java:540)
[junit4:junit4]   2> 	at org.apache.solr.core.JmxMonitoredMap.unregister(JmxMonitoredMap.java:175)
[junit4:junit4]   2> 	at org.apache.solr.core.JmxMonitoredMap.clear(JmxMonitoredMap.java:116)
[junit4:junit4]   2> 	at org.apache.solr.core.SolrCore.close(SolrCore.java:864)
[junit4:junit4]   2> 	at org.apache.solr.cloud.ShardLeaderElectionContext.runLeaderProcess(ElectionContext.java:213)
[junit4:junit4]   2> 	at org.apache.solr.cloud.LeaderElector.runIamLeaderProcess(LeaderElector.java:158)
[junit4:junit4]   2> 	at org.apache.solr.cloud.LeaderElector.checkIfIamLeader(LeaderElector.java:102)
[junit4:junit4]   2> 	at org.apache.solr.cloud.LeaderElector.access$000(LeaderElector.java:56)
[junit4:junit4]   2> 	at org.apache.solr.cloud.LeaderElector$1.process(LeaderElector.java:131)
[junit4:junit4]   2> 	at org.apache.zookeeper.ClientCnxn$EventThread.processEvent(ClientCnxn.java:526)
[junit4:junit4]   2> 	at org.apache.zookeeper.ClientCnxn$EventThread.run(ClientCnxn.java:502)
[junit4:junit4]   2> 
[junit4:junit4]   2> 306577 T1766 oasc.SolrCore.closeSearcher [collection1] Closing main searcher on request.
[junit4:junit4]   2> 306578 T1766 oasu.DirectUpdateHandler2.close closing DirectUpdateHandler2{commits=5,autocommits=0,soft autocommits=0,optimizes=0,rollbacks=0,expungeDeletes=0,docsPending=0,adds=0,deletesById=0,deletesByQuery=0,errors=0,cumulative_adds=35,cumulative_deletesById=0,cumulative_deletesByQuery=0,cumulative_errors=0}
[junit4:junit4]   2> 306579 T1766 oasu.DefaultSolrCoreState.decref SolrCoreState ref count has reached 0 - closing IndexWriter
[junit4:junit4]   2> 306580 T1766 oasu.DefaultSolrCoreState.decref Closing SolrCoreState - canceling any ongoing recovery
[junit4:junit4]   2> 306580 T1766 oascc.ZkStateReader$3.process Updating live nodes
[junit4:junit4]   2> 306581 T1766 oascc.ZkStateReader$3.process WARNING ZooKeeper watch triggered, but Solr cannot talk to ZK
[junit4:junit4]   2> 306581 T1766 oascc.ZkStateReader$2.process A cluster state change has occurred - updating...
[junit4:junit4]   2> 306581 T1766 oascc.ZkStateReader$2.process WARNING ZooKeeper watch triggered, but Solr cannot talk to ZK
[junit4:junit4]   2> 306581 T1766 oascc.ConnectionManager.process Watcher org.apache.solr.common.cloud.ConnectionManager@2e24cb85 name:ZooKeeperConnection Watcher:127.0.0.1:27198/solr got event WatchedEvent state:Disconnected type:None path:null path:null type:None
[junit4:junit4]   2> 306581 T1766 oascc.ConnectionManager.process Client->ZooKeeper status change trigger but we are already closed
[junit4:junit4]   2> 306581 T1766 oaz.ClientCnxn$EventThread.run EventThread shut down
[junit4:junit4]   2> NOTE: test params are: codec=Lucene40: {n_f1=MockVariableIntBlock(baseBlockSize=109), foo_b=Pulsing40(freqCutoff=17 minBlockSize=22 maxBlockSize=67), foo_d=PostingsFormat(name=Memory doPackFST= true), foo_f=Pulsing40(freqCutoff=17 minBlockSize=22 maxBlockSize=67), n_tl1=MockVariableIntBlock(baseBlockSize=109), n_d1=PostingsFormat(name=Direct), rnd_b=PostingsFormat(name=Memory doPackFST= true), intDefault=MockVariableIntBlock(baseBlockSize=109), n_td1=MockVariableIntBlock(baseBlockSize=109), id=PostingsFormat(name=Memory doPackFST= true), timestamp=PostingsFormat(name=Direct), range_facet_sl=PostingsFormat(name=Memory doPackFST= true), range_facet_si=PostingsFormat(name=Direct), oddField_s=PostingsFormat(name=Memory doPackFST= true), multiDefault=PostingsFormat(name=Direct), n_tf1=PostingsFormat(name=Direct), n_dt1=MockVariableIntBlock(baseBlockSize=109), n_ti1=PostingsFormat(name=Memory doPackFST= true), range_facet_l=PostingsFormat(name=Direct), text=Pulsing40(freqCutoff=17 minBlockSize=22 maxBlockSize=67), _version_=MockVariableIntBlock(baseBlockSize=109), SubjectTerms_mfacet=MockVariableIntBlock(baseBlockSize=109), a_t=PostingsFormat(name=Direct), n_tdt1=MockVariableIntBlock(baseBlockSize=109), other_tl1=MockVariableIntBlock(baseBlockSize=109), n_l1=PostingsFormat(name=Direct), a_si=MockVariableIntBlock(baseBlockSize=109)}, sim=DefaultSimilarity, locale=hr_HR, timezone=America/Denver
[junit4:junit4]   2> NOTE: FreeBSD 9.0-RELEASE amd64/Sun Microsystems Inc. 1.6.0_32 (64-bit)/cpus=16,threads=2,free=46495296,total=266076160
[junit4:junit4]   2> NOTE: All tests run in this JVM: [TestFastWriter, DateMathParserTest, TestPseudoReturnFields, SOLR749Test, FieldAnalysisRequestHandlerTest, BadComponentTest, SuggesterWFSTTest, TestIBSimilarityFactory, PluginInfoTest, LoggingHandlerTest, TestSolrJ, TestCollationField, TestExtendedDismaxParser, NoCacheHeaderTest, TestGroupingSearch, TestElisionMultitermQuery, TestSearchPerf, SpatialFilterTest, TestJoin, ZkControllerTest, QueryElevationComponentTest, TestLuceneMatchVersion, JsonLoaderTest, MBeansHandlerTest, TestSolrQueryParser, DirectSolrConnectionTest, TestPerFieldSimilarity, DateFieldTest, TestIndexSearcher, FileBasedSpellCheckerTest, UniqFieldsUpdateProcessorFactoryTest, DistributedTermsComponentTest, FastVectorHighlighterTest, TestWordDelimiterFilterFactory, TestBinaryResponseWriter, SolrRequestParserTest, WordBreakSolrSpellCheckerTest, SolrCoreCheckLockOnStartupTest, CSVRequestHandlerTest, SolrPluginUtilsTest, TestConfig, TestLFUCache, DirectUpdateHandlerOptimizeTest, NumericFieldsTest, SearchHandlerTest, TestIndexingPerformance, TestCoreContainer, LeaderElectionIntegrationTest, SimpleFacetsTest, AnalysisAfterCoreReloadTest, SimplePostToolTest, SystemInfoHandlerTest, BasicDistributedZkTest, LeaderElectionTest, DistributedSpellCheckComponentTest, TestDistributedGrouping, SpellCheckCollatorTest, AutoCommitTest, ZkSolrClientTest, TestFaceting, TestRecovery, ConvertedLegacyTest, PeerSyncTest, SortByFunctionTest, TestJmxIntegration, SampleTest, CoreAdminHandlerTest, TestFunctionQuery, TestRemoteStreaming, CacheHeaderTest, PolyFieldTest, IndexSchemaTest, QueryParsingTest, DistanceFunctionTest, MinimalSchemaTest, TestPHPSerializedResponseWriter, TermVectorComponentTest, TestSurroundQueryParser, IndexSchemaRuntimeFieldTest, DebugComponentTest, ReturnFieldsTest, SuggesterFSTTest, TestArbitraryIndexDir, NotRequiredUniqueKeyTest, BadIndexSchemaTest, UpdateRequestProcessorFactoryTest, TestPropInject, AlternateDirectoryTest, TestUpdate, TestBinaryField, TestPropInjectDefaults, TestMergePolicyConfig, TestDocSet, TestQuerySenderNoQuery, TestJmxMonitoredMap, EchoParamsTest, TestBM25SimilarityFactory, TestLMDirichletSimilarityFactory, TestLMJelinekMercerSimilarityFactory, TestCodecSupport, TestFastLRUCache, ResourceLoaderTest, SpellingQueryConverterTest, TestBadConfig, BasicDistributedZk2Test]
[junit4:junit4] Completed on J0 in 307.02s, 1 test, 1 failure <<< FAILURES!

[...truncated 5 lines...]
BUILD FAILED
/usr/home/hudson/hudson-slave/workspace/Lucene-Solr-Tests-trunk-Java6/build.xml:32: The following error occurred while executing this line:
/usr/home/hudson/hudson-slave/workspace/Lucene-Solr-Tests-trunk-Java6/solr/build.xml:146: The following error occurred while executing this line:
/usr/home/hudson/hudson-slave/workspace/Lucene-Solr-Tests-trunk-Java6/lucene/module-build.xml:63: The following error occurred while executing this line:
/usr/home/hudson/hudson-slave/workspace/Lucene-Solr-Tests-trunk-Java6/lucene/common-build.xml:1133: The following error occurred while executing this line:
/usr/home/hudson/hudson-slave/workspace/Lucene-Solr-Tests-trunk-Java6/lucene/common-build.xml:810: There were test failures: 230 suites, 950 tests, 1 failure, 8 ignored (3 assumptions)

Total time: 30 minutes 36 seconds
Build step 'Invoke Ant' marked build as failure
Recording test results
Email was triggered for: Failure
Sending email for trigger: Failure



Mime
View raw message