lucene-dev mailing list archives

Site index · List index
Message view « Date » · « Thread »
Top « Date » · « Thread »
From Apache Jenkins Server <jenk...@builds.apache.org>
Subject [JENKINS-MAVEN] Lucene-Solr-Maven-4.x #82: POMs out of sync
Date Sun, 02 Sep 2012 14:10:33 GMT
Build: https://builds.apache.org/job/Lucene-Solr-Maven-4.x/82/

3 tests failed.
FAILED:  org.apache.solr.handler.extraction.ExtractingRequestHandlerTest.testLiteralsOverride

Error Message:
ERROR: [doc=three] unknown field 'meta:save-date'

Stack Trace:
org.apache.solr.common.SolrException: ERROR: [doc=three] unknown field 'meta:save-date'
	at __randomizedtesting.SeedInfo.seed([CB4CEB8374C84B8E:F327AA6DA687274F]:0)
	at org.apache.solr.update.DocumentBuilder.toDocument(DocumentBuilder.java:306)
	at org.apache.solr.update.AddUpdateCommand.getLuceneDocument(AddUpdateCommand.java:73)
	at org.apache.solr.update.DirectUpdateHandler2.addDoc(DirectUpdateHandler2.java:208)
	at org.apache.solr.update.processor.RunUpdateProcessor.processAdd(RunUpdateProcessorFactory.java:61)
	at org.apache.solr.update.processor.UpdateRequestProcessor.processAdd(UpdateRequestProcessor.java:51)
	at org.apache.solr.update.processor.DistributedUpdateProcessor.versionAdd(DistributedUpdateProcessor.java:463)
	at org.apache.solr.update.processor.DistributedUpdateProcessor.processAdd(DistributedUpdateProcessor.java:342)
	at org.apache.solr.handler.extraction.ExtractingDocumentLoader.doAdd(ExtractingDocumentLoader.java:121)
	at org.apache.solr.handler.extraction.ExtractingDocumentLoader.addDoc(ExtractingDocumentLoader.java:126)
	at org.apache.solr.handler.extraction.ExtractingDocumentLoader.load(ExtractingDocumentLoader.java:233)
	at org.apache.solr.handler.ContentStreamHandlerBase.handleRequestBody(ContentStreamHandlerBase.java:74)
	at org.apache.solr.handler.RequestHandlerBase.handleRequest(RequestHandlerBase.java:129)
	at org.apache.solr.core.SolrCore.execute(SolrCore.java:1692)
	at org.apache.solr.util.TestHarness.queryAndResponse(TestHarness.java:375)
	at org.apache.solr.handler.extraction.ExtractingRequestHandlerTest.loadLocal(ExtractingRequestHandlerTest.java:602)
	at org.apache.solr.handler.extraction.ExtractingRequestHandlerTest.testLiteralsOverride(ExtractingRequestHandlerTest.java:469)
	at sun.reflect.NativeMethodAccessorImpl.invoke0(Native Method)
	at sun.reflect.NativeMethodAccessorImpl.invoke(NativeMethodAccessorImpl.java:57)
	at sun.reflect.DelegatingMethodAccessorImpl.invoke(DelegatingMethodAccessorImpl.java:43)
	at java.lang.reflect.Method.invoke(Method.java:616)
	at com.carrotsearch.randomizedtesting.RandomizedRunner.invoke(RandomizedRunner.java:1559)
	at com.carrotsearch.randomizedtesting.RandomizedRunner.access$600(RandomizedRunner.java:79)
	at com.carrotsearch.randomizedtesting.RandomizedRunner$6.evaluate(RandomizedRunner.java:737)
	at com.carrotsearch.randomizedtesting.RandomizedRunner$7.evaluate(RandomizedRunner.java:773)
	at com.carrotsearch.randomizedtesting.RandomizedRunner$8.evaluate(RandomizedRunner.java:787)
	at com.carrotsearch.randomizedtesting.rules.SystemPropertiesRestoreRule$1.evaluate(SystemPropertiesRestoreRule.java:53)
	at org.apache.lucene.util.TestRuleSetupTeardownChained$1.evaluate(TestRuleSetupTeardownChained.java:50)
	at org.apache.lucene.util.TestRuleFieldCacheSanity$1.evaluate(TestRuleFieldCacheSanity.java:51)
	at org.apache.lucene.util.AbstractBeforeAfterRule$1.evaluate(AbstractBeforeAfterRule.java:45)
	at com.carrotsearch.randomizedtesting.rules.SystemPropertiesInvariantRule$1.evaluate(SystemPropertiesInvariantRule.java:55)
	at org.apache.lucene.util.TestRuleThreadAndTestName$1.evaluate(TestRuleThreadAndTestName.java:48)
	at org.apache.lucene.util.TestRuleIgnoreAfterMaxFailures$1.evaluate(TestRuleIgnoreAfterMaxFailures.java:70)
	at org.apache.lucene.util.TestRuleMarkFailure$1.evaluate(TestRuleMarkFailure.java:48)
	at com.carrotsearch.randomizedtesting.rules.StatementAdapter.evaluate(StatementAdapter.java:36)
	at com.carrotsearch.randomizedtesting.ThreadLeakControl$StatementRunner.run(ThreadLeakControl.java:345)
	at com.carrotsearch.randomizedtesting.ThreadLeakControl.forkTimeoutingTask(ThreadLeakControl.java:769)
	at com.carrotsearch.randomizedtesting.ThreadLeakControl$3.evaluate(ThreadLeakControl.java:429)
	at com.carrotsearch.randomizedtesting.RandomizedRunner.runSingleTest(RandomizedRunner.java:746)
	at com.carrotsearch.randomizedtesting.RandomizedRunner$3.evaluate(RandomizedRunner.java:648)
	at com.carrotsearch.randomizedtesting.RandomizedRunner$4.evaluate(RandomizedRunner.java:682)
	at com.carrotsearch.randomizedtesting.RandomizedRunner$5.evaluate(RandomizedRunner.java:693)
	at com.carrotsearch.randomizedtesting.rules.StatementAdapter.evaluate(StatementAdapter.java:36)
	at com.carrotsearch.randomizedtesting.rules.SystemPropertiesRestoreRule$1.evaluate(SystemPropertiesRestoreRule.java:53)
	at org.apache.lucene.util.AbstractBeforeAfterRule$1.evaluate(AbstractBeforeAfterRule.java:45)
	at org.apache.lucene.util.TestRuleStoreClassName$1.evaluate(TestRuleStoreClassName.java:42)
	at com.carrotsearch.randomizedtesting.rules.SystemPropertiesInvariantRule$1.evaluate(SystemPropertiesInvariantRule.java:55)
	at com.carrotsearch.randomizedtesting.rules.NoShadowingOrOverridesOnMethodsRule$1.evaluate(NoShadowingOrOverridesOnMethodsRule.java:39)
	at com.carrotsearch.randomizedtesting.rules.NoShadowingOrOverridesOnMethodsRule$1.evaluate(NoShadowingOrOverridesOnMethodsRule.java:39)
	at org.apache.lucene.util.TestRuleAssertionsRequired$1.evaluate(TestRuleAssertionsRequired.java:40)
	at org.apache.lucene.util.TestRuleMarkFailure$1.evaluate(TestRuleMarkFailure.java:48)
	at org.apache.lucene.util.TestRuleIgnoreAfterMaxFailures$1.evaluate(TestRuleIgnoreAfterMaxFailures.java:70)
	at org.apache.lucene.util.TestRuleIgnoreTestSuites$1.evaluate(TestRuleIgnoreTestSuites.java:55)
	at com.carrotsearch.randomizedtesting.rules.StatementAdapter.evaluate(StatementAdapter.java:36)
	at com.carrotsearch.randomizedtesting.ThreadLeakControl$StatementRunner.run(ThreadLeakControl.java:345)
	at java.lang.Thread.run(Thread.java:679)


FAILED:  org.apache.solr.handler.extraction.ExtractingRequestHandlerTest.testExtraction

Error Message:
ERROR: [doc=one] unknown field 'meta:save-date'

Stack Trace:
org.apache.solr.common.SolrException: ERROR: [doc=one] unknown field 'meta:save-date'
	at __randomizedtesting.SeedInfo.seed([CB4CEB8374C84B8E:723F9FFD08E09B7B]:0)
	at org.apache.solr.update.DocumentBuilder.toDocument(DocumentBuilder.java:306)
	at org.apache.solr.update.AddUpdateCommand.getLuceneDocument(AddUpdateCommand.java:73)
	at org.apache.solr.update.DirectUpdateHandler2.addDoc(DirectUpdateHandler2.java:208)
	at org.apache.solr.update.processor.RunUpdateProcessor.processAdd(RunUpdateProcessorFactory.java:61)
	at org.apache.solr.update.processor.UpdateRequestProcessor.processAdd(UpdateRequestProcessor.java:51)
	at org.apache.solr.update.processor.DistributedUpdateProcessor.versionAdd(DistributedUpdateProcessor.java:463)
	at org.apache.solr.update.processor.DistributedUpdateProcessor.processAdd(DistributedUpdateProcessor.java:342)
	at org.apache.solr.handler.extraction.ExtractingDocumentLoader.doAdd(ExtractingDocumentLoader.java:121)
	at org.apache.solr.handler.extraction.ExtractingDocumentLoader.addDoc(ExtractingDocumentLoader.java:126)
	at org.apache.solr.handler.extraction.ExtractingDocumentLoader.load(ExtractingDocumentLoader.java:233)
	at org.apache.solr.handler.ContentStreamHandlerBase.handleRequestBody(ContentStreamHandlerBase.java:74)
	at org.apache.solr.handler.RequestHandlerBase.handleRequest(RequestHandlerBase.java:129)
	at org.apache.solr.core.SolrCore.execute(SolrCore.java:1692)
	at org.apache.solr.util.TestHarness.queryAndResponse(TestHarness.java:375)
	at org.apache.solr.handler.extraction.ExtractingRequestHandlerTest.loadLocal(ExtractingRequestHandlerTest.java:602)
	at org.apache.solr.handler.extraction.ExtractingRequestHandlerTest.testExtraction(ExtractingRequestHandlerTest.java:62)
	at sun.reflect.NativeMethodAccessorImpl.invoke0(Native Method)
	at sun.reflect.NativeMethodAccessorImpl.invoke(NativeMethodAccessorImpl.java:57)
	at sun.reflect.DelegatingMethodAccessorImpl.invoke(DelegatingMethodAccessorImpl.java:43)
	at java.lang.reflect.Method.invoke(Method.java:616)
	at com.carrotsearch.randomizedtesting.RandomizedRunner.invoke(RandomizedRunner.java:1559)
	at com.carrotsearch.randomizedtesting.RandomizedRunner.access$600(RandomizedRunner.java:79)
	at com.carrotsearch.randomizedtesting.RandomizedRunner$6.evaluate(RandomizedRunner.java:737)
	at com.carrotsearch.randomizedtesting.RandomizedRunner$7.evaluate(RandomizedRunner.java:773)
	at com.carrotsearch.randomizedtesting.RandomizedRunner$8.evaluate(RandomizedRunner.java:787)
	at com.carrotsearch.randomizedtesting.rules.SystemPropertiesRestoreRule$1.evaluate(SystemPropertiesRestoreRule.java:53)
	at org.apache.lucene.util.TestRuleSetupTeardownChained$1.evaluate(TestRuleSetupTeardownChained.java:50)
	at org.apache.lucene.util.TestRuleFieldCacheSanity$1.evaluate(TestRuleFieldCacheSanity.java:51)
	at org.apache.lucene.util.AbstractBeforeAfterRule$1.evaluate(AbstractBeforeAfterRule.java:45)
	at com.carrotsearch.randomizedtesting.rules.SystemPropertiesInvariantRule$1.evaluate(SystemPropertiesInvariantRule.java:55)
	at org.apache.lucene.util.TestRuleThreadAndTestName$1.evaluate(TestRuleThreadAndTestName.java:48)
	at org.apache.lucene.util.TestRuleIgnoreAfterMaxFailures$1.evaluate(TestRuleIgnoreAfterMaxFailures.java:70)
	at org.apache.lucene.util.TestRuleMarkFailure$1.evaluate(TestRuleMarkFailure.java:48)
	at com.carrotsearch.randomizedtesting.rules.StatementAdapter.evaluate(StatementAdapter.java:36)
	at com.carrotsearch.randomizedtesting.ThreadLeakControl$StatementRunner.run(ThreadLeakControl.java:345)
	at com.carrotsearch.randomizedtesting.ThreadLeakControl.forkTimeoutingTask(ThreadLeakControl.java:769)
	at com.carrotsearch.randomizedtesting.ThreadLeakControl$3.evaluate(ThreadLeakControl.java:429)
	at com.carrotsearch.randomizedtesting.RandomizedRunner.runSingleTest(RandomizedRunner.java:746)
	at com.carrotsearch.randomizedtesting.RandomizedRunner$3.evaluate(RandomizedRunner.java:648)
	at com.carrotsearch.randomizedtesting.RandomizedRunner$4.evaluate(RandomizedRunner.java:682)
	at com.carrotsearch.randomizedtesting.RandomizedRunner$5.evaluate(RandomizedRunner.java:693)
	at com.carrotsearch.randomizedtesting.rules.StatementAdapter.evaluate(StatementAdapter.java:36)
	at com.carrotsearch.randomizedtesting.rules.SystemPropertiesRestoreRule$1.evaluate(SystemPropertiesRestoreRule.java:53)
	at org.apache.lucene.util.AbstractBeforeAfterRule$1.evaluate(AbstractBeforeAfterRule.java:45)
	at org.apache.lucene.util.TestRuleStoreClassName$1.evaluate(TestRuleStoreClassName.java:42)
	at com.carrotsearch.randomizedtesting.rules.SystemPropertiesInvariantRule$1.evaluate(SystemPropertiesInvariantRule.java:55)
	at com.carrotsearch.randomizedtesting.rules.NoShadowingOrOverridesOnMethodsRule$1.evaluate(NoShadowingOrOverridesOnMethodsRule.java:39)
	at com.carrotsearch.randomizedtesting.rules.NoShadowingOrOverridesOnMethodsRule$1.evaluate(NoShadowingOrOverridesOnMethodsRule.java:39)
	at org.apache.lucene.util.TestRuleAssertionsRequired$1.evaluate(TestRuleAssertionsRequired.java:40)
	at org.apache.lucene.util.TestRuleMarkFailure$1.evaluate(TestRuleMarkFailure.java:48)
	at org.apache.lucene.util.TestRuleIgnoreAfterMaxFailures$1.evaluate(TestRuleIgnoreAfterMaxFailures.java:70)
	at org.apache.lucene.util.TestRuleIgnoreTestSuites$1.evaluate(TestRuleIgnoreTestSuites.java:55)
	at com.carrotsearch.randomizedtesting.rules.StatementAdapter.evaluate(StatementAdapter.java:36)
	at com.carrotsearch.randomizedtesting.ThreadLeakControl$StatementRunner.run(ThreadLeakControl.java:345)
	at java.lang.Thread.run(Thread.java:679)


FAILED:  org.apache.solr.handler.extraction.ExtractingRequestHandlerTest.testArabicPDF

Error Message:
ERROR: [doc=one] unknown field 'meta:creation-date'

Stack Trace:
org.apache.solr.common.SolrException: ERROR: [doc=one] unknown field 'meta:creation-date'
	at __randomizedtesting.SeedInfo.seed([CB4CEB8374C84B8E:A58A908C770DE0DB]:0)
	at org.apache.solr.update.DocumentBuilder.toDocument(DocumentBuilder.java:306)
	at org.apache.solr.update.AddUpdateCommand.getLuceneDocument(AddUpdateCommand.java:73)
	at org.apache.solr.update.DirectUpdateHandler2.addDoc(DirectUpdateHandler2.java:208)
	at org.apache.solr.update.processor.RunUpdateProcessor.processAdd(RunUpdateProcessorFactory.java:61)
	at org.apache.solr.update.processor.UpdateRequestProcessor.processAdd(UpdateRequestProcessor.java:51)
	at org.apache.solr.update.processor.DistributedUpdateProcessor.versionAdd(DistributedUpdateProcessor.java:463)
	at org.apache.solr.update.processor.DistributedUpdateProcessor.processAdd(DistributedUpdateProcessor.java:342)
	at org.apache.solr.handler.extraction.ExtractingDocumentLoader.doAdd(ExtractingDocumentLoader.java:121)
	at org.apache.solr.handler.extraction.ExtractingDocumentLoader.addDoc(ExtractingDocumentLoader.java:126)
	at org.apache.solr.handler.extraction.ExtractingDocumentLoader.load(ExtractingDocumentLoader.java:233)
	at org.apache.solr.handler.ContentStreamHandlerBase.handleRequestBody(ContentStreamHandlerBase.java:74)
	at org.apache.solr.handler.RequestHandlerBase.handleRequest(RequestHandlerBase.java:129)
	at org.apache.solr.core.SolrCore.execute(SolrCore.java:1692)
	at org.apache.solr.util.TestHarness.queryAndResponse(TestHarness.java:375)
	at org.apache.solr.handler.extraction.ExtractingRequestHandlerTest.loadLocal(ExtractingRequestHandlerTest.java:602)
	at org.apache.solr.handler.extraction.ExtractingRequestHandlerTest.testArabicPDF(ExtractingRequestHandlerTest.java:388)
	at sun.reflect.NativeMethodAccessorImpl.invoke0(Native Method)
	at sun.reflect.NativeMethodAccessorImpl.invoke(NativeMethodAccessorImpl.java:57)
	at sun.reflect.DelegatingMethodAccessorImpl.invoke(DelegatingMethodAccessorImpl.java:43)
	at java.lang.reflect.Method.invoke(Method.java:616)
	at com.carrotsearch.randomizedtesting.RandomizedRunner.invoke(RandomizedRunner.java:1559)
	at com.carrotsearch.randomizedtesting.RandomizedRunner.access$600(RandomizedRunner.java:79)
	at com.carrotsearch.randomizedtesting.RandomizedRunner$6.evaluate(RandomizedRunner.java:737)
	at com.carrotsearch.randomizedtesting.RandomizedRunner$7.evaluate(RandomizedRunner.java:773)
	at com.carrotsearch.randomizedtesting.RandomizedRunner$8.evaluate(RandomizedRunner.java:787)
	at com.carrotsearch.randomizedtesting.rules.SystemPropertiesRestoreRule$1.evaluate(SystemPropertiesRestoreRule.java:53)
	at org.apache.lucene.util.TestRuleSetupTeardownChained$1.evaluate(TestRuleSetupTeardownChained.java:50)
	at org.apache.lucene.util.TestRuleFieldCacheSanity$1.evaluate(TestRuleFieldCacheSanity.java:51)
	at org.apache.lucene.util.AbstractBeforeAfterRule$1.evaluate(AbstractBeforeAfterRule.java:45)
	at com.carrotsearch.randomizedtesting.rules.SystemPropertiesInvariantRule$1.evaluate(SystemPropertiesInvariantRule.java:55)
	at org.apache.lucene.util.TestRuleThreadAndTestName$1.evaluate(TestRuleThreadAndTestName.java:48)
	at org.apache.lucene.util.TestRuleIgnoreAfterMaxFailures$1.evaluate(TestRuleIgnoreAfterMaxFailures.java:70)
	at org.apache.lucene.util.TestRuleMarkFailure$1.evaluate(TestRuleMarkFailure.java:48)
	at com.carrotsearch.randomizedtesting.rules.StatementAdapter.evaluate(StatementAdapter.java:36)
	at com.carrotsearch.randomizedtesting.ThreadLeakControl$StatementRunner.run(ThreadLeakControl.java:345)
	at com.carrotsearch.randomizedtesting.ThreadLeakControl.forkTimeoutingTask(ThreadLeakControl.java:769)
	at com.carrotsearch.randomizedtesting.ThreadLeakControl$3.evaluate(ThreadLeakControl.java:429)
	at com.carrotsearch.randomizedtesting.RandomizedRunner.runSingleTest(RandomizedRunner.java:746)
	at com.carrotsearch.randomizedtesting.RandomizedRunner$3.evaluate(RandomizedRunner.java:648)
	at com.carrotsearch.randomizedtesting.RandomizedRunner$4.evaluate(RandomizedRunner.java:682)
	at com.carrotsearch.randomizedtesting.RandomizedRunner$5.evaluate(RandomizedRunner.java:693)
	at com.carrotsearch.randomizedtesting.rules.StatementAdapter.evaluate(StatementAdapter.java:36)
	at com.carrotsearch.randomizedtesting.rules.SystemPropertiesRestoreRule$1.evaluate(SystemPropertiesRestoreRule.java:53)
	at org.apache.lucene.util.AbstractBeforeAfterRule$1.evaluate(AbstractBeforeAfterRule.java:45)
	at org.apache.lucene.util.TestRuleStoreClassName$1.evaluate(TestRuleStoreClassName.java:42)
	at com.carrotsearch.randomizedtesting.rules.SystemPropertiesInvariantRule$1.evaluate(SystemPropertiesInvariantRule.java:55)
	at com.carrotsearch.randomizedtesting.rules.NoShadowingOrOverridesOnMethodsRule$1.evaluate(NoShadowingOrOverridesOnMethodsRule.java:39)
	at com.carrotsearch.randomizedtesting.rules.NoShadowingOrOverridesOnMethodsRule$1.evaluate(NoShadowingOrOverridesOnMethodsRule.java:39)
	at org.apache.lucene.util.TestRuleAssertionsRequired$1.evaluate(TestRuleAssertionsRequired.java:40)
	at org.apache.lucene.util.TestRuleMarkFailure$1.evaluate(TestRuleMarkFailure.java:48)
	at org.apache.lucene.util.TestRuleIgnoreAfterMaxFailures$1.evaluate(TestRuleIgnoreAfterMaxFailures.java:70)
	at org.apache.lucene.util.TestRuleIgnoreTestSuites$1.evaluate(TestRuleIgnoreTestSuites.java:55)
	at com.carrotsearch.randomizedtesting.rules.StatementAdapter.evaluate(StatementAdapter.java:36)
	at com.carrotsearch.randomizedtesting.ThreadLeakControl$StatementRunner.run(ThreadLeakControl.java:345)
	at java.lang.Thread.run(Thread.java:679)




Build Log:
[...truncated 4122 lines...]
226 T3 oasc.SolrCore.finalize SEVERE REFCOUNT ERROR: unreferenced org.apache.solr.core.SolrCore@5c344920 (col_bad) has a reference count of 1
Tests run: 2, Failures: 0, Errors: 0, Skipped: 0, Time elapsed: 0.25 sec
Running org.apache.solr.core.TestMergePolicyConfig
Creating dataDir: /usr/home/hudson/hudson-slave/workspace/Lucene-Solr-Maven-4.x/maven-build/solr/core/target/test/./solrtest-TestMergePolicyConfig-1346593876368
Tests run: 1, Failures: 0, Errors: 0, Skipped: 0, Time elapsed: 0.33 sec
Running org.apache.solr.search.TestFiltering
Creating dataDir: /usr/home/hudson/hudson-slave/workspace/Lucene-Solr-Maven-4.x/maven-build/solr/core/target/test/./solrtest-TestFiltering-1346593876693
Tests run: 2, Failures: 0, Errors: 0, Skipped: 0, Time elapsed: 3.387 sec
Running org.apache.solr.internal.csv.CSVParserTest
Tests run: 23, Failures: 0, Errors: 0, Skipped: 0, Time elapsed: 0.016 sec
Running org.apache.solr.servlet.DirectSolrConnectionTest
Tests run: 2, Failures: 0, Errors: 0, Skipped: 0, Time elapsed: 0.176 sec
Running org.apache.solr.cloud.ZkNodePropsTest
Tests run: 1, Failures: 0, Errors: 0, Skipped: 0, Time elapsed: 0.014 sec
Running org.apache.solr.search.TestRealTimeGet
Creating dataDir: /usr/home/hudson/hudson-slave/workspace/Lucene-Solr-Maven-4.x/maven-build/solr/core/target/test/./solrtest-TestRealTimeGet-1346593880283
Tests run: 4, Failures: 0, Errors: 0, Skipped: 0, Time elapsed: 12.073 sec
Running org.apache.solr.search.TestLRUCache
Tests run: 3, Failures: 0, Errors: 0, Skipped: 0, Time elapsed: 0.045 sec
Running org.apache.solr.schema.DateFieldTest
Tests run: 8, Failures: 0, Errors: 0, Skipped: 1, Time elapsed: 0.065 sec
Running org.apache.solr.internal.csv.CSVUtilsTest
Tests run: 14, Failures: 0, Errors: 0, Skipped: 0, Time elapsed: 0.004 sec
Running org.apache.solr.handler.XsltUpdateRequestHandlerTest
Creating dataDir: /usr/home/hudson/hudson-slave/workspace/Lucene-Solr-Maven-4.x/maven-build/solr/core/target/test/./solrtest-XsltUpdateRequestHandlerTest-1346593892479
Tests run: 1, Failures: 0, Errors: 0, Skipped: 0, Time elapsed: 0.794 sec
Running org.apache.solr.request.TestWriterPerf
Tests run: 1, Failures: 0, Errors: 0, Skipped: 0, Time elapsed: 0.954 sec
Running org.apache.solr.analysis.TestWordDelimiterFilterFactory
Creating dataDir: /usr/home/hudson/hudson-slave/workspace/Lucene-Solr-Maven-4.x/maven-build/solr/core/target/test/./solrtest-TestWordDelimiterFilterFactory-1346593894224
Tests run: 7, Failures: 0, Errors: 0, Skipped: 0, Time elapsed: 0.681 sec
Running org.apache.solr.schema.UUIDFieldTest
Tests run: 1, Failures: 0, Errors: 0, Skipped: 0, Time elapsed: 0.017 sec
Running org.apache.solr.internal.csv.writer.CSVConfigGuesserTest
Tests run: 3, Failures: 0, Errors: 0, Skipped: 0, Time elapsed: 0.004 sec
Running org.apache.solr.cloud.ClusterStateTest
Tests run: 1, Failures: 0, Errors: 0, Skipped: 0, Time elapsed: 0.021 sec
Running org.apache.solr.search.TestStressRecovery
Creating dataDir: /usr/home/hudson/hudson-slave/workspace/Lucene-Solr-Maven-4.x/maven-build/solr/core/target/test/./solrtest-TestStressRecovery-1346593894951
Tests run: 1, Failures: 0, Errors: 0, Skipped: 0, Time elapsed: 1.749 sec
Running org.apache.solr.TestJoin
Creating dataDir: /usr/home/hudson/hudson-slave/workspace/Lucene-Solr-Maven-4.x/maven-build/solr/core/target/test/./solrtest-TestJoin-1346593896701
Tests run: 2, Failures: 0, Errors: 0, Skipped: 0, Time elapsed: 4.027 sec
Running org.apache.solr.analysis.LegacyHTMLStripCharFilterTest
Tests run: 13, Failures: 0, Errors: 0, Skipped: 1, Time elapsed: 0.315 sec
Running org.apache.solr.search.TestPseudoReturnFields
Creating dataDir: /usr/home/hudson/hudson-slave/workspace/Lucene-Solr-Maven-4.x/maven-build/solr/core/target/test/./solrtest-TestPseudoReturnFields-1346593901070
Tests run: 13, Failures: 0, Errors: 0, Skipped: 0, Time elapsed: 0.602 sec
Running org.apache.solr.AnalysisAfterCoreReloadTest
Tests run: 1, Failures: 0, Errors: 0, Skipped: 0, Time elapsed: 1.73 sec
Running org.apache.solr.core.IndexReaderFactoryTest
Tests run: 1, Failures: 0, Errors: 0, Skipped: 0, Time elapsed: 0.425 sec
Running org.apache.solr.TestTrie
Creating dataDir: /usr/home/hudson/hudson-slave/workspace/Lucene-Solr-Maven-4.x/maven-build/solr/core/target/test/./solrtest-TestTrie-1346593903813
Tests run: 8, Failures: 0, Errors: 0, Skipped: 0, Time elapsed: 0.895 sec
Running org.apache.solr.request.TestFaceting
Creating dataDir: /usr/home/hudson/hudson-slave/workspace/Lucene-Solr-Maven-4.x/maven-build/solr/core/target/test/./solrtest-TestFaceting-1346593904704
Tests run: 3, Failures: 0, Errors: 0, Skipped: 0, Time elapsed: 5.587 sec
Running org.apache.solr.request.TestBinaryResponseWriter
Tests run: 2, Failures: 0, Errors: 0, Skipped: 0, Time elapsed: 0.92 sec
Running org.apache.solr.search.TestElisionMultitermQuery
Creating dataDir: /usr/home/hudson/hudson-slave/workspace/Lucene-Solr-Maven-4.x/maven-build/solr/core/target/test/./solrtest-TestElisionMultitermQuery-1346593911213
Tests run: 1, Failures: 0, Errors: 0, Skipped: 0, Time elapsed: 0.237 sec
Running org.apache.solr.core.RAMDirectoryFactoryTest
Tests run: 1, Failures: 0, Errors: 0, Skipped: 0, Time elapsed: 0.021 sec
Running org.apache.solr.DisMaxRequestHandlerTest
Creating dataDir: /usr/home/hudson/hudson-slave/workspace/Lucene-Solr-Maven-4.x/maven-build/solr/core/target/test/./solrtest-DisMaxRequestHandlerTest-1346593911472
Tests run: 2, Failures: 0, Errors: 0, Skipped: 0, Time elapsed: 0.665 sec
Running org.apache.solr.OutputWriterTest
Creating dataDir: /usr/home/hudson/hudson-slave/workspace/Lucene-Solr-Maven-4.x/maven-build/solr/core/target/test/./solrtest-OutputWriterTest-1346593912142
Tests run: 5, Failures: 0, Errors: 0, Skipped: 0, Time elapsed: 0.171 sec
Running org.apache.solr.handler.admin.MBeansHandlerTest
Creating dataDir: /usr/home/hudson/hudson-slave/workspace/Lucene-Solr-Maven-4.x/maven-build/solr/core/target/test/./solrtest-MBeansHandlerTest-1346593912321
Tests run: 1, Failures: 0, Errors: 0, Skipped: 0, Time elapsed: 0.471 sec
Running org.apache.solr.TestGroupingSearch
Creating dataDir: /usr/home/hudson/hudson-slave/workspace/Lucene-Solr-Maven-4.x/maven-build/solr/core/target/test/./solrtest-TestGroupingSearch-1346593912780
Tests run: 12, Failures: 0, Errors: 0, Skipped: 0, Time elapsed: 2.096 sec
Running org.apache.solr.core.TestJmxMonitoredMap
Tests run: 2, Failures: 0, Errors: 0, Skipped: 0, Time elapsed: 0.145 sec
Running org.apache.solr.handler.admin.CoreAdminHandlerTest
Creating dataDir: /usr/home/hudson/hudson-slave/workspace/Lucene-Solr-Maven-4.x/maven-build/solr/core/target/test/./solrtest-CoreAdminHandlerTest-1346593915024
Tests run: 1, Failures: 0, Errors: 0, Skipped: 0, Time elapsed: 1.087 sec
Running org.apache.solr.cloud.ZkSolrClientTest
Tests run: 4, Failures: 0, Errors: 0, Skipped: 0, Time elapsed: 7.5 sec
Running org.apache.solr.search.similarities.TestPerFieldSimilarity
Creating dataDir: /usr/home/hudson/hudson-slave/workspace/Lucene-Solr-Maven-4.x/maven-build/solr/core/target/test/./solrtest-TestPerFieldSimilarity-1346593923619
Tests run: 7, Failures: 0, Errors: 0, Skipped: 0, Time elapsed: 0.122 sec
Running org.apache.solr.servlet.NoCacheHeaderTest
Creating dataDir: /usr/home/hudson/hudson-slave/workspace/Lucene-Solr-Maven-4.x/maven-build/solr/core/target/test/./solrtest-NoCacheHeaderTest-1346593923742
Tests run: 3, Failures: 0, Errors: 0, Skipped: 0, Time elapsed: 0.584 sec
Running org.apache.solr.spelling.suggest.SuggesterTest
Creating dataDir: /usr/home/hudson/hudson-slave/workspace/Lucene-Solr-Maven-4.x/maven-build/solr/core/target/test/./solrtest-SuggesterTest-1346593924321
NOTE: per solr.test.leavedatadir, dataDir will not be removed: /usr/home/hudson/hudson-slave/workspace/Lucene-Solr-Maven-4.x/maven-build/solr/core/target/test/./solrtest-SuggesterTest-1346593924321
Tests run: 4, Failures: 0, Errors: 0, Skipped: 0, Time elapsed: 0.795 sec
Running org.apache.solr.handler.admin.SystemInfoHandlerTest
Tests run: 1, Failures: 0, Errors: 0, Skipped: 0, Time elapsed: 0.066 sec
Running org.apache.solr.cloud.TestMultiCoreConfBootstrap
Creating dataDir: /usr/home/hudson/hudson-slave/workspace/Lucene-Solr-Maven-4.x/maven-build/solr/core/target/test/./solrtest-TestMultiCoreConfBootstrap-1346593925190
!!!! WARNING: best effort to remove /usr/home/hudson/hudson-slave/workspace/Lucene-Solr-Maven-4.x/maven-build/solr/core/target/test/./solrtest-TestMultiCoreConfBootstrap-1346593925190 FAILED !!!!!
Tests run: 1, Failures: 0, Errors: 0, Skipped: 0, Time elapsed: 6.953 sec
Running org.apache.solr.schema.PreAnalyzedFieldTest
Tests run: 3, Failures: 0, Errors: 0, Skipped: 0, Time elapsed: 0.045 sec
Running org.apache.solr.cloud.BasicZkTest
azt beforeclass
Creating dataDir: /usr/home/hudson/hudson-slave/workspace/Lucene-Solr-Maven-4.x/maven-build/solr/core/target/test/./solrtest-BasicZkTest-1346593932188
Tests run: 1, Failures: 0, Errors: 0, Skipped: 0, Time elapsed: 14.314 sec
Running org.apache.solr.handler.component.TermVectorComponentTest
Creating dataDir: /usr/home/hudson/hudson-slave/workspace/Lucene-Solr-Maven-4.x/maven-build/solr/core/target/test/./solrtest-TermVectorComponentTest-1346593946498
Tests run: 3, Failures: 0, Errors: 0, Skipped: 0, Time elapsed: 0.581 sec
Running org.apache.solr.TestDistributedSearch
Tests run: 1, Failures: 0, Errors: 0, Skipped: 0, Time elapsed: 86.222 sec
Running org.apache.solr.cloud.BasicDistributedZkTest
Creating dataDir: /usr/home/hudson/hudson-slave/workspace/Lucene-Solr-Maven-4.x/maven-build/solr/core/target/test/./solrtest-BasicDistributedZkTest-1346594033309
69255 T1465 oasc.SolrException.log SEVERE org.apache.solr.common.SolrException: Failed to unregister info bean: org.apache.solr.handler.admin.AdminHandlers
		at org.apache.solr.core.JmxMonitoredMap.unregister(JmxMonitoredMap.java:178)
		at org.apache.solr.core.JmxMonitoredMap.clear(JmxMonitoredMap.java:116)
		at org.apache.solr.core.SolrCore.close(SolrCore.java:863)
		at org.apache.solr.handler.admin.CoreAdminHandler.handleUnloadAction(CoreAdminHandler.java:615)
		at org.apache.solr.handler.admin.CoreAdminHandler.handleRequestBody(CoreAdminHandler.java:149)
		at org.apache.solr.handler.RequestHandlerBase.handleRequest(RequestHandlerBase.java:129)
		at org.apache.solr.servlet.SolrDispatchFilter.handleAdminRequest(SolrDispatchFilter.java:371)
		at org.apache.solr.servlet.SolrDispatchFilter.doFilter(SolrDispatchFilter.java:180)
		at org.eclipse.jetty.servlet.ServletHandler$CachedChain.doFilter(ServletHandler.java:1337)
		at org.eclipse.jetty.servlet.ServletHandler.doHandle(ServletHandler.java:484)
		at org.eclipse.jetty.server.session.SessionHandler.doHandle(SessionHandler.java:231)
		at org.eclipse.jetty.server.handler.ScopedHandler.handle(ScopedHandler.java:119)
		at org.eclipse.jetty.server.handler.GzipHandler.handle(GzipHandler.java:267)
		at org.eclipse.jetty.server.handler.ContextHandler.doHandle(ContextHandler.java:1067)
		at org.eclipse.jetty.servlet.ServletHandler.doScope(ServletHandler.java:413)
		at org.eclipse.jetty.server.session.SessionHandler.doScope(SessionHandler.java:192)
		at org.eclipse.jetty.server.handler.ContextHandler.doScope(ContextHandler.java:999)
		at org.eclipse.jetty.server.handler.ScopedHandler.handle(ScopedHandler.java:117)
		at org.eclipse.jetty.server.handler.HandlerWrapper.handle(HandlerWrapper.java:111)
		at org.eclipse.jetty.server.Server.handle(Server.java:351)
		at org.eclipse.jetty.server.AbstractHttpConnection.handleRequest(AbstractHttpConnection.java:454)
		at org.eclipse.jetty.server.BlockingHttpConnection.handleRequest(BlockingHttpConnection.java:47)
		at org.eclipse.jetty.server.AbstractHttpConnection.content(AbstractHttpConnection.java:900)
		at org.eclipse.jetty.server.AbstractHttpConnection$RequestHandler.content(AbstractHttpConnection.java:954)
		at org.eclipse.jetty.http.HttpParser.parseNext(HttpParser.java:857)
		at org.eclipse.jetty.http.HttpParser.parseAvailable(HttpParser.java:235)
		at org.eclipse.jetty.server.BlockingHttpConnection.handle(BlockingHttpConnection.java:66)
		at org.eclipse.jetty.server.bio.SocketConnector$ConnectorEndPoint.run(SocketConnector.java:254)
		at org.eclipse.jetty.util.thread.QueuedThreadPool.runJob(QueuedThreadPool.java:599)
		at org.eclipse.jetty.util.thread.QueuedThreadPool$3.run(QueuedThreadPool.java:534)
		at java.lang.Thread.run(Thread.java:679)
	Caused by: javax.management.InstanceNotFoundException: solr/awholynewcollection_0:type=org.apache.solr.handler.admin.AdminHandlers,id=org.apache.solr.handler.admin.AdminHandlers
		at com.sun.jmx.interceptor.DefaultMBeanServerInterceptor.getMBean(DefaultMBeanServerInterceptor.java:1118)
		at com.sun.jmx.interceptor.DefaultMBeanServerInterceptor.getAttribute(DefaultMBeanServerInterceptor.java:679)
		at com.sun.jmx.mbeanserver.JmxMBeanServer.getAttribute(JmxMBeanServer.java:672)
		at org.apache.solr.core.JmxMonitoredMap.unregister(JmxMonitoredMap.java:174)
		... 30 more
	
69789 T1401 oasc.Overseer$ClusterStateUpdater.setShardLeader SEVERE Could not mark shard leader for non existing collection:awholynewcollection_0
100117 T1426 oasc.SolrException.log SEVERE Sync request error: org.apache.solr.client.solrj.SolrServerException: IOException occured when talking to server at: http://127.0.0.1:27970/solr/collection2
145133 T1426 oasc.SolrException.log SEVERE http://127.0.0.1:57477/solr/collection2/: Could not tell a replica to recover:org.apache.solr.client.solrj.SolrServerException: IOException occured when talking to server at: http://127.0.0.1:27970/solr
		at org.apache.solr.client.solrj.impl.HttpSolrServer.request(HttpSolrServer.java:414)
		at org.apache.solr.client.solrj.impl.HttpSolrServer.request(HttpSolrServer.java:182)
		at org.apache.solr.cloud.SyncStrategy.requestRecovery(SyncStrategy.java:282)
		at org.apache.solr.cloud.SyncStrategy.syncToMe(SyncStrategy.java:226)
		at org.apache.solr.cloud.SyncStrategy.syncReplicas(SyncStrategy.java:119)
		at org.apache.solr.cloud.SyncStrategy.sync(SyncStrategy.java:85)
		at org.apache.solr.cloud.ShardLeaderElectionContext.runLeaderProcess(ElectionContext.java:180)
		at org.apache.solr.cloud.LeaderElector.runIamLeaderProcess(LeaderElector.java:159)
		at org.apache.solr.cloud.LeaderElector.checkIfIamLeader(LeaderElector.java:103)
		at org.apache.solr.cloud.LeaderElector.access$000(LeaderElector.java:57)
		at org.apache.solr.cloud.LeaderElector$1.process(LeaderElector.java:132)
		at org.apache.zookeeper.ClientCnxn$EventThread.processEvent(ClientCnxn.java:526)
		at org.apache.zookeeper.ClientCnxn$EventThread.run(ClientCnxn.java:502)
	Caused by: org.apache.http.conn.ConnectTimeoutException: Connect to 127.0.0.1:27970 timed out
		at org.apache.http.conn.scheme.PlainSocketFactory.connectSocket(PlainSocketFactory.java:125)
		at org.apache.http.impl.conn.DefaultClientConnectionOperator.openConnection(DefaultClientConnectionOperator.java:148)
		at org.apache.http.impl.conn.AbstractPoolEntry.open(AbstractPoolEntry.java:150)
		at org.apache.http.impl.conn.AbstractPooledConnAdapter.open(AbstractPooledConnAdapter.java:121)
		at org.apache.http.impl.client.DefaultRequestDirector.tryConnect(DefaultRequestDirector.java:575)
		at org.apache.http.impl.client.DefaultRequestDirector.execute(DefaultRequestDirector.java:425)
		at org.apache.http.impl.client.AbstractHttpClient.execute(AbstractHttpClient.java:820)
		at org.apache.http.impl.client.AbstractHttpClient.execute(AbstractHttpClient.java:754)
		at org.apache.http.impl.client.AbstractHttpClient.execute(AbstractHttpClient.java:732)
		at org.apache.solr.client.solrj.impl.HttpSolrServer.request(HttpSolrServer.java:353)
		... 12 more
	
Tests run: 1, Failures: 0, Errors: 0, Skipped: 0, Time elapsed: 145.688 sec
Running org.apache.solr.TestRandomFaceting
Creating dataDir: /usr/home/hudson/hudson-slave/workspace/Lucene-Solr-Maven-4.x/maven-build/solr/core/target/test/./solrtest-TestRandomFaceting-1346594179010
Tests run: 1, Failures: 0, Errors: 0, Skipped: 0, Time elapsed: 10.955 sec
Running org.apache.solr.response.TestCSVResponseWriter
Creating dataDir: /usr/home/hudson/hudson-slave/workspace/Lucene-Solr-Maven-4.x/maven-build/solr/core/target/test/./solrtest-TestCSVResponseWriter-1346594189943
Tests run: 1, Failures: 0, Errors: 0, Skipped: 0, Time elapsed: 0.349 sec
Running org.apache.solr.spelling.SpellPossibilityIteratorTest
Tests run: 3, Failures: 0, Errors: 0, Skipped: 0, Time elapsed: 0.217 sec
Running org.apache.solr.handler.TestCSVLoader
Creating dataDir: /usr/home/hudson/hudson-slave/workspace/Lucene-Solr-Maven-4.x/maven-build/solr/core/target/test/./solrtest-TestCSVLoader-1346594190515
Tests run: 5, Failures: 0, Errors: 0, Skipped: 0, Time elapsed: 0.671 sec
Running org.apache.solr.TestSolrCoreProperties
Tests run: 1, Failures: 0, Errors: 0, Skipped: 0, Time elapsed: 0.198 sec
Running org.apache.solr.util.TimeZoneUtilsTest
Tests run: 5, Failures: 0, Errors: 0, Skipped: 0, Time elapsed: 0.174 sec
Running org.apache.solr.internal.csv.writer.CSVFieldTest
Tests run: 2, Failures: 0, Errors: 0, Skipped: 0, Time elapsed: 0 sec
Running org.apache.solr.spelling.FileBasedSpellCheckerTest
Creating dataDir: /usr/home/hudson/hudson-slave/workspace/Lucene-Solr-Maven-4.x/maven-build/solr/core/target/test/./solrtest-FileBasedSpellCheckerTest-1346594191561
Tests run: 3, Failures: 0, Errors: 0, Skipped: 0, Time elapsed: 0.643 sec
Running org.apache.solr.schema.CurrencyFieldTest
Creating dataDir: /usr/home/hudson/hudson-slave/workspace/Lucene-Solr-Maven-4.x/maven-build/solr/core/target/test/./solrtest-CurrencyFieldTest-1346594192207
Tests run: 8, Failures: 0, Errors: 0, Skipped: 1, Time elapsed: 0.587 sec
Running org.apache.solr.servlet.SolrRequestParserTest
Creating dataDir: /usr/home/hudson/hudson-slave/workspace/Lucene-Solr-Maven-4.x/maven-build/solr/core/target/test/./solrtest-SolrRequestParserTest-1346594192794
Tests run: 4, Failures: 0, Errors: 0, Skipped: 0, Time elapsed: 0.597 sec
Running org.apache.solr.search.ReturnFieldsTest
Creating dataDir: /usr/home/hudson/hudson-slave/workspace/Lucene-Solr-Maven-4.x/maven-build/solr/core/target/test/./solrtest-ReturnFieldsTest-1346594193392
Tests run: 10, Failures: 0, Errors: 0, Skipped: 0, Time elapsed: 0.545 sec
Running org.apache.solr.TestPluginEnable
Creating dataDir: /usr/home/hudson/hudson-slave/workspace/Lucene-Solr-Maven-4.x/maven-build/solr/core/target/test/./solrtest-TestPluginEnable-1346594193941
Tests run: 1, Failures: 0, Errors: 0, Skipped: 0, Time elapsed: 0.092 sec
Running org.apache.solr.util.TestUtils
Tests run: 3, Failures: 0, Errors: 0, Skipped: 0, Time elapsed: 0.036 sec
Running org.apache.solr.schema.BadIndexSchemaTest
Creating dataDir: /usr/home/hudson/hudson-slave/workspace/Lucene-Solr-Maven-4.x/maven-build/solr/core/target/test/./solrtest-BadIndexSchemaTest-1346594194071
67 T1764 oasc.SolrCore.initCodec SEVERE FieldType 'pulsing1' is configured with a postings format, but the codec does not support it: class org.apache.solr.core.SolrCore$3
Creating dataDir: /usr/home/hudson/hudson-slave/workspace/Lucene-Solr-Maven-4.x/maven-build/solr/core/target/test/./solrtest-BadIndexSchemaTest-1346594194144
Creating dataDir: /usr/home/hudson/hudson-slave/workspace/Lucene-Solr-Maven-4.x/maven-build/solr/core/target/test/./solrtest-BadIndexSchemaTest-1346594194196
Creating dataDir: /usr/home/hudson/hudson-slave/workspace/Lucene-Solr-Maven-4.x/maven-build/solr/core/target/test/./solrtest-BadIndexSchemaTest-1346594194244
Creating dataDir: /usr/home/hudson/hudson-slave/workspace/Lucene-Solr-Maven-4.x/maven-build/solr/core/target/test/./solrtest-BadIndexSchemaTest-1346594194310
Creating dataDir: /usr/home/hudson/hudson-slave/workspace/Lucene-Solr-Maven-4.x/maven-build/solr/core/target/test/./solrtest-BadIndexSchemaTest-1346594194365
351 T3 oasc.SolrCore.finalize SEVERE REFCOUNT ERROR: unreferenced org.apache.solr.core.SolrCore@7c1969ac (collection1) has a reference count of 1
355 T3 oasc.CoreContainer.finalize SEVERE CoreContainer was not shutdown prior to finalize(), indicates a bug -- POSSIBLE RESOURCE LEAK!!!  instance=666972047
Creating dataDir: /usr/home/hudson/hudson-slave/workspace/Lucene-Solr-Maven-4.x/maven-build/solr/core/target/test/./solrtest-BadIndexSchemaTest-1346594194423
406 T1764 oass.IndexSchema.readSchema SEVERE FieldType 'sim1' is configured with a similarity, but the global similarity does not support it: class org.apache.solr.search.similarities.DefaultSimilarityFactory
Creating dataDir: /usr/home/hudson/hudson-slave/workspace/Lucene-Solr-Maven-4.x/maven-build/solr/core/target/test/./solrtest-BadIndexSchemaTest-1346594194473
457 T1764 oass.IndexSchema.readSchema SEVERE uniqueKey field (id) can not be the dest of a copyField (src=XXX)
Creating dataDir: /usr/home/hudson/hudson-slave/workspace/Lucene-Solr-Maven-4.x/maven-build/solr/core/target/test/./solrtest-BadIndexSchemaTest-1346594194522
506 T1764 oass.IndexSchema.readSchema SEVERE uniqueKey field (null) can not be configured with a default value (XXX)
Creating dataDir: /usr/home/hudson/hudson-slave/workspace/Lucene-Solr-Maven-4.x/maven-build/solr/core/target/test/./solrtest-BadIndexSchemaTest-1346594194570
554 T1764 oass.IndexSchema.readSchema SEVERE uniqueKey field (null) can not be configured to be multivalued
Creating dataDir: /usr/home/hudson/hudson-slave/workspace/Lucene-Solr-Maven-4.x/maven-build/solr/core/target/test/./solrtest-BadIndexSchemaTest-1346594194621
Creating dataDir: /usr/home/hudson/hudson-slave/workspace/Lucene-Solr-Maven-4.x/maven-build/solr/core/target/test/./solrtest-BadIndexSchemaTest-1346594194668
Creating dataDir: /usr/home/hudson/hudson-slave/workspace/Lucene-Solr-Maven-4.x/maven-build/solr/core/target/test/./solrtest-BadIndexSchemaTest-1346594194720
Creating dataDir: /usr/home/hudson/hudson-slave/workspace/Lucene-Solr-Maven-4.x/maven-build/solr/core/target/test/./solrtest-BadIndexSchemaTest-1346594194770
Creating dataDir: /usr/home/hudson/hudson-slave/workspace/Lucene-Solr-Maven-4.x/maven-build/solr/core/target/test/./solrtest-BadIndexSchemaTest-1346594194820
Tests run: 9, Failures: 0, Errors: 0, Skipped: 0, Time elapsed: 0.817 sec
Running org.apache.solr.core.TestQuerySenderNoQuery
Creating dataDir: /usr/home/hudson/hudson-slave/workspace/Lucene-Solr-Maven-4.x/maven-build/solr/core/target/test/./solrtest-TestQuerySenderNoQuery-1346594194885
Tests run: 3, Failures: 0, Errors: 0, Skipped: 0, Time elapsed: 0.4 sec
Running org.apache.solr.update.DirectUpdateHandlerTest
Creating dataDir: /usr/home/hudson/hudson-slave/workspace/Lucene-Solr-Maven-4.x/maven-build/solr/core/target/test/./solrtest-DirectUpdateHandlerTest-1346594195285
Creating dataDir: /usr/home/hudson/hudson-slave/workspace/Lucene-Solr-Maven-4.x/maven-build/solr/core/target/test/./solrtest-DirectUpdateHandlerTest-1346594195820
Creating dataDir: /usr/home/hudson/hudson-slave/workspace/Lucene-Solr-Maven-4.x/maven-build/solr/core/target/test/./solrtest-DirectUpdateHandlerTest-1346594196346
Tests run: 6, Failures: 0, Errors: 0, Skipped: 0, Time elapsed: 1.889 sec
Running org.apache.solr.util.SolrPluginUtilsTest
Creating dataDir: /usr/home/hudson/hudson-slave/workspace/Lucene-Solr-Maven-4.x/maven-build/solr/core/target/test/./solrtest-SolrPluginUtilsTest-1346594197179
Tests run: 7, Failures: 0, Errors: 0, Skipped: 0, Time elapsed: 0.554 sec
Running org.apache.solr.internal.csv.CSVPrinterTest
Tests run: 6, Failures: 0, Errors: 0, Skipped: 0, Time elapsed: 0.588 sec
Running org.apache.solr.response.TestPHPSerializedResponseWriter
Creating dataDir: /usr/home/hudson/hudson-slave/workspace/Lucene-Solr-Maven-4.x/maven-build/solr/core/target/test/./solrtest-TestPHPSerializedResponseWriter-1346594198319
Tests run: 2, Failures: 0, Errors: 0, Skipped: 0, Time elapsed: 0.444 sec
Running org.apache.solr.SolrInfoMBeanTest
Creating dataDir: /usr/home/hudson/hudson-slave/workspace/Lucene-Solr-Maven-4.x/maven-build/solr/core/target/test/./solrtest-SolrInfoMBeanTest-1346594198762
Tests run: 1, Failures: 0, Errors: 0, Skipped: 0, Time elapsed: 0.37 sec
Running org.apache.solr.cloud.SyncSliceTest
Creating dataDir: /usr/home/hudson/hudson-slave/workspace/Lucene-Solr-Maven-4.x/maven-build/solr/core/target/test/./solrtest-SyncSliceTest-1346594199140
check const of shard1
client0
PROPS:shard=shard1
leader=true
roles=null
state=active
core=collection1
collection=collection1
node_name=127.0.0.1:52873_solr
base_url=http://127.0.0.1:52873/solr

 live:true
 num:4

client1
PROPS:shard=shard1
roles=null
state=active
core=collection1
collection=collection1
node_name=127.0.0.1:17666_solr
base_url=http://127.0.0.1:17666/solr

 live:true
 num:2

######shard1 is not consistent.  Got 4 from http://127.0.0.1:52873/solr/collection1lastClient and got 2 from http://127.0.0.1:17666/solr/collection1
######http://127.0.0.1:52873/solr/collection1: {numFound=4,start=0,docs=[SolrDocument{id=0, _version_=1412006378027876352}, SolrDocument{id=1, _version_=1412006378037313536}, SolrDocument{id=2, _version_=1412006378044653568}, SolrDocument{id=3, _version_=1412006378053042176}]}
######http://127.0.0.1:17666/solr/collection1: {numFound=2,start=0,docs=[SolrDocument{id=0, _version_=1412006378027876352}, SolrDocument{id=1, _version_=1412006378037313536}]}
###### sizes=4,2
###### Only in http://127.0.0.1:52873/solr/collection1: [{id=2, _version_=1412006378044653568}, {id=3, _version_=1412006378053042176}]
client2
PROPS:shard=shard1
roles=null
state=active
core=collection1
collection=collection1
node_name=127.0.0.1:12215_solr
base_url=http://127.0.0.1:12215/solr

 live:true
 num:3

client3
PROPS:shard=shard1
roles=null
state=active
core=collection1
collection=collection1
node_name=127.0.0.1:37498_solr
base_url=http://127.0.0.1:37498/solr

 live:true
 num:4

Control Docs:4
check const of shard1
client0
PROPS:shard=shard1
leader=true
roles=null
state=active
core=collection1
collection=collection1
node_name=127.0.0.1:52873_solr
base_url=http://127.0.0.1:52873/solr

 live:true
 num:4

client1
PROPS:shard=shard1
roles=null
state=active
core=collection1
collection=collection1
node_name=127.0.0.1:17666_solr
base_url=http://127.0.0.1:17666/solr

 live:true
 num:4

client2
PROPS:shard=shard1
roles=null
state=active
core=collection1
collection=collection1
node_name=127.0.0.1:12215_solr
base_url=http://127.0.0.1:12215/solr

 live:true
 num:4

client3
PROPS:shard=shard1
roles=null
state=active
core=collection1
collection=collection1
node_name=127.0.0.1:37498_solr
base_url=http://127.0.0.1:37498/solr

 live:true
 num:4

Control Docs:5
check const of shard1
client0
PROPS:shard=shard1
roles=null
state=active
core=collection1
collection=collection1
node_name=127.0.0.1:52873_solr
base_url=http://127.0.0.1:52873/solr

error contacting client: IOException occured when talking to server at: http://localhost:52873/solr/collection1

client1
PROPS:shard=shard1
roles=null
leader=true
state=active
core=collection1
collection=collection1
node_name=127.0.0.1:17666_solr
base_url=http://127.0.0.1:17666/solr

 live:true
 num:5

client2
PROPS:shard=shard1
roles=null
state=active
core=collection1
collection=collection1
node_name=127.0.0.1:12215_solr
base_url=http://127.0.0.1:12215/solr

 live:true
 num:5

client3
PROPS:shard=shard1
roles=null
state=active
core=collection1
collection=collection1
node_name=127.0.0.1:37498_solr
base_url=http://127.0.0.1:37498/solr

 live:true
 num:5

check const of shard1
client0
PROPS:shard=shard1
roles=null
state=active
core=collection1
collection=collection1
node_name=127.0.0.1:52873_solr
base_url=http://127.0.0.1:52873/solr

 live:true
 num:305

client1
PROPS:shard=shard1
leader=true
roles=null
state=active
core=collection1
collection=collection1
node_name=127.0.0.1:17666_solr
base_url=http://127.0.0.1:17666/solr

 live:true
 num:305

client2
PROPS:shard=shard1
roles=null
state=active
core=collection1
collection=collection1
node_name=127.0.0.1:12215_solr
base_url=http://127.0.0.1:12215/solr

 live:true
 num:5

######shard1 is not consistent.  Got 305 from http://127.0.0.1:17666/solr/collection1lastClient and got 5 from http://127.0.0.1:12215/solr/collection1
######http://127.0.0.1:17666/solr/collection1: {numFound=305,start=0,docs=[SolrDocument{id=0, _version_=1412006378027876352}, SolrDocument{id=1, _version_=1412006378037313536}, SolrDocument{id=2, _version_=1412006378044653568}, SolrDocument{id=3, _version_=1412006378053042176}, SolrDocument{id=4, _version_=1412006380540264448}, SolrDocument{id=5, _version_=1412006401573650432}, SolrDocument{id=6, _version_=1412006401585184768}, SolrDocument{id=7, _version_=1412006401594621952}, SolrDocument{id=8, _version_=1412006401603010560}, SolrDocument{id=9, _version_=1412006401611399168}, SolrDocument{id=10, _version_=1412006401619787776}, SolrDocument{id=11, _version_=1412006401628176384}, SolrDocument{id=12, _version_=1412006401635516416}, SolrDocument{id=13, _version_=1412006401642856448}, SolrDocument{id=14, _version_=1412006401653342208}, SolrDocument{id=15, _version_=1412006401669070848}, SolrDocument{id=16, _version_=1412006401678508032}, SolrDocument{id=17, _version_=1412006401685848064}, SolrDocument{id=18, _version_=1412006401694236672}, SolrDocument{id=19, _version_=1412006401702625280}, SolrDocument{id=20, _version_=1412006401709965312}, SolrDocument{id=21, _version_=1412006401718353920}, SolrDocument{id=22, _version_=1412006401725693952}, SolrDocument{id=23, _version_=1412006401735131136}, SolrDocument{id=24, _version_=1412006401744568320}, SolrDocument{id=25, _version_=1412006401757151232}, SolrDocument{id=26, _version_=1412006401766588416}, SolrDocument{id=27, _version_=1412006401774977024}, SolrDocument{id=28, _version_=1412006401783365632}, SolrDocument{id=29, _version_=1412006401791754240}, SolrDocument{id=30, _version_=1412006401800142848}, SolrDocument{id=31, _version_=1412006401809580032}, SolrDocument{id=32, _version_=1412006401817968640}, SolrDocument{id=33, _version_=1412006401825308672}, SolrDocument{id=34, _version_=1412006401834745856}, SolrDocument{id=35, _version_=1412006401846280192}, SolrDocument{id=36, _version_=1412006401856765952}, SolrDocument{id=37, _version_=1412006401866203136}, SolrDocument{id=38, _version_=1412006401875640320}, SolrDocument{id=39, _version_=1412006401885077504}, SolrDocument{id=40, _version_=1412006401894514688}, SolrDocument{id=41, _version_=1412006401903951872}, SolrDocument{id=42, _version_=1412006401913389056}, SolrDocument{id=43, _version_=1412006401921777664}, SolrDocument{id=44, _version_=1412006401932263424}, SolrDocument{id=45, _version_=1412006401945894912}, SolrDocument{id=46, _version_=1412006401956380672}, SolrDocument{id=47, _version_=1412006401965817856}, SolrDocument{id=48, _version_=1412006401975255040}, SolrDocument{id=49, _version_=1412006401984692224}, SolrDocument{id=50, _version_=1412006401994129408}, SolrDocument{id=51, _version_=1412006402003566592}, SolrDocument{id=52, _version_=1412006402013003776}, SolrDocument{id=53, _version_=1412006402022440960}, SolrDocument{id=54, _version_=1412006402035023872}, SolrDocument{id=55, _version_=1412006402052849664}, SolrDocument{id=56, _version_=1412006402066481152}, SolrDocument{id=57, _version_=1412006402074869760}, SolrDocument{id=58, _version_=1412006402084306944}, SolrDocument{id=59, _version_=1412006402093744128}, SolrDocument{id=60, _version_=1412006402102132736}, SolrDocument{id=61, _version_=1412006402111569920}, SolrDocument{id=62, _version_=1412006402121007104}, SolrDocument{id=63, _version_=1412006402130444288}, SolrDocument{id=64, _version_=1412006402146172928}, SolrDocument{id=65, _version_=1412006402165047296}, SolrDocument{id=66, _version_=1412006402176581632}, SolrDocument{id=67, _version_=1412006402184970240}, SolrDocument{id=68, _version_=1412006402193358848}, SolrDocument{id=69, _version_=1412006402202796032}, SolrDocument{id=70, _version_=1412006402211184640}, SolrDocument{id=71, _version_=1412006402219573248}, SolrDocument{id=72, _version_=1412006402227961856}, SolrDocument{id=73, _version_=1412006402236350464}, SolrDocument{id=74, _version_=1412006402245787648}, SolrDocument{id=75, _version_=1412006402257321984}, SolrDocument{id=76, _version_=1412006402267807744}, SolrDocument{id=77, _version_=1412006402274099200}, SolrDocument{id=78, _version_=1412006402282487808}, SolrDocument{id=79, _version_=1412006402290876416}, SolrDocument{id=80, _version_=1412006402298216448}, SolrDocument{id=81, _version_=1412006402306605056}, SolrDocument{id=82, _version_=1412006402314993664}, SolrDocument{id=83, _version_=1412006402323382272}, SolrDocument{id=84, _version_=1412006402338062336}, SolrDocument{id=85, _version_=1412006402349596672}, SolrDocument{id=86, _version_=1412006402359033856}, SolrDocument{id=87, _version_=1412006402368471040}, SolrDocument{id=88, _version_=1412006402376859648}, SolrDocument{id=89, _version_=1412006402385248256}, SolrDocument{id=90, _version_=1412006402393636864}, SolrDocument{id=91, _version_=1412006402400976896}, SolrDocument{id=92, _version_=1412006402409365504}, SolrDocument{id=93, _version_=1412006402417754112}, SolrDocument{id=94, _version_=1412006402427191296}, SolrDocument{id=95, _version_=1412006402438725632}, SolrDocument{id=96, _version_=1412006402448162816}, SolrDocument{id=97, _version_=1412006402455502848}, SolrDocument{id=98, _version_=1412006402462842880}, SolrDocument{id=99, _version_=1412006402470182912}, SolrDocument{id=100, _version_=1412006402477522944}, SolrDocument{id=101, _version_=1412006402484862976}, SolrDocument{id=102, _version_=1412006402492203008}, SolrDocument{id=103, _version_=1412006402499543040}, SolrDocument{id=104, _version_=1412006402508980224}, SolrDocument{id=105, _version_=1412006402520514560}, SolrDocument{id=106, _version_=1412006402531000320}, SolrDocument{id=107, _version_=1412006402539388928}, SolrDocument{id=108, _version_=1412006402547777536}, SolrDocument{id=109, _version_=1412006402556166144}, SolrDocument{id=110, _version_=1412006402564554752}, SolrDocument{id=111, _version_=1412006402573991936}, SolrDocument{id=112, _version_=1412006402584477696}, SolrDocument{id=113, _version_=1412006402591817728}, SolrDocument{id=114, _version_=1412006402601254912}, SolrDocument{id=115, _version_=1412006402612789248}, SolrDocument{id=116, _version_=1412006402635857920}, SolrDocument{id=117, _version_=1412006402644246528}, SolrDocument{id=118, _version_=1412006402651586560}, SolrDocument{id=119, _version_=1412006402658926592}, SolrDocument{id=120, _version_=1412006402667315200}, SolrDocument{id=121, _version_=1412006402673606656}, SolrDocument{id=122, _version_=1412006402680946688}, SolrDocument{id=123, _version_=1412006402688286720}, SolrDocument{id=124, _version_=1412006402697723904}, SolrDocument{id=125, _version_=1412006402710306816}, SolrDocument{id=126, _version_=1412006402719744000}, SolrDocument{id=127, _version_=1412006402727084032}, SolrDocument{id=128, _version_=1412006402734424064}, SolrDocument{id=129, _version_=1412006402741764096}, SolrDocument{id=130, _version_=1412006402749104128}, SolrDocument{id=131, _version_=1412006402756444160}, SolrDocument{id=132, _version_=1412006402763784192}, SolrDocument{id=133, _version_=1412006402771124224}, SolrDocument{id=134, _version_=1412006402781609984}, SolrDocument{id=135, _version_=1412006402794192896}, SolrDocument{id=136, _version_=1412006402803630080}, SolrDocument{id=137, _version_=1412006402809921536}, SolrDocument{id=138, _version_=1412006402817261568}, SolrDocument{id=139, _version_=1412006402824601600}, SolrDocument{id=140, _version_=1412006402830893056}, SolrDocument{id=141, _version_=1412006402838233088}, SolrDocument{id=142, _version_=1412006402845573120}, SolrDocument{id=143, _version_=1412006402852913152}, SolrDocument{id=144, _version_=1412006402861301760}, SolrDocument{id=145, _version_=1412006402871787520}, SolrDocument{id=146, _version_=1412006402879127552}, SolrDocument{id=147, _version_=1412006402886467584}, SolrDocument{id=148, _version_=1412006402893807616}, SolrDocument{id=149, _version_=1412006402900099072}, SolrDocument{id=150, _version_=1412006402906390528}, SolrDocument{id=151, _version_=1412006402912681984}, SolrDocument{id=152, _version_=1412006402918973440}, SolrDocument{id=153, _version_=1412006402925264896}, SolrDocument{id=154, _version_=1412006402933653504}, SolrDocument{id=155, _version_=1412006402944139264}, SolrDocument{id=156, _version_=1412006402951479296}, SolrDocument{id=157, _version_=1412006402957770752}, SolrDocument{id=158, _version_=1412006402966159360}, SolrDocument{id=159, _version_=1412006402974547968}, SolrDocument{id=160, _version_=1412006402981888000}, SolrDocument{id=161, _version_=1412006402990276608}, SolrDocument{id=162, _version_=1412006402998665216}, SolrDocument{id=163, _version_=1412006403007053824}, SolrDocument{id=164, _version_=1412006403017539584}, SolrDocument{id=165, _version_=1412006403029073920}, SolrDocument{id=166, _version_=1412006403038511104}, SolrDocument{id=167, _version_=1412006403046899712}, SolrDocument{id=168, _version_=1412006403055288320}, SolrDocument{id=169, _version_=1412006403063676928}, SolrDocument{id=170, _version_=1412006403072065536}, SolrDocument{id=171, _version_=1412006403080454144}, SolrDocument{id=172, _version_=1412006403088842752}, SolrDocument{id=173, _version_=1412006403096182784}, SolrDocument{id=174, _version_=1412006403104571392}, SolrDocument{id=175, _version_=1412006403115057152}, SolrDocument{id=176, _version_=1412006403123445760}, SolrDocument{id=177, _version_=1412006403129737216}, SolrDocument{id=178, _version_=1412006403138125824}, SolrDocument{id=179, _version_=1412006403144417280}, SolrDocument{id=180, _version_=1412006403150708736}, SolrDocument{id=181, _version_=1412006403157000192}, SolrDocument{id=182, _version_=1412006403164340224}, SolrDocument{id=183, _version_=1412006403171680256}, SolrDocument{id=184, _version_=1412006403180068864}, SolrDocument{id=185, _version_=1412006403188457472}, SolrDocument{id=186, _version_=1412006403195797504}, SolrDocument{id=187, _version_=1412006403202088960}, SolrDocument{id=188, _version_=1412006403208380416}, SolrDocument{id=189, _version_=1412006403215720448}, SolrDocument{id=190, _version_=1412006403222011904}, SolrDocument{id=191, _version_=1412006403229351936}, SolrDocument{id=192, _version_=1412006403235643392}, SolrDocument{id=193, _version_=1412006403241934848}, SolrDocument{id=194, _version_=1412006403249274880}, SolrDocument{id=195, _version_=1412006403261857792}, SolrDocument{id=196, _version_=1412006403270246400}, SolrDocument{id=197, _version_=1412006403277586432}, SolrDocument{id=198, _version_=1412006403285975040}, SolrDocument{id=199, _version_=1412006403292266496}, SolrDocument{id=200, _version_=1412006403299606528}, SolrDocument{id=201, _version_=1412006403306946560}, SolrDocument{id=202, _version_=1412006403314286592}, SolrDocument{id=203, _version_=1412006403321626624}, SolrDocument{id=204, _version_=1412006403332112384}, SolrDocument{id=205, _version_=1412006403347841024}, SolrDocument{id=206, _version_=1412006403356229632}, SolrDocument{id=207, _version_=1412006403363569664}, SolrDocument{id=208, _version_=1412006403369861120}, SolrDocument{id=209, _version_=1412006403376152576}, SolrDocument{id=210, _version_=1412006403382444032}, SolrDocument{id=211, _version_=1412006403388735488}, SolrDocument{id=212, _version_=1412006403395026944}, SolrDocument{id=213, _version_=1412006403401318400}, SolrDocument{id=214, _version_=1412006403408658432}, SolrDocument{id=215, _version_=1412006403418095616}, SolrDocument{id=216, _version_=1412006403425435648}, SolrDocument{id=217, _version_=1412006403432775680}, SolrDocument{id=218, _version_=1412006403440115712}, SolrDocument{id=219, _version_=1412006403448504320}, SolrDocument{id=220, _version_=1412006403463184384}, SolrDocument{id=221, _version_=1412006403472621568}, SolrDocument{id=222, _version_=1412006403478913024}, SolrDocument{id=223, _version_=1412006403485204480}, SolrDocument{id=224, _version_=1412006403494641664}, SolrDocument{id=225, _version_=1412006403506176000}, SolrDocument{id=226, _version_=1412006403515613184}, SolrDocument{id=227, _version_=1412006403524001792}, SolrDocument{id=228, _version_=1412006403533438976}, SolrDocument{id=229, _version_=1412006403540779008}, SolrDocument{id=230, _version_=1412006403549167616}, SolrDocument{id=231, _version_=1412006403556507648}, SolrDocument{id=232, _version_=1412006403565944832}, SolrDocument{id=233, _version_=1412006403574333440}, SolrDocument{id=234, _version_=1412006403583770624}, SolrDocument{id=235, _version_=1412006403595304960}, SolrDocument{id=236, _version_=1412006403603693568}, SolrDocument{id=237, _version_=1412006403611033600}, SolrDocument{id=238, _version_=1412006403618373632}, SolrDocument{id=239, _version_=1412006403625713664}, SolrDocument{id=240, _version_=1412006403633053696}, SolrDocument{id=241, _version_=1412006403641442304}, SolrDocument{id=242, _version_=1412006403648782336}, SolrDocument{id=243, _version_=1412006403656122368}, SolrDocument{id=244, _version_=1412006403665559552}, SolrDocument{id=245, _version_=1412006403677093888}, SolrDocument{id=246, _version_=1412006403685482496}, SolrDocument{id=247, _version_=1412006403692822528}, SolrDocument{id=248, _version_=1412006403700162560}, SolrDocument{id=249, _version_=1412006403707502592}, SolrDocument{id=250, _version_=1412006403714842624}, SolrDocument{id=251, _version_=1412006403722182656}, SolrDocument{id=252, _version_=1412006403729522688}, SolrDocument{id=253, _version_=1412006403736862720}, SolrDocument{id=254, _version_=1412006403746299904}, SolrDocument{id=255, _version_=1412006403757834240}, SolrDocument{id=256, _version_=1412006403767271424}, SolrDocument{id=257, _version_=1412006403774611456}, SolrDocument{id=258, _version_=1412006403783000064}, SolrDocument{id=259, _version_=1412006403790340096}, SolrDocument{id=260, _version_=1412006403797680128}, SolrDocument{id=261, _version_=1412006403806068736}, SolrDocument{id=262, _version_=1412006403814457344}, SolrDocument{id=263, _version_=1412006403822845952}, SolrDocument{id=264, _version_=1412006403832283136}, SolrDocument{id=265, _version_=1412006403844866048}, SolrDocument{id=266, _version_=1412006403854303232}, SolrDocument{id=267, _version_=1412006403862691840}, SolrDocument{id=268, _version_=1412006403870031872}, SolrDocument{id=269, _version_=1412006403877371904}, SolrDocument{id=270, _version_=1412006403884711936}, SolrDocument{id=271, _version_=1412006403892051968}, SolrDocument{id=272, _version_=1412006403900440576}, SolrDocument{id=273, _version_=1412006403907780608}, SolrDocument{id=274, _version_=1412006403919314944}, SolrDocument{id=275, _version_=1412006403932946432}, SolrDocument{id=276, _version_=1412006403942383616}, SolrDocument{id=277, _version_=1412006403949723648}, SolrDocument{id=278, _version_=1412006403956015104}, SolrDocument{id=279, _version_=1412006403963355136}, SolrDocument{id=280, _version_=1412006403971743744}, SolrDocument{id=281, _version_=1412006403980132352}, SolrDocument{id=282, _version_=1412006403988520960}, SolrDocument{id=283, _version_=1412006403997958144}, SolrDocument{id=284, _version_=1412006404008443904}, SolrDocument{id=285, _version_=1412006404021026816}, SolrDocument{id=286, _version_=1412006404030464000}, SolrDocument{id=287, _version_=1412006404041998336}, SolrDocument{id=288, _version_=1412006404050386944}, SolrDocument{id=289, _version_=1412006404062969856}, SolrDocument{id=290, _version_=1412006404072407040}, SolrDocument{id=291, _version_=1412006404080795648}, SolrDocument{id=292, _version_=1412006404088135680}, SolrDocument{id=293, _version_=1412006404096524288}, SolrDocument{id=294, _version_=1412006404105961472}, SolrDocument{id=295, _version_=1412006404117495808}, SolrDocument{id=296, _version_=1412006404125884416}, SolrDocument{id=297, _version_=1412006404134273024}, SolrDocument{id=298, _version_=1412006404141613056}, SolrDocument{id=299, _version_=1412006404148953088}, SolrDocument{id=300, _version_=1412006404156293120}, SolrDocument{id=301, _version_=1412006404163633152}, SolrDocument{id=302, _version_=1412006404170973184}, SolrDocument{id=303, _version_=1412006404179361792}, SolrDocument{id=304, _version_=1412006404188798976}]}
######http://127.0.0.1:12215/solr/collection1: {numFound=5,start=0,docs=[SolrDocument{id=0, _version_=1412006378027876352}, SolrDocument{id=1, _version_=1412006378037313536}, SolrDocument{id=2, _version_=1412006378044653568}, SolrDocument{id=3, _version_=1412006378053042176}, SolrDocument{id=4, _version_=1412006380540264448}]}
###### sizes=305,5
###### Only in http://127.0.0.1:17666/solr/collection1: [{id=81, _version_=1412006402306605056}, {id=217, _version_=1412006403432775680}, {id=171, _version_=1412006403080454144}, {id=260, _version_=1412006403797680128}, {id=154, _version_=1412006402933653504}, {id=234, _version_=1412006403583770624}, {id=195, _version_=1412006403261857792}, {id=49, _version_=1412006401984692224}, {id=136, _version_=1412006402803630080}, {id=277, _version_=1412006403949723648}, {id=131, _version_=1412006402756444160}, {id=157, _version_=1412006402957770752}, {id=291, _version_=1412006404080795648}, {id=39, _version_=1412006401885077504}, {id=31, _version_=1412006401809580032}, {id=13, _version_=1412006401642856448}, {id=29, _version_=1412006401791754240}, {id=84, _version_=1412006402338062336}, {id=96, _version_=1412006402448162816}, {id=5, _version_=1412006401573650432}, {id=92, _version_=1412006402409365504}, {id=245, _version_=1412006403677093888}, {id=241, _version_=1412006403641442304}, {id=163, _version_=1412006403007053824}, {id=78, _version_=1412006402282487808}, {id=269, _version_=1412006403877371904}, {id=66, _version_=1412006402176581632}, {id=173, _version_=1412006403096182784}, {id=108, _version_=1412006402547777536}, {id=123, _version_=1412006402688286720}, {id=168, _version_=1412006403055288320}, {id=70, _version_=1412006402211184640}, {id=87, _version_=1412006402368471040}, {id=239, _version_=1412006403625713664}, {id=270, _version_=1412006403884711936}, {id=289, _version_=1412006404062969856}, {id=101, _version_=1412006402484862976}, {id=105, _version_=1412006402520514560}, {id=36, _version_=1412006401856765952}, {id=213, _version_=1412006403401318400}, {id=126, _version_=1412006402719744000}, {id=202, _version_=1412006403314286592}, {id=51, _version_=1412006402003566592}, {id=232, _version_=1412006403565944832}, {id=99, _version_=1412006402470182912}, {id=219, _version_=1412006403448504320}, {id=140, _version_=1412006402830893056}, {id=272, _version_=1412006403900440576}, {id=247, _version_=1412006403692822528}, {id=254, _version_=1412006403746299904}, {id=300, _version_=1412006404156293120}, {id=226, _version_=1412006403515613184}, {id=40, _version_=1412006401894514688}, {id=9, _version_=1412006401611399168}, {id=57, _version_=1412006402074869760}, {id=33, _version_=1412006401825308672}, {id=149, _version_=1412006402900099072}, {id=228, _version_=1412006403533438976}, {id=94, _version_=1412006402427191296}, {id=115, _version_=1412006402612789248}, {id=299, _version_=1412006404148953088}, {id=204, _version_=1412006403332112384}, {id=117, _version_=1412006402644246528}, {id=6, _version_=1412006401585184768}, {id=236, _version_=1412006403603693568}, {id=280, _version_=1412006403971743744}, {id=156, _version_=1412006402951479296}, {id=177, _version_=1412006403129737216}, {id=148, _version_=1412006402893807616}, {id=208, _version_=1412006403369861120}, {id=44, _version_=1412006401932263424}, {id=206, _version_=1412006403356229632}, {id=278, _version_=1412006403956015104}, {id=43, _version_=1412006401921777664}, {id=102, _version_=1412006402492203008}, {id=256, _version_=1412006403767271424}, {id=127, _version_=1412006402727084032}, {id=41, _version_=1412006401903951872}, {id=21, _version_=1412006401718353920}, {id=114, _version_=1412006402601254912}, {id=283, _version_=1412006403997958144}, {id=290, _version_=1412006404072407040}, {id=196, _version_=1412006403270246400}, {id=147, _version_=1412006402886467584}, {id=132, _version_=1412006402763784192}, {id=24, _version_=1412006401744568320}, {id=164, _version_=1412006403017539584}, {id=285, _version_=1412006404021026816}, {id=297, _version_=1412006404134273024}, {id=201, _version_=1412006403306946560}, {id=172, _version_=1412006403088842752}, {id=82, _version_=1412006402314993664}, {id=65, _version_=1412006402165047296}, {id=167, _version_=1412006403046899712}, {id=19, _version_=1412006401702625280}, {id=124, _version_=1412006402697723904}, {id=225, _version_=1412006403506176000}, {id=71, _version_=1412006402219573248}, {id=50, _version_=1412006401994129408}, {id=138, _version_=1412006402817261568}, {id=162, _version_=1412006402998665216}, {id=77, _version_=1412006402274099200}, {id=93, _version_=1412006402417754112}, {id=69, _version_=1412006402202796032}, {id=174, _version_=1412006403104571392}, {id=67, _version_=1412006402184970240}, {id=240, _version_=1412006403633053696}, {id=109, _version_=1412006402556166144}, {id=30, _version_=1412006401800142848}, {id=255, _version_=1412006403757834240}, {id=222, _version_=1412006403478913024}, {id=46, _version_=1412006401956380672}, {id=15, _version_=1412006401669070848}, {id=90, _version_=1412006402393636864}, {id=209, _version_=1412006403376152576}, {id=8, _version_=1412006401603010560}, {id=227, _version_=1412006403524001792}, {id=63, _version_=1412006402130444288}, {id=276, _version_=1412006403942383616}, {id=183, _version_=1412006403171680256}, {id=221, _version_=1412006403472621568}, {id=233, _version_=1412006403574333440}, {id=242, _version_=1412006403648782336}, {id=32, _version_=1412006401817968640}, {id=231, _version_=1412006403556507648}, {id=150, _version_=1412006402906390528}, {id=216, _version_=1412006403425435648}, {id=26, _version_=1412006401766588416}, {id=248, _version_=1412006403700162560}, {id=165, _version_=1412006403029073920}, {id=205, _version_=1412006403347841024}, {id=207, _version_=1412006403363569664}, {id=288, _version_=1412006404050386944}, {id=129, _version_=1412006402741764096}, {id=258, _version_=1412006403783000064}, {id=134, _version_=1412006402781609984}, {id=224, _version_=1412006403494641664}, {id=251, _version_=1412006403722182656}, {id=178, _version_=1412006403138125824}, {id=281, _version_=1412006403980132352}, {id=143, _version_=1412006402852913152}, {id=302, _version_=1412006404170973184}, {id=133, _version_=1412006402771124224}, {id=170, _version_=1412006403072065536}, {id=68, _version_=1412006402193358848}, {id=72, _version_=1412006402227961856}, {id=180, _version_=1412006403150708736}, {id=61, _version_=1412006402111569920}, {id=192, _version_=1412006403235643392}, {id=186, _version_=1412006403195797504}, {id=110, _version_=1412006402564554752}, {id=184, _version_=1412006403180068864}, {id=304, _version_=1412006404188798976}, {id=23, _version_=1412006401735131136}, {id=175, _version_=1412006403115057152}, {id=27, _version_=1412006401774977024}, {id=161, _version_=1412006402990276608}, {id=146, _version_=1412006402879127552}, {id=293, _version_=1412006404096524288}, {id=286, _version_=1412006404030464000}, {id=75, _version_=1412006402257321984}, {id=91, _version_=1412006402400976896}, {id=262, _version_=1412006403814457344}, {id=159, _version_=1412006402974547968}, {id=144, _version_=1412006402861301760}, {id=282, _version_=1412006403988520960}, {id=113, _version_=1412006402591817728}, {id=107, _version_=1412006402539388928}, {id=42, _version_=1412006401913389056}, {id=103, _version_=1412006402499543040}, {id=190, _version_=1412006403222011904}, {id=257, _version_=1412006403774611456}, {id=45, _version_=1412006401945894912}, {id=265, _version_=1412006403844866048}, {id=83, _version_=1412006402323382272}, {id=111, _version_=1412006402573991936}, {id=296, _version_=1412006404125884416}, {id=137, _version_=1412006402809921536}, {id=275, _version_=1412006403932946432}, {id=274, _version_=1412006403919314944}, {id=212, _version_=1412006403395026944}, {id=62, _version_=1412006402121007104}, {id=249, _version_=1412006403707502592}, {id=59, _version_=1412006402093744128}, {id=74, _version_=1412006402245787648}, {id=220, _version_=1412006403463184384}, {id=53, _version_=1412006402022440960}, {id=20, _version_=1412006401709965312}, {id=182, _version_=1412006403164340224}, {id=47, _version_=1412006401965817856}, {id=179, _version_=1412006403144417280}, {id=215, _version_=1412006403418095616}, {id=97, _version_=1412006402455502848}, {id=243, _version_=1412006403656122368}, {id=210, _version_=1412006403382444032}, {id=166, _version_=1412006403038511104}, {id=16, _version_=1412006401678508032}, {id=89, _version_=1412006402385248256}, {id=18, _version_=1412006401694236672}, {id=252, _version_=1412006403729522688}, {id=85, _version_=1412006402349596672}, {id=259, _version_=1412006403790340096}, {id=11, _version_=1412006401628176384}, {id=194, _version_=1412006403249274880}, {id=198, _version_=1412006403285975040}, {id=25, _version_=1412006401757151232}, {id=230, _version_=1412006403549167616}, {id=287, _version_=1412006404041998336}, {id=128, _version_=1412006402734424064}, {id=267, _version_=1412006403862691840}, {id=187, _version_=1412006403202088960}, {id=142, _version_=1412006402845573120}, {id=151, _version_=1412006402912681984}, {id=200, _version_=1412006403299606528}, {id=119, _version_=1412006402658926592}, {id=79, _version_=1412006402290876416}, {id=121, _version_=1412006402673606656}, {id=54, _version_=1412006402035023872}, {id=218, _version_=1412006403440115712}, {id=160, _version_=1412006402981888000}, {id=28, _version_=1412006401783365632}, {id=181, _version_=1412006403157000192}, {id=185, _version_=1412006403188457472}, {id=64, _version_=1412006402146172928}, {id=38, _version_=1412006401875640320}, {id=223, _version_=1412006403485204480}, {id=14, _version_=1412006401653342208}, {id=250, _version_=1412006403714842624}, {id=135, _version_=1412006402794192896}, {id=73, _version_=1412006402236350464}, {id=12, _version_=1412006401635516416}, {id=271, _version_=1412006403892051968}, {id=292, _version_=1412006404088135680}, {id=303, _version_=1412006404179361792}, {id=130, _version_=1412006402749104128}, {id=116, _version_=1412006402635857920}, {id=122, _version_=1412006402680946688}, {id=169, _version_=1412006403063676928}, {id=153, _version_=1412006402925264896}, {id=263, _version_=1412006403822845952}, {id=294, _version_=1412006404105961472}, {id=295, _version_=1412006404117495808}, {id=37, _version_=1412006401866203136}, {id=191, _version_=1412006403229351936}, {id=246, _version_=1412006403685482496}, {id=106, _version_=1412006402531000320}, {id=214, _version_=1412006403408658432}, {id=125, _version_=1412006402710306816}, {id=176, _version_=1412006403123445760}, {id=193, _version_=1412006403241934848}, {id=48, _version_=1412006401975255040}, {id=261, _version_=1412006403806068736}, {id=112, _version_=1412006402584477696}, {id=158, _version_=1412006402966159360}, {id=55, _version_=1412006402052849664}, {id=273, _version_=1412006403907780608}, {id=7, _version_=1412006401594621952}, {id=268, _version_=1412006403870031872}, {id=100, _version_=1412006402477522944}, {id=141, _version_=1412006402838233088}, {id=80, _version_=1412006402298216448}, {id=237, _version_=1412006403611033600}, {id=139, _version_=1412006402824601600}, {id=235, _version_=1412006403595304960}, {id=152, _version_=1412006402918973440}, {id=95, _version_=1412006402438725632}, {id=56, _version_=1412006402066481152}, {id=199, _version_=1412006403292266496}, {id=188, _version_=1412006403208380416}, {id=301, _version_=1412006404163633152}, {id=145, _version_=1412006402871787520}, {id=279, _version_=1412006403963355136}, {id=58, _version_=1412006402084306944}, {id=238, _version_=1412006403618373632}, {id=86, _version_=1412006402359033856}, {id=284, _version_=1412006404008443904}, {id=76, _version_=1412006402267807744}, {id=104, _version_=1412006402508980224}, {id=60, _version_=1412006402102132736}, {id=189, _version_=1412006403215720448}, {id=211, _version_=1412006403388735488}, {id=244, _version_=1412006403665559552}, {id=118, _version_=1412006402651586560}, {id=98, _version_=1412006402462842880}, {id=35, _version_=1412006401846280192}, {id=264, _version_=1412006403832283136}, {id=34, _version_=1412006401834745856}, {id=266, _version_=1412006403854303232}, {id=120, _version_=1412006402667315200}, {id=203, _version_=1412006403321626624}, {id=298, _version_=1412006404141613056}, {id=155, _version_=1412006402944139264}, {id=17, _version_=1412006401685848064}, {id=229, _version_=1412006403540779008}, {id=10, _version_=1412006401619787776}, {id=52, _version_=1412006402013003776}, {id=88, _version_=1412006402376859648}, {id=197, _version_=1412006403277586432}, {id=253, _version_=1412006403736862720}, {id=22, _version_=1412006401725693952}]
client3
PROPS:shard=shard1
roles=null
state=active
core=collection1
collection=collection1
node_name=127.0.0.1:37498_solr
base_url=http://127.0.0.1:37498/solr

 live:true
 num:305

43885 T1843 oasc.SolrException.log SEVERE Sync Failed
ASYNC  NEW_CORE C2 name=collection1 org.apache.solr.core.SolrCore@471f412d url=http://127.0.0.1:12215/solr/collection1 node=127.0.0.1:12215_solr
88908 T1926 C2 P12215 oasc.SolrException.log SEVERE Error while trying to recover. core=collection1:org.apache.solr.client.solrj.SolrServerException: IOException occured when talking to server at: http://127.0.0.1:17666/solr
		at org.apache.solr.client.solrj.impl.HttpSolrServer.request(HttpSolrServer.java:414)
		at org.apache.solr.client.solrj.impl.HttpSolrServer.request(HttpSolrServer.java:182)
		at org.apache.solr.cloud.RecoveryStrategy.sendPrepRecoveryCmd(RecoveryStrategy.java:191)
		at org.apache.solr.cloud.RecoveryStrategy.doRecovery(RecoveryStrategy.java:320)
		at org.apache.solr.cloud.RecoveryStrategy.run(RecoveryStrategy.java:212)
	Caused by: org.apache.http.conn.ConnectTimeoutException: Connect to 127.0.0.1:17666 timed out
		at org.apache.http.conn.scheme.PlainSocketFactory.connectSocket(PlainSocketFactory.java:125)
		at org.apache.http.impl.conn.DefaultClientConnectionOperator.openConnection(DefaultClientConnectionOperator.java:148)
		at org.apache.http.impl.conn.AbstractPoolEntry.open(AbstractPoolEntry.java:150)
		at org.apache.http.impl.conn.AbstractPooledConnAdapter.open(AbstractPooledConnAdapter.java:121)
		at org.apache.http.impl.client.DefaultRequestDirector.tryConnect(DefaultRequestDirector.java:575)
		at org.apache.http.impl.client.DefaultRequestDirector.execute(DefaultRequestDirector.java:425)
		at org.apache.http.impl.client.AbstractHttpClient.execute(AbstractHttpClient.java:820)
		at org.apache.http.impl.client.AbstractHttpClient.execute(AbstractHttpClient.java:754)
		at org.apache.http.impl.client.AbstractHttpClient.execute(AbstractHttpClient.java:732)
		at org.apache.solr.client.solrj.impl.HttpSolrServer.request(HttpSolrServer.java:353)
		... 4 more
	
88911 T1926 C2 P12215 oasc.RecoveryStrategy.doRecovery SEVERE Recovery failed - trying again... core=collection1
Control Docs:305
check const of shard1
client0
PROPS:shard=shard1
roles=null
state=active
core=collection1
collection=collection1
node_name=127.0.0.1:52873_solr
base_url=http://127.0.0.1:52873/solr

 live:true
 num:305

client1
PROPS:shard=shard1
roles=null
state=active
core=collection1
collection=collection1
node_name=127.0.0.1:17666_solr
base_url=http://127.0.0.1:17666/solr

error contacting client: IOException occured when talking to server at: http://localhost:17666/solr/collection1

client2
PROPS:shard=shard1
roles=null
state=active
core=collection1
collection=collection1
node_name=127.0.0.1:12215_solr
base_url=http://127.0.0.1:12215/solr

 live:true
 num:305

client3
PROPS:shard=shard1
roles=null
leader=true
state=active
core=collection1
collection=collection1
node_name=127.0.0.1:37498_solr
base_url=http://127.0.0.1:37498/solr

 live:true
 num:305

http://127.0.0.1:52873/solr/collection1/ : 305
shard:shard1
Tests run: 1, Failures: 0, Errors: 0, Skipped: 0, Time elapsed: 99.403 sec
Running org.apache.solr.search.TestStressVersions
Creating dataDir: /usr/home/hudson/hudson-slave/workspace/Lucene-Solr-Maven-4.x/maven-build/solr/core/target/test/./solrtest-TestStressVersions-1346594298538
Tests run: 1, Failures: 0, Errors: 0, Skipped: 0, Time elapsed: 3.024 sec
Running org.apache.solr.cloud.ChaosMonkeySafeLeaderTest
Tests run: 1, Failures: 0, Errors: 0, Skipped: 1, Time elapsed: 0 sec
Running org.apache.solr.core.AlternateDirectoryTest
Creating dataDir: /usr/home/hudson/hudson-slave/workspace/Lucene-Solr-Maven-4.x/maven-build/solr/core/target/test/./solrtest-AlternateDirectoryTest-1346594301562
Tests run: 1, Failures: 0, Errors: 0, Skipped: 0, Time elapsed: 0.413 sec
Running org.apache.solr.search.TestRecovery
Creating dataDir: /usr/home/hudson/hudson-slave/workspace/Lucene-Solr-Maven-4.x/maven-build/solr/core/target/test/./solrtest-TestRecovery-1346594301987
Tests run: 9, Failures: 0, Errors: 0, Skipped: 0, Time elapsed: 7.077 sec
Running org.apache.solr.handler.PingRequestHandlerTest
Creating dataDir: /usr/home/hudson/hudson-slave/workspace/Lucene-Solr-Maven-4.x/maven-build/solr/core/target/test/./solrtest-PingRequestHandlerTest-1346594309059
Tests run: 5, Failures: 0, Errors: 0, Skipped: 0, Time elapsed: 0.377 sec
Running org.apache.solr.handler.component.DebugComponentTest
Creating dataDir: /usr/home/hudson/hudson-slave/workspace/Lucene-Solr-Maven-4.x/maven-build/solr/core/target/test/./solrtest-DebugComponentTest-1346594309437
Tests run: 2, Failures: 0, Errors: 0, Skipped: 0, Time elapsed: 0.561 sec
Running org.apache.solr.core.SOLR749Test
Creating dataDir: /usr/home/hudson/hudson-slave/workspace/Lucene-Solr-Maven-4.x/maven-build/solr/core/target/test/./solrtest-SOLR749Test-1346594309996
Tests run: 1, Failures: 0, Errors: 0, Skipped: 0, Time elapsed: 0.311 sec
Running org.apache.solr.util.TestNumberUtils
Tests run: 1, Failures: 0, Errors: 0, Skipped: 0, Time elapsed: 0.248 sec
Running org.apache.solr.search.TestValueSourceCache
Creating dataDir: /usr/home/hudson/hudson-slave/workspace/Lucene-Solr-Maven-4.x/maven-build/solr/core/target/test/./solrtest-TestValueSourceCache-1346594310558
Tests run: 2, Failures: 0, Errors: 0, Skipped: 0, Time elapsed: 0.58 sec
Running org.apache.solr.analysis.TestCollationKeyRangeQueries
Creating dataDir: /usr/home/hudson/hudson-slave/workspace/Lucene-Solr-Maven-4.x/maven-build/solr/core/target/test/./solrtest-TestCollationKeyRangeQueries-1346594311139
Tests run: 3, Failures: 0, Errors: 0, Skipped: 0, Time elapsed: 0.203 sec
Running org.apache.solr.core.TestArbitraryIndexDir
Tests run: 1, Failures: 0, Errors: 0, Skipped: 0, Time elapsed: 0.455 sec
Running org.apache.solr.update.processor.URLClassifyProcessorTest
Tests run: 7, Failures: 0, Errors: 0, Skipped: 0, Time elapsed: 0.04 sec
Running org.apache.solr.search.similarities.TestDefaultSimilarityFactory
Creating dataDir: /usr/home/hudson/hudson-slave/workspace/Lucene-Solr-Maven-4.x/maven-build/solr/core/target/test/./solrtest-TestDefaultSimilarityFactory-1346594311840
Tests run: 2, Failures: 0, Errors: 0, Skipped: 0, Time elapsed: 0.076 sec
Running org.apache.solr.schema.RequiredFieldsTest
Creating dataDir: /usr/home/hudson/hudson-slave/workspace/Lucene-Solr-Maven-4.x/maven-build/solr/core/target/test/./solrtest-RequiredFieldsTest-1346594311918
Tests run: 3, Failures: 0, Errors: 0, Skipped: 0, Time elapsed: 0.453 sec
Running org.apache.solr.update.SoftAutoCommitTest
Tests run: 3, Failures: 0, Errors: 0, Skipped: 0, Time elapsed: 8.775 sec
Running org.apache.solr.search.TestSurroundQueryParser
Tests run: 1, Failures: 0, Errors: 0, Skipped: 0, Time elapsed: 0.405 sec
Running org.apache.solr.cloud.ZkControllerTest
Creating dataDir: /usr/home/hudson/hudson-slave/workspace/Lucene-Solr-Maven-4.x/maven-build/solr/core/target/test/./solrtest-ZkControllerTest-1346594321552
Tests run: 2, Failures: 0, Errors: 0, Skipped: 0, Time elapsed: 3.572 sec
Running org.apache.solr.util.FileUtilsTest
Tests run: 1, Failures: 0, Errors: 0, Skipped: 0, Time elapsed: 0.023 sec
Running org.apache.solr.handler.DocumentAnalysisRequestHandlerTest
Creating dataDir: /usr/home/hudson/hudson-slave/workspace/Lucene-Solr-Maven-4.x/maven-build/solr/core/target/test/./solrtest-DocumentAnalysisRequestHandlerTest-1346594325154
Tests run: 4, Failures: 0, Errors: 0, Skipped: 0, Time elapsed: 0.548 sec
Running org.apache.solr.search.TestSolrQueryParser
Creating dataDir: /usr/home/hudson/hudson-slave/workspace/Lucene-Solr-Maven-4.x/maven-build/solr/core/target/test/./solrtest-TestSolrQueryParser-1346594325709
Tests run: 1, Failures: 0, Errors: 0, Skipped: 0, Time elapsed: 0.706 sec
Running org.apache.solr.search.TestIndexSearcher
Creating dataDir: /usr/home/hudson/hudson-slave/workspace/Lucene-Solr-Maven-4.x/maven-build/solr/core/target/test/./solrtest-TestIndexSearcher-1346594326409
Tests run: 2, Failures: 0, Errors: 0, Skipped: 0, Time elapsed: 1.262 sec
Running org.apache.solr.spelling.DirectSolrSpellCheckerTest
Creating dataDir: /usr/home/hudson/hudson-slave/workspace/Lucene-Solr-Maven-4.x/maven-build/solr/core/target/test/./solrtest-DirectSolrSpellCheckerTest-1346594327673
Tests run: 2, Failures: 0, Errors: 0, Skipped: 0, Time elapsed: 0.635 sec
Running org.apache.solr.internal.csv.writer.CSVConfigTest
Tests run: 7, Failures: 0, Errors: 0, Skipped: 0, Time elapsed: 0.001 sec
Running org.apache.solr.handler.component.StatsComponentTest
ASYNC  NEW_CORE C3 name=collection1 org.apache.solr.core.SolrCore@32f9e838
1805 T2133 C3 oasc.SolrException.log SEVERE org.apache.solr.common.SolrException: Stats can only facet on single-valued fields, not: foo_ss
		at org.apache.solr.handler.component.SimpleStats.getFieldCacheStats(StatsComponent.java:261)
		at org.apache.solr.handler.component.SimpleStats.getStatsFields(StatsComponent.java:227)
		at org.apache.solr.handler.component.SimpleStats.getStatsCounts(StatsComponent.java:201)
		at org.apache.solr.handler.component.StatsComponent.process(StatsComponent.java:70)
		at org.apache.solr.handler.component.SearchHandler.handleRequestBody(SearchHandler.java:206)
		at org.apache.solr.handler.RequestHandlerBase.handleRequest(RequestHandlerBase.java:129)
		at org.apache.solr.core.SolrCore.execute(SolrCore.java:1692)
		at org.apache.solr.util.TestHarness.query(TestHarness.java:351)
		at org.apache.solr.util.TestHarness.query(TestHarness.java:333)
		at org.apache.solr.util.AbstractSolrTestCase.assertQEx(AbstractSolrTestCase.java:290)
		at org.apache.solr.handler.component.StatsComponentTest.testStatsFacetMultivaluedErrorHandling(StatsComponentTest.java:363)
		at sun.reflect.NativeMethodAccessorImpl.invoke0(Native Method)
		at sun.reflect.NativeMethodAccessorImpl.invoke(NativeMethodAccessorImpl.java:57)
		at sun.reflect.DelegatingMethodAccessorImpl.invoke(DelegatingMethodAccessorImpl.java:43)
		at java.lang.reflect.Method.invoke(Method.java:616)
		at com.carrotsearch.randomizedtesting.RandomizedRunner.invoke(RandomizedRunner.java:1559)
		at com.carrotsearch.randomizedtesting.RandomizedRunner.access$600(RandomizedRunner.java:79)
		at com.carrotsearch.randomizedtesting.RandomizedRunner$6.evaluate(RandomizedRunner.java:737)
		at com.carrotsearch.randomizedtesting.RandomizedRunner$7.evaluate(RandomizedRunner.java:773)
		at com.carrotsearch.randomizedtesting.RandomizedRunner$8.evaluate(RandomizedRunner.java:787)
		at com.carrotsearch.randomizedtesting.rules.SystemPropertiesRestoreRule$1.evaluate(SystemPropertiesRestoreRule.java:53)
		at org.apache.lucene.util.TestRuleSetupTeardownChained$1.evaluate(TestRuleSetupTeardownChained.java:50)
		at org.apache.lucene.util.TestRuleFieldCacheSanity$1.evaluate(TestRuleFieldCacheSanity.java:51)
		at org.apache.lucene.util.AbstractBeforeAfterRule$1.evaluate(AbstractBeforeAfterRule.java:45)
		at com.carrotsearch.randomizedtesting.rules.SystemPropertiesInvariantRule$1.evaluate(SystemPropertiesInvariantRule.java:55)
		at org.apache.lucene.util.TestRuleThreadAndTestName$1.evaluate(TestRuleThreadAndTestName.java:48)
		at org.apache.lucene.util.TestRuleIgnoreAfterMaxFailures$1.evaluate(TestRuleIgnoreAfterMaxFailures.java:70)
		at org.apache.lucene.util.TestRuleMarkFailure$1.evaluate(TestRuleMarkFailure.java:48)
		at com.carrotsearch.randomizedtesting.rules.StatementAdapter.evaluate(StatementAdapter.java:36)
		at com.carrotsearch.randomizedtesting.ThreadLeakControl$StatementRunner.run(ThreadLeakControl.java:345)
		at com.carrotsearch.randomizedtesting.ThreadLeakControl.forkTimeoutingTask(ThreadLeakControl.java:769)
		at com.carrotsearch.randomizedtesting.ThreadLeakControl$3.evaluate(ThreadLeakControl.java:429)
		at com.carrotsearch.randomizedtesting.RandomizedRunner.runSingleTest(RandomizedRunner.java:746)
		at com.carrotsearch.randomizedtesting.RandomizedRunner$3.evaluate(RandomizedRunner.java:648)
		at com.carrotsearch.randomizedtesting.RandomizedRunner$4.evaluate(RandomizedRunner.java:682)
		at com.carrotsearch.randomizedtesting.RandomizedRunner$5.evaluate(RandomizedRunner.java:693)
		at com.carrotsearch.randomizedtesting.rules.StatementAdapter.evaluate(StatementAdapter.java:36)
		at com.carrotsearch.randomizedtesting.rules.SystemPropertiesRestoreRule$1.evaluate(SystemPropertiesRestoreRule.java:53)
		at org.apache.lucene.util.AbstractBeforeAfterRule$1.evaluate(AbstractBeforeAfterRule.java:45)
		at org.apache.lucene.util.TestRuleStoreClassName$1.evaluate(TestRuleStoreClassName.java:42)
		at com.carrotsearch.randomizedtesting.rules.SystemPropertiesInvariantRule$1.evaluate(SystemPropertiesInvariantRule.java:55)
		at com.carrotsearch.randomizedtesting.rules.NoShadowingOrOverridesOnMethodsRule$1.evaluate(NoShadowingOrOverridesOnMethodsRule.java:39)
		at com.carrotsearch.randomizedtesting.rules.NoShadowingOrOverridesOnMethodsRule$1.evaluate(NoShadowingOrOverridesOnMethodsRule.java:39)
		at org.apache.lucene.util.TestRuleAssertionsRequired$1.evaluate(TestRuleAssertionsRequired.java:40)
		at org.apache.lucene.util.TestRuleMarkFailure$1.evaluate(TestRuleMarkFailure.java:48)
		at org.apache.lucene.util.TestRuleIgnoreAfterMaxFailures$1.evaluate(TestRuleIgnoreAfterMaxFailures.java:70)
		at org.apache.lucene.util.TestRuleIgnoreTestSuites$1.evaluate(TestRuleIgnoreTestSuites.java:55)
		at com.carrotsearch.randomizedtesting.rules.StatementAdapter.evaluate(StatementAdapter.java:36)
		at com.carrotsearch.randomizedtesting.ThreadLeakControl$StatementRunner.run(ThreadLeakControl.java:345)
		at java.lang.Thread.run(Thread.java:679)
	
Tests run: 7, Failures: 0, Errors: 0, Skipped: 0, Time elapsed: 3.154 sec
Running org.apache.solr.handler.JsonLoaderTest
Creating dataDir: /usr/home/hudson/hudson-slave/workspace/Lucene-Solr-Maven-4.x/maven-build/solr/core/target/test/./solrtest-JsonLoaderTest-1346594331460
Tests run: 6, Failures: 0, Errors: 0, Skipped: 0, Time elapsed: 0.503 sec
Running org.apache.solr.core.RequestHandlersTest
Creating dataDir: /usr/home/hudson/hudson-slave/workspace/Lucene-Solr-Maven-4.x/maven-build/solr/core/target/test/./solrtest-RequestHandlersTest-1346594331968
Tests run: 3, Failures: 0, Errors: 0, Skipped: 0, Time elapsed: 0.607 sec
Running org.apache.solr.handler.component.SpellCheckComponentTest
Creating dataDir: /usr/home/hudson/hudson-slave/workspace/Lucene-Solr-Maven-4.x/maven-build/solr/core/target/test/./solrtest-SpellCheckComponentTest-1346594332577
Tests run: 9, Failures: 0, Errors: 0, Skipped: 0, Time elapsed: 6.174 sec
Running org.apache.solr.handler.component.DistributedSpellCheckComponentTest
Tests run: 1, Failures: 0, Errors: 0, Skipped: 0, Time elapsed: 7.592 sec
Running org.apache.solr.core.TestCoreContainer
Creating dataDir: /usr/home/hudson/hudson-slave/workspace/Lucene-Solr-Maven-4.x/maven-build/solr/core/target/test/./solrtest-TestCoreContainer-1346594346347
Tests run: 2, Failures: 0, Errors: 0, Skipped: 0, Time elapsed: 1.497 sec
Running org.apache.solr.update.TestUpdate
Creating dataDir: /usr/home/hudson/hudson-slave/workspace/Lucene-Solr-Maven-4.x/maven-build/solr/core/target/test/./solrtest-TestUpdate-1346594347843
Tests run: 1, Failures: 0, Errors: 0, Skipped: 0, Time elapsed: 0.414 sec
Running org.apache.solr.core.TestPropInjectDefaults
Creating dataDir: /usr/home/hudson/hudson-slave/workspace/Lucene-Solr-Maven-4.x/maven-build/solr/core/target/test/./solrtest-TestPropInjectDefaults-1346594348273
Tests run: 2, Failures: 0, Errors: 0, Skipped: 0, Time elapsed: 0.276 sec
Running org.apache.solr.util.DateMathParserTest
Tests run: 8, Failures: 0, Errors: 0, Skipped: 0, Time elapsed: 0.067 sec
Running org.apache.solr.update.TestIndexingPerformance
Tests run: 1, Failures: 0, Errors: 0, Skipped: 0, Time elapsed: 0.412 sec
Running org.apache.solr.cloud.LeaderElectionIntegrationTest
Creating dataDir: /usr/home/hudson/hudson-slave/workspace/Lucene-Solr-Maven-4.x/maven-build/solr/core/target/test/./solrtest-LeaderElectionIntegrationTest-1346594349041
13265 T2304 oasc.SolrException.log SEVERE Failed setting watch:org.apache.zookeeper.KeeperException$NoNodeException: KeeperErrorCode = NoNode for /overseer_elect/election/88250407259013123-127.0.0.1:7001_solr-n_0000000001
		at org.apache.zookeeper.KeeperException.create(KeeperException.java:102)
		at org.apache.zookeeper.KeeperException.create(KeeperException.java:42)
		at org.apache.zookeeper.ZooKeeper.getData(ZooKeeper.java:927)
		at org.apache.solr.common.cloud.SolrZkClient$7.execute(SolrZkClient.java:301)
		at org.apache.solr.common.cloud.SolrZkClient$7.execute(SolrZkClient.java:298)
		at org.apache.solr.common.cloud.ZkCmdExecutor.retryOperation(ZkCmdExecutor.java:67)
		at org.apache.solr.common.cloud.SolrZkClient.getData(SolrZkClient.java:298)
		at org.apache.solr.cloud.LeaderElector.checkIfIamLeader(LeaderElector.java:120)
		at org.apache.solr.cloud.LeaderElector.access$000(LeaderElector.java:57)
		at org.apache.solr.cloud.LeaderElector$1.process(LeaderElector.java:132)
		at org.apache.zookeeper.ClientCnxn$EventThread.processEvent(ClientCnxn.java:526)
		at org.apache.zookeeper.ClientCnxn$EventThread.run(ClientCnxn.java:502)
	
Creating dataDir: /usr/home/hudson/hudson-slave/workspace/Lucene-Solr-Maven-4.x/maven-build/solr/core/target/test/./solrtest-LeaderElectionIntegrationTest-1346594362370
20985 T2327 oasc.SyncStrategy.sync SEVERE No UpdateLog found - cannot sync
21008 T2330 oasc.SyncStrategy.sync SEVERE No UpdateLog found - cannot sync
21012 T2333 oasc.SyncStrategy.sync SEVERE No UpdateLog found - cannot sync
21015 T2336 oasc.SyncStrategy.sync SEVERE No UpdateLog found - cannot sync
21035 T2327 oasc.SyncStrategy.sync SEVERE No UpdateLog found - cannot sync
22195 T2330 oasc.SyncStrategy.sync SEVERE No UpdateLog found - cannot sync
23188 T2336 oasc.SyncStrategy.sync SEVERE No UpdateLog found - cannot sync
Tests run: 2, Failures: 0, Errors: 0, Skipped: 0, Time elapsed: 27.148 sec
Running org.apache.solr.update.processor.UniqFieldsUpdateProcessorFactoryTest
Creating dataDir: /usr/home/hudson/hudson-slave/workspace/Lucene-Solr-Maven-4.x/maven-build/solr/core/target/test/./solrtest-UniqFieldsUpdateProcessorFactoryTest-1346594376190
Tests run: 1, Failures: 0, Errors: 0, Skipped: 0, Time elapsed: 0.526 sec
Running org.apache.solr.cloud.ClusterStateUpdateTest
Creating dataDir: /usr/home/hudson/hudson-slave/workspace/Lucene-Solr-Maven-4.x/maven-build/solr/core/target/test/./solrtest-ClusterStateUpdateTest-1346594376716
Tests run: 1, Failures: 0, Errors: 0, Skipped: 0, Time elapsed: 8.976 sec
Running org.apache.solr.spelling.suggest.SuggesterTSTTest
Creating dataDir: /usr/home/hudson/hudson-slave/workspace/Lucene-Solr-Maven-4.x/maven-build/solr/core/target/test/./solrtest-SuggesterTSTTest-1346594385692
NOTE: per solr.test.leavedatadir, dataDir will not be removed: /usr/home/hudson/hudson-slave/workspace/Lucene-Solr-Maven-4.x/maven-build/solr/core/target/test/./solrtest-SuggesterTSTTest-1346594385692
Tests run: 4, Failures: 0, Errors: 0, Skipped: 0, Time elapsed: 0.897 sec
Running org.apache.solr.search.similarities.TestIBSimilarityFactory
Creating dataDir: /usr/home/hudson/hudson-slave/workspace/Lucene-Solr-Maven-4.x/maven-build/solr/core/target/test/./solrtest-TestIBSimilarityFactory-1346594386586
Tests run: 2, Failures: 0, Errors: 0, Skipped: 0, Time elapsed: 0.074 sec
Running org.apache.solr.search.QueryParsingTest
Creating dataDir: /usr/home/hudson/hudson-slave/workspace/Lucene-Solr-Maven-4.x/maven-build/solr/core/target/test/./solrtest-QueryParsingTest-1346594386664
Tests run: 4, Failures: 0, Errors: 0, Skipped: 0, Time elapsed: 0.522 sec
Running org.apache.solr.spelling.suggest.SuggesterWFSTTest
Creating dataDir: /usr/home/hudson/hudson-slave/workspace/Lucene-Solr-Maven-4.x/maven-build/solr/core/target/test/./solrtest-SuggesterWFSTTest-1346594387187
NOTE: per solr.test.leavedatadir, dataDir will not be removed: /usr/home/hudson/hudson-slave/workspace/Lucene-Solr-Maven-4.x/maven-build/solr/core/target/test/./solrtest-SuggesterWFSTTest-1346594387187
Tests run: 4, Failures: 0, Errors: 0, Skipped: 0, Time elapsed: 0.834 sec
Running org.apache.solr.update.UpdateParamsTest
Tests run: 1, Failures: 0, Errors: 0, Skipped: 0, Time elapsed: 0.5 sec
Running org.apache.solr.search.TestReload
Creating dataDir: /usr/home/hudson/hudson-slave/workspace/Lucene-Solr-Maven-4.x/maven-build/solr/core/target/test/./solrtest-TestReload-1346594388524
!!! softCommittrue
!!! softCommitfalse
!!! softCommittrue
!!! softCommittrue
!!! softCommittrue
!!! softCommittrue
!!! softCommitfalse
Tests run: 1, Failures: 0, Errors: 0, Skipped: 0, Time elapsed: 5.428 sec
Running org.apache.solr.schema.CopyFieldTest
Creating dataDir: /usr/home/hudson/hudson-slave/workspace/Lucene-Solr-Maven-4.x/maven-build/solr/core/target/test/./solrtest-CopyFieldTest-1346594393948
Tests run: 6, Failures: 0, Errors: 0, Skipped: 0, Time elapsed: 0.305 sec
Running org.apache.solr.cloud.BasicDistributedZk2Test
Creating dataDir: /usr/home/hudson/hudson-slave/workspace/Lucene-Solr-Maven-4.x/maven-build/solr/core/target/test/./solrtest-BasicDistributedZk2Test-1346594394261
51210 T2494 oasc.SolrException.log SEVERE Sync request error: org.apache.solr.client.solrj.SolrServerException: IOException occured when talking to server at: http://127.0.0.1:38427/solr/collection1
96228 T2494 oasc.SolrException.log SEVERE http://127.0.0.1:38439/solr/collection1/: Could not tell a replica to recover:org.apache.solr.client.solrj.SolrServerException: IOException occured when talking to server at: http://127.0.0.1:38427/solr
		at org.apache.solr.client.solrj.impl.HttpSolrServer.request(HttpSolrServer.java:414)
		at org.apache.solr.client.solrj.impl.HttpSolrServer.request(HttpSolrServer.java:182)
		at org.apache.solr.cloud.SyncStrategy.requestRecovery(SyncStrategy.java:282)
		at org.apache.solr.cloud.SyncStrategy.syncToMe(SyncStrategy.java:226)
		at org.apache.solr.cloud.SyncStrategy.syncReplicas(SyncStrategy.java:119)
		at org.apache.solr.cloud.SyncStrategy.sync(SyncStrategy.java:85)
		at org.apache.solr.cloud.ShardLeaderElectionContext.runLeaderProcess(ElectionContext.java:180)
		at org.apache.solr.cloud.LeaderElector.runIamLeaderProcess(LeaderElector.java:159)
		at org.apache.solr.cloud.LeaderElector.checkIfIamLeader(LeaderElector.java:103)
		at org.apache.solr.cloud.LeaderElector.access$000(LeaderElector.java:57)
		at org.apache.solr.cloud.LeaderElector$1.process(LeaderElector.java:132)
		at org.apache.zookeeper.ClientCnxn$EventThread.processEvent(ClientCnxn.java:526)
		at org.apache.zookeeper.ClientCnxn$EventThread.run(ClientCnxn.java:502)
	Caused by: org.apache.http.conn.ConnectTimeoutException: Connect to 127.0.0.1:38427 timed out
		at org.apache.http.conn.scheme.PlainSocketFactory.connectSocket(PlainSocketFactory.java:125)
		at org.apache.http.impl.conn.DefaultClientConnectionOperator.openConnection(DefaultClientConnectionOperator.java:148)
		at org.apache.http.impl.conn.AbstractPoolEntry.open(AbstractPoolEntry.java:150)
		at org.apache.http.impl.conn.AbstractPooledConnAdapter.open(AbstractPooledConnAdapter.java:121)
		at org.apache.http.impl.client.DefaultRequestDirector.tryConnect(DefaultRequestDirector.java:575)
		at org.apache.http.impl.client.DefaultRequestDirector.execute(DefaultRequestDirector.java:425)
		at org.apache.http.impl.client.AbstractHttpClient.execute(AbstractHttpClient.java:820)
		at org.apache.http.impl.client.AbstractHttpClient.execute(AbstractHttpClient.java:754)
		at org.apache.http.impl.client.AbstractHttpClient.execute(AbstractHttpClient.java:732)
		at org.apache.solr.client.solrj.impl.HttpSolrServer.request(HttpSolrServer.java:353)
		... 12 more
	
ASYNC  NEW_CORE C4 name=collection1 org.apache.solr.core.SolrCore@7c1edec9 url=http://127.0.0.1:38423/solr/collection1 node=127.0.0.1:38423_solr
136302 T2435 C4 P38423 oasc.SolrException.log SEVERE org.apache.solr.common.SolrException: Document is missing mandatory uniqueKey field: id
		at org.apache.solr.update.AddUpdateCommand.getHashableId(AddUpdateCommand.java:132)
		at org.apache.solr.update.processor.DistributedUpdateProcessor.hash(DistributedUpdateProcessor.java:1067)
		at org.apache.solr.update.processor.DistributedUpdateProcessor.processAdd(DistributedUpdateProcessor.java:332)
		at org.apache.solr.handler.loader.XMLLoader.processUpdate(XMLLoader.java:230)
		at org.apache.solr.handler.loader.XMLLoader.load(XMLLoader.java:157)
		at org.apache.solr.handler.UpdateRequestHandler$1.load(UpdateRequestHandler.java:92)
		at org.apache.solr.handler.ContentStreamHandlerBase.handleRequestBody(ContentStreamHandlerBase.java:74)
		at org.apache.solr.handler.RequestHandlerBase.handleRequest(RequestHandlerBase.java:129)
		at org.apache.solr.core.SolrCore.execute(SolrCore.java:1692)
		at org.apache.solr.servlet.SolrDispatchFilter.execute(SolrDispatchFilter.java:454)
		at org.apache.solr.servlet.SolrDispatchFilter.doFilter(SolrDispatchFilter.java:275)
		at org.eclipse.jetty.servlet.ServletHandler$CachedChain.doFilter(ServletHandler.java:1337)
		at org.eclipse.jetty.servlet.ServletHandler.doHandle(ServletHandler.java:484)
		at org.eclipse.jetty.server.session.SessionHandler.doHandle(SessionHandler.java:231)
		at org.eclipse.jetty.server.handler.ScopedHandler.handle(ScopedHandler.java:119)
		at org.eclipse.jetty.server.handler.GzipHandler.handle(GzipHandler.java:267)
		at org.eclipse.jetty.server.handler.ContextHandler.doHandle(ContextHandler.java:1067)
		at org.eclipse.jetty.servlet.ServletHandler.doScope(ServletHandler.java:413)
		at org.eclipse.jetty.server.session.SessionHandler.doScope(SessionHandler.java:192)
		at org.eclipse.jetty.server.handler.ContextHandler.doScope(ContextHandler.java:999)
		at org.eclipse.jetty.server.handler.ScopedHandler.handle(ScopedHandler.java:117)
		at org.eclipse.jetty.server.handler.HandlerWrapper.handle(HandlerWrapper.java:111)
		at org.eclipse.jetty.server.Server.handle(Server.java:351)
		at org.eclipse.jetty.server.AbstractHttpConnection.handleRequest(AbstractHttpConnection.java:454)
		at org.eclipse.jetty.server.BlockingHttpConnection.handleRequest(BlockingHttpConnection.java:47)
		at org.eclipse.jetty.server.AbstractHttpConnection.content(AbstractHttpConnection.java:900)
		at org.eclipse.jetty.server.AbstractHttpConnection$RequestHandler.content(AbstractHttpConnection.java:954)
		at org.eclipse.jetty.http.HttpParser.parseNext(HttpParser.java:952)
		at org.eclipse.jetty.http.HttpParser.parseAvailable(HttpParser.java:235)
		at org.eclipse.jetty.server.BlockingHttpConnection.handle(BlockingHttpConnection.java:66)
		at org.eclipse.jetty.server.bio.SocketConnector$ConnectorEndPoint.run(SocketConnector.java:254)
		at org.eclipse.jetty.util.thread.QueuedThreadPool.runJob(QueuedThreadPool.java:599)
		at org.eclipse.jetty.util.thread.QueuedThreadPool$3.run(QueuedThreadPool.java:534)
		at java.lang.Thread.run(Thread.java:679)
	
136386 T2481 oasc.SolrException.log SEVERE Sync Failed
138007 T2611 oasc.SolrException.log SEVERE java.lang.InterruptedException: sleep interrupted
		at java.lang.Thread.sleep(Native Method)
		at org.apache.solr.handler.admin.CoreAdminHandler.handleWaitForStateAction(CoreAdminHandler.java:896)
		at org.apache.solr.handler.admin.CoreAdminHandler.handleRequestBody(CoreAdminHandler.java:185)
		at org.apache.solr.handler.RequestHandlerBase.handleRequest(RequestHandlerBase.java:129)
		at org.apache.solr.servlet.SolrDispatchFilter.handleAdminRequest(SolrDispatchFilter.java:371)
		at org.apache.solr.servlet.SolrDispatchFilter.doFilter(SolrDispatchFilter.java:180)
		at org.eclipse.jetty.servlet.ServletHandler$CachedChain.doFilter(ServletHandler.java:1337)
		at org.eclipse.jetty.servlet.ServletHandler.doHandle(ServletHandler.java:484)
		at org.eclipse.jetty.server.session.SessionHandler.doHandle(SessionHandler.java:231)
		at org.eclipse.jetty.server.handler.ScopedHandler.handle(ScopedHandler.java:119)
		at org.eclipse.jetty.server.handler.GzipHandler.handle(GzipHandler.java:267)
		at org.eclipse.jetty.server.handler.ContextHandler.doHandle(ContextHandler.java:1067)
		at org.eclipse.jetty.servlet.ServletHandler.doScope(ServletHandler.java:413)
		at org.eclipse.jetty.server.session.SessionHandler.doScope(SessionHandler.java:192)
		at org.eclipse.jetty.server.handler.ContextHandler.doScope(ContextHandler.java:999)
		at org.eclipse.jetty.server.handler.ScopedHandler.handle(ScopedHandler.java:117)
		at org.eclipse.jetty.server.handler.HandlerWrapper.handle(HandlerWrapper.java:111)
		at org.eclipse.jetty.server.Server.handle(Server.java:351)
		at org.eclipse.jetty.server.AbstractHttpConnection.handleRequest(AbstractHttpConnection.java:454)
		at org.eclipse.jetty.server.BlockingHttpConnection.handleRequest(BlockingHttpConnection.java:47)
		at org.eclipse.jetty.server.AbstractHttpConnection.headerComplete(AbstractHttpConnection.java:890)
		at org.eclipse.jetty.server.AbstractHttpConnection$RequestHandler.headerComplete(AbstractHttpConnection.java:944)
		at org.eclipse.jetty.http.HttpParser.parseNext(HttpParser.java:634)
		at org.eclipse.jetty.http.HttpParser.parseAvailable(HttpParser.java:230)
		at org.eclipse.jetty.server.BlockingHttpConnection.handle(BlockingHttpConnection.java:66)
		at org.eclipse.jetty.server.bio.SocketConnector$ConnectorEndPoint.run(SocketConnector.java:254)
		at org.eclipse.jetty.util.thread.QueuedThreadPool.runJob(QueuedThreadPool.java:599)
		at org.eclipse.jetty.util.thread.QueuedThreadPool$3.run(QueuedThreadPool.java:534)
		at java.lang.Thread.run(Thread.java:679)
	
138008 T2611 oasc.SolrException.log SEVERE null:java.lang.InterruptedException: sleep interrupted
		at java.lang.Thread.sleep(Native Method)
		at org.apache.solr.handler.admin.CoreAdminHandler.handleWaitForStateAction(CoreAdminHandler.java:896)
		at org.apache.solr.handler.admin.CoreAdminHandler.handleRequestBody(CoreAdminHandler.java:185)
		at org.apache.solr.handler.RequestHandlerBase.handleRequest(RequestHandlerBase.java:129)
		at org.apache.solr.servlet.SolrDispatchFilter.handleAdminRequest(SolrDispatchFilter.java:371)
		at org.apache.solr.servlet.SolrDispatchFilter.doFilter(SolrDispatchFilter.java:180)
		at org.eclipse.jetty.servlet.ServletHandler$CachedChain.doFilter(ServletHandler.java:1337)
		at org.eclipse.jetty.servlet.ServletHandler.doHandle(ServletHandler.java:484)
		at org.eclipse.jetty.server.session.SessionHandler.doHandle(SessionHandler.java:231)
		at org.eclipse.jetty.server.handler.ScopedHandler.handle(ScopedHandler.java:119)
		at org.eclipse.jetty.server.handler.GzipHandler.handle(GzipHandler.java:267)
		at org.eclipse.jetty.server.handler.ContextHandler.doHandle(ContextHandler.java:1067)
		at org.eclipse.jetty.servlet.ServletHandler.doScope(ServletHandler.java:413)
		at org.eclipse.jetty.server.session.SessionHandler.doScope(SessionHandler.java:192)
		at org.eclipse.jetty.server.handler.ContextHandler.doScope(ContextHandler.java:999)
		at org.eclipse.jetty.server.handler.ScopedHandler.handle(ScopedHandler.java:117)
		at org.eclipse.jetty.server.handler.HandlerWrapper.handle(HandlerWrapper.java:111)
		at org.eclipse.jetty.server.Server.handle(Server.java:351)
		at org.eclipse.jetty.server.AbstractHttpConnection.handleRequest(AbstractHttpConnection.java:454)
		at org.eclipse.jetty.server.BlockingHttpConnection.handleRequest(BlockingHttpConnection.java:47)
		at org.eclipse.jetty.server.AbstractHttpConnection.headerComplete(AbstractHttpConnection.java:890)
		at org.eclipse.jetty.server.AbstractHttpConnection$RequestHandler.headerComplete(AbstractHttpConnection.java:944)
		at org.eclipse.jetty.http.HttpParser.parseNext(HttpParser.java:634)
		at org.eclipse.jetty.http.HttpParser.parseAvailable(HttpParser.java:230)
		at org.eclipse.jetty.server.BlockingHttpConnection.handle(BlockingHttpConnection.java:66)
		at org.eclipse.jetty.server.bio.SocketConnector$ConnectorEndPoint.run(SocketConnector.java:254)
		at org.eclipse.jetty.util.thread.QueuedThreadPool.runJob(QueuedThreadPool.java:599)
		at org.eclipse.jetty.util.thread.QueuedThreadPool$3.run(QueuedThreadPool.java:534)
		at java.lang.Thread.run(Thread.java:679)
	
138009 T2611 oasc.SolrException.log SEVERE null:org.eclipse.jetty.io.EofException
		at org.eclipse.jetty.server.HttpOutput.write(HttpOutput.java:154)
		at org.eclipse.jetty.server.HttpOutput.write(HttpOutput.java:101)
		at org.apache.solr.common.util.FastOutputStream.flush(FastOutputStream.java:204)
		at org.apache.solr.common.util.FastOutputStream.flushBuffer(FastOutputStream.java:197)
		at org.apache.solr.common.util.JavaBinCodec.marshal(JavaBinCodec.java:94)
		at org.apache.solr.response.BinaryResponseWriter.write(BinaryResponseWriter.java:49)
		at org.apache.solr.servlet.SolrDispatchFilter.writeResponse(SolrDispatchFilter.java:403)
		at org.apache.solr.servlet.SolrDispatchFilter.handleAdminRequest(SolrDispatchFilter.java:381)
		at org.apache.solr.servlet.SolrDispatchFilter.doFilter(SolrDispatchFilter.java:180)
		at org.eclipse.jetty.servlet.ServletHandler$CachedChain.doFilter(ServletHandler.java:1337)
		at org.eclipse.jetty.servlet.ServletHandler.doHandle(ServletHandler.java:484)
		at org.eclipse.jetty.server.session.SessionHandler.doHandle(SessionHandler.java:231)
		at org.eclipse.jetty.server.handler.ScopedHandler.handle(ScopedHandler.java:119)
		at org.eclipse.jetty.server.handler.GzipHandler.handle(GzipHandler.java:267)
		at org.eclipse.jetty.server.handler.ContextHandler.doHandle(ContextHandler.java:1067)
		at org.eclipse.jetty.servlet.ServletHandler.doScope(ServletHandler.java:413)
		at org.eclipse.jetty.server.session.SessionHandler.doScope(SessionHandler.java:192)
		at org.eclipse.jetty.server.handler.ContextHandler.doScope(ContextHandler.java:999)
		at org.eclipse.jetty.server.handler.ScopedHandler.handle(ScopedHandler.java:117)
		at org.eclipse.jetty.server.handler.HandlerWrapper.handle(HandlerWrapper.java:111)
		at org.eclipse.jetty.server.Server.handle(Server.java:351)
		at org.eclipse.jetty.server.AbstractHttpConnection.handleRequest(AbstractHttpConnection.java:454)
		at org.eclipse.jetty.server.BlockingHttpConnection.handleRequest(BlockingHttpConnection.java:47)
		at org.eclipse.jetty.server.AbstractHttpConnection.headerComplete(AbstractHttpConnection.java:890)
		at org.eclipse.jetty.server.AbstractHttpConnection$RequestHandler.headerComplete(AbstractHttpConnection.java:944)
		at org.eclipse.jetty.http.HttpParser.parseNext(HttpParser.java:634)
		at org.eclipse.jetty.http.HttpParser.parseAvailable(HttpParser.java:230)
		at org.eclipse.jetty.server.BlockingHttpConnection.handle(BlockingHttpConnection.java:66)
		at org.eclipse.jetty.server.bio.SocketConnector$ConnectorEndPoint.run(SocketConnector.java:254)
		at org.eclipse.jetty.util.thread.QueuedThreadPool.runJob(QueuedThreadPool.java:599)
		at org.eclipse.jetty.util.thread.QueuedThreadPool$3.run(QueuedThreadPool.java:534)
		at java.lang.Thread.run(Thread.java:679)
	
181420 T2606 oasc.SolrException.log SEVERE http://127.0.0.1:25228/solr/collection1/: Could not tell a replica to recover:org.apache.solr.client.solrj.SolrServerException: Timeout occured while waiting response from server at: http://127.0.0.1:38429/solr
		at org.apache.solr.client.solrj.impl.HttpSolrServer.request(HttpSolrServer.java:410)
		at org.apache.solr.client.solrj.impl.HttpSolrServer.request(HttpSolrServer.java:182)
		at org.apache.solr.cloud.SyncStrategy.requestRecovery(SyncStrategy.java:282)
		at org.apache.solr.cloud.SyncStrategy.syncToMe(SyncStrategy.java:226)
		at org.apache.solr.cloud.SyncStrategy.syncReplicas(SyncStrategy.java:119)
		at org.apache.solr.cloud.SyncStrategy.sync(SyncStrategy.java:85)
		at org.apache.solr.cloud.ShardLeaderElectionContext.runLeaderProcess(ElectionContext.java:180)
		at org.apache.solr.cloud.LeaderElector.runIamLeaderProcess(LeaderElector.java:159)
		at org.apache.solr.cloud.LeaderElector.checkIfIamLeader(LeaderElector.java:103)
		at org.apache.solr.cloud.LeaderElector.access$000(LeaderElector.java:57)
		at org.apache.solr.cloud.LeaderElector$1.process(LeaderElector.java:132)
		at org.apache.zookeeper.ClientCnxn$EventThread.processEvent(ClientCnxn.java:526)
		at org.apache.zookeeper.ClientCnxn$EventThread.run(ClientCnxn.java:502)
	Caused by: java.net.SocketTimeoutException: Read timed out
		at java.net.SocketInputStream.socketRead0(Native Method)
		at java.net.SocketInputStream.read(SocketInputStream.java:146)
		at org.apache.http.impl.io.AbstractSessionInputBuffer.fillBuffer(AbstractSessionInputBuffer.java:149)
		at org.apache.http.impl.io.SocketInputBuffer.fillBuffer(SocketInputBuffer.java:111)
		at org.apache.http.impl.io.AbstractSessionInputBuffer.readLine(AbstractSessionInputBuffer.java:264)
		at org.apache.http.impl.conn.DefaultResponseParser.parseHead(DefaultResponseParser.java:98)
		at org.apache.http.impl.io.AbstractMessageParser.parse(AbstractMessageParser.java:252)
		at org.apache.http.impl.AbstractHttpClientConnection.receiveResponseHeader(AbstractHttpClientConnection.java:282)
		at org.apache.http.impl.conn.DefaultClientConnection.receiveResponseHeader(DefaultClientConnection.java:247)
		at org.apache.http.impl.conn.AbstractClientConnAdapter.receiveResponseHeader(AbstractClientConnAdapter.java:216)
		at org.apache.http.protocol.HttpRequestExecutor.doReceiveResponse(HttpRequestExecutor.java:298)
		at org.apache.http.protocol.HttpRequestExecutor.execute(HttpRequestExecutor.java:125)
		at org.apache.http.impl.client.DefaultRequestDirector.tryExecute(DefaultRequestDirector.java:647)
		at org.apache.http.impl.client.DefaultRequestDirector.execute(DefaultRequestDirector.java:464)
		at org.apache.http.impl.client.AbstractHttpClient.execute(AbstractHttpClient.java:820)
		at org.apache.http.impl.client.AbstractHttpClient.execute(AbstractHttpClient.java:754)
		at org.apache.http.impl.client.AbstractHttpClient.execute(AbstractHttpClient.java:732)
		at org.apache.solr.client.solrj.impl.HttpSolrServer.request(HttpSolrServer.java:353)
		... 12 more
	
ASYNC  NEW_CORE C5 name=collection1 org.apache.solr.core.SolrCore@6eea90ee url=http://127.0.0.1:38429/solr/collection1 node=127.0.0.1:38429_solr
182957 T2625 C5 P38429 oasc.SolrException.log SEVERE Error while trying to recover. core=collection1:org.apache.solr.client.solrj.SolrServerException: IOException occured when talking to server at: http://127.0.0.1:38425/solr
		at org.apache.solr.client.solrj.impl.HttpSolrServer.request(HttpSolrServer.java:414)
		at org.apache.solr.client.solrj.impl.HttpSolrServer.request(HttpSolrServer.java:182)
		at org.apache.solr.cloud.RecoveryStrategy.sendPrepRecoveryCmd(RecoveryStrategy.java:191)
		at org.apache.solr.cloud.RecoveryStrategy.doRecovery(RecoveryStrategy.java:320)
		at org.apache.solr.cloud.RecoveryStrategy.run(RecoveryStrategy.java:212)
	Caused by: org.apache.http.conn.ConnectTimeoutException: Connect to 127.0.0.1:38425 timed out
		at org.apache.http.conn.scheme.PlainSocketFactory.connectSocket(PlainSocketFactory.java:125)
		at org.apache.http.impl.conn.DefaultClientConnectionOperator.openConnection(DefaultClientConnectionOperator.java:148)
		at org.apache.http.impl.conn.AbstractPoolEntry.open(AbstractPoolEntry.java:150)
		at org.apache.http.impl.conn.AbstractPooledConnAdapter.open(AbstractPooledConnAdapter.java:121)
		at org.apache.http.impl.client.DefaultRequestDirector.tryExecute(DefaultRequestDirector.java:636)
		at org.apache.http.impl.client.DefaultRequestDirector.execute(DefaultRequestDirector.java:464)
		at org.apache.http.impl.client.AbstractHttpClient.execute(AbstractHttpClient.java:820)
		at org.apache.http.impl.client.AbstractHttpClient.execute(AbstractHttpClient.java:754)
		at org.apache.http.impl.client.AbstractHttpClient.execute(AbstractHttpClient.java:732)
		at org.apache.solr.client.solrj.impl.HttpSolrServer.request(HttpSolrServer.java:353)
		... 4 more
	
182959 T2625 C5 P38429 oasc.RecoveryStrategy.doRecovery SEVERE Recovery failed - trying again... core=collection1
Tests run: 1, Failures: 0, Errors: 0, Skipped: 0, Time elapsed: 185.772 sec
Running org.apache.solr.request.JSONWriterTest
Creating dataDir: /usr/home/hudson/hudson-slave/workspace/Lucene-Solr-Maven-4.x/maven-build/solr/core/target/test/./solrtest-JSONWriterTest-1346594580028
Tests run: 3, Failures: 0, Errors: 0, Skipped: 0, Time elapsed: 0.411 sec
Running org.apache.solr.request.TestRemoteStreaming
Creating dataDir: /usr/home/hudson/hudson-slave/workspace/Lucene-Solr-Maven-4.x/maven-build/solr/core/target/test/./solrtest-TestRemoteStreaming-1346594580440
Tests run: 4, Failures: 0, Errors: 0, Skipped: 0, Time elapsed: 0.718 sec
Running org.apache.solr.schema.IndexSchemaRuntimeFieldTest
Creating dataDir: /usr/home/hudson/hudson-slave/workspace/Lucene-Solr-Maven-4.x/maven-build/solr/core/target/test/./solrtest-IndexSchemaRuntimeFieldTest-1346594581159
Tests run: 1, Failures: 0, Errors: 0, Skipped: 0, Time elapsed: 0.475 sec
Running org.apache.solr.analysis.TestCharFilters
Creating dataDir: /usr/home/hudson/hudson-slave/workspace/Lucene-Solr-Maven-4.x/maven-build/solr/core/target/test/./solrtest-TestCharFilters-1346594581637
Tests run: 2, Failures: 0, Errors: 0, Skipped: 0, Time elapsed: 0.129 sec
Running org.apache.solr.handler.XmlUpdateRequestHandlerTest
Creating dataDir: /usr/home/hudson/hudson-slave/workspace/Lucene-Solr-Maven-4.x/maven-build/solr/core/target/test/./solrtest-XmlUpdateRequestHandlerTest-1346594581768
Tests run: 3, Failures: 0, Errors: 0, Skipped: 0, Time elapsed: 0.51 sec
Running org.apache.solr.spelling.IndexBasedSpellCheckerTest
Creating dataDir: /usr/home/hudson/hudson-slave/workspace/Lucene-Solr-Maven-4.x/maven-build/solr/core/target/test/./solrtest-IndexBasedSpellCheckerTest-1346594582278
Tests run: 5, Failures: 0, Errors: 0, Skipped: 0, Time elapsed: 0.74 sec
Running org.apache.solr.spelling.WordBreakSolrSpellCheckerTest
Creating dataDir: /usr/home/hudson/hudson-slave/workspace/Lucene-Solr-Maven-4.x/maven-build/solr/core/target/test/./solrtest-WordBreakSolrSpellCheckerTest-1346594583022
Tests run: 3, Failures: 0, Errors: 0, Skipped: 0, Time elapsed: 1.007 sec
Running org.apache.solr.handler.component.SearchHandlerTest
Creating dataDir: /usr/home/hudson/hudson-slave/workspace/Lucene-Solr-Maven-4.x/maven-build/solr/core/target/test/./solrtest-SearchHandlerTest-1346594584027
Tests run: 1, Failures: 0, Errors: 0, Skipped: 0, Time elapsed: 0.394 sec
Running org.apache.solr.highlight.HighlighterConfigTest
Tests run: 1, Failures: 0, Errors: 0, Skipped: 0, Time elapsed: 0.309 sec
Running org.apache.solr.search.TestStressLucene
Tests run: 1, Failures: 0, Errors: 0, Skipped: 0, Time elapsed: 3.619 sec
Running org.apache.solr.update.DocumentBuilderTest
Creating dataDir: /usr/home/hudson/hudson-slave/workspace/Lucene-Solr-Maven-4.x/maven-build/solr/core/target/test/./solrtest-DocumentBuilderTest-1346594588354
Tests run: 11, Failures: 0, Errors: 0, Skipped: 0, Time elapsed: 0.518 sec
Running org.apache.solr.request.SimpleFacetsTest
Creating dataDir: /usr/home/hudson/hudson-slave/workspace/Lucene-Solr-Maven-4.x/maven-build/solr/core/target/test/./solrtest-SimpleFacetsTest-1346594588876
ASYNC  NEW_CORE C6 name=collection1 org.apache.solr.core.SolrCore@2368902c
1348 T2714 C6 oasc.SolrException.log SEVERE org.apache.solr.common.SolrException: range facet infinite loop: gap is either zero, or too small relative start/end and caused underflow: 23.0 + 0 = 23.0
		at org.apache.solr.request.SimpleFacets.getFacetRangeCounts(SimpleFacets.java:1122)
		at org.apache.solr.request.SimpleFacets.getFacetRangeCounts(SimpleFacets.java:1074)
		at org.apache.solr.request.SimpleFacets.getFacetRangeCounts(SimpleFacets.java:1018)
		at org.apache.solr.request.SimpleFacets.getFacetCounts(SimpleFacets.java:208)
		at org.apache.solr.handler.component.FacetComponent.process(FacetComponent.java:87)
		at org.apache.solr.handler.component.SearchHandler.handleRequestBody(SearchHandler.java:206)
		at org.apache.solr.handler.RequestHandlerBase.handleRequest(RequestHandlerBase.java:129)
		at org.apache.solr.core.SolrCore.execute(SolrCore.java:1692)
		at org.apache.solr.util.TestHarness.query(TestHarness.java:351)
		at org.apache.solr.util.TestHarness.query(TestHarness.java:333)
		at org.apache.solr.SolrTestCaseJ4.assertQEx(SolrTestCaseJ4.java:601)
		at org.apache.solr.request.SimpleFacetsTest.testRangeFacetInfiniteLoopDetection(SimpleFacetsTest.java:2018)
		at sun.reflect.NativeMethodAccessorImpl.invoke0(Native Method)
		at sun.reflect.NativeMethodAccessorImpl.invoke(NativeMethodAccessorImpl.java:57)
		at sun.reflect.DelegatingMethodAccessorImpl.invoke(DelegatingMethodAccessorImpl.java:43)
		at java.lang.reflect.Method.invoke(Method.java:616)
		at com.carrotsearch.randomizedtesting.RandomizedRunner.invoke(RandomizedRunner.java:1559)
		at com.carrotsearch.randomizedtesting.RandomizedRunner.access$600(RandomizedRunner.java:79)
		at com.carrotsearch.randomizedtesting.RandomizedRunner$6.evaluate(RandomizedRunner.java:737)
		at com.carrotsearch.randomizedtesting.RandomizedRunner$7.evaluate(RandomizedRunner.java:773)
		at com.carrotsearch.randomizedtesting.RandomizedRunner$8.evaluate(RandomizedRunner.java:787)
		at com.carrotsearch.randomizedtesting.rules.SystemPropertiesRestoreRule$1.evaluate(SystemPropertiesRestoreRule.java:53)
		at org.apache.lucene.util.TestRuleSetupTeardownChained$1.evaluate(TestRuleSetupTeardownChained.java:50)
		at org.apache.lucene.util.TestRuleFieldCacheSanity$1.evaluate(TestRuleFieldCacheSanity.java:51)
		at org.apache.lucene.util.AbstractBeforeAfterRule$1.evaluate(AbstractBeforeAfterRule.java:45)
		at com.carrotsearch.randomizedtesting.rules.SystemPropertiesInvariantRule$1.evaluate(SystemPropertiesInvariantRule.java:55)
		at org.apache.lucene.util.TestRuleThreadAndTestName$1.evaluate(TestRuleThreadAndTestName.java:48)
		at org.apache.lucene.util.TestRuleIgnoreAfterMaxFailures$1.evaluate(TestRuleIgnoreAfterMaxFailures.java:70)
		at org.apache.lucene.util.TestRuleMarkFailure$1.evaluate(TestRuleMarkFailure.java:48)
		at com.carrotsearch.randomizedtesting.rules.StatementAdapter.evaluate(StatementAdapter.java:36)
		at com.carrotsearch.randomizedtesting.ThreadLeakControl$StatementRunner.run(ThreadLeakControl.java:345)
		at com.carrotsearch.randomizedtesting.ThreadLeakControl.forkTimeoutingTask(ThreadLeakControl.java:769)
		at com.carrotsearch.randomizedtesting.ThreadLeakControl$3.evaluate(ThreadLeakControl.java:429)
		at com.carrotsearch.randomizedtesting.RandomizedRunner.runSingleTest(RandomizedRunner.java:746)
		at com.carrotsearch.randomizedtesting.RandomizedRunner$3.evaluate(RandomizedRunner.java:648)
		at com.carrotsearch.randomizedtesting.RandomizedRunner$4.evaluate(RandomizedRunner.java:682)
		at com.carrotsearch.randomizedtesting.RandomizedRunner$5.evaluate(RandomizedRunner.java:693)
		at com.carrotsearch.randomizedtesting.rules.StatementAdapter.evaluate(StatementAdapter.java:36)
		at com.carrotsearch.randomizedtesting.rules.SystemPropertiesRestoreRule$1.evaluate(SystemPropertiesRestoreRule.java:53)
		at org.apache.lucene.util.AbstractBeforeAfterRule$1.evaluate(AbstractBeforeAfterRule.java:45)
		at org.apache.lucene.util.TestRuleStoreClassName$1.evaluate(TestRuleStoreClassName.java:42)
		at com.carrotsearch.randomizedtesting.rules.SystemPropertiesInvariantRule$1.evaluate(SystemPropertiesInvariantRule.java:55)
		at com.carrotsearch.randomizedtesting.rules.NoShadowingOrOverridesOnMethodsRule$1.evaluate(NoShadowingOrOverridesOnMethodsRule.java:39)
		at com.carrotsearch.randomizedtesting.rules.NoShadowingOrOverridesOnMethodsRule$1.evaluate(NoShadowingOrOverridesOnMethodsRule.java:39)
		at org.apache.lucene.util.TestRuleAssertionsRequired$1.evaluate(TestRuleAssertionsRequired.java:40)
		at org.apache.lucene.util.TestRuleMarkFailure$1.evaluate(TestRuleMarkFailure.java:48)
		at org.apache.lucene.util.TestRuleIgnoreAfterMaxFailures$1.evaluate(TestRuleIgnoreAfterMaxFailures.java:70)
		at org.apache.lucene.util.TestRuleIgnoreTestSuites$1.evaluate(TestRuleIgnoreTestSuites.java:55)
		at com.carrotsearch.randomizedtesting.rules.StatementAdapter.evaluate(StatementAdapter.java:36)
		at com.carrotsearch.randomizedtesting.ThreadLeakControl$StatementRunner.run(ThreadLeakControl.java:345)
		at java.lang.Thread.run(Thread.java:679)
	
1349 T2714 C6 oasc.SolrException.log SEVERE org.apache.solr.common.SolrException: range facet infinite loop: gap is either zero, or too small relative start/end and caused underflow: 23.0 + 0 = 23.0
		at org.apache.solr.request.SimpleFacets.getFacetRangeCounts(SimpleFacets.java:1122)
		at org.apache.solr.request.SimpleFacets.getFacetRangeCounts(SimpleFacets.java:1074)
		at org.apache.solr.request.SimpleFacets.getFacetRangeCounts(SimpleFacets.java:1018)
		at org.apache.solr.request.SimpleFacets.getFacetCounts(SimpleFacets.java:208)
		at org.apache.solr.handler.component.FacetComponent.process(FacetComponent.java:87)
		at org.apache.solr.handler.component.SearchHandler.handleRequestBody(SearchHandler.java:206)
		at org.apache.solr.handler.RequestHandlerBase.handleRequest(RequestHandlerBase.java:129)
		at org.apache.solr.core.SolrCore.execute(SolrCore.java:1692)
		at org.apache.solr.util.TestHarness.query(TestHarness.java:351)
		at org.apache.solr.util.TestHarness.query(TestHarness.java:333)
		at org.apache.solr.SolrTestCaseJ4.assertQEx(SolrTestCaseJ4.java:601)
		at org.apache.solr.request.SimpleFacetsTest.testRangeFacetInfiniteLoopDetection(SimpleFacetsTest.java:2018)
		at sun.reflect.NativeMethodAccessorImpl.invoke0(Native Method)
		at sun.reflect.NativeMethodAccessorImpl.invoke(NativeMethodAccessorImpl.java:57)
		at sun.reflect.DelegatingMethodAccessorImpl.invoke(DelegatingMethodAccessorImpl.java:43)
		at java.lang.reflect.Method.invoke(Method.java:616)
		at com.carrotsearch.randomizedtesting.RandomizedRunner.invoke(RandomizedRunner.java:1559)
		at com.carrotsearch.randomizedtesting.RandomizedRunner.access$600(RandomizedRunner.java:79)
		at com.carrotsearch.randomizedtesting.RandomizedRunner$6.evaluate(RandomizedRunner.java:737)
		at com.carrotsearch.randomizedtesting.RandomizedRunner$7.evaluate(RandomizedRunner.java:773)
		at com.carrotsearch.randomizedtesting.RandomizedRunner$8.evaluate(RandomizedRunner.java:787)
		at com.carrotsearch.randomizedtesting.rules.SystemPropertiesRestoreRule$1.evaluate(SystemPropertiesRestoreRule.java:53)
		at org.apache.lucene.util.TestRuleSetupTeardownChained$1.evaluate(TestRuleSetupTeardownChained.java:50)
		at org.apache.lucene.util.TestRuleFieldCacheSanity$1.evaluate(TestRuleFieldCacheSanity.java:51)
		at org.apache.lucene.util.AbstractBeforeAfterRule$1.evaluate(AbstractBeforeAfterRule.java:45)
		at com.carrotsearch.randomizedtesting.rules.SystemPropertiesInvariantRule$1.evaluate(SystemPropertiesInvariantRule.java:55)
		at org.apache.lucene.util.TestRuleThreadAndTestName$1.evaluate(TestRuleThreadAndTestName.java:48)
		at org.apache.lucene.util.TestRuleIgnoreAfterMaxFailures$1.evaluate(TestRuleIgnoreAfterMaxFailures.java:70)
		at org.apache.lucene.util.TestRuleMarkFailure$1.evaluate(TestRuleMarkFailure.java:48)
		at com.carrotsearch.randomizedtesting.rules.StatementAdapter.evaluate(StatementAdapter.java:36)
		at com.carrotsearch.randomizedtesting.ThreadLeakControl$StatementRunner.run(ThreadLeakControl.java:345)
		at com.carrotsearch.randomizedtesting.ThreadLeakControl.forkTimeoutingTask(ThreadLeakControl.java:769)
		at com.carrotsearch.randomizedtesting.ThreadLeakControl$3.evaluate(ThreadLeakControl.java:429)
		at com.carrotsearch.randomizedtesting.RandomizedRunner.runSingleTest(RandomizedRunner.java:746)
		at com.carrotsearch.randomizedtesting.RandomizedRunner$3.evaluate(RandomizedRunner.java:648)
		at com.carrotsearch.randomizedtesting.RandomizedRunner$4.evaluate(RandomizedRunner.java:682)
		at com.carrotsearch.randomizedtesting.RandomizedRunner$5.evaluate(RandomizedRunner.java:693)
		at com.carrotsearch.randomizedtesting.rules.StatementAdapter.evaluate(StatementAdapter.java:36)
		at com.carrotsearch.randomizedtesting.rules.SystemPropertiesRestoreRule$1.evaluate(SystemPropertiesRestoreRule.java:53)
		at org.apache.lucene.util.AbstractBeforeAfterRule$1.evaluate(AbstractBeforeAfterRule.java:45)
		at org.apache.lucene.util.TestRuleStoreClassName$1.evaluate(TestRuleStoreClassName.java:42)
		at com.carrotsearch.randomizedtesting.rules.SystemPropertiesInvariantRule$1.evaluate(SystemPropertiesInvariantRule.java:55)
		at com.carrotsearch.randomizedtesting.rules.NoShadowingOrOverridesOnMethodsRule$1.evaluate(NoShadowingOrOverridesOnMethodsRule.java:39)
		at com.carrotsearch.randomizedtesting.rules.NoShadowingOrOverridesOnMethodsRule$1.evaluate(NoShadowingOrOverridesOnMethodsRule.java:39)
		at org.apache.lucene.util.TestRuleAssertionsRequired$1.evaluate(TestRuleAssertionsRequired.java:40)
		at org.apache.lucene.util.TestRuleMarkFailure$1.evaluate(TestRuleMarkFailure.java:48)
		at org.apache.lucene.util.TestRuleIgnoreAfterMaxFailures$1.evaluate(TestRuleIgnoreAfterMaxFailures.java:70)
		at org.apache.lucene.util.TestRuleIgnoreTestSuites$1.evaluate(TestRuleIgnoreTestSuites.java:55)
		at com.carrotsearch.randomizedtesting.rules.StatementAdapter.evaluate(StatementAdapter.java:36)
		at com.carrotsearch.randomizedtesting.ThreadLeakControl$StatementRunner.run(ThreadLeakControl.java:345)
		at java.lang.Thread.run(Thread.java:679)
	
1349 T2714 C6 oasc.SolrException.log SEVERE org.apache.solr.common.SolrException: range facet infinite loop: gap is either zero, or too small relative start/end and caused underflow: 23.0 + 0 = 23.0
		at org.apache.solr.request.SimpleFacets.getFacetRangeCounts(SimpleFacets.java:1122)
		at org.apache.solr.request.SimpleFacets.getFacetRangeCounts(SimpleFacets.java:1074)
		at org.apache.solr.request.SimpleFacets.getFacetRangeCounts(SimpleFacets.java:1018)
		at org.apache.solr.request.SimpleFacets.getFacetCounts(SimpleFacets.java:208)
		at org.apache.solr.handler.component.FacetComponent.process(FacetComponent.java:87)
		at org.apache.solr.handler.component.SearchHandler.handleRequestBody(SearchHandler.java:206)
		at org.apache.solr.handler.RequestHandlerBase.handleRequest(RequestHandlerBase.java:129)
		at org.apache.solr.core.SolrCore.execute(SolrCore.java:1692)
		at org.apache.solr.util.TestHarness.query(TestHarness.java:351)
		at org.apache.solr.util.TestHarness.query(TestHarness.java:333)
		at org.apache.solr.SolrTestCaseJ4.assertQEx(SolrTestCaseJ4.java:601)
		at org.apache.solr.request.SimpleFacetsTest.testRangeFacetInfiniteLoopDetection(SimpleFacetsTest.java:2018)
		at sun.reflect.NativeMethodAccessorImpl.invoke0(Native Method)
		at sun.reflect.NativeMethodAccessorImpl.invoke(NativeMethodAccessorImpl.java:57)
		at sun.reflect.DelegatingMethodAccessorImpl.invoke(DelegatingMethodAccessorImpl.java:43)
		at java.lang.reflect.Method.invoke(Method.java:616)
		at com.carrotsearch.randomizedtesting.RandomizedRunner.invoke(RandomizedRunner.java:1559)
		at com.carrotsearch.randomizedtesting.RandomizedRunner.access$600(RandomizedRunner.java:79)
		at com.carrotsearch.randomizedtesting.RandomizedRunner$6.evaluate(RandomizedRunner.java:737)
		at com.carrotsearch.randomizedtesting.RandomizedRunner$7.evaluate(RandomizedRunner.java:773)
		at com.carrotsearch.randomizedtesting.RandomizedRunner$8.evaluate(RandomizedRunner.java:787)
		at com.carrotsearch.randomizedtesting.rules.SystemPropertiesRestoreRule$1.evaluate(SystemPropertiesRestoreRule.java:53)
		at org.apache.lucene.util.TestRuleSetupTeardownChained$1.evaluate(TestRuleSetupTeardownChained.java:50)
		at org.apache.lucene.util.TestRuleFieldCacheSanity$1.evaluate(TestRuleFieldCacheSanity.java:51)
		at org.apache.lucene.util.AbstractBeforeAfterRule$1.evaluate(AbstractBeforeAfterRule.java:45)
		at com.carrotsearch.randomizedtesting.rules.SystemPropertiesInvariantRule$1.evaluate(SystemPropertiesInvariantRule.java:55)
		at org.apache.lucene.util.TestRuleThreadAndTestName$1.evaluate(TestRuleThreadAndTestName.java:48)
		at org.apache.lucene.util.TestRuleIgnoreAfterMaxFailures$1.evaluate(TestRuleIgnoreAfterMaxFailures.java:70)
		at org.apache.lucene.util.TestRuleMarkFailure$1.evaluate(TestRuleMarkFailure.java:48)
		at com.carrotsearch.randomizedtesting.rules.StatementAdapter.evaluate(StatementAdapter.java:36)
		at com.carrotsearch.randomizedtesting.ThreadLeakControl$StatementRunner.run(ThreadLeakControl.java:345)
		at com.carrotsearch.randomizedtesting.ThreadLeakControl.forkTimeoutingTask(ThreadLeakControl.java:769)
		at com.carrotsearch.randomizedtesting.ThreadLeakControl$3.evaluate(ThreadLeakControl.java:429)
		at com.carrotsearch.randomizedtesting.RandomizedRunner.runSingleTest(RandomizedRunner.java:746)
		at com.carrotsearch.randomizedtesting.RandomizedRunner$3.evaluate(RandomizedRunner.java:648)
		at com.carrotsearch.randomizedtesting.RandomizedRunner$4.evaluate(RandomizedRunner.java:682)
		at com.carrotsearch.randomizedtesting.RandomizedRunner$5.evaluate(RandomizedRunner.java:693)
		at com.carrotsearch.randomizedtesting.rules.StatementAdapter.evaluate(StatementAdapter.java:36)
		at com.carrotsearch.randomizedtesting.rules.SystemPropertiesRestoreRule$1.evaluate(SystemPropertiesRestoreRule.java:53)
		at org.apache.lucene.util.AbstractBeforeAfterRule$1.evaluate(AbstractBeforeAfterRule.java:45)
		at org.apache.lucene.util.TestRuleStoreClassName$1.evaluate(TestRuleStoreClassName.java:42)
		at com.carrotsearch.randomizedtesting.rules.SystemPropertiesInvariantRule$1.evaluate(SystemPropertiesInvariantRule.java:55)
		at com.carrotsearch.randomizedtesting.rules.NoShadowingOrOverridesOnMethodsRule$1.evaluate(NoShadowingOrOverridesOnMethodsRule.java:39)
		at com.carrotsearch.randomizedtesting.rules.NoShadowingOrOverridesOnMethodsRule$1.evaluate(NoShadowingOrOverridesOnMethodsRule.java:39)
		at org.apache.lucene.util.TestRuleAssertionsRequired$1.evaluate(TestRuleAssertionsRequired.java:40)
		at org.apache.lucene.util.TestRuleMarkFailure$1.evaluate(TestRuleMarkFailure.java:48)
		at org.apache.lucene.util.TestRuleIgnoreAfterMaxFailures$1.evaluate(TestRuleIgnoreAfterMaxFailures.java:70)
		at org.apache.lucene.util.TestRuleIgnoreTestSuites$1.evaluate(TestRuleIgnoreTestSuites.java:55)
		at com.carrotsearch.randomizedtesting.rules.StatementAdapter.evaluate(StatementAdapter.java:36)
		at com.carrotsearch.randomizedtesting.ThreadLeakControl$StatementRunner.run(ThreadLeakControl.java:345)
		at java.lang.Thread.run(Thread.java:679)
	
1350 T2714 C6 oasc.SolrException.log SEVERE org.apache.solr.common.SolrException: range facet infinite loop: gap is either zero, or too small relative start/end and caused underflow: 23.0 + 0 = 23.0
		at org.apache.solr.request.SimpleFacets.getFacetRangeCounts(SimpleFacets.java:1122)
		at org.apache.solr.request.SimpleFacets.getFacetRangeCounts(SimpleFacets.java:1074)
		at org.apache.solr.request.SimpleFacets.getFacetRangeCounts(SimpleFacets.java:1018)
		at org.apache.solr.request.SimpleFacets.getFacetCounts(SimpleFacets.java:208)
		at org.apache.solr.handler.component.FacetComponent.process(FacetComponent.java:87)
		at org.apache.solr.handler.component.SearchHandler.handleRequestBody(SearchHandler.java:206)
		at org.apache.solr.handler.RequestHandlerBase.handleRequest(RequestHandlerBase.java:129)
		at org.apache.solr.core.SolrCore.execute(SolrCore.java:1692)
		at org.apache.solr.util.TestHarness.query(TestHarness.java:351)
		at org.apache.solr.util.TestHarness.query(TestHarness.java:333)
		at org.apache.solr.SolrTestCaseJ4.assertQEx(SolrTestCaseJ4.java:601)
		at org.apache.solr.request.SimpleFacetsTest.testRangeFacetInfiniteLoopDetection(SimpleFacetsTest.java:2018)
		at sun.reflect.NativeMethodAccessorImpl.invoke0(Native Method)
		at sun.reflect.NativeMethodAccessorImpl.invoke(NativeMethodAccessorImpl.java:57)
		at sun.reflect.DelegatingMethodAccessorImpl.invoke(DelegatingMethodAccessorImpl.java:43)
		at java.lang.reflect.Method.invoke(Method.java:616)
		at com.carrotsearch.randomizedtesting.RandomizedRunner.invoke(RandomizedRunner.java:1559)
		at com.carrotsearch.randomizedtesting.RandomizedRunner.access$600(RandomizedRunner.java:79)
		at com.carrotsearch.randomizedtesting.RandomizedRunner$6.evaluate(RandomizedRunner.java:737)
		at com.carrotsearch.randomizedtesting.RandomizedRunner$7.evaluate(RandomizedRunner.java:773)
		at com.carrotsearch.randomizedtesting.RandomizedRunner$8.evaluate(RandomizedRunner.java:787)
		at com.carrotsearch.randomizedtesting.rules.SystemPropertiesRestoreRule$1.evaluate(SystemPropertiesRestoreRule.java:53)
		at org.apache.lucene.util.TestRuleSetupTeardownChained$1.evaluate(TestRuleSetupTeardownChained.java:50)
		at org.apache.lucene.util.TestRuleFieldCacheSanity$1.evaluate(TestRuleFieldCacheSanity.java:51)
		at org.apache.lucene.util.AbstractBeforeAfterRule$1.evaluate(AbstractBeforeAfterRule.java:45)
		at com.carrotsearch.randomizedtesting.rules.SystemPropertiesInvariantRule$1.evaluate(SystemPropertiesInvariantRule.java:55)
		at org.apache.lucene.util.TestRuleThreadAndTestName$1.evaluate(TestRuleThreadAndTestName.java:48)
		at org.apache.lucene.util.TestRuleIgnoreAfterMaxFailures$1.evaluate(TestRuleIgnoreAfterMaxFailures.java:70)
		at org.apache.lucene.util.TestRuleMarkFailure$1.evaluate(TestRuleMarkFailure.java:48)
		at com.carrotsearch.randomizedtesting.rules.StatementAdapter.evaluate(StatementAdapter.java:36)
		at com.carrotsearch.randomizedtesting.ThreadLeakControl$StatementRunner.run(ThreadLeakControl.java:345)
		at com.carrotsearch.randomizedtesting.ThreadLeakControl.forkTimeoutingTask(ThreadLeakControl.java:769)
		at com.carrotsearch.randomizedtesting.ThreadLeakControl$3.evaluate(ThreadLeakControl.java:429)
		at com.carrotsearch.randomizedtesting.RandomizedRunner.runSingleTest(RandomizedRunner.java:746)
		at com.carrotsearch.randomizedtesting.RandomizedRunner$3.evaluate(RandomizedRunner.java:648)
		at com.carrotsearch.randomizedtesting.RandomizedRunner$4.evaluate(RandomizedRunner.java:682)
		at com.carrotsearch.randomizedtesting.RandomizedRunner$5.evaluate(RandomizedRunner.java:693)
		at com.carrotsearch.randomizedtesting.rules.StatementAdapter.evaluate(StatementAdapter.java:36)
		at com.carrotsearch.randomizedtesting.rules.SystemPropertiesRestoreRule$1.evaluate(SystemPropertiesRestoreRule.java:53)
		at org.apache.lucene.util.AbstractBeforeAfterRule$1.evaluate(AbstractBeforeAfterRule.java:45)
		at org.apache.lucene.util.TestRuleStoreClassName$1.evaluate(TestRuleStoreClassName.java:42)
		at com.carrotsearch.randomizedtesting.rules.SystemPropertiesInvariantRule$1.evaluate(SystemPropertiesInvariantRule.java:55)
		at com.carrotsearch.randomizedtesting.rules.NoShadowingOrOverridesOnMethodsRule$1.evaluate(NoShadowingOrOverridesOnMethodsRule.java:39)
		at com.carrotsearch.randomizedtesting.rules.NoShadowingOrOverridesOnMethodsRule$1.evaluate(NoShadowingOrOverridesOnMethodsRule.java:39)
		at org.apache.lucene.util.TestRuleAssertionsRequired$1.evaluate(TestRuleAssertionsRequired.java:40)
		at org.apache.lucene.util.TestRuleMarkFailure$1.evaluate(TestRuleMarkFailure.java:48)
		at org.apache.lucene.util.TestRuleIgnoreAfterMaxFailures$1.evaluate(TestRuleIgnoreAfterMaxFailures.java:70)
		at org.apache.lucene.util.TestRuleIgnoreTestSuites$1.evaluate(TestRuleIgnoreTestSuites.java:55)
		at com.carrotsearch.randomizedtesting.rules.StatementAdapter.evaluate(StatementAdapter.java:36)
		at com.carrotsearch.randomizedtesting.ThreadLeakControl$StatementRunner.run(ThreadLeakControl.java:345)
		at java.lang.Thread.run(Thread.java:679)
	
1351 T2714 C6 oasc.SolrException.log SEVERE org.apache.solr.common.SolrException: range facet infinite loop: gap is either zero, or too small relative start/end and caused underflow: 23 + 0 = 23
		at org.apache.solr.request.SimpleFacets.getFacetRangeCounts(SimpleFacets.java:1122)
		at org.apache.solr.request.SimpleFacets.getFacetRangeCounts(SimpleFacets.java:1074)
		at org.apache.solr.request.SimpleFacets.getFacetRangeCounts(SimpleFacets.java:1018)
		at org.apache.solr.request.SimpleFacets.getFacetCounts(SimpleFacets.java:208)
		at org.apache.solr.handler.component.FacetComponent.process(FacetComponent.java:87)
		at org.apache.solr.handler.component.SearchHandler.handleRequestBody(SearchHandler.java:206)
		at org.apache.solr.handler.RequestHandlerBase.handleRequest(RequestHandlerBase.java:129)
		at org.apache.solr.core.SolrCore.execute(SolrCore.java:1692)
		at org.apache.solr.util.TestHarness.query(TestHarness.java:351)
		at org.apache.solr.util.TestHarness.query(TestHarness.java:333)
		at org.apache.solr.SolrTestCaseJ4.assertQEx(SolrTestCaseJ4.java:601)
		at org.apache.solr.request.SimpleFacetsTest.testRangeFacetInfiniteLoopDetection(SimpleFacetsTest.java:2018)
		at sun.reflect.NativeMethodAccessorImpl.invoke0(Native Method)
		at sun.reflect.NativeMethodAccessorImpl.invoke(NativeMethodAccessorImpl.java:57)
		at sun.reflect.DelegatingMethodAccessorImpl.invoke(DelegatingMethodAccessorImpl.java:43)
		at java.lang.reflect.Method.invoke(Method.java:616)
		at com.carrotsearch.randomizedtesting.RandomizedRunner.invoke(RandomizedRunner.java:1559)
		at com.carrotsearch.randomizedtesting.RandomizedRunner.access$600(RandomizedRunner.java:79)
		at com.carrotsearch.randomizedtesting.RandomizedRunner$6.evaluate(RandomizedRunner.java:737)
		at com.carrotsearch.randomizedtesting.RandomizedRunner$7.evaluate(RandomizedRunner.java:773)
		at com.carrotsearch.randomizedtesting.RandomizedRunner$8.evaluate(RandomizedRunner.java:787)
		at com.carrotsearch.randomizedtesting.rules.SystemPropertiesRestoreRule$1.evaluate(SystemPropertiesRestoreRule.java:53)
		at org.apache.lucene.util.TestRuleSetupTeardownChained$1.evaluate(TestRuleSetupTeardownChained.java:50)
		at org.apache.lucene.util.TestRuleFieldCacheSanity$1.evaluate(TestRuleFieldCacheSanity.java:51)
		at org.apache.lucene.util.AbstractBeforeAfterRule$1.evaluate(AbstractBeforeAfterRule.java:45)
		at com.carrotsearch.randomizedtesting.rules.SystemPropertiesInvariantRule$1.evaluate(SystemPropertiesInvariantRule.java:55)
		at org.apache.lucene.util.TestRuleThreadAndTestName$1.evaluate(TestRuleThreadAndTestName.java:48)
		at org.apache.lucene.util.TestRuleIgnoreAfterMaxFailures$1.evaluate(TestRuleIgnoreAfterMaxFailures.java:70)
		at org.apache.lucene.util.TestRuleMarkFailure$1.evaluate(TestRuleMarkFailure.java:48)
		at com.carrotsearch.randomizedtesting.rules.StatementAdapter.evaluate(StatementAdapter.java:36)
		at com.carrotsearch.randomizedtesting.ThreadLeakControl$StatementRunner.run(ThreadLeakControl.java:345)
		at com.carrotsearch.randomizedtesting.ThreadLeakControl.forkTimeoutingTask(ThreadLeakControl.java:769)
		at com.carrotsearch.randomizedtesting.ThreadLeakControl$3.evaluate(ThreadLeakControl.java:429)
		at com.carrotsearch.randomizedtesting.RandomizedRunner.runSingleTest(RandomizedRunner.java:746)
		at com.carrotsearch.randomizedtesting.RandomizedRunner$3.evaluate(RandomizedRunner.java:648)
		at com.carrotsearch.randomizedtesting.RandomizedRunner$4.evaluate(RandomizedRunner.java:682)
		at com.carrotsearch.randomizedtesting.RandomizedRunner$5.evaluate(RandomizedRunner.java:693)
		at com.carrotsearch.randomizedtesting.rules.StatementAdapter.evaluate(StatementAdapter.java:36)
		at com.carrotsearch.randomizedtesting.rules.SystemPropertiesRestoreRule$1.evaluate(SystemPropertiesRestoreRule.java:53)
		at org.apache.lucene.util.AbstractBeforeAfterRule$1.evaluate(AbstractBeforeAfterRule.java:45)
		at org.apache.lucene.util.TestRuleStoreClassName$1.evaluate(TestRuleStoreClassName.java:42)
		at com.carrotsearch.randomizedtesting.rules.SystemPropertiesInvariantRule$1.evaluate(SystemPropertiesInvariantRule.java:55)
		at com.carrotsearch.randomizedtesting.rules.NoShadowingOrOverridesOnMethodsRule$1.evaluate(NoShadowingOrOverridesOnMethodsRule.java:39)
		at com.carrotsearch.randomizedtesting.rules.NoShadowingOrOverridesOnMethodsRule$1.evaluate(NoShadowingOrOverridesOnMethodsRule.java:39)
		at org.apache.lucene.util.TestRuleAssertionsRequired$1.evaluate(TestRuleAssertionsRequired.java:40)
		at org.apache.lucene.util.TestRuleMarkFailure$1.evaluate(TestRuleMarkFailure.java:48)
		at org.apache.lucene.util.TestRuleIgnoreAfterMaxFailures$1.evaluate(TestRuleIgnoreAfterMaxFailures.java:70)
		at org.apache.lucene.util.TestRuleIgnoreTestSuites$1.evaluate(TestRuleIgnoreTestSuites.java:55)
		at com.carrotsearch.randomizedtesting.rules.StatementAdapter.evaluate(StatementAdapter.java:36)
		at com.carrotsearch.randomizedtesting.ThreadLeakControl$StatementRunner.run(ThreadLeakControl.java:345)
		at java.lang.Thread.run(Thread.java:679)
	
1352 T2714 C6 oasc.SolrException.log SEVERE org.apache.solr.common.SolrException: range facet infinite loop: gap is either zero, or too small relative start/end and caused underflow: 23 + 0 = 23
		at org.apache.solr.request.SimpleFacets.getFacetRangeCounts(SimpleFacets.java:1122)
		at org.apache.solr.request.SimpleFacets.getFacetRangeCounts(SimpleFacets.java:1074)
		at org.apache.solr.request.SimpleFacets.getFacetRangeCounts(SimpleFacets.java:1018)
		at org.apache.solr.request.SimpleFacets.getFacetCounts(SimpleFacets.java:208)
		at org.apache.solr.handler.component.FacetComponent.process(FacetComponent.java:87)
		at org.apache.solr.handler.component.SearchHandler.handleRequestBody(SearchHandler.java:206)
		at org.apache.solr.handler.RequestHandlerBase.handleRequest(RequestHandlerBase.java:129)
		at org.apache.solr.core.SolrCore.execute(SolrCore.java:1692)
		at org.apache.solr.util.TestHarness.query(TestHarness.java:351)
		at org.apache.solr.util.TestHarness.query(TestHarness.java:333)
		at org.apache.solr.SolrTestCaseJ4.assertQEx(SolrTestCaseJ4.java:601)
		at org.apache.solr.request.SimpleFacetsTest.testRangeFacetInfiniteLoopDetection(SimpleFacetsTest.java:2018)
		at sun.reflect.NativeMethodAccessorImpl.invoke0(Native Method)
		at sun.reflect.NativeMethodAccessorImpl.invoke(NativeMethodAccessorImpl.java:57)
		at sun.reflect.DelegatingMethodAccessorImpl.invoke(DelegatingMethodAccessorImpl.java:43)
		at java.lang.reflect.Method.invoke(Method.java:616)
		at com.carrotsearch.randomizedtesting.RandomizedRunner.invoke(RandomizedRunner.java:1559)
		at com.carrotsearch.randomizedtesting.RandomizedRunner.access$600(RandomizedRunner.java:79)
		at com.carrotsearch.randomizedtesting.RandomizedRunner$6.evaluate(RandomizedRunner.java:737)
		at com.carrotsearch.randomizedtesting.RandomizedRunner$7.evaluate(RandomizedRunner.java:773)
		at com.carrotsearch.randomizedtesting.RandomizedRunner$8.evaluate(RandomizedRunner.java:787)
		at com.carrotsearch.randomizedtesting.rules.SystemPropertiesRestoreRule$1.evaluate(SystemPropertiesRestoreRule.java:53)
		at org.apache.lucene.util.TestRuleSetupTeardownChained$1.evaluate(TestRuleSetupTeardownChained.java:50)
		at org.apache.lucene.util.TestRuleFieldCacheSanity$1.evaluate(TestRuleFieldCacheSanity.java:51)
		at org.apache.lucene.util.AbstractBeforeAfterRule$1.evaluate(AbstractBeforeAfterRule.java:45)
		at com.carrotsearch.randomizedtesting.rules.SystemPropertiesInvariantRule$1.evaluate(SystemPropertiesInvariantRule.java:55)
		at org.apache.lucene.util.TestRuleThreadAndTestName$1.evaluate(TestRuleThreadAndTestName.java:48)
		at org.apache.lucene.util.TestRuleIgnoreAfterMaxFailures$1.evaluate(TestRuleIgnoreAfterMaxFailures.java:70)
		at org.apache.lucene.util.TestRuleMarkFailure$1.evaluate(TestRuleMarkFailure.java:48)
		at com.carrotsearch.randomizedtesting.rules.StatementAdapter.evaluate(StatementAdapter.java:36)
		at com.carrotsearch.randomizedtesting.ThreadLeakControl$StatementRunner.run(ThreadLeakControl.java:345)
		at com.carrotsearch.randomizedtesting.ThreadLeakControl.forkTimeoutingTask(ThreadLeakControl.java:769)
		at com.carrotsearch.randomizedtesting.ThreadLeakControl$3.evaluate(ThreadLeakControl.java:429)
		at com.carrotsearch.randomizedtesting.RandomizedRunner.runSingleTest(RandomizedRunner.java:746)
		at com.carrotsearch.randomizedtesting.RandomizedRunner$3.evaluate(RandomizedRunner.java:648)
		at com.carrotsearch.randomizedtesting.RandomizedRunner$4.evaluate(RandomizedRunner.java:682)
		at com.carrotsearch.randomizedtesting.RandomizedRunner$5.evaluate(RandomizedRunner.java:693)
		at com.carrotsearch.randomizedtesting.rules.StatementAdapter.evaluate(StatementAdapter.java:36)
		at com.carrotsearch.randomizedtesting.rules.SystemPropertiesRestoreRule$1.evaluate(SystemPropertiesRestoreRule.java:53)
		at org.apache.lucene.util.AbstractBeforeAfterRule$1.evaluate(AbstractBeforeAfterRule.java:45)
		at org.apache.lucene.util.TestRuleStoreClassName$1.evaluate(TestRuleStoreClassName.java:42)
		at com.carrotsearch.randomizedtesting.rules.SystemPropertiesInvariantRule$1.evaluate(SystemPropertiesInvariantRule.java:55)
		at com.carrotsearch.randomizedtesting.rules.NoShadowingOrOverridesOnMethodsRule$1.evaluate(NoShadowingOrOverridesOnMethodsRule.java:39)
		at com.carrotsearch.randomizedtesting.rules.NoShadowingOrOverridesOnMethodsRule$1.evaluate(NoShadowingOrOverridesOnMethodsRule.java:39)
		at org.apache.lucene.util.TestRuleAssertionsRequired$1.evaluate(TestRuleAssertionsRequired.java:40)
		at org.apache.lucene.util.TestRuleMarkFailure$1.evaluate(TestRuleMarkFailure.java:48)
		at org.apache.lucene.util.TestRuleIgnoreAfterMaxFailures$1.evaluate(TestRuleIgnoreAfterMaxFailures.java:70)
		at org.apache.lucene.util.TestRuleIgnoreTestSuites$1.evaluate(TestRuleIgnoreTestSuites.java:55)
		at com.carrotsearch.randomizedtesting.rules.StatementAdapter.evaluate(StatementAdapter.java:36)
		at com.carrotsearch.randomizedtesting.ThreadLeakControl$StatementRunner.run(ThreadLeakControl.java:345)
		at java.lang.Thread.run(Thread.java:679)
	
1352 T2714 C6 oasc.SolrException.log SEVERE org.apache.solr.common.SolrException: date facet infinite loop: gap is effectively zero
		at org.apache.solr.request.SimpleFacets.getFacetDateCounts(SimpleFacets.java:928)
		at org.apache.solr.request.SimpleFacets.getFacetDateCounts(SimpleFacets.java:837)
		at org.apache.solr.request.SimpleFacets.getFacetCounts(SimpleFacets.java:207)
		at org.apache.solr.handler.component.FacetComponent.process(FacetComponent.java:87)
		at org.apache.solr.handler.component.SearchHandler.handleRequestBody(SearchHandler.java:206)
		at org.apache.solr.handler.RequestHandlerBase.handleRequest(RequestHandlerBase.java:129)
		at org.apache.solr.core.SolrCore.execute(SolrCore.java:1692)
		at org.apache.solr.util.TestHarness.query(TestHarness.java:351)
		at org.apache.solr.util.TestHarness.query(TestHarness.java:333)
		at org.apache.solr.SolrTestCaseJ4.assertQEx(SolrTestCaseJ4.java:601)
		at org.apache.solr.request.SimpleFacetsTest.testRangeFacetInfiniteLoopDetection(SimpleFacetsTest.java:2029)
		at sun.reflect.NativeMethodAccessorImpl.invoke0(Native Method)
		at sun.reflect.NativeMethodAccessorImpl.invoke(NativeMethodAccessorImpl.java:57)
		at sun.reflect.DelegatingMethodAccessorImpl.invoke(DelegatingMethodAccessorImpl.java:43)
		at java.lang.reflect.Method.invoke(Method.java:616)
		at com.carrotsearch.randomizedtesting.RandomizedRunner.invoke(RandomizedRunner.java:1559)
		at com.carrotsearch.randomizedtesting.RandomizedRunner.access$600(RandomizedRunner.java:79)
		at com.carrotsearch.randomizedtesting.RandomizedRunner$6.evaluate(RandomizedRunner.java:737)
		at com.carrotsearch.randomizedtesting.RandomizedRunner$7.evaluate(RandomizedRunner.java:773)
		at com.carrotsearch.randomizedtesting.RandomizedRunner$8.evaluate(RandomizedRunner.java:787)
		at com.carrotsearch.randomizedtesting.rules.SystemPropertiesRestoreRule$1.evaluate(SystemPropertiesRestoreRule.java:53)
		at org.apache.lucene.util.TestRuleSetupTeardownChained$1.evaluate(TestRuleSetupTeardownChained.java:50)
		at org.apache.lucene.util.TestRuleFieldCacheSanity$1.evaluate(TestRuleFieldCacheSanity.java:51)
		at org.apache.lucene.util.AbstractBeforeAfterRule$1.evaluate(AbstractBeforeAfterRule.java:45)
		at com.carrotsearch.randomizedtesting.rules.SystemPropertiesInvariantRule$1.evaluate(SystemPropertiesInvariantRule.java:55)
		at org.apache.lucene.util.TestRuleThreadAndTestName$1.evaluate(TestRuleThreadAndTestName.java:48)
		at org.apache.lucene.util.TestRuleIgnoreAfterMaxFailures$1.evaluate(TestRuleIgnoreAfterMaxFailures.java:70)
		at org.apache.lucene.util.TestRuleMarkFailure$1.evaluate(TestRuleMarkFailure.java:48)
		at com.carrotsearch.randomizedtesting.rules.StatementAdapter.evaluate(StatementAdapter.java:36)
		at com.carrotsearch.randomizedtesting.ThreadLeakControl$StatementRunner.run(ThreadLeakControl.java:345)
		at com.carrotsearch.randomizedtesting.ThreadLeakControl.forkTimeoutingTask(ThreadLeakControl.java:769)
		at com.carrotsearch.randomizedtesting.ThreadLeakControl$3.evaluate(ThreadLeakControl.java:429)
		at com.carrotsearch.randomizedtesting.RandomizedRunner.runSingleTest(RandomizedRunner.java:746)
		at com.carrotsearch.randomizedtesting.RandomizedRunner$3.evaluate(RandomizedRunner.java:648)
		at com.carrotsearch.randomizedtesting.RandomizedRunner$4.evaluate(RandomizedRunner.java:682)
		at com.carrotsearch.randomizedtesting.RandomizedRunner$5.evaluate(RandomizedRunner.java:693)
		at com.carrotsearch.randomizedtesting.rules.StatementAdapter.evaluate(StatementAdapter.java:36)
		at com.carrotsearch.randomizedtesting.rules.SystemPropertiesRestoreRule$1.evaluate(SystemPropertiesRestoreRule.java:53)
		at org.apache.lucene.util.AbstractBeforeAfterRule$1.evaluate(AbstractBeforeAfterRule.java:45)
		at org.apache.lucene.util.TestRuleStoreClassName$1.evaluate(TestRuleStoreClassName.java:42)
		at com.carrotsearch.randomizedtesting.rules.SystemPropertiesInvariantRule$1.evaluate(SystemPropertiesInvariantRule.java:55)
		at com.carrotsearch.randomizedtesting.rules.NoShadowingOrOverridesOnMethodsRule$1.evaluate(NoShadowingOrOverridesOnMethodsRule.java:39)
		at com.carrotsearch.randomizedtesting.rules.NoShadowingOrOverridesOnMethodsRule$1.evaluate(NoShadowingOrOverridesOnMethodsRule.java:39)
		at org.apache.lucene.util.TestRuleAssertionsRequired$1.evaluate(TestRuleAssertionsRequired.java:40)
		at org.apache.lucene.util.TestRuleMarkFailure$1.evaluate(TestRuleMarkFailure.java:48)
		at org.apache.lucene.util.TestRuleIgnoreAfterMaxFailures$1.evaluate(TestRuleIgnoreAfterMaxFailures.java:70)
		at org.apache.lucene.util.TestRuleIgnoreTestSuites$1.evaluate(TestRuleIgnoreTestSuites.java:55)
		at com.carrotsearch.randomizedtesting.rules.StatementAdapter.evaluate(StatementAdapter.java:36)
		at com.carrotsearch.randomizedtesting.ThreadLeakControl$StatementRunner.run(ThreadLeakControl.java:345)
		at java.lang.Thread.run(Thread.java:679)
	
1353 T2714 C6 oasc.SolrException.log SEVERE org.apache.solr.common.SolrException: range facet infinite loop: gap is either zero, or too small relative start/end and caused underflow: Sun Sep 02 10:03:10 EDT 2012 + +0DAYS = Sun Sep 02 10:03:10 EDT 2012
		at org.apache.solr.request.SimpleFacets.getFacetRangeCounts(SimpleFacets.java:1122)
		at org.apache.solr.request.SimpleFacets.getFacetRangeCounts(SimpleFacets.java:1074)
		at org.apache.solr.request.SimpleFacets.getFacetRangeCounts(SimpleFacets.java:1018)
		at org.apache.solr.request.SimpleFacets.getFacetCounts(SimpleFacets.java:208)
		at org.apache.solr.handler.component.FacetComponent.process(FacetComponent.java:87)
		at org.apache.solr.handler.component.SearchHandler.handleRequestBody(SearchHandler.java:206)
		at org.apache.solr.handler.RequestHandlerBase.handleRequest(RequestHandlerBase.java:129)
		at org.apache.solr.core.SolrCore.execute(SolrCore.java:1692)
		at org.apache.solr.util.TestHarness.query(TestHarness.java:351)
		at org.apache.solr.util.TestHarness.query(TestHarness.java:333)
		at org.apache.solr.SolrTestCaseJ4.assertQEx(SolrTestCaseJ4.java:601)
		at org.apache.solr.request.SimpleFacetsTest.testRangeFacetInfiniteLoopDetection(SimpleFacetsTest.java:2029)
		at sun.reflect.NativeMethodAccessorImpl.invoke0(Native Method)
		at sun.reflect.NativeMethodAccessorImpl.invoke(NativeMethodAccessorImpl.java:57)
		at sun.reflect.DelegatingMethodAccessorImpl.invoke(DelegatingMethodAccessorImpl.java:43)
		at java.lang.reflect.Method.invoke(Method.java:616)
		at com.carrotsearch.randomizedtesting.RandomizedRunner.invoke(RandomizedRunner.java:1559)
		at com.carrotsearch.randomizedtesting.RandomizedRunner.access$600(RandomizedRunner.java:79)
		at com.carrotsearch.randomizedtesting.RandomizedRunner$6.evaluate(RandomizedRunner.java:737)
		at com.carrotsearch.randomizedtesting.RandomizedRunner$7.evaluate(RandomizedRunner.java:773)
		at com.carrotsearch.randomizedtesting.RandomizedRunner$8.evaluate(RandomizedRunner.java:787)
		at com.carrotsearch.randomizedtesting.rules.SystemPropertiesRestoreRule$1.evaluate(SystemPropertiesRestoreRule.java:53)
		at org.apache.lucene.util.TestRuleSetupTeardownChained$1.evaluate(TestRuleSetupTeardownChained.java:50)
		at org.apache.lucene.util.TestRuleFieldCacheSanity$1.evaluate(TestRuleFieldCacheSanity.java:51)
		at org.apache.lucene.util.AbstractBeforeAfterRule$1.evaluate(AbstractBeforeAfterRule.java:45)
		at com.carrotsearch.randomizedtesting.rules.SystemPropertiesInvariantRule$1.evaluate(SystemPropertiesInvariantRule.java:55)
		at org.apache.lucene.util.TestRuleThreadAndTestName$1.evaluate(TestRuleThreadAndTestName.java:48)
		at org.apache.lucene.util.TestRuleIgnoreAfterMaxFailures$1.evaluate(TestRuleIgnoreAfterMaxFailures.java:70)
		at org.apache.lucene.util.TestRuleMarkFailure$1.evaluate(TestRuleMarkFailure.java:48)
		at com.carrotsearch.randomizedtesting.rules.StatementAdapter.evaluate(StatementAdapter.java:36)
		at com.carrotsearch.randomizedtesting.ThreadLeakControl$StatementRunner.run(ThreadLeakControl.java:345)
		at com.carrotsearch.randomizedtesting.ThreadLeakControl.forkTimeoutingTask(ThreadLeakControl.java:769)
		at com.carrotsearch.randomizedtesting.ThreadLeakControl$3.evaluate(ThreadLeakControl.java:429)
		at com.carrotsearch.randomizedtesting.RandomizedRunner.runSingleTest(RandomizedRunner.java:746)
		at com.carrotsearch.randomizedtesting.RandomizedRunner$3.evaluate(RandomizedRunner.java:648)
		at com.carrotsearch.randomizedtesting.RandomizedRunner$4.evaluate(RandomizedRunner.java:682)
		at com.carrotsearch.randomizedtesting.RandomizedRunner$5.evaluate(RandomizedRunner.java:693)
		at com.carrotsearch.randomizedtesting.rules.StatementAdapter.evaluate(StatementAdapter.java:36)
		at com.carrotsearch.randomizedtesting.rules.SystemPropertiesRestoreRule$1.evaluate(SystemPropertiesRestoreRule.java:53)
		at org.apache.lucene.util.AbstractBeforeAfterRule$1.evaluate(AbstractBeforeAfterRule.java:45)
		at org.apache.lucene.util.TestRuleStoreClassName$1.evaluate(TestRuleStoreClassName.java:42)
		at com.carrotsearch.randomizedtesting.rules.SystemPropertiesInvariantRule$1.evaluate(SystemPropertiesInvariantRule.java:55)
		at com.carrotsearch.randomizedtesting.rules.NoShadowingOrOverridesOnMethodsRule$1.evaluate(NoShadowingOrOverridesOnMethodsRule.java:39)
		at com.carrotsearch.randomizedtesting.rules.NoShadowingOrOverridesOnMethodsRule$1.evaluate(NoShadowingOrOverridesOnMethodsRule.java:39)
		at org.apache.lucene.util.TestRuleAssertionsRequired$1.evaluate(TestRuleAssertionsRequired.java:40)
		at org.apache.lucene.util.TestRuleMarkFailure$1.evaluate(TestRuleMarkFailure.java:48)
		at org.apache.lucene.util.TestRuleIgnoreAfterMaxFailures$1.evaluate(TestRuleIgnoreAfterMaxFailures.java:70)
		at org.apache.lucene.util.TestRuleIgnoreTestSuites$1.evaluate(TestRuleIgnoreTestSuites.java:55)
		at com.carrotsearch.randomizedtesting.rules.StatementAdapter.evaluate(StatementAdapter.java:36)
		at com.carrotsearch.randomizedtesting.ThreadLeakControl$StatementRunner.run(ThreadLeakControl.java:345)
		at java.lang.Thread.run(Thread.java:679)
	
1354 T2714 C6 oasc.SolrException.log SEVERE org.apache.solr.common.SolrException: date facet infinite loop: gap is effectively zero
		at org.apache.solr.request.SimpleFacets.getFacetDateCounts(SimpleFacets.java:928)
		at org.apache.solr.request.SimpleFacets.getFacetDateCounts(SimpleFacets.java:837)
		at org.apache.solr.request.SimpleFacets.getFacetCounts(SimpleFacets.java:207)
		at org.apache.solr.handler.component.FacetComponent.process(FacetComponent.java:87)
		at org.apache.solr.handler.component.SearchHandler.handleRequestBody(SearchHandler.java:206)
		at org.apache.solr.handler.RequestHandlerBase.handleRequest(RequestHandlerBase.java:129)
		at org.apache.solr.core.SolrCore.execute(SolrCore.java:1692)
		at org.apache.solr.util.TestHarness.query(TestHarness.java:351)
		at org.apache.solr.util.TestHarness.query(TestHarness.java:333)
		at org.apache.solr.SolrTestCaseJ4.assertQEx(SolrTestCaseJ4.java:601)
		at org.apache.solr.request.SimpleFacetsTest.testRangeFacetInfiniteLoopDetection(SimpleFacetsTest.java:2029)
		at sun.reflect.NativeMethodAccessorImpl.invoke0(Native Method)
		at sun.reflect.NativeMethodAccessorImpl.invoke(NativeMethodAccessorImpl.java:57)
		at sun.reflect.DelegatingMethodAccessorImpl.invoke(DelegatingMethodAccessorImpl.java:43)
		at java.lang.reflect.Method.invoke(Method.java:616)
		at com.carrotsearch.randomizedtesting.RandomizedRunner.invoke(RandomizedRunner.java:1559)
		at com.carrotsearch.randomizedtesting.RandomizedRunner.access$600(RandomizedRunner.java:79)
		at com.carrotsearch.randomizedtesting.RandomizedRunner$6.evaluate(RandomizedRunner.java:737)
		at com.carrotsearch.randomizedtesting.RandomizedRunner$7.evaluate(RandomizedRunner.java:773)
		at com.carrotsearch.randomizedtesting.RandomizedRunner$8.evaluate(RandomizedRunner.java:787)
		at com.carrotsearch.randomizedtesting.rules.SystemPropertiesRestoreRule$1.evaluate(SystemPropertiesRestoreRule.java:53)
		at org.apache.lucene.util.TestRuleSetupTeardownChained$1.evaluate(TestRuleSetupTeardownChained.java:50)
		at org.apache.lucene.util.TestRuleFieldCacheSanity$1.evaluate(TestRuleFieldCacheSanity.java:51)
		at org.apache.lucene.util.AbstractBeforeAfterRule$1.evaluate(AbstractBeforeAfterRule.java:45)
		at com.carrotsearch.randomizedtesting.rules.SystemPropertiesInvariantRule$1.evaluate(SystemPropertiesInvariantRule.java:55)
		at org.apache.lucene.util.TestRuleThreadAndTestName$1.evaluate(TestRuleThreadAndTestName.java:48)
		at org.apache.lucene.util.TestRuleIgnoreAfterMaxFailures$1.evaluate(TestRuleIgnoreAfterMaxFailures.java:70)
		at org.apache.lucene.util.TestRuleMarkFailure$1.evaluate(TestRuleMarkFailure.java:48)
		at com.carrotsearch.randomizedtesting.rules.StatementAdapter.evaluate(StatementAdapter.java:36)
		at com.carrotsearch.randomizedtesting.ThreadLeakControl$StatementRunner.run(ThreadLeakControl.java:345)
		at com.carrotsearch.randomizedtesting.ThreadLeakControl.forkTimeoutingTask(ThreadLeakControl.java:769)
		at com.carrotsearch.randomizedtesting.ThreadLeakControl$3.evaluate(ThreadLeakControl.java:429)
		at com.carrotsearch.randomizedtesting.RandomizedRunner.runSingleTest(RandomizedRunner.java:746)
		at com.carrotsearch.randomizedtesting.RandomizedRunner$3.evaluate(RandomizedRunner.java:648)
		at com.carrotsearch.randomizedtesting.RandomizedRunner$4.evaluate(RandomizedRunner.java:682)
		at com.carrotsearch.randomizedtesting.RandomizedRunner$5.evaluate(RandomizedRunner.java:693)
		at com.carrotsearch.randomizedtesting.rules.StatementAdapter.evaluate(StatementAdapter.java:36)
		at com.carrotsearch.randomizedtesting.rules.SystemPropertiesRestoreRule$1.evaluate(SystemPropertiesRestoreRule.java:53)
		at org.apache.lucene.util.AbstractBeforeAfterRule$1.evaluate(AbstractBeforeAfterRule.java:45)
		at org.apache.lucene.util.TestRuleStoreClassName$1.evaluate(TestRuleStoreClassName.java:42)
		at com.carrotsearch.randomizedtesting.rules.SystemPropertiesInvariantRule$1.evaluate(SystemPropertiesInvariantRule.java:55)
		at com.carrotsearch.randomizedtesting.rules.NoShadowingOrOverridesOnMethodsRule$1.evaluate(NoShadowingOrOverridesOnMethodsRule.java:39)
		at com.carrotsearch.randomizedtesting.rules.NoShadowingOrOverridesOnMethodsRule$1.evaluate(NoShadowingOrOverridesOnMethodsRule.java:39)
		at org.apache.lucene.util.TestRuleAssertionsRequired$1.evaluate(TestRuleAssertionsRequired.java:40)
		at org.apache.lucene.util.TestRuleMarkFailure$1.evaluate(TestRuleMarkFailure.java:48)
		at org.apache.lucene.util.TestRuleIgnoreAfterMaxFailures$1.evaluate(TestRuleIgnoreAfterMaxFailures.java:70)
		at org.apache.lucene.util.TestRuleIgnoreTestSuites$1.evaluate(TestRuleIgnoreTestSuites.java:55)
		at com.carrotsearch.randomizedtesting.rules.StatementAdapter.evaluate(StatementAdapter.java:36)
		at com.carrotsearch.randomizedtesting.ThreadLeakControl$StatementRunner.run(ThreadLeakControl.java:345)
		at java.lang.Thread.run(Thread.java:679)
	
1355 T2714 C6 oasc.SolrException.log SEVERE org.apache.solr.common.SolrException: range facet infinite loop: gap is either zero, or too small relative start/end and caused underflow: Sun Sep 02 10:03:10 EDT 2012 + +0DAYS = Sun Sep 02 10:03:10 EDT 2012
		at org.apache.solr.request.SimpleFacets.getFacetRangeCounts(SimpleFacets.java:1122)
		at org.apache.solr.request.SimpleFacets.getFacetRangeCounts(SimpleFacets.java:1074)
		at org.apache.solr.request.SimpleFacets.getFacetRangeCounts(SimpleFacets.java:1018)
		at org.apache.solr.request.SimpleFacets.getFacetCounts(SimpleFacets.java:208)
		at org.apache.solr.handler.component.FacetComponent.process(FacetComponent.java:87)
		at org.apache.solr.handler.component.SearchHandler.handleRequestBody(SearchHandler.java:206)
		at org.apache.solr.handler.RequestHandlerBase.handleRequest(RequestHandlerBase.java:129)
		at org.apache.solr.core.SolrCore.execute(SolrCore.java:1692)
		at org.apache.solr.util.TestHarness.query(TestHarness.java:351)
		at org.apache.solr.util.TestHarness.query(TestHarness.java:333)
		at org.apache.solr.SolrTestCaseJ4.assertQEx(SolrTestCaseJ4.java:601)
		at org.apache.solr.request.SimpleFacetsTest.testRangeFacetInfiniteLoopDetection(SimpleFacetsTest.java:2029)
		at sun.reflect.NativeMethodAccessorImpl.invoke0(Native Method)
		at sun.reflect.NativeMethodAccessorImpl.invoke(NativeMethodAccessorImpl.java:57)
		at sun.reflect.DelegatingMethodAccessorImpl.invoke(DelegatingMethodAccessorImpl.java:43)
		at java.lang.reflect.Method.invoke(Method.java:616)
		at com.carrotsearch.randomizedtesting.RandomizedRunner.invoke(RandomizedRunner.java:1559)
		at com.carrotsearch.randomizedtesting.RandomizedRunner.access$600(RandomizedRunner.java:79)
		at com.carrotsearch.randomizedtesting.RandomizedRunner$6.evaluate(RandomizedRunner.java:737)
		at com.carrotsearch.randomizedtesting.RandomizedRunner$7.evaluate(RandomizedRunner.java:773)
		at com.carrotsearch.randomizedtesting.RandomizedRunner$8.evaluate(RandomizedRunner.java:787)
		at com.carrotsearch.randomizedtesting.rules.SystemPropertiesRestoreRule$1.evaluate(SystemPropertiesRestoreRule.java:53)
		at org.apache.lucene.util.TestRuleSetupTeardownChained$1.evaluate(TestRuleSetupTeardownChained.java:50)
		at org.apache.lucene.util.TestRuleFieldCacheSanity$1.evaluate(TestRuleFieldCacheSanity.java:51)
		at org.apache.lucene.util.AbstractBeforeAfterRule$1.evaluate(AbstractBeforeAfterRule.java:45)
		at com.carrotsearch.randomizedtesting.rules.SystemPropertiesInvariantRule$1.evaluate(SystemPropertiesInvariantRule.java:55)
		at org.apache.lucene.util.TestRuleThreadAndTestName$1.evaluate(TestRuleThreadAndTestName.java:48)
		at org.apache.lucene.util.TestRuleIgnoreAfterMaxFailures$1.evaluate(TestRuleIgnoreAfterMaxFailures.java:70)
		at org.apache.lucene.util.TestRuleMarkFailure$1.evaluate(TestRuleMarkFailure.java:48)
		at com.carrotsearch.randomizedtesting.rules.StatementAdapter.evaluate(StatementAdapter.java:36)
		at com.carrotsearch.randomizedtesting.ThreadLeakControl$StatementRunner.run(ThreadLeakControl.java:345)
		at com.carrotsearch.randomizedtesting.ThreadLeakControl.forkTimeoutingTask(ThreadLeakControl.java:769)
		at com.carrotsearch.randomizedtesting.ThreadLeakControl$3.evaluate(ThreadLeakControl.java:429)
		at com.carrotsearch.randomizedtesting.RandomizedRunner.runSingleTest(RandomizedRunner.java:746)
		at com.carrotsearch.randomizedtesting.RandomizedRunner$3.evaluate(RandomizedRunner.java:648)
		at com.carrotsearch.randomizedtesting.RandomizedRunner$4.evaluate(RandomizedRunner.java:682)
		at com.carrotsearch.randomizedtesting.RandomizedRunner$5.evaluate(RandomizedRunner.java:693)
		at com.carrotsearch.randomizedtesting.rules.StatementAdapter.evaluate(StatementAdapter.java:36)
		at com.carrotsearch.randomizedtesting.rules.SystemPropertiesRestoreRule$1.evaluate(SystemPropertiesRestoreRule.java:53)
		at org.apache.lucene.util.AbstractBeforeAfterRule$1.evaluate(AbstractBeforeAfterRule.java:45)
		at org.apache.lucene.util.TestRuleStoreClassName$1.evaluate(TestRuleStoreClassName.java:42)
		at com.carrotsearch.randomizedtesting.rules.SystemPropertiesInvariantRule$1.evaluate(SystemPropertiesInvariantRule.java:55)
		at com.carrotsearch.randomizedtesting.rules.NoShadowingOrOverridesOnMethodsRule$1.evaluate(NoShadowingOrOverridesOnMethodsRule.java:39)
		at com.carrotsearch.randomizedtesting.rules.NoShadowingOrOverridesOnMethodsRule$1.evaluate(NoShadowingOrOverridesOnMethodsRule.java:39)
		at org.apache.lucene.util.TestRuleAssertionsRequired$1.evaluate(TestRuleAssertionsRequired.java:40)
		at org.apache.lucene.util.TestRuleMarkFailure$1.evaluate(TestRuleMarkFailure.java:48)
		at org.apache.lucene.util.TestRuleIgnoreAfterMaxFailures$1.evaluate(TestRuleIgnoreAfterMaxFailures.java:70)
		at org.apache.lucene.util.TestRuleIgnoreTestSuites$1.evaluate(TestRuleIgnoreTestSuites.java:55)
		at com.carrotsearch.randomizedtesting.rules.StatementAdapter.evaluate(StatementAdapter.java:36)
		at com.carrotsearch.randomizedtesting.ThreadLeakControl$StatementRunner.run(ThreadLeakControl.java:345)
		at java.lang.Thread.run(Thread.java:679)
	
1356 T2714 C6 oasc.SolrException.log SEVERE org.apache.solr.common.SolrException: range facet infinite loop: gap is either zero, or too small relative start/end and caused underflow: 9.9999998E10 + 2160 = 9.9999998E10
		at org.apache.solr.request.SimpleFacets.getFacetRangeCounts(SimpleFacets.java:1122)
		at org.apache.solr.request.SimpleFacets.getFacetRangeCounts(SimpleFacets.java:1074)
		at org.apache.solr.request.SimpleFacets.getFacetRangeCounts(SimpleFacets.java:1018)
		at org.apache.solr.request.SimpleFacets.getFacetCounts(SimpleFacets.java:208)
		at org.apache.solr.handler.component.FacetComponent.process(FacetComponent.java:87)
		at org.apache.solr.handler.component.SearchHandler.handleRequestBody(SearchHandler.java:206)
		at org.apache.solr.handler.RequestHandlerBase.handleRequest(RequestHandlerBase.java:129)
		at org.apache.solr.core.SolrCore.execute(SolrCore.java:1692)
		at org.apache.solr.util.TestHarness.query(TestHarness.java:351)
		at org.apache.solr.util.TestHarness.query(TestHarness.java:333)
		at org.apache.solr.SolrTestCaseJ4.assertQEx(SolrTestCaseJ4.java:601)
		at org.apache.solr.request.SimpleFacetsTest.testRangeFacetInfiniteLoopDetection(SimpleFacetsTest.java:2041)
		at sun.reflect.NativeMethodAccessorImpl.invoke0(Native Method)
		at sun.reflect.NativeMethodAccessorImpl.invoke(NativeMethodAccessorImpl.java:57)
		at sun.reflect.DelegatingMethodAccessorImpl.invoke(DelegatingMethodAccessorImpl.java:43)
		at java.lang.reflect.Method.invoke(Method.java:616)
		at com.carrotsearch.randomizedtesting.RandomizedRunner.invoke(RandomizedRunner.java:1559)
		at com.carrotsearch.randomizedtesting.RandomizedRunner.access$600(RandomizedRunner.java:79)
		at com.carrotsearch.randomizedtesting.RandomizedRunner$6.evaluate(RandomizedRunner.java:737)
		at com.carrotsearch.randomizedtesting.RandomizedRunner$7.evaluate(RandomizedRunner.java:773)
		at com.carrotsearch.randomizedtesting.RandomizedRunner$8.evaluate(RandomizedRunner.java:787)
		at com.carrotsearch.randomizedtesting.rules.SystemPropertiesRestoreRule$1.evaluate(SystemPropertiesRestoreRule.java:53)
		at org.apache.lucene.util.TestRuleSetupTeardownChained$1.evaluate(TestRuleSetupTeardownChained.java:50)
		at org.apache.lucene.util.TestRuleFieldCacheSanity$1.evaluate(TestRuleFieldCacheSanity.java:51)
		at org.apache.lucene.util.AbstractBeforeAfterRule$1.evaluate(AbstractBeforeAfterRule.java:45)
		at com.carrotsearch.randomizedtesting.rules.SystemPropertiesInvariantRule$1.evaluate(SystemPropertiesInvariantRule.java:55)
		at org.apache.lucene.util.TestRuleThreadAndTestName$1.evaluate(TestRuleThreadAndTestName.java:48)
		at org.apache.lucene.util.TestRuleIgnoreAfterMaxFailures$1.evaluate(TestRuleIgnoreAfterMaxFailures.java:70)
		at org.apache.lucene.util.TestRuleMarkFailure$1.evaluate(TestRuleMarkFailure.java:48)
		at com.carrotsearch.randomizedtesting.rules.StatementAdapter.evaluate(StatementAdapter.java:36)
		at com.carrotsearch.randomizedtesting.ThreadLeakControl$StatementRunner.run(ThreadLeakControl.java:345)
		at com.carrotsearch.randomizedtesting.ThreadLeakControl.forkTimeoutingTask(ThreadLeakControl.java:769)
		at com.carrotsearch.randomizedtesting.ThreadLeakControl$3.evaluate(ThreadLeakControl.java:429)
		at com.carrotsearch.randomizedtesting.RandomizedRunner.runSingleTest(RandomizedRunner.java:746)
		at com.carrotsearch.randomizedtesting.RandomizedRunner$3.evaluate(RandomizedRunner.java:648)
		at com.carrotsearch.randomizedtesting.RandomizedRunner$4.evaluate(RandomizedRunner.java:682)
		at com.carrotsearch.randomizedtesting.RandomizedRunner$5.evaluate(RandomizedRunner.java:693)
		at com.carrotsearch.randomizedtesting.rules.StatementAdapter.evaluate(StatementAdapter.java:36)
		at com.carrotsearch.randomizedtesting.rules.SystemPropertiesRestoreRule$1.evaluate(SystemPropertiesRestoreRule.java:53)
		at org.apache.lucene.util.AbstractBeforeAfterRule$1.evaluate(AbstractBeforeAfterRule.java:45)
		at org.apache.lucene.util.TestRuleStoreClassName$1.evaluate(TestRuleStoreClassName.java:42)
		at com.carrotsearch.randomizedtesting.rules.SystemPropertiesInvariantRule$1.evaluate(SystemPropertiesInvariantRule.java:55)
		at com.carrotsearch.randomizedtesting.rules.NoShadowingOrOverridesOnMethodsRule$1.evaluate(NoShadowingOrOverridesOnMethodsRule.java:39)
		at com.carrotsearch.randomizedtesting.rules.NoShadowingOrOverridesOnMethodsRule$1.evaluate(NoShadowingOrOverridesOnMethodsRule.java:39)
		at org.apache.lucene.util.TestRuleAssertionsRequired$1.evaluate(TestRuleAssertionsRequired.java:40)
		at org.apache.lucene.util.TestRuleMarkFailure$1.evaluate(TestRuleMarkFailure.java:48)
		at org.apache.lucene.util.TestRuleIgnoreAfterMaxFailures$1.evaluate(TestRuleIgnoreAfterMaxFailures.java:70)
		at org.apache.lucene.util.TestRuleIgnoreTestSuites$1.evaluate(TestRuleIgnoreTestSuites.java:55)
		at com.carrotsearch.randomizedtesting.rules.StatementAdapter.evaluate(StatementAdapter.java:36)
		at com.carrotsearch.randomizedtesting.ThreadLeakControl$StatementRunner.run(ThreadLeakControl.java:345)
		at java.lang.Thread.run(Thread.java:679)
	
1356 T2714 C6 oasc.SolrException.log SEVERE org.apache.solr.common.SolrException: range facet infinite loop: gap is either zero, or too small relative start/end and caused underflow: 9.9999998E10 + 2160 = 9.9999998E10
		at org.apache.solr.request.SimpleFacets.getFacetRangeCounts(SimpleFacets.java:1122)
		at org.apache.solr.request.SimpleFacets.getFacetRangeCounts(SimpleFacets.java:1074)
		at org.apache.solr.request.SimpleFacets.getFacetRangeCounts(SimpleFacets.java:1018)
		at org.apache.solr.request.SimpleFacets.getFacetCounts(SimpleFacets.java:208)
		at org.apache.solr.handler.component.FacetComponent.process(FacetComponent.java:87)
		at org.apache.solr.handler.component.SearchHandler.handleRequestBody(SearchHandler.java:206)
		at org.apache.solr.handler.RequestHandlerBase.handleRequest(RequestHandlerBase.java:129)
		at org.apache.solr.core.SolrCore.execute(SolrCore.java:1692)
		at org.apache.solr.util.TestHarness.query(TestHarness.java:351)
		at org.apache.solr.util.TestHarness.query(TestHarness.java:333)
		at org.apache.solr.SolrTestCaseJ4.assertQEx(SolrTestCaseJ4.java:601)
		at org.apache.solr.request.SimpleFacetsTest.testRangeFacetInfiniteLoopDetection(SimpleFacetsTest.java:2041)
		at sun.reflect.NativeMethodAccessorImpl.invoke0(Native Method)
		at sun.reflect.NativeMethodAccessorImpl.invoke(NativeMethodAccessorImpl.java:57)
		at sun.reflect.DelegatingMethodAccessorImpl.invoke(DelegatingMethodAccessorImpl.java:43)
		at java.lang.reflect.Method.invoke(Method.java:616)
		at com.carrotsearch.randomizedtesting.RandomizedRunner.invoke(RandomizedRunner.java:1559)
		at com.carrotsearch.randomizedtesting.RandomizedRunner.access$600(RandomizedRunner.java:79)
		at com.carrotsearch.randomizedtesting.RandomizedRunner$6.evaluate(RandomizedRunner.java:737)
		at com.carrotsearch.randomizedtesting.RandomizedRunner$7.evaluate(RandomizedRunner.java:773)
		at com.carrotsearch.randomizedtesting.RandomizedRunner$8.evaluate(RandomizedRunner.java:787)
		at com.carrotsearch.randomizedtesting.rules.SystemPropertiesRestoreRule$1.evaluate(SystemPropertiesRestoreRule.java:53)
		at org.apache.lucene.util.TestRuleSetupTeardownChained$1.evaluate(TestRuleSetupTeardownChained.java:50)
		at org.apache.lucene.util.TestRuleFieldCacheSanity$1.evaluate(TestRuleFieldCacheSanity.java:51)
		at org.apache.lucene.util.AbstractBeforeAfterRule$1.evaluate(AbstractBeforeAfterRule.java:45)
		at com.carrotsearch.randomizedtesting.rules.SystemPropertiesInvariantRule$1.evaluate(SystemPropertiesInvariantRule.java:55)
		at org.apache.lucene.util.TestRuleThreadAndTestName$1.evaluate(TestRuleThreadAndTestName.java:48)
		at org.apache.lucene.util.TestRuleIgnoreAfterMaxFailures$1.evaluate(TestRuleIgnoreAfterMaxFailures.java:70)
		at org.apache.lucene.util.TestRuleMarkFailure$1.evaluate(TestRuleMarkFailure.java:48)
		at com.carrotsearch.randomizedtesting.rules.StatementAdapter.evaluate(StatementAdapter.java:36)
		at com.carrotsearch.randomizedtesting.ThreadLeakControl$StatementRunner.run(ThreadLeakControl.java:345)
		at com.carrotsearch.randomizedtesting.ThreadLeakControl.forkTimeoutingTask(ThreadLeakControl.java:769)
		at com.carrotsearch.randomizedtesting.ThreadLeakControl$3.evaluate(ThreadLeakControl.java:429)
		at com.carrotsearch.randomizedtesting.RandomizedRunner.runSingleTest(RandomizedRunner.java:746)
		at com.carrotsearch.randomizedtesting.RandomizedRunner$3.evaluate(RandomizedRunner.java:648)
		at com.carrotsearch.randomizedtesting.RandomizedRunner$4.evaluate(RandomizedRunner.java:682)
		at com.carrotsearch.randomizedtesting.RandomizedRunner$5.evaluate(RandomizedRunner.java:693)
		at com.carrotsearch.randomizedtesting.rules.StatementAdapter.evaluate(StatementAdapter.java:36)
		at com.carrotsearch.randomizedtesting.rules.SystemPropertiesRestoreRule$1.evaluate(SystemPropertiesRestoreRule.java:53)
		at org.apache.lucene.util.AbstractBeforeAfterRule$1.evaluate(AbstractBeforeAfterRule.java:45)
		at org.apache.lucene.util.TestRuleStoreClassName$1.evaluate(TestRuleStoreClassName.java:42)
		at com.carrotsearch.randomizedtesting.rules.SystemPropertiesInvariantRule$1.evaluate(SystemPropertiesInvariantRule.java:55)
		at com.carrotsearch.randomizedtesting.rules.NoShadowingOrOverridesOnMethodsRule$1.evaluate(NoShadowingOrOverridesOnMethodsRule.java:39)
		at com.carrotsearch.randomizedtesting.rules.NoShadowingOrOverridesOnMethodsRule$1.evaluate(NoShadowingOrOverridesOnMethodsRule.java:39)
		at org.apache.lucene.util.TestRuleAssertionsRequired$1.evaluate(TestRuleAssertionsRequired.java:40)
		at org.apache.lucene.util.TestRuleMarkFailure$1.evaluate(TestRuleMarkFailure.java:48)
		at org.apache.lucene.util.TestRuleIgnoreAfterMaxFailures$1.evaluate(TestRuleIgnoreAfterMaxFailures.java:70)
		at org.apache.lucene.util.TestRuleIgnoreTestSuites$1.evaluate(TestRuleIgnoreTestSuites.java:55)
		at com.carrotsearch.randomizedtesting.rules.StatementAdapter.evaluate(StatementAdapter.java:36)
		at com.carrotsearch.randomizedtesting.ThreadLeakControl$StatementRunner.run(ThreadLeakControl.java:345)
		at java.lang.Thread.run(Thread.java:679)
	
1357 T2714 C6 oasc.SolrException.log SEVERE org.apache.solr.common.SolrException: range facet infinite loop: gap is either zero, or too small relative start/end and caused underflow: 9.9E12 + 0.0003 = 9.9E12
		at org.apache.solr.request.SimpleFacets.getFacetRangeCounts(SimpleFacets.java:1122)
		at org.apache.solr.request.SimpleFacets.getFacetRangeCounts(SimpleFacets.java:1074)
		at org.apache.solr.request.SimpleFacets.getFacetRangeCounts(SimpleFacets.java:1018)
		at org.apache.solr.request.SimpleFacets.getFacetCounts(SimpleFacets.java:208)
		at org.apache.solr.handler.component.FacetComponent.process(FacetComponent.java:87)
		at org.apache.solr.handler.component.SearchHandler.handleRequestBody(SearchHandler.java:206)
		at org.apache.solr.handler.RequestHandlerBase.handleRequest(RequestHandlerBase.java:129)
		at org.apache.solr.core.SolrCore.execute(SolrCore.java:1692)
		at org.apache.solr.util.TestHarness.query(TestHarness.java:351)
		at org.apache.solr.util.TestHarness.query(TestHarness.java:333)
		at org.apache.solr.SolrTestCaseJ4.assertQEx(SolrTestCaseJ4.java:601)
		at org.apache.solr.request.SimpleFacetsTest.testRangeFacetInfiniteLoopDetection(SimpleFacetsTest.java:2052)
		at sun.reflect.NativeMethodAccessorImpl.invoke0(Native Method)
		at sun.reflect.NativeMethodAccessorImpl.invoke(NativeMethodAccessorImpl.java:57)
		at sun.reflect.DelegatingMethodAccessorImpl.invoke(DelegatingMethodAccessorImpl.java:43)
		at java.lang.reflect.Method.invoke(Method.java:616)
		at com.carrotsearch.randomizedtesting.RandomizedRunner.invoke(RandomizedRunner.java:1559)
		at com.carrotsearch.randomizedtesting.RandomizedRunner.access$600(RandomizedRunner.java:79)
		at com.carrotsearch.randomizedtesting.RandomizedRunner$6.evaluate(RandomizedRunner.java:737)
		at com.carrotsearch.randomizedtesting.RandomizedRunner$7.evaluate(RandomizedRunner.java:773)
		at com.carrotsearch.randomizedtesting.RandomizedRunner$8.evaluate(RandomizedRunner.java:787)
		at com.carrotsearch.randomizedtesting.rules.SystemPropertiesRestoreRule$1.evaluate(SystemPropertiesRestoreRule.java:53)
		at org.apache.lucene.util.TestRuleSetupTeardownChained$1.evaluate(TestRuleSetupTeardownChained.java:50)
		at org.apache.lucene.util.TestRuleFieldCacheSanity$1.evaluate(TestRuleFieldCacheSanity.java:51)
		at org.apache.lucene.util.AbstractBeforeAfterRule$1.evaluate(AbstractBeforeAfterRule.java:45)
		at com.carrotsearch.randomizedtesting.rules.SystemPropertiesInvariantRule$1.evaluate(SystemPropertiesInvariantRule.java:55)
		at org.apache.lucene.util.TestRuleThreadAndTestName$1.evaluate(TestRuleThreadAndTestName.java:48)
		at org.apache.lucene.util.TestRuleIgnoreAfterMaxFailures$1.evaluate(TestRuleIgnoreAfterMaxFailures.java:70)
		at org.apache.lucene.util.TestRuleMarkFailure$1.evaluate(TestRuleMarkFailure.java:48)
		at com.carrotsearch.randomizedtesting.rules.StatementAdapter.evaluate(StatementAdapter.java:36)
		at com.carrotsearch.randomizedtesting.ThreadLeakControl$StatementRunner.run(ThreadLeakControl.java:345)
		at com.carrotsearch.randomizedtesting.ThreadLeakControl.forkTimeoutingTask(ThreadLeakControl.java:769)
		at com.carrotsearch.randomizedtesting.ThreadLeakControl$3.evaluate(ThreadLeakControl.java:429)
		at com.carrotsearch.randomizedtesting.RandomizedRunner.runSingleTest(RandomizedRunner.java:746)
		at com.carrotsearch.randomizedtesting.RandomizedRunner$3.evaluate(RandomizedRunner.java:648)
		at com.carrotsearch.randomizedtesting.RandomizedRunner$4.evaluate(RandomizedRunner.java:682)
		at com.carrotsearch.randomizedtesting.RandomizedRunner$5.evaluate(RandomizedRunner.java:693)
		at com.carrotsearch.randomizedtesting.rules.StatementAdapter.evaluate(StatementAdapter.java:36)
		at com.carrotsearch.randomizedtesting.rules.SystemPropertiesRestoreRule$1.evaluate(SystemPropertiesRestoreRule.java:53)
		at org.apache.lucene.util.AbstractBeforeAfterRule$1.evaluate(AbstractBeforeAfterRule.java:45)
		at org.apache.lucene.util.TestRuleStoreClassName$1.evaluate(TestRuleStoreClassName.java:42)
		at com.carrotsearch.randomizedtesting.rules.SystemPropertiesInvariantRule$1.evaluate(SystemPropertiesInvariantRule.java:55)
		at com.carrotsearch.randomizedtesting.rules.NoShadowingOrOverridesOnMethodsRule$1.evaluate(NoShadowingOrOverridesOnMethodsRule.java:39)
		at com.carrotsearch.randomizedtesting.rules.NoShadowingOrOverridesOnMethodsRule$1.evaluate(NoShadowingOrOverridesOnMethodsRule.java:39)
		at org.apache.lucene.util.TestRuleAssertionsRequired$1.evaluate(TestRuleAssertionsRequired.java:40)
		at org.apache.lucene.util.TestRuleMarkFailure$1.evaluate(TestRuleMarkFailure.java:48)
		at org.apache.lucene.util.TestRuleIgnoreAfterMaxFailures$1.evaluate(TestRuleIgnoreAfterMaxFailures.java:70)
		at org.apache.lucene.util.TestRuleIgnoreTestSuites$1.evaluate(TestRuleIgnoreTestSuites.java:55)
		at com.carrotsearch.randomizedtesting.rules.StatementAdapter.evaluate(StatementAdapter.java:36)
		at com.carrotsearch.randomizedtesting.ThreadLeakControl$StatementRunner.run(ThreadLeakControl.java:345)
		at java.lang.Thread.run(Thread.java:679)
	
1358 T2714 C6 oasc.SolrException.log SEVERE org.apache.solr.common.SolrException: range facet infinite loop: gap is either zero, or too small relative start/end and caused underflow: 9.9E12 + 0.0003 = 9.9E12
		at org.apache.solr.request.SimpleFacets.getFacetRangeCounts(SimpleFacets.java:1122)
		at org.apache.solr.request.SimpleFacets.getFacetRangeCounts(SimpleFacets.java:1074)
		at org.apache.solr.request.SimpleFacets.getFacetRangeCounts(SimpleFacets.java:1018)
		at org.apache.solr.request.SimpleFacets.getFacetCounts(SimpleFacets.java:208)
		at org.apache.solr.handler.component.FacetComponent.process(FacetComponent.java:87)
		at org.apache.solr.handler.component.SearchHandler.handleRequestBody(SearchHandler.java:206)
		at org.apache.solr.handler.RequestHandlerBase.handleRequest(RequestHandlerBase.java:129)
		at org.apache.solr.core.SolrCore.execute(SolrCore.java:1692)
		at org.apache.solr.util.TestHarness.query(TestHarness.java:351)
		at org.apache.solr.util.TestHarness.query(TestHarness.java:333)
		at org.apache.solr.SolrTestCaseJ4.assertQEx(SolrTestCaseJ4.java:601)
		at org.apache.solr.request.SimpleFacetsTest.testRangeFacetInfiniteLoopDetection(SimpleFacetsTest.java:2052)
		at sun.reflect.NativeMethodAccessorImpl.invoke0(Native Method)
		at sun.reflect.NativeMethodAccessorImpl.invoke(NativeMethodAccessorImpl.java:57)
		at sun.reflect.DelegatingMethodAccessorImpl.invoke(DelegatingMethodAccessorImpl.java:43)
		at java.lang.reflect.Method.invoke(Method.java:616)
		at com.carrotsearch.randomizedtesting.RandomizedRunner.invoke(RandomizedRunner.java:1559)
		at com.carrotsearch.randomizedtesting.RandomizedRunner.access$600(RandomizedRunner.java:79)
		at com.carrotsearch.randomizedtesting.RandomizedRunner$6.evaluate(RandomizedRunner.java:737)
		at com.carrotsearch.randomizedtesting.RandomizedRunner$7.evaluate(RandomizedRunner.java:773)
		at com.carrotsearch.randomizedtesting.RandomizedRunner$8.evaluate(RandomizedRunner.java:787)
		at com.carrotsearch.randomizedtesting.rules.SystemPropertiesRestoreRule$1.evaluate(SystemPropertiesRestoreRule.java:53)
		at org.apache.lucene.util.TestRuleSetupTeardownChained$1.evaluate(TestRuleSetupTeardownChained.java:50)
		at org.apache.lucene.util.TestRuleFieldCacheSanity$1.evaluate(TestRuleFieldCacheSanity.java:51)
		at org.apache.lucene.util.AbstractBeforeAfterRule$1.evaluate(AbstractBeforeAfterRule.java:45)
		at com.carrotsearch.randomizedtesting.rules.SystemPropertiesInvariantRule$1.evaluate(SystemPropertiesInvariantRule.java:55)
		at org.apache.lucene.util.TestRuleThreadAndTestName$1.evaluate(TestRuleThreadAndTestName.java:48)
		at org.apache.lucene.util.TestRuleIgnoreAfterMaxFailures$1.evaluate(TestRuleIgnoreAfterMaxFailures.java:70)
		at org.apache.lucene.util.TestRuleMarkFailure$1.evaluate(TestRuleMarkFailure.java:48)
		at com.carrotsearch.randomizedtesting.rules.StatementAdapter.evaluate(StatementAdapter.java:36)
		at com.carrotsearch.randomizedtesting.ThreadLeakControl$StatementRunner.run(ThreadLeakControl.java:345)
		at com.carrotsearch.randomizedtesting.ThreadLeakControl.forkTimeoutingTask(ThreadLeakControl.java:769)
		at com.carrotsearch.randomizedtesting.ThreadLeakControl$3.evaluate(ThreadLeakControl.java:429)
		at com.carrotsearch.randomizedtesting.RandomizedRunner.runSingleTest(RandomizedRunner.java:746)
		at com.carrotsearch.randomizedtesting.RandomizedRunner$3.evaluate(RandomizedRunner.java:648)
		at com.carrotsearch.randomizedtesting.RandomizedRunner$4.evaluate(RandomizedRunner.java:682)
		at com.carrotsearch.randomizedtesting.RandomizedRunner$5.evaluate(RandomizedRunner.java:693)
		at com.carrotsearch.randomizedtesting.rules.StatementAdapter.evaluate(StatementAdapter.java:36)
		at com.carrotsearch.randomizedtesting.rules.SystemPropertiesRestoreRule$1.evaluate(SystemPropertiesRestoreRule.java:53)
		at org.apache.lucene.util.AbstractBeforeAfterRule$1.evaluate(AbstractBeforeAfterRule.java:45)
		at org.apache.lucene.util.TestRuleStoreClassName$1.evaluate(TestRuleStoreClassName.java:42)
		at com.carrotsearch.randomizedtesting.rules.SystemPropertiesInvariantRule$1.evaluate(SystemPropertiesInvariantRule.java:55)
		at com.carrotsearch.randomizedtesting.rules.NoShadowingOrOverridesOnMethodsRule$1.evaluate(NoShadowingOrOverridesOnMethodsRule.java:39)
		at com.carrotsearch.randomizedtesting.rules.NoShadowingOrOverridesOnMethodsRule$1.evaluate(NoShadowingOrOverridesOnMethodsRule.java:39)
		at org.apache.lucene.util.TestRuleAssertionsRequired$1.evaluate(TestRuleAssertionsRequired.java:40)
		at org.apache.lucene.util.TestRuleMarkFailure$1.evaluate(TestRuleMarkFailure.java:48)
		at org.apache.lucene.util.TestRuleIgnoreAfterMaxFailures$1.evaluate(TestRuleIgnoreAfterMaxFailures.java:70)
		at org.apache.lucene.util.TestRuleIgnoreTestSuites$1.evaluate(TestRuleIgnoreTestSuites.java:55)
		at com.carrotsearch.randomizedtesting.rules.StatementAdapter.evaluate(StatementAdapter.java:36)
		at com.carrotsearch.randomizedtesting.ThreadLeakControl$StatementRunner.run(ThreadLeakControl.java:345)
		at java.lang.Thread.run(Thread.java:679)
	
1430 T2714 C6 oasc.SolrException.log SEVERE org.apache.solr.common.SolrException: Specify the group.field as parameter or local parameter
		at org.apache.solr.request.SimpleFacets.getGroupedCounts(SimpleFacets.java:360)
		at org.apache.solr.request.SimpleFacets.getTermCounts(SimpleFacets.java:319)
		at org.apache.solr.request.SimpleFacets.getFacetFieldCounts(SimpleFacets.java:423)
		at org.apache.solr.request.SimpleFacets.getFacetCounts(SimpleFacets.java:206)
		at org.apache.solr.handler.component.FacetComponent.process(FacetComponent.java:87)
		at org.apache.solr.handler.component.SearchHandler.handleRequestBody(SearchHandler.java:206)
		at org.apache.solr.handler.RequestHandlerBase.handleRequest(RequestHandlerBase.java:129)
		at org.apache.solr.core.SolrCore.execute(SolrCore.java:1692)
		at org.apache.solr.util.TestHarness.query(TestHarness.java:351)
		at org.apache.solr.util.TestHarness.query(TestHarness.java:333)
		at org.apache.solr.request.SimpleFacetsTest.testSimpleGroupedFacets(SimpleFacetsTest.java:211)
		at sun.reflect.NativeMethodAccessorImpl.invoke0(Native Method)
		at sun.reflect.NativeMethodAccessorImpl.invoke(NativeMethodAccessorImpl.java:57)
		at sun.reflect.DelegatingMethodAccessorImpl.invoke(DelegatingMethodAccessorImpl.java:43)
		at java.lang.reflect.Method.invoke(Method.java:616)
		at com.carrotsearch.randomizedtesting.RandomizedRunner.invoke(RandomizedRunner.java:1559)
		at com.carrotsearch.randomizedtesting.RandomizedRunner.access$600(RandomizedRunner.java:79)
		at com.carrotsearch.randomizedtesting.RandomizedRunner$6.evaluate(RandomizedRunner.java:737)
		at com.carrotsearch.randomizedtesting.RandomizedRunner$7.evaluate(RandomizedRunner.java:773)
		at com.carrotsearch.randomizedtesting.RandomizedRunner$8.evaluate(RandomizedRunner.java:787)
		at com.carrotsearch.randomizedtesting.rules.SystemPropertiesRestoreRule$1.evaluate(SystemPropertiesRestoreRule.java:53)
		at org.apache.lucene.util.TestRuleSetupTeardownChained$1.evaluate(TestRuleSetupTeardownChained.java:50)
		at org.apache.lucene.util.TestRuleFieldCacheSanity$1.evaluate(TestRuleFieldCacheSanity.java:51)
		at org.apache.lucene.util.AbstractBeforeAfterRule$1.evaluate(AbstractBeforeAfterRule.java:45)
		at com.carrotsearch.randomizedtesting.rules.SystemPropertiesInvariantRule$1.evaluate(SystemPropertiesInvariantRule.java:55)
		at org.apache.lucene.util.TestRuleThr

[...truncated too long message...]

arch.randomizedtesting.rules.NoShadowingOrOverridesOnMethodsRule$1.evaluate(NoShadowingOrOverridesOnMethodsRule.java:39)
	at org.apache.lucene.util.TestRuleAssertionsRequired$1.evaluate(TestRuleAssertionsRequired.java:40)
	at org.apache.lucene.util.TestRuleMarkFailure$1.evaluate(TestRuleMarkFailure.java:48)
	at org.apache.lucene.util.TestRuleIgnoreAfterMaxFailures$1.evaluate(TestRuleIgnoreAfterMaxFailures.java:70)
	at org.apache.lucene.util.TestRuleIgnoreTestSuites$1.evaluate(TestRuleIgnoreTestSuites.java:55)
	at com.carrotsearch.randomizedtesting.rules.StatementAdapter.evaluate(StatementAdapter.java:36)
	at com.carrotsearch.randomizedtesting.ThreadLeakControl$StatementRunner.run(ThreadLeakControl.java:345)
	at java.lang.Thread.run(Thread.java:679)

Tests run: 5, Failures: 0, Errors: 0, Skipped: 0, Time elapsed: 10.574 sec
Running org.apache.solr.uima.analysis.UIMAAnnotationsTokenizerFactoryTest
Creating dataDir: /usr/home/hudson/hudson-slave/workspace/Lucene-Solr-Maven-4.x/maven-build/solr/contrib/uima/target/test/./solrtest-UIMAAnnotationsTokenizerFactoryTest-1346595007012
Tests run: 2, Failures: 0, Errors: 0, Skipped: 0, Time elapsed: 6.791 sec

Results :

Tests run: 9, Failures: 0, Errors: 0, Skipped: 0

[INFO] [jar:jar {execution: default-jar}]
[INFO] Building jar: /usr/home/hudson/hudson-slave/workspace/Lucene-Solr-Maven-4.x/maven-build/solr/contrib/uima/target/solr-uima-4.0-SNAPSHOT.jar
[INFO] [install:install {execution: default-install}]
[INFO] Installing /usr/home/hudson/hudson-slave/workspace/Lucene-Solr-Maven-4.x/maven-build/solr/contrib/uima/target/solr-uima-4.0-SNAPSHOT.jar to /home/hudson/.m2/repository/org/apache/solr/solr-uima/4.0-SNAPSHOT/solr-uima-4.0-SNAPSHOT.jar
[INFO] ------------------------------------------------------------------------
[INFO] Building Apache Solr Velocity
[INFO]    task-segment: [install]
[INFO] ------------------------------------------------------------------------
[INFO] [groovy:execute {execution: generate-timestamps}]
[INFO] [buildnumber:create {execution: default}]
[INFO] [enforcer:enforce {execution: enforce-java-compat-version-and-maven-2.2.1}]
[INFO] [remote-resources:process {execution: default}]
[debug] execute contextualize
[INFO] [resources:resources {execution: default-resources}]
[INFO] Using 'UTF-8' encoding to copy filtered resources.
[INFO] skip non existing resourceDirectory /usr/home/hudson/hudson-slave/workspace/Lucene-Solr-Maven-4.x/maven-build/solr/contrib/velocity/src/main/resources
[INFO] Copying 3 resources
[INFO] [compiler:compile {execution: default-compile}]
[INFO] Compiling 4 source files to /usr/home/hudson/hudson-slave/workspace/Lucene-Solr-Maven-4.x/maven-build/solr/contrib/velocity/target/classes
[INFO] [bundle:manifest {execution: bundle-manifest}]
[debug] execute contextualize
[INFO] [resources:testResources {execution: default-testResources}]
[INFO] Using 'UTF-8' encoding to copy filtered resources.
[INFO] Copying 3 resources
[INFO] Copying 148 resources
[INFO] Copying 1 resource
[INFO] Copying 3 resources
[INFO] [compiler:testCompile {execution: default-testCompile}]
[INFO] Compiling 1 source file to /usr/home/hudson/hudson-slave/workspace/Lucene-Solr-Maven-4.x/maven-build/solr/contrib/velocity/target/test-classes
[INFO] [surefire:test {execution: default-test}]
[INFO] Surefire report directory: /usr/home/hudson/hudson-slave/workspace/Lucene-Solr-Maven-4.x/maven-build/solr/contrib/velocity/target/surefire-reports

-------------------------------------------------------
 T E S T S
-------------------------------------------------------
Running org.apache.solr.velocity.VelocityResponseWriterTest
Creating dataDir: /usr/home/hudson/hudson-slave/workspace/Lucene-Solr-Maven-4.x/maven-build/solr/contrib/velocity/target/test/./solrtest-VelocityResponseWriterTest-1346595018247
Tests run: 1, Failures: 0, Errors: 0, Skipped: 0, Time elapsed: 2.145 sec

Results :

Tests run: 1, Failures: 0, Errors: 0, Skipped: 0

[INFO] [jar:jar {execution: default-jar}]
[INFO] Building jar: /usr/home/hudson/hudson-slave/workspace/Lucene-Solr-Maven-4.x/maven-build/solr/contrib/velocity/target/solr-velocity-4.0-SNAPSHOT.jar
[INFO] [install:install {execution: default-install}]
[INFO] Installing /usr/home/hudson/hudson-slave/workspace/Lucene-Solr-Maven-4.x/maven-build/solr/contrib/velocity/target/solr-velocity-4.0-SNAPSHOT.jar to /home/hudson/.m2/repository/org/apache/solr/solr-velocity/4.0-SNAPSHOT/solr-velocity-4.0-SNAPSHOT.jar
[INFO] ------------------------------------------------------------------------
[INFO] Building Apache Solr Contrib aggregator POM
[INFO]    task-segment: [install]
[INFO] ------------------------------------------------------------------------
[INFO] [groovy:execute {execution: generate-timestamps}]
[INFO] [buildnumber:create {execution: default}]
[INFO] [enforcer:enforce {execution: enforce-java-compat-version-and-maven-2.2.1}]
[INFO] [remote-resources:process {execution: default}]
[INFO] [bundle:manifest {execution: bundle-manifest}]
[WARNING] Ignoring project type pom - supportedProjectTypes = [jar, bundle]
[INFO] [site:attach-descriptor {execution: default-attach-descriptor}]
[INFO] [install:install {execution: default-install}]
[INFO] Installing /usr/home/hudson/hudson-slave/workspace/Lucene-Solr-Maven-4.x/maven-build/solr/contrib/pom.xml to /home/hudson/.m2/repository/org/apache/solr/solr-contrib-aggregator/4.0-SNAPSHOT/solr-contrib-aggregator-4.0-SNAPSHOT.pom
[INFO] 
[INFO] 
[INFO] ------------------------------------------------------------------------
[INFO] Reactor Summary:
[INFO] ------------------------------------------------------------------------
[INFO] Grandparent POM for Apache Lucene Core and Apache Solr  SUCCESS [7.925s]
[INFO] Lucene parent POM ..................................... SUCCESS [0.085s]
[INFO] Lucene Core ........................................... SUCCESS [5:10.484s]
[INFO] Lucene Test Framework ................................. SUCCESS [4.599s]
[INFO] Lucene Common Analyzers ............................... SUCCESS [1:59.786s]
[INFO] Lucene ICU Analysis Components ........................ SUCCESS [18.468s]
[INFO] Lucene Kuromoji Japanese Morphological Analyzer ....... SUCCESS [23.845s]
[INFO] Lucene Morfologik Polish Lemmatizer ................... SUCCESS [6.697s]
[INFO] Lucene Phonetic Filters ............................... SUCCESS [19.922s]
[INFO] Lucene Smart Chinese Analyzer ......................... SUCCESS [8.285s]
[INFO] Lucene Stempel Analyzer ............................... SUCCESS [4.151s]
[INFO] Lucene UIMA Analysis Components ....................... SUCCESS [20.399s]
[INFO] Lucene Analysis Modules aggregator POM ................ SUCCESS [0.185s]
[INFO] Lucene Queries ........................................ SUCCESS [9.493s]
[INFO] Lucene Sandbox ........................................ SUCCESS [9.145s]
[INFO] Lucene QueryParsers ................................... SUCCESS [13.598s]
[INFO] Lucene Memory ......................................... SUCCESS [8.536s]
[INFO] Lucene Highlighter .................................... SUCCESS [9.826s]
[INFO] Lucene Facets ......................................... SUCCESS [52.915s]
[INFO] Lucene Benchmark ...................................... SUCCESS [24.701s]
[INFO] Lucene Demo ........................................... SUCCESS [4.255s]
[INFO] Lucene Grouping ....................................... SUCCESS [19.002s]
[INFO] Lucene Join ........................................... SUCCESS [20.062s]
[INFO] Lucene Miscellaneous .................................. SUCCESS [6.659s]
[INFO] Lucene Spatial ........................................ SUCCESS [13.701s]
[INFO] Lucene Suggest ........................................ SUCCESS [18.809s]
[INFO] Apache Solr parent POM ................................ SUCCESS [0.106s]
[INFO] Apache Solr Solrj ..................................... SUCCESS [4:45.534s]
[INFO] Apache Solr Core ...................................... SUCCESS [17:46.557s]
[INFO] Apache Solr Search Server ............................. SUCCESS [5.402s]
[INFO] Apache Solr Test Framework ............................ SUCCESS [2.932s]
[INFO] Apache Solr Analysis Extras ........................... SUCCESS [8.892s]
[INFO] Apache Solr Clustering ................................ SUCCESS [15.209s]
[INFO] Apache Solr DataImportHandler ......................... SUCCESS [1:34.187s]
[INFO] Apache Solr DataImportHandler Extras .................. SUCCESS [8.128s]
[INFO] Apache Solr Content Extraction Library ................ FAILED [10.080s]
[INFO] Apache Solr Language Identifier ....................... SUCCESS [7.808s]
[INFO] Apache Solr UIMA integration .......................... SUCCESS [31.265s]
[INFO] Apache Solr Velocity .................................. SUCCESS [6.209s]
[INFO] Apache Solr Contrib aggregator POM .................... SUCCESS [0.091s]
[INFO] ------------------------------------------------------------------------
[INFO] Error for project: Apache Solr Content Extraction Library (during install)
[INFO] ------------------------------------------------------------------------
[INFO] There are test failures.

Please refer to /usr/home/hudson/hudson-slave/workspace/Lucene-Solr-Maven-4.x/maven-build/solr/contrib/extraction/target/surefire-reports for the individual test results.
[INFO] ------------------------------------------------------------------------
[INFO] For more information, run Maven with the -e switch
[INFO] ------------------------------------------------------------------------
[INFO] BUILD ERRORS
[INFO] ------------------------------------------------------------------------
[INFO] Total time: 38 minutes 19 seconds
[INFO] Finished at: Sun Sep 02 14:10:20 UTC 2012
[INFO] Final Memory: 233M/1378M
[INFO] ------------------------------------------------------------------------
Build step 'Invoke top-level Maven targets' marked build as failure
Recording test results
Email was triggered for: Failure
Sending email for trigger: Failure




Mime
View raw message