lucene-dev mailing list archives

Site index · List index
Message view « Date » · « Thread »
Top « Date » · « Thread »
From Apache Jenkins Server <jenk...@builds.apache.org>
Subject [JENKINS] Lucene-Solr-Tests-4.x-java7 - Build # 477 - Failure
Date Thu, 20 Sep 2012 13:30:04 GMT
Build: https://builds.apache.org/job/Lucene-Solr-Tests-4.x-java7/477/

2 tests failed.
REGRESSION:  org.apache.solr.cloud.BasicDistributedZk2Test.testDistribSearch

Error Message:
Shard still reported as live in zk

Stack Trace:
java.lang.AssertionError: Shard still reported as live in zk
	at __randomizedtesting.SeedInfo.seed([1ABF24B33B3E58A2:9B59AAAB4C61389E]:0)
	at org.junit.Assert.fail(Assert.java:93)
	at org.apache.solr.cloud.AbstractFullDistribZkTestBase.waitToSeeNotLive(AbstractFullDistribZkTestBase.java:1220)
	at org.apache.solr.cloud.BasicDistributedZk2Test.brindDownShardIndexSomeDocsAndRecover(BasicDistributedZk2Test.java:190)
	at org.apache.solr.cloud.BasicDistributedZk2Test.doTest(BasicDistributedZk2Test.java:83)
	at org.apache.solr.BaseDistributedSearchTestCase.testDistribSearch(BaseDistributedSearchTestCase.java:695)
	at sun.reflect.NativeMethodAccessorImpl.invoke0(Native Method)
	at sun.reflect.NativeMethodAccessorImpl.invoke(NativeMethodAccessorImpl.java:57)
	at sun.reflect.DelegatingMethodAccessorImpl.invoke(DelegatingMethodAccessorImpl.java:43)
	at java.lang.reflect.Method.invoke(Method.java:601)
	at com.carrotsearch.randomizedtesting.RandomizedRunner.invoke(RandomizedRunner.java:1559)
	at com.carrotsearch.randomizedtesting.RandomizedRunner.access$600(RandomizedRunner.java:79)
	at com.carrotsearch.randomizedtesting.RandomizedRunner$6.evaluate(RandomizedRunner.java:737)
	at com.carrotsearch.randomizedtesting.RandomizedRunner$7.evaluate(RandomizedRunner.java:773)
	at com.carrotsearch.randomizedtesting.RandomizedRunner$8.evaluate(RandomizedRunner.java:787)
	at com.carrotsearch.randomizedtesting.rules.SystemPropertiesRestoreRule$1.evaluate(SystemPropertiesRestoreRule.java:53)
	at org.apache.lucene.util.TestRuleSetupTeardownChained$1.evaluate(TestRuleSetupTeardownChained.java:50)
	at org.apache.lucene.util.TestRuleFieldCacheSanity$1.evaluate(TestRuleFieldCacheSanity.java:51)
	at org.apache.lucene.util.AbstractBeforeAfterRule$1.evaluate(AbstractBeforeAfterRule.java:45)
	at com.carrotsearch.randomizedtesting.rules.SystemPropertiesInvariantRule$1.evaluate(SystemPropertiesInvariantRule.java:55)
	at org.apache.lucene.util.TestRuleThreadAndTestName$1.evaluate(TestRuleThreadAndTestName.java:48)
	at org.apache.lucene.util.TestRuleIgnoreAfterMaxFailures$1.evaluate(TestRuleIgnoreAfterMaxFailures.java:70)
	at org.apache.lucene.util.TestRuleMarkFailure$1.evaluate(TestRuleMarkFailure.java:48)
	at com.carrotsearch.randomizedtesting.rules.StatementAdapter.evaluate(StatementAdapter.java:36)
	at com.carrotsearch.randomizedtesting.ThreadLeakControl$StatementRunner.run(ThreadLeakControl.java:358)
	at com.carrotsearch.randomizedtesting.ThreadLeakControl.forkTimeoutingTask(ThreadLeakControl.java:782)
	at com.carrotsearch.randomizedtesting.ThreadLeakControl$3.evaluate(ThreadLeakControl.java:442)
	at com.carrotsearch.randomizedtesting.RandomizedRunner.runSingleTest(RandomizedRunner.java:746)
	at com.carrotsearch.randomizedtesting.RandomizedRunner$3.evaluate(RandomizedRunner.java:648)
	at com.carrotsearch.randomizedtesting.RandomizedRunner$4.evaluate(RandomizedRunner.java:682)
	at com.carrotsearch.randomizedtesting.RandomizedRunner$5.evaluate(RandomizedRunner.java:693)
	at com.carrotsearch.randomizedtesting.rules.StatementAdapter.evaluate(StatementAdapter.java:36)
	at com.carrotsearch.randomizedtesting.rules.SystemPropertiesRestoreRule$1.evaluate(SystemPropertiesRestoreRule.java:53)
	at org.apache.lucene.util.AbstractBeforeAfterRule$1.evaluate(AbstractBeforeAfterRule.java:45)
	at org.apache.lucene.util.TestRuleStoreClassName$1.evaluate(TestRuleStoreClassName.java:42)
	at com.carrotsearch.randomizedtesting.rules.SystemPropertiesInvariantRule$1.evaluate(SystemPropertiesInvariantRule.java:55)
	at com.carrotsearch.randomizedtesting.rules.NoShadowingOrOverridesOnMethodsRule$1.evaluate(NoShadowingOrOverridesOnMethodsRule.java:39)
	at com.carrotsearch.randomizedtesting.rules.NoShadowingOrOverridesOnMethodsRule$1.evaluate(NoShadowingOrOverridesOnMethodsRule.java:39)
	at com.carrotsearch.randomizedtesting.rules.StatementAdapter.evaluate(StatementAdapter.java:36)
	at org.apache.lucene.util.TestRuleAssertionsRequired$1.evaluate(TestRuleAssertionsRequired.java:43)
	at org.apache.lucene.util.TestRuleMarkFailure$1.evaluate(TestRuleMarkFailure.java:48)
	at org.apache.lucene.util.TestRuleIgnoreAfterMaxFailures$1.evaluate(TestRuleIgnoreAfterMaxFailures.java:70)
	at org.apache.lucene.util.TestRuleIgnoreTestSuites$1.evaluate(TestRuleIgnoreTestSuites.java:55)
	at com.carrotsearch.randomizedtesting.rules.StatementAdapter.evaluate(StatementAdapter.java:36)
	at com.carrotsearch.randomizedtesting.ThreadLeakControl$StatementRunner.run(ThreadLeakControl.java:358)
	at java.lang.Thread.run(Thread.java:722)


REGRESSION:  org.apache.solr.cloud.SyncSliceTest.testDistribSearch

Error Message:
There are still nodes recoverying

Stack Trace:
java.lang.AssertionError: There are still nodes recoverying
	at __randomizedtesting.SeedInfo.seed([1ABF24B33B3E58A2:9B59AAAB4C61389E]:0)
	at org.junit.Assert.fail(Assert.java:93)
	at org.apache.solr.cloud.AbstractDistribZkTestBase.waitForRecoveriesToFinish(AbstractDistribZkTestBase.java:154)
	at org.apache.solr.cloud.AbstractFullDistribZkTestBase.waitForRecoveriesToFinish(AbstractFullDistribZkTestBase.java:560)
	at org.apache.solr.cloud.AbstractFullDistribZkTestBase.waitForThingsToLevelOut(AbstractFullDistribZkTestBase.java:1135)
	at org.apache.solr.cloud.SyncSliceTest.doTest(SyncSliceTest.java:162)
	at org.apache.solr.BaseDistributedSearchTestCase.testDistribSearch(BaseDistributedSearchTestCase.java:695)
	at sun.reflect.NativeMethodAccessorImpl.invoke0(Native Method)
	at sun.reflect.NativeMethodAccessorImpl.invoke(NativeMethodAccessorImpl.java:57)
	at sun.reflect.DelegatingMethodAccessorImpl.invoke(DelegatingMethodAccessorImpl.java:43)
	at java.lang.reflect.Method.invoke(Method.java:601)
	at com.carrotsearch.randomizedtesting.RandomizedRunner.invoke(RandomizedRunner.java:1559)
	at com.carrotsearch.randomizedtesting.RandomizedRunner.access$600(RandomizedRunner.java:79)
	at com.carrotsearch.randomizedtesting.RandomizedRunner$6.evaluate(RandomizedRunner.java:737)
	at com.carrotsearch.randomizedtesting.RandomizedRunner$7.evaluate(RandomizedRunner.java:773)
	at com.carrotsearch.randomizedtesting.RandomizedRunner$8.evaluate(RandomizedRunner.java:787)
	at com.carrotsearch.randomizedtesting.rules.SystemPropertiesRestoreRule$1.evaluate(SystemPropertiesRestoreRule.java:53)
	at org.apache.lucene.util.TestRuleSetupTeardownChained$1.evaluate(TestRuleSetupTeardownChained.java:50)
	at org.apache.lucene.util.TestRuleFieldCacheSanity$1.evaluate(TestRuleFieldCacheSanity.java:51)
	at org.apache.lucene.util.AbstractBeforeAfterRule$1.evaluate(AbstractBeforeAfterRule.java:45)
	at com.carrotsearch.randomizedtesting.rules.SystemPropertiesInvariantRule$1.evaluate(SystemPropertiesInvariantRule.java:55)
	at org.apache.lucene.util.TestRuleThreadAndTestName$1.evaluate(TestRuleThreadAndTestName.java:48)
	at org.apache.lucene.util.TestRuleIgnoreAfterMaxFailures$1.evaluate(TestRuleIgnoreAfterMaxFailures.java:70)
	at org.apache.lucene.util.TestRuleMarkFailure$1.evaluate(TestRuleMarkFailure.java:48)
	at com.carrotsearch.randomizedtesting.rules.StatementAdapter.evaluate(StatementAdapter.java:36)
	at com.carrotsearch.randomizedtesting.ThreadLeakControl$StatementRunner.run(ThreadLeakControl.java:358)
	at com.carrotsearch.randomizedtesting.ThreadLeakControl.forkTimeoutingTask(ThreadLeakControl.java:782)
	at com.carrotsearch.randomizedtesting.ThreadLeakControl$3.evaluate(ThreadLeakControl.java:442)
	at com.carrotsearch.randomizedtesting.RandomizedRunner.runSingleTest(RandomizedRunner.java:746)
	at com.carrotsearch.randomizedtesting.RandomizedRunner$3.evaluate(RandomizedRunner.java:648)
	at com.carrotsearch.randomizedtesting.RandomizedRunner$4.evaluate(RandomizedRunner.java:682)
	at com.carrotsearch.randomizedtesting.RandomizedRunner$5.evaluate(RandomizedRunner.java:693)
	at com.carrotsearch.randomizedtesting.rules.StatementAdapter.evaluate(StatementAdapter.java:36)
	at com.carrotsearch.randomizedtesting.rules.SystemPropertiesRestoreRule$1.evaluate(SystemPropertiesRestoreRule.java:53)
	at org.apache.lucene.util.AbstractBeforeAfterRule$1.evaluate(AbstractBeforeAfterRule.java:45)
	at org.apache.lucene.util.TestRuleStoreClassName$1.evaluate(TestRuleStoreClassName.java:42)
	at com.carrotsearch.randomizedtesting.rules.SystemPropertiesInvariantRule$1.evaluate(SystemPropertiesInvariantRule.java:55)
	at com.carrotsearch.randomizedtesting.rules.NoShadowingOrOverridesOnMethodsRule$1.evaluate(NoShadowingOrOverridesOnMethodsRule.java:39)
	at com.carrotsearch.randomizedtesting.rules.NoShadowingOrOverridesOnMethodsRule$1.evaluate(NoShadowingOrOverridesOnMethodsRule.java:39)
	at com.carrotsearch.randomizedtesting.rules.StatementAdapter.evaluate(StatementAdapter.java:36)
	at org.apache.lucene.util.TestRuleAssertionsRequired$1.evaluate(TestRuleAssertionsRequired.java:43)
	at org.apache.lucene.util.TestRuleMarkFailure$1.evaluate(TestRuleMarkFailure.java:48)
	at org.apache.lucene.util.TestRuleIgnoreAfterMaxFailures$1.evaluate(TestRuleIgnoreAfterMaxFailures.java:70)
	at org.apache.lucene.util.TestRuleIgnoreTestSuites$1.evaluate(TestRuleIgnoreTestSuites.java:55)
	at com.carrotsearch.randomizedtesting.rules.StatementAdapter.evaluate(StatementAdapter.java:36)
	at com.carrotsearch.randomizedtesting.ThreadLeakControl$StatementRunner.run(ThreadLeakControl.java:358)
	at java.lang.Thread.run(Thread.java:722)




Build Log:
[...truncated 7721 lines...]
[junit4:junit4] Suite: org.apache.solr.cloud.BasicDistributedZk2Test
[junit4:junit4]   2> 4 T52 oas.SolrTestCaseJ4.setUp ###Starting testDistribSearch
[junit4:junit4]   2> Creating dataDir: /usr/home/hudson/hudson-slave/workspace/Lucene-Solr-Tests-4.x-java7/solr/build/solr-core/test/J1/./solrtest-BasicDistributedZk2Test-1348146943104
[junit4:junit4]   2> 10 T52 oasc.ZkTestServer.run STARTING ZK TEST SERVER
[junit4:junit4]   2> 141 T53 oaz.Environment.logEnv Server environment:zookeeper.version=3.3.6-1366786, built on 07/29/2012 06:22 GMT
[junit4:junit4]   2> 142 T53 oaz.Environment.logEnv Server environment:host.name=lucene.zones.apache.org
[junit4:junit4]   2> 142 T53 oaz.Environment.logEnv Server environment:java.version=1.7.0_06
[junit4:junit4]   2> 143 T53 oaz.Environment.logEnv Server environment:java.vendor=Oracle Corporation
[junit4:junit4]   2> 143 T53 oaz.Environment.logEnv Server environment:java.home=/usr/local/openjdk7/jre
[junit4:junit4]   2> 144 T53 oaz.Environment.logEnv Server environment:java.class.path=/usr/home/hudson/hudson-slave/workspace/Lucene-Solr-Tests-4.x-java7/solr/build/solr-core/classes/test:/usr/home/hudson/hudson-slave/workspace/Lucene-Solr-Tests-4.x-java7/solr/build/solr-test-framework/classes/java:/usr/home/hudson/hudson-slave/workspace/Lucene-Solr-Tests-4.x-java7/solr/build/solr-core/test-files:/usr/home/hudson/hudson-slave/workspace/Lucene-Solr-Tests-4.x-java7/lucene/build/codecs/classes/java:/usr/home/hudson/hudson-slave/workspace/Lucene-Solr-Tests-4.x-java7/lucene/build/test-framework/classes/java:/usr/home/hudson/hudson-slave/workspace/Lucene-Solr-Tests-4.x-java7/solr/build/solr-solrj/classes/java:/usr/home/hudson/hudson-slave/workspace/Lucene-Solr-Tests-4.x-java7/solr/build/solr-core/classes/java:/usr/home/hudson/hudson-slave/workspace/Lucene-Solr-Tests-4.x-java7/lucene/build/analysis/common/lucene-analyzers-common-4.0-SNAPSHOT.jar:/usr/home/hudson/hudson-slave/workspace/Lucene-Solr-Tests-4.x-java7/lucene/build/analysis/kuromoji/lucene-analyzers-kuromoji-4.0-SNAPSHOT.jar:/usr/home/hudson/hudson-slave/workspace/Lucene-Solr-Tests-4.x-java7/lucene/build/analysis/phonetic/lucene-analyzers-phonetic-4.0-SNAPSHOT.jar:/usr/home/hudson/hudson-slave/workspace/Lucene-Solr-Tests-4.x-java7/lucene/build/highlighter/lucene-highlighter-4.0-SNAPSHOT.jar:/usr/home/hudson/hudson-slave/workspace/Lucene-Solr-Tests-4.x-java7/lucene/build/memory/lucene-memory-4.0-SNAPSHOT.jar:/usr/home/hudson/hudson-slave/workspace/Lucene-Solr-Tests-4.x-java7/lucene/build/misc/lucene-misc-4.0-SNAPSHOT.jar:/usr/home/hudson/hudson-slave/workspace/Lucene-Solr-Tests-4.x-java7/lucene/build/spatial/lucene-spatial-4.0-SNAPSHOT.jar:/usr/home/hudson/hudson-slave/workspace/Lucene-Solr-Tests-4.x-java7/lucene/build/suggest/lucene-suggest-4.0-SNAPSHOT.jar:/usr/home/hudson/hudson-slave/workspace/Lucene-Solr-Tests-4.x-java7/lucene/build/grouping/lucene-grouping-4.0-SNAPSHOT.jar:/usr/home/hudson/hudson-slave/workspace/Lucene-Solr-Tests-4.x-java7/lucene/build/queries/lucene-queries-4.0-SNAPSHOT.jar:/usr/home/hudson/hudson-slave/workspace/Lucene-Solr-Tests-4.x-java7/lucene/build/queryparser/lucene-queryparser-4.0-SNAPSHOT.jar:/usr/home/hudson/hudson-slave/workspace/Lucene-Solr-Tests-4.x-java7/solr/core/lib/commons-cli-1.2.jar:/usr/home/hudson/hudson-slave/workspace/Lucene-Solr-Tests-4.x-java7/solr/core/lib/commons-codec-1.7.jar:/usr/home/hudson/hudson-slave/workspace/Lucene-Solr-Tests-4.x-java7/solr/core/lib/commons-fileupload-1.2.1.jar:/usr/home/hudson/hudson-slave/workspace/Lucene-Solr-Tests-4.x-java7/solr/core/lib/commons-lang-2.6.jar:/usr/home/hudson/hudson-slave/workspace/Lucene-Solr-Tests-4.x-java7/solr/core/lib/easymock-2.2.jar:/usr/home/hudson/hudson-slave/workspace/Lucene-Solr-Tests-4.x-java7/solr/core/lib/guava-r05.jar:/usr/home/hudson/hudson-slave/workspace/Lucene-Solr-Tests-4.x-java7/solr/core/lib/javax.servlet-api-3.0.1.jar:/usr/home/hudson/hudson-slave/workspace/Lucene-Solr-Tests-4.x-java7/solr/core/lib/spatial4j-0.3.jar:/usr/home/hudson/hudson-slave/workspace/Lucene-Solr-Tests-4.x-java7/solr/solrj/lib/commons-io-2.1.jar:/usr/home/hudson/hudson-slave/workspace/Lucene-Solr-Tests-4.x-java7/solr/solrj/lib/httpclient-4.1.3.jar:/usr/home/hudson/hudson-slave/workspace/Lucene-Solr-Tests-4.x-java7/solr/solrj/lib/httpcore-4.1.4.jar:/usr/home/hudson/hudson-slave/workspace/Lucene-Solr-Tests-4.x-java7/solr/solrj/lib/httpmime-4.1.3.jar:/usr/home/hudson/hudson-slave/workspace/Lucene-Solr-Tests-4.x-java7/solr/solrj/lib/jcl-over-slf4j-1.6.4.jar:/usr/home/hudson/hudson-slave/workspace/Lucene-Solr-Tests-4.x-java7/solr/solrj/lib/log4j-over-slf4j-1.6.4.jar:/usr/home/hudson/hudson-slave/workspace/Lucene-Solr-Tests-4.x-java7/solr/solrj/lib/slf4j-api-1.6.4.jar:/usr/home/hudson/hudson-slave/workspace/Lucene-Solr-Tests-4.x-java7/solr/solrj/lib/slf4j-jdk14-1.6.4.jar:/usr/home/hudson/hudson-slave/workspace/Lucene-Solr-Tests-4.x-java7/solr/solrj/lib/wstx-asl-3.2.7.jar:/usr/home/hudson/hudson-slave/workspace/Lucene-Solr-Tests-4.x-java7/solr/solrj/lib/zookeeper-3.3.6.jar:/usr/home/hudson/hudson-slave/workspace/Lucene-Solr-Tests-4.x-java7/solr/example/lib/jetty-continuation-8.1.2.v20120308.jar:/usr/home/hudson/hudson-slave/workspace/Lucene-Solr-Tests-4.x-java7/solr/example/lib/jetty-deploy-8.1.2.v20120308.jar:/usr/home/hudson/hudson-slave/workspace/Lucene-Solr-Tests-4.x-java7/solr/example/lib/jetty-http-8.1.2.v20120308.jar:/usr/home/hudson/hudson-slave/workspace/Lucene-Solr-Tests-4.x-java7/solr/example/lib/jetty-io-8.1.2.v20120308.jar:/usr/home/hudson/hudson-slave/workspace/Lucene-Solr-Tests-4.x-java7/solr/example/lib/jetty-jmx-8.1.2.v20120308.jar:/usr/home/hudson/hudson-slave/workspace/Lucene-Solr-Tests-4.x-java7/solr/example/lib/jetty-security-8.1.2.v20120308.jar:/usr/home/hudson/hudson-slave/workspace/Lucene-Solr-Tests-4.x-java7/solr/example/lib/jetty-server-8.1.2.v20120308.jar:/usr/home/hudson/hudson-slave/workspace/Lucene-Solr-Tests-4.x-java7/solr/example/lib/jetty-servlet-8.1.2.v20120308.jar:/usr/home/hudson/hudson-slave/workspace/Lucene-Solr-Tests-4.x-java7/solr/example/lib/jetty-util-8.1.2.v20120308.jar:/usr/home/hudson/hudson-slave/workspace/Lucene-Solr-Tests-4.x-java7/solr/example/lib/jetty-webapp-8.1.2.v20120308.jar:/usr/home/hudson/hudson-slave/workspace/Lucene-Solr-Tests-4.x-java7/solr/example/lib/jetty-xml-8.1.2.v20120308.jar:/usr/home/hudson/hudson-slave/workspace/Lucene-Solr-Tests-4.x-java7/solr/example/lib/servlet-api-3.0.jar:/usr/home/hudson/hudson-slave/workspace/Lucene-Solr-Tests-4.x-java7/solr/example/example-DIH/solr/db/lib/hsqldb-1.8.0.10.jar:/usr/home/hudson/hudson-slave/workspace/Lucene-Solr-Tests-4.x-java7/lucene/build/core/classes/java:/usr/home/hudson/hudson-slave/workspace/Lucene-Solr-Tests-4.x-java7/lucene/test-framework/lib/junit-4.10.jar:/usr/home/hudson/hudson-slave/workspace/Lucene-Solr-Tests-4.x-java7/lucene/test-framework/lib/randomizedtesting-runner-2.0.1.jar:/home/hudson/hudson-slave/tools/Ant/ant-1.8.2/lib/ant-launcher.jar:/home/hudson/.ant/lib/ivy-2.2.0.jar:/home/hudson/hudson-slave/tools/Ant/ant-1.8.2/lib/ant-apache-regexp.jar:/home/hudson/hudson-slave/tools/Ant/ant-1.8.2/lib/ant-junit.jar:/home/hudson/hudson-slave/tools/Ant/ant-1.8.2/lib/ant-apache-bsf.jar:/home/hudson/hudson-slave/tools/Ant/ant-1.8.2/lib/ant-commons-net.jar:/home/hudson/hudson-slave/tools/Ant/ant-1.8.2/lib/ant-antlr.jar:/home/hudson/hudson-slave/tools/Ant/ant-1.8.2/lib/ant-apache-log4j.jar:/home/hudson/hudson-slave/tools/Ant/ant-1.8.2/lib/ant-commons-logging.jar:/home/hudson/hudson-slave/tools/Ant/ant-1.8.2/lib/ant-apache-xalan2.jar:/home/hudson/hudson-slave/tools/Ant/ant-1.8.2/lib/ant-apache-oro.jar:/home/hudson/hudson-slave/tools/Ant/ant-1.8.2/lib/ant-junit4.jar:/home/hudson/hudson-slave/tools/Ant/ant-1.8.2/lib/ant-netrexx.jar:/home/hudson/hudson-slave/tools/Ant/ant-1.8.2/lib/ant-swing.jar:/home/hudson/hudson-slave/tools/Ant/ant-1.8.2/lib/ant-javamail.jar:/home/hudson/hudson-slave/tools/Ant/ant-1.8.2/lib/ant-jsch.jar:/home/hudson/hudson-slave/tools/Ant/ant-1.8.2/lib/ant-jmf.jar:/home/hudson/hudson-slave/tools/Ant/ant-1.8.2/lib/ant.jar:/home/hudson/hudson-slave/tools/Ant/ant-1.8.2/lib/ant-apache-bcel.jar:/home/hudson/hudson-slave/tools/Ant/ant-1.8.2/lib/ant-jai.jar:/home/hudson/hudson-slave/tools/Ant/ant-1.8.2/lib/ant-testutil.jar:/home/hudson/hudson-slave/tools/Ant/ant-1.8.2/lib/ant-apache-resolver.jar:/home/hudson/hudson-slave/tools/Ant/ant-1.8.2/lib/ant-jdepend.jar:/usr/local/openjdk7/lib/tools.jar:/home/hudson/.ivy2/cache/com.carrotsearch.randomizedtesting/junit4-ant/jars/junit4-ant-2.0.1.jar
[junit4:junit4]   2> 145 T53 oaz.Environment.logEnv Server environment:java.library.path=/usr/local/openjdk7/jre/lib/amd64/server:/usr/local/openjdk7/jre/lib/amd64:/usr/local/openjdk7/jre/../lib/amd64:/usr/local/openjdk6/jre/lib/amd64/server:/usr/local/openjdk6/jre/lib/amd64:/usr/local/openjdk6/jre/../lib/amd64:/usr/java/packages/lib/amd64:/lib:/usr/lib:/usr/local/lib
[junit4:junit4]   2> 146 T53 oaz.Environment.logEnv Server environment:java.io.tmpdir=.
[junit4:junit4]   2> 146 T53 oaz.Environment.logEnv Server environment:java.compiler=<NA>
[junit4:junit4]   2> 146 T53 oaz.Environment.logEnv Server environment:os.name=FreeBSD
[junit4:junit4]   2> 147 T53 oaz.Environment.logEnv Server environment:os.arch=amd64
[junit4:junit4]   2> 147 T53 oaz.Environment.logEnv Server environment:os.version=9.0-RELEASE
[junit4:junit4]   2> 147 T53 oaz.Environment.logEnv Server environment:user.name=hudson
[junit4:junit4]   2> 148 T53 oaz.Environment.logEnv Server environment:user.home=/home/hudson
[junit4:junit4]   2> 148 T53 oaz.Environment.logEnv Server environment:user.dir=/usr/home/hudson/hudson-slave/workspace/Lucene-Solr-Tests-4.x-java7/solr/build/solr-core/test/J1
[junit4:junit4]   2> 218 T53 oazs.ZooKeeperServer.setTickTime tickTime set to 1000
[junit4:junit4]   2> 264 T53 oazs.NIOServerCnxn$Factory.<init> binding to port 0.0.0.0/0.0.0.0:0
[junit4:junit4]   2> 318 T52 oasc.ZkTestServer.run start zk server on port:18135
[junit4:junit4]   2> 379 T53 oazsp.FileTxnSnapLog.save Snapshotting: 0
[junit4:junit4]   2> 400 T52 oaz.Environment.logEnv Client environment:zookeeper.version=3.3.6-1366786, built on 07/29/2012 06:22 GMT
[junit4:junit4]   2> 401 T52 oaz.Environment.logEnv Client environment:host.name=lucene.zones.apache.org
[junit4:junit4]   2> 401 T52 oaz.Environment.logEnv Client environment:java.version=1.7.0_06
[junit4:junit4]   2> 402 T52 oaz.Environment.logEnv Client environment:java.vendor=Oracle Corporation
[junit4:junit4]   2> 402 T52 oaz.Environment.logEnv Client environment:java.home=/usr/local/openjdk7/jre
[junit4:junit4]   2> 402 T52 oaz.Environment.logEnv Client environment:java.class.path=/usr/home/hudson/hudson-slave/workspace/Lucene-Solr-Tests-4.x-java7/solr/build/solr-core/classes/test:/usr/home/hudson/hudson-slave/workspace/Lucene-Solr-Tests-4.x-java7/solr/build/solr-test-framework/classes/java:/usr/home/hudson/hudson-slave/workspace/Lucene-Solr-Tests-4.x-java7/solr/build/solr-core/test-files:/usr/home/hudson/hudson-slave/workspace/Lucene-Solr-Tests-4.x-java7/lucene/build/codecs/classes/java:/usr/home/hudson/hudson-slave/workspace/Lucene-Solr-Tests-4.x-java7/lucene/build/test-framework/classes/java:/usr/home/hudson/hudson-slave/workspace/Lucene-Solr-Tests-4.x-java7/solr/build/solr-solrj/classes/java:/usr/home/hudson/hudson-slave/workspace/Lucene-Solr-Tests-4.x-java7/solr/build/solr-core/classes/java:/usr/home/hudson/hudson-slave/workspace/Lucene-Solr-Tests-4.x-java7/lucene/build/analysis/common/lucene-analyzers-common-4.0-SNAPSHOT.jar:/usr/home/hudson/hudson-slave/workspace/Lucene-Solr-Tests-4.x-java7/lucene/build/analysis/kuromoji/lucene-analyzers-kuromoji-4.0-SNAPSHOT.jar:/usr/home/hudson/hudson-slave/workspace/Lucene-Solr-Tests-4.x-java7/lucene/build/analysis/phonetic/lucene-analyzers-phonetic-4.0-SNAPSHOT.jar:/usr/home/hudson/hudson-slave/workspace/Lucene-Solr-Tests-4.x-java7/lucene/build/highlighter/lucene-highlighter-4.0-SNAPSHOT.jar:/usr/home/hudson/hudson-slave/workspace/Lucene-Solr-Tests-4.x-java7/lucene/build/memory/lucene-memory-4.0-SNAPSHOT.jar:/usr/home/hudson/hudson-slave/workspace/Lucene-Solr-Tests-4.x-java7/lucene/build/misc/lucene-misc-4.0-SNAPSHOT.jar:/usr/home/hudson/hudson-slave/workspace/Lucene-Solr-Tests-4.x-java7/lucene/build/spatial/lucene-spatial-4.0-SNAPSHOT.jar:/usr/home/hudson/hudson-slave/workspace/Lucene-Solr-Tests-4.x-java7/lucene/build/suggest/lucene-suggest-4.0-SNAPSHOT.jar:/usr/home/hudson/hudson-slave/workspace/Lucene-Solr-Tests-4.x-java7/lucene/build/grouping/lucene-grouping-4.0-SNAPSHOT.jar:/usr/home/hudson/hudson-slave/workspace/Lucene-Solr-Tests-4.x-java7/lucene/build/queries/lucene-queries-4.0-SNAPSHOT.jar:/usr/home/hudson/hudson-slave/workspace/Lucene-Solr-Tests-4.x-java7/lucene/build/queryparser/lucene-queryparser-4.0-SNAPSHOT.jar:/usr/home/hudson/hudson-slave/workspace/Lucene-Solr-Tests-4.x-java7/solr/core/lib/commons-cli-1.2.jar:/usr/home/hudson/hudson-slave/workspace/Lucene-Solr-Tests-4.x-java7/solr/core/lib/commons-codec-1.7.jar:/usr/home/hudson/hudson-slave/workspace/Lucene-Solr-Tests-4.x-java7/solr/core/lib/commons-fileupload-1.2.1.jar:/usr/home/hudson/hudson-slave/workspace/Lucene-Solr-Tests-4.x-java7/solr/core/lib/commons-lang-2.6.jar:/usr/home/hudson/hudson-slave/workspace/Lucene-Solr-Tests-4.x-java7/solr/core/lib/easymock-2.2.jar:/usr/home/hudson/hudson-slave/workspace/Lucene-Solr-Tests-4.x-java7/solr/core/lib/guava-r05.jar:/usr/home/hudson/hudson-slave/workspace/Lucene-Solr-Tests-4.x-java7/solr/core/lib/javax.servlet-api-3.0.1.jar:/usr/home/hudson/hudson-slave/workspace/Lucene-Solr-Tests-4.x-java7/solr/core/lib/spatial4j-0.3.jar:/usr/home/hudson/hudson-slave/workspace/Lucene-Solr-Tests-4.x-java7/solr/solrj/lib/commons-io-2.1.jar:/usr/home/hudson/hudson-slave/workspace/Lucene-Solr-Tests-4.x-java7/solr/solrj/lib/httpclient-4.1.3.jar:/usr/home/hudson/hudson-slave/workspace/Lucene-Solr-Tests-4.x-java7/solr/solrj/lib/httpcore-4.1.4.jar:/usr/home/hudson/hudson-slave/workspace/Lucene-Solr-Tests-4.x-java7/solr/solrj/lib/httpmime-4.1.3.jar:/usr/home/hudson/hudson-slave/workspace/Lucene-Solr-Tests-4.x-java7/solr/solrj/lib/jcl-over-slf4j-1.6.4.jar:/usr/home/hudson/hudson-slave/workspace/Lucene-Solr-Tests-4.x-java7/solr/solrj/lib/log4j-over-slf4j-1.6.4.jar:/usr/home/hudson/hudson-slave/workspace/Lucene-Solr-Tests-4.x-java7/solr/solrj/lib/slf4j-api-1.6.4.jar:/usr/home/hudson/hudson-slave/workspace/Lucene-Solr-Tests-4.x-java7/solr/solrj/lib/slf4j-jdk14-1.6.4.jar:/usr/home/hudson/hudson-slave/workspace/Lucene-Solr-Tests-4.x-java7/solr/solrj/lib/wstx-asl-3.2.7.jar:/usr/home/hudson/hudson-slave/workspace/Lucene-Solr-Tests-4.x-java7/solr/solrj/lib/zookeeper-3.3.6.jar:/usr/home/hudson/hudson-slave/workspace/Lucene-Solr-Tests-4.x-java7/solr/example/lib/jetty-continuation-8.1.2.v20120308.jar:/usr/home/hudson/hudson-slave/workspace/Lucene-Solr-Tests-4.x-java7/solr/example/lib/jetty-deploy-8.1.2.v20120308.jar:/usr/home/hudson/hudson-slave/workspace/Lucene-Solr-Tests-4.x-java7/solr/example/lib/jetty-http-8.1.2.v20120308.jar:/usr/home/hudson/hudson-slave/workspace/Lucene-Solr-Tests-4.x-java7/solr/example/lib/jetty-io-8.1.2.v20120308.jar:/usr/home/hudson/hudson-slave/workspace/Lucene-Solr-Tests-4.x-java7/solr/example/lib/jetty-jmx-8.1.2.v20120308.jar:/usr/home/hudson/hudson-slave/workspace/Lucene-Solr-Tests-4.x-java7/solr/example/lib/jetty-security-8.1.2.v20120308.jar:/usr/home/hudson/hudson-slave/workspace/Lucene-Solr-Tests-4.x-java7/solr/example/lib/jetty-server-8.1.2.v20120308.jar:/usr/home/hudson/hudson-slave/workspace/Lucene-Solr-Tests-4.x-java7/solr/example/lib/jetty-servlet-8.1.2.v20120308.jar:/usr/home/hudson/hudson-slave/workspace/Lucene-Solr-Tests-4.x-java7/solr/example/lib/jetty-util-8.1.2.v20120308.jar:/usr/home/hudson/hudson-slave/workspace/Lucene-Solr-Tests-4.x-java7/solr/example/lib/jetty-webapp-8.1.2.v20120308.jar:/usr/home/hudson/hudson-slave/workspace/Lucene-Solr-Tests-4.x-java7/solr/example/lib/jetty-xml-8.1.2.v20120308.jar:/usr/home/hudson/hudson-slave/workspace/Lucene-Solr-Tests-4.x-java7/solr/example/lib/servlet-api-3.0.jar:/usr/home/hudson/hudson-slave/workspace/Lucene-Solr-Tests-4.x-java7/solr/example/example-DIH/solr/db/lib/hsqldb-1.8.0.10.jar:/usr/home/hudson/hudson-slave/workspace/Lucene-Solr-Tests-4.x-java7/lucene/build/core/classes/java:/usr/home/hudson/hudson-slave/workspace/Lucene-Solr-Tests-4.x-java7/lucene/test-framework/lib/junit-4.10.jar:/usr/home/hudson/hudson-slave/workspace/Lucene-Solr-Tests-4.x-java7/lucene/test-framework/lib/randomizedtesting-runner-2.0.1.jar:/home/hudson/hudson-slave/tools/Ant/ant-1.8.2/lib/ant-launcher.jar:/home/hudson/.ant/lib/ivy-2.2.0.jar:/home/hudson/hudson-slave/tools/Ant/ant-1.8.2/lib/ant-apache-regexp.jar:/home/hudson/hudson-slave/tools/Ant/ant-1.8.2/lib/ant-junit.jar:/home/hudson/hudson-slave/tools/Ant/ant-1.8.2/lib/ant-apache-bsf.jar:/home/hudson/hudson-slave/tools/Ant/ant-1.8.2/lib/ant-commons-net.jar:/home/hudson/hudson-slave/tools/Ant/ant-1.8.2/lib/ant-antlr.jar:/home/hudson/hudson-slave/tools/Ant/ant-1.8.2/lib/ant-apache-log4j.jar:/home/hudson/hudson-slave/tools/Ant/ant-1.8.2/lib/ant-commons-logging.jar:/home/hudson/hudson-slave/tools/Ant/ant-1.8.2/lib/ant-apache-xalan2.jar:/home/hudson/hudson-slave/tools/Ant/ant-1.8.2/lib/ant-apache-oro.jar:/home/hudson/hudson-slave/tools/Ant/ant-1.8.2/lib/ant-junit4.jar:/home/hudson/hudson-slave/tools/Ant/ant-1.8.2/lib/ant-netrexx.jar:/home/hudson/hudson-slave/tools/Ant/ant-1.8.2/lib/ant-swing.jar:/home/hudson/hudson-slave/tools/Ant/ant-1.8.2/lib/ant-javamail.jar:/home/hudson/hudson-slave/tools/Ant/ant-1.8.2/lib/ant-jsch.jar:/home/hudson/hudson-slave/tools/Ant/ant-1.8.2/lib/ant-jmf.jar:/home/hudson/hudson-slave/tools/Ant/ant-1.8.2/lib/ant.jar:/home/hudson/hudson-slave/tools/Ant/ant-1.8.2/lib/ant-apache-bcel.jar:/home/hudson/hudson-slave/tools/Ant/ant-1.8.2/lib/ant-jai.jar:/home/hudson/hudson-slave/tools/Ant/ant-1.8.2/lib/ant-testutil.jar:/home/hudson/hudson-slave/tools/Ant/ant-1.8.2/lib/ant-apache-resolver.jar:/home/hudson/hudson-slave/tools/Ant/ant-1.8.2/lib/ant-jdepend.jar:/usr/local/openjdk7/lib/tools.jar:/home/hudson/.ivy2/cache/com.carrotsearch.randomizedtesting/junit4-ant/jars/junit4-ant-2.0.1.jar
[junit4:junit4]   2> 403 T52 oaz.Environment.logEnv Client environment:java.library.path=/usr/local/openjdk7/jre/lib/amd64/server:/usr/local/openjdk7/jre/lib/amd64:/usr/local/openjdk7/jre/../lib/amd64:/usr/local/openjdk6/jre/lib/amd64/server:/usr/local/openjdk6/jre/lib/amd64:/usr/local/openjdk6/jre/../lib/amd64:/usr/java/packages/lib/amd64:/lib:/usr/lib:/usr/local/lib
[junit4:junit4]   2> 404 T52 oaz.Environment.logEnv Client environment:java.io.tmpdir=.
[junit4:junit4]   2> 404 T52 oaz.Environment.logEnv Client environment:java.compiler=<NA>
[junit4:junit4]   2> 405 T52 oaz.Environment.logEnv Client environment:os.name=FreeBSD
[junit4:junit4]   2> 405 T52 oaz.Environment.logEnv Client environment:os.arch=amd64
[junit4:junit4]   2> 405 T52 oaz.Environment.logEnv Client environment:os.version=9.0-RELEASE
[junit4:junit4]   2> 406 T52 oaz.Environment.logEnv Client environment:user.name=hudson
[junit4:junit4]   2> 406 T52 oaz.Environment.logEnv Client environment:user.home=/home/hudson
[junit4:junit4]   2> 406 T52 oaz.Environment.logEnv Client environment:user.dir=/usr/home/hudson/hudson-slave/workspace/Lucene-Solr-Tests-4.x-java7/solr/build/solr-core/test/J1
[junit4:junit4]   2> 411 T52 oaz.ZooKeeper.<init> Initiating client connection, connectString=127.0.0.1:18135 sessionTimeout=10000 watcher=org.apache.solr.common.cloud.ConnectionManager@f08f2a
[junit4:junit4]   2> 465 T56 oaz.ClientCnxn$SendThread.startConnect Opening socket connection to server /127.0.0.1:18135
[junit4:junit4]   2> 465 T52 oascc.ConnectionManager.waitForConnected Waiting for client to connect to ZooKeeper
[junit4:junit4]   2> 469 T56 oaz.ClientCnxn$SendThread.primeConnection Socket connection established to localhost/127.0.0.1:18135, initiating session
[junit4:junit4]   2> 469 T54 oazs.NIOServerCnxn$Factory.run Accepted socket connection from /140.211.11.196:21789
[junit4:junit4]   2> 489 T54 oazs.NIOServerCnxn.doIO WARNING Exception causing close of session 0x0 due to java.io.IOException: ZooKeeperServer not running
[junit4:junit4]   2> 489 T54 oazs.NIOServerCnxn.closeSock Closed socket connection for client /140.211.11.196:21789 (no session established for client)
[junit4:junit4]   2> 490 T56 oaz.ClientCnxn$SendThread.run Unable to read additional data from server sessionid 0x0, likely server has closed socket, closing socket connection and attempting reconnect
[junit4:junit4]   2> 2078 T56 oaz.ClientCnxn$SendThread.startConnect Opening socket connection to server localhost/127.0.0.1:18135
[junit4:junit4]   2> 2079 T56 oaz.ClientCnxn$SendThread.primeConnection Socket connection established to localhost/127.0.0.1:18135, initiating session
[junit4:junit4]   2> 2080 T54 oazs.NIOServerCnxn$Factory.run Accepted socket connection from /140.211.11.196:13934
[junit4:junit4]   2> 2081 T54 oazs.NIOServerCnxn.readConnectRequest Client attempting to establish new session at /140.211.11.196:13934
[junit4:junit4]   2> 2105 T58 oazsp.FileTxnLog.append Creating new log file: log.1
[junit4:junit4]   2> 2180 T58 oazs.NIOServerCnxn.finishSessionInit Established session 0x139e3d1d6370000 with negotiated timeout 10000 for client /140.211.11.196:13934
[junit4:junit4]   2> 2180 T56 oaz.ClientCnxn$SendThread.readConnectResult Session establishment complete on server localhost/127.0.0.1:18135, sessionid = 0x139e3d1d6370000, negotiated timeout = 10000
[junit4:junit4]   2> 2186 T57 oascc.ConnectionManager.process Watcher org.apache.solr.common.cloud.ConnectionManager@f08f2a name:ZooKeeperConnection Watcher:127.0.0.1:18135 got event WatchedEvent state:SyncConnected type:None path:null path:null type:None
[junit4:junit4]   2> 2186 T52 oascc.ConnectionManager.waitForConnected Client is connected to ZooKeeper
[junit4:junit4]   2> 2192 T52 oascc.SolrZkClient.makePath makePath: /solr
[junit4:junit4]   2> 2296 T59 oazs.PrepRequestProcessor.pRequest Processed session termination for sessionid: 0x139e3d1d6370000
[junit4:junit4]   2> 2298 T57 oaz.ClientCnxn$EventThread.run EventThread shut down
[junit4:junit4]   2> 2298 T52 oaz.ZooKeeper.close Session: 0x139e3d1d6370000 closed
[junit4:junit4]   2> 2299 T54 oazs.NIOServerCnxn.closeSock Closed socket connection for client /140.211.11.196:13934 which had sessionid 0x139e3d1d6370000
[junit4:junit4]   2> 2299 T52 oaz.ZooKeeper.<init> Initiating client connection, connectString=127.0.0.1:18135/solr sessionTimeout=10000 watcher=org.apache.solr.common.cloud.ConnectionManager@1430cf28
[junit4:junit4]   2> 2300 T60 oaz.ClientCnxn$SendThread.startConnect Opening socket connection to server /127.0.0.1:18135
[junit4:junit4]   2> 2300 T52 oascc.ConnectionManager.waitForConnected Waiting for client to connect to ZooKeeper
[junit4:junit4]   2> 2301 T60 oaz.ClientCnxn$SendThread.primeConnection Socket connection established to localhost/127.0.0.1:18135, initiating session
[junit4:junit4]   2> 2302 T54 oazs.NIOServerCnxn$Factory.run Accepted socket connection from /140.211.11.196:62089
[junit4:junit4]   2> 2302 T54 oazs.NIOServerCnxn.readConnectRequest Client attempting to establish new session at /140.211.11.196:62089
[junit4:junit4]   2> 2305 T58 oazs.NIOServerCnxn.finishSessionInit Established session 0x139e3d1d6370001 with negotiated timeout 10000 for client /140.211.11.196:62089
[junit4:junit4]   2> 2305 T60 oaz.ClientCnxn$SendThread.readConnectResult Session establishment complete on server localhost/127.0.0.1:18135, sessionid = 0x139e3d1d6370001, negotiated timeout = 10000
[junit4:junit4]   2> 2305 T61 oascc.ConnectionManager.process Watcher org.apache.solr.common.cloud.ConnectionManager@1430cf28 name:ZooKeeperConnection Watcher:127.0.0.1:18135/solr got event WatchedEvent state:SyncConnected type:None path:null path:null type:None
[junit4:junit4]   2> 2306 T52 oascc.ConnectionManager.waitForConnected Client is connected to ZooKeeper
[junit4:junit4]   2> 2338 T52 oascc.SolrZkClient.makePath makePath: /collections/collection1
[junit4:junit4]   2> 2350 T52 oascc.SolrZkClient.makePath makePath: /collections/collection1/shards
[junit4:junit4]   2> 2362 T52 oascc.SolrZkClient.makePath makePath: /collections/control_collection
[junit4:junit4]   2> 2368 T52 oascc.SolrZkClient.makePath makePath: /collections/control_collection/shards
[junit4:junit4]   2> 2374 T52 oasc.AbstractZkTestCase.putConfig put /usr/home/hudson/hudson-slave/workspace/Lucene-Solr-Tests-4.x-java7/solr/build/solr-core/test-files/solr/collection1/conf/solrconfig.xml to /configs/conf1/solrconfig.xml
[junit4:junit4]   2> 2417 T52 oascc.SolrZkClient.makePath makePath: /configs/conf1/solrconfig.xml
[junit4:junit4]   2> 2435 T52 oasc.AbstractZkTestCase.putConfig put /usr/home/hudson/hudson-slave/workspace/Lucene-Solr-Tests-4.x-java7/solr/build/solr-core/test-files/solr/collection1/conf/schema.xml to /configs/conf1/schema.xml
[junit4:junit4]   2> 2437 T52 oascc.SolrZkClient.makePath makePath: /configs/conf1/schema.xml
[junit4:junit4]   2> 2548 T52 oasc.AbstractZkTestCase.putConfig put /usr/home/hudson/hudson-slave/workspace/Lucene-Solr-Tests-4.x-java7/solr/build/solr-core/test-files/solr/collection1/conf/solrconfig.xml to /configs/conf1/solrconfig.xml
[junit4:junit4]   2> 2550 T52 oascc.SolrZkClient.makePath makePath: /configs/conf1/solrconfig.xml
[junit4:junit4]   2> 2578 T52 oasc.AbstractZkTestCase.putConfig put /usr/home/hudson/hudson-slave/workspace/Lucene-Solr-Tests-4.x-java7/solr/build/solr-core/test-files/solr/collection1/conf/stopwords.txt to /configs/conf1/stopwords.txt
[junit4:junit4]   2> 2580 T52 oascc.SolrZkClient.makePath makePath: /configs/conf1/stopwords.txt
[junit4:junit4]   2> 2592 T52 oasc.AbstractZkTestCase.putConfig put /usr/home/hudson/hudson-slave/workspace/Lucene-Solr-Tests-4.x-java7/solr/build/solr-core/test-files/solr/collection1/conf/protwords.txt to /configs/conf1/protwords.txt
[junit4:junit4]   2> 2594 T52 oascc.SolrZkClient.makePath makePath: /configs/conf1/protwords.txt
[junit4:junit4]   2> 2600 T52 oasc.AbstractZkTestCase.putConfig put /usr/home/hudson/hudson-slave/workspace/Lucene-Solr-Tests-4.x-java7/solr/build/solr-core/test-files/solr/collection1/conf/currency.xml to /configs/conf1/currency.xml
[junit4:junit4]   2> 2602 T52 oascc.SolrZkClient.makePath makePath: /configs/conf1/currency.xml
[junit4:junit4]   2> 2608 T52 oasc.AbstractZkTestCase.putConfig put /usr/home/hudson/hudson-slave/workspace/Lucene-Solr-Tests-4.x-java7/solr/build/solr-core/test-files/solr/collection1/conf/open-exchange-rates.json to /configs/conf1/open-exchange-rates.json
[junit4:junit4]   2> 2610 T52 oascc.SolrZkClient.makePath makePath: /configs/conf1/open-exchange-rates.json
[junit4:junit4]   2> 2618 T52 oasc.AbstractZkTestCase.putConfig put /usr/home/hudson/hudson-slave/workspace/Lucene-Solr-Tests-4.x-java7/solr/build/solr-core/test-files/solr/collection1/conf/mapping-ISOLatin1Accent.txt to /configs/conf1/mapping-ISOLatin1Accent.txt
[junit4:junit4]   2> 2621 T52 oascc.SolrZkClient.makePath makePath: /configs/conf1/mapping-ISOLatin1Accent.txt
[junit4:junit4]   2> 2633 T52 oasc.AbstractZkTestCase.putConfig put /usr/home/hudson/hudson-slave/workspace/Lucene-Solr-Tests-4.x-java7/solr/build/solr-core/test-files/solr/collection1/conf/old_synonyms.txt to /configs/conf1/old_synonyms.txt
[junit4:junit4]   2> 2634 T52 oascc.SolrZkClient.makePath makePath: /configs/conf1/old_synonyms.txt
[junit4:junit4]   2> 2645 T52 oasc.AbstractZkTestCase.putConfig put /usr/home/hudson/hudson-slave/workspace/Lucene-Solr-Tests-4.x-java7/solr/build/solr-core/test-files/solr/collection1/conf/synonyms.txt to /configs/conf1/synonyms.txt
[junit4:junit4]   2> 2647 T52 oascc.SolrZkClient.makePath makePath: /configs/conf1/synonyms.txt
[junit4:junit4]   2> 2659 T59 oazs.PrepRequestProcessor.pRequest Processed session termination for sessionid: 0x139e3d1d6370001
[junit4:junit4]   2> 2661 T61 oaz.ClientCnxn$EventThread.run EventThread shut down
[junit4:junit4]   2> 2661 T54 oazs.NIOServerCnxn.closeSock Closed socket connection for client /140.211.11.196:62089 which had sessionid 0x139e3d1d6370001
[junit4:junit4]   2> 2661 T52 oaz.ZooKeeper.close Session: 0x139e3d1d6370001 closed
[junit4:junit4]   2> 3637 T52 oejs.Server.doStart jetty-8.1.2.v20120308
[junit4:junit4]   2> 4274 T52 oejs.AbstractConnector.doStart Started SocketConnector@0.0.0.0:12784
[junit4:junit4]   2> 4322 T52 oasc.SolrResourceLoader.locateSolrHome JNDI not configured for solr (NoInitialContextEx)
[junit4:junit4]   2> 4323 T52 oasc.SolrResourceLoader.locateSolrHome using system property solr.solr.home: /usr/home/hudson/hudson-slave/workspace/Lucene-Solr-Tests-4.x-java7/solr/build/solr-core/test-files/solr
[junit4:junit4]   2> 4324 T52 oasc.SolrResourceLoader.<init> new SolrResourceLoader for deduced Solr Home: '/usr/home/hudson/hudson-slave/workspace/Lucene-Solr-Tests-4.x-java7/solr/build/solr-core/test-files/solr/'
[junit4:junit4]   2> 4388 T52 oass.SolrDispatchFilter.init SolrDispatchFilter.init()
[junit4:junit4]   2> 4389 T52 oasc.SolrResourceLoader.locateSolrHome JNDI not configured for solr (NoInitialContextEx)
[junit4:junit4]   2> 4390 T52 oasc.SolrResourceLoader.locateSolrHome using system property solr.solr.home: /usr/home/hudson/hudson-slave/workspace/Lucene-Solr-Tests-4.x-java7/solr/build/solr-core/test-files/solr
[junit4:junit4]   2> 4390 T52 oasc.CoreContainer$Initializer.initialize looking for solr.xml: /usr/home/hudson/hudson-slave/workspace/Lucene-Solr-Tests-4.x-java7/solr/build/solr-core/test-files/solr/solr.xml
[junit4:junit4]   2> 4391 T52 oasc.CoreContainer.<init> New CoreContainer 1384085424
[junit4:junit4]   2> 4393 T52 oasc.CoreContainer.load Loading CoreContainer using Solr Home: '/usr/home/hudson/hudson-slave/workspace/Lucene-Solr-Tests-4.x-java7/solr/build/solr-core/test-files/solr/'
[junit4:junit4]   2> 4394 T52 oasc.SolrResourceLoader.<init> new SolrResourceLoader for directory: '/usr/home/hudson/hudson-slave/workspace/Lucene-Solr-Tests-4.x-java7/solr/build/solr-core/test-files/solr/'
[junit4:junit4]   2> 4446 T52 oasc.CoreContainer.load Registering Log Listener
[junit4:junit4]   2> 4477 T52 oasc.CoreContainer.initZooKeeper Zookeeper client=127.0.0.1:18135/solr
[junit4:junit4]   2> 4527 T52 oaz.ZooKeeper.<init> Initiating client connection, connectString=127.0.0.1:18135/solr sessionTimeout=5000 watcher=org.apache.solr.common.cloud.ConnectionManager@722e89f2
[junit4:junit4]   2> 4529 T72 oaz.ClientCnxn$SendThread.startConnect Opening socket connection to server /127.0.0.1:18135
[junit4:junit4]   2> 4529 T52 oascc.ConnectionManager.waitForConnected Waiting for client to connect to ZooKeeper
[junit4:junit4]   2> 4532 T72 oaz.ClientCnxn$SendThread.primeConnection Socket connection established to localhost/127.0.0.1:18135, initiating session
[junit4:junit4]   2> 4532 T54 oazs.NIOServerCnxn$Factory.run Accepted socket connection from /140.211.11.196:30357
[junit4:junit4]   2> 4533 T54 oazs.NIOServerCnxn.readConnectRequest Client attempting to establish new session at /140.211.11.196:30357
[junit4:junit4]   2> 4538 T58 oazs.NIOServerCnxn.finishSessionInit Established session 0x139e3d1d6370002 with negotiated timeout 5000 for client /140.211.11.196:30357
[junit4:junit4]   2> 4538 T72 oaz.ClientCnxn$SendThread.readConnectResult Session establishment complete on server localhost/127.0.0.1:18135, sessionid = 0x139e3d1d6370002, negotiated timeout = 5000
[junit4:junit4]   2> 4540 T73 oascc.ConnectionManager.process Watcher org.apache.solr.common.cloud.ConnectionManager@722e89f2 name:ZooKeeperConnection Watcher:127.0.0.1:18135/solr got event WatchedEvent state:SyncConnected type:None path:null path:null type:None
[junit4:junit4]   2> 4540 T52 oascc.ConnectionManager.waitForConnected Client is connected to ZooKeeper
[junit4:junit4]   2> 4577 T59 oazs.PrepRequestProcessor.pRequest Got user-level KeeperException when processing sessionid:0x139e3d1d6370002 type:create cxid:0x2 zxid:0xfffffffffffffffe txntype:unknown reqpath:n/a Error Path:/solr/overseer Error:KeeperErrorCode = NodeExists for /solr/overseer
[junit4:junit4]   2> 4599 T52 oascc.SolrZkClient.makePath makePath: /live_nodes
[junit4:junit4]   2> 4606 T52 oasc.ZkController.createEphemeralLiveNode Register node as live in ZooKeeper:/live_nodes/127.0.0.1:12784_solr
[junit4:junit4]   2> 4620 T59 oazs.PrepRequestProcessor.pRequest Got user-level KeeperException when processing sessionid:0x139e3d1d6370002 type:delete cxid:0x7 zxid:0xfffffffffffffffe txntype:unknown reqpath:n/a Error Path:/solr/live_nodes/127.0.0.1:12784_solr Error:KeeperErrorCode = NoNode for /solr/live_nodes/127.0.0.1:12784_solr
[junit4:junit4]   2> 4622 T52 oascc.SolrZkClient.makePath makePath: /live_nodes/127.0.0.1:12784_solr
[junit4:junit4]   2> 4629 T52 oashc.HttpShardHandlerFactory.getParameter Setting socketTimeout to: 0
[junit4:junit4]   2> 4630 T52 oashc.HttpShardHandlerFactory.getParameter Setting urlScheme to: http://
[junit4:junit4]   2> 4631 T52 oashc.HttpShardHandlerFactory.getParameter Setting connTimeout to: 0
[junit4:junit4]   2> 4632 T52 oashc.HttpShardHandlerFactory.getParameter Setting maxConnectionsPerHost to: 20
[junit4:junit4]   2> 4633 T52 oashc.HttpShardHandlerFactory.getParameter Setting corePoolSize to: 0
[junit4:junit4]   2> 4634 T52 oashc.HttpShardHandlerFactory.getParameter Setting maximumPoolSize to: 2147483647
[junit4:junit4]   2> 4636 T52 oashc.HttpShardHandlerFactory.getParameter Setting maxThreadIdleTime to: 5
[junit4:junit4]   2> 4637 T52 oashc.HttpShardHandlerFactory.getParameter Setting sizeOfQueue to: -1
[junit4:junit4]   2> 4638 T52 oashc.HttpShardHandlerFactory.getParameter Setting fairnessPolicy to: false
[junit4:junit4]   2> 4639 T52 oascsi.HttpClientUtil.createClient Creating new http client, config:maxConnectionsPerHost=20&maxConnections=10000&socketTimeout=0&connTimeout=0&retry=false
[junit4:junit4]   2> 4675 T52 oascc.SolrZkClient.makePath makePath: /overseer_elect/election
[junit4:junit4]   2> 4718 T59 oazs.PrepRequestProcessor.pRequest Got user-level KeeperException when processing sessionid:0x139e3d1d6370002 type:delete cxid:0x15 zxid:0xfffffffffffffffe txntype:unknown reqpath:n/a Error Path:/solr/overseer_elect/leader Error:KeeperErrorCode = NoNode for /solr/overseer_elect/leader
[junit4:junit4]   2> 4731 T52 oascc.SolrZkClient.makePath makePath: /overseer_elect/leader
[junit4:junit4]   2> 4739 T52 oasc.Overseer.start Overseer (id=88352158092034050-127.0.0.1:12784_solr-n_0000000000) starting
[junit4:junit4]   2> 4741 T59 oazs.PrepRequestProcessor.pRequest Got user-level KeeperException when processing sessionid:0x139e3d1d6370002 type:create cxid:0x1a zxid:0xfffffffffffffffe txntype:unknown reqpath:n/a Error Path:/solr/overseer Error:KeeperErrorCode = NodeExists for /solr/overseer
[junit4:junit4]   2> 4773 T59 oazs.PrepRequestProcessor.pRequest Got user-level KeeperException when processing sessionid:0x139e3d1d6370002 type:create cxid:0x1b zxid:0xfffffffffffffffe txntype:unknown reqpath:n/a Error Path:/solr/overseer Error:KeeperErrorCode = NodeExists for /solr/overseer
[junit4:junit4]   2> 4776 T59 oazs.PrepRequestProcessor.pRequest Got user-level KeeperException when processing sessionid:0x139e3d1d6370002 type:create cxid:0x1c zxid:0xfffffffffffffffe txntype:unknown reqpath:n/a Error Path:/solr/overseer Error:KeeperErrorCode = NodeExists for /solr/overseer
[junit4:junit4]   2> 4787 T59 oazs.PrepRequestProcessor.pRequest Got user-level KeeperException when processing sessionid:0x139e3d1d6370002 type:create cxid:0x1d zxid:0xfffffffffffffffe txntype:unknown reqpath:n/a Error Path:/solr/overseer Error:KeeperErrorCode = NodeExists for /solr/overseer
[junit4:junit4]   2> 4790 T75 oasc.OverseerCollectionProcessor.run Process current queue of collection creations
[junit4:junit4]   2> 4791 T52 oascc.SolrZkClient.makePath makePath: /clusterstate.json
[junit4:junit4]   2> 4799 T52 oascc.ZkStateReader.createClusterStateWatchersAndUpdate Updating cluster state from ZooKeeper... 
[junit4:junit4]   2> 4854 T74 oasc.Overseer$ClusterStateUpdater.run Starting to work on the main queue
[junit4:junit4]   2> 4936 T52 oasc.CoreContainer.create Creating SolrCore 'collection1' using instanceDir: /usr/home/hudson/hudson-slave/workspace/Lucene-Solr-Tests-4.x-java7/solr/build/solr-core/test-files/solr/collection1
[junit4:junit4]   2> 4937 T52 oasc.ZkController.createCollectionZkNode Check for collection zkNode:control_collection
[junit4:junit4]   2> 4939 T52 oasc.ZkController.createCollectionZkNode Collection zkNode exists
[junit4:junit4]   2> 4940 T52 oasc.ZkController.readConfigName Load collection config from:/collections/control_collection
[junit4:junit4]   2> 4946 T52 oasc.SolrResourceLoader.<init> new SolrResourceLoader for directory: '/usr/home/hudson/hudson-slave/workspace/Lucene-Solr-Tests-4.x-java7/solr/build/solr-core/test-files/solr/collection1/'
[junit4:junit4]   2> 4949 T52 oasc.SolrResourceLoader.replaceClassLoader Adding 'file:/usr/home/hudson/hudson-slave/workspace/Lucene-Solr-Tests-4.x-java7/solr/build/solr-core/test-files/solr/collection1/lib/classes/' to classloader
[junit4:junit4]   2> 4951 T52 oasc.SolrResourceLoader.replaceClassLoader Adding 'file:/usr/home/hudson/hudson-slave/workspace/Lucene-Solr-Tests-4.x-java7/solr/build/solr-core/test-files/solr/collection1/lib/README' to classloader
[junit4:junit4]   2> 5351 T52 oasc.SolrConfig.<init> Using Lucene MatchVersion: LUCENE_40
[junit4:junit4]   2> 5547 T52 oasc.SolrConfig.<init> Loaded SolrConfig: solrconfig.xml
[junit4:junit4]   2> 5649 T52 oass.IndexSchema.readSchema Reading Solr Schema
[junit4:junit4]   2> 5682 T52 oass.IndexSchema.readSchema Schema name=test
[junit4:junit4]   2> 6890 T52 oass.OpenExchangeRatesOrgProvider.init Initialized with rates=open-exchange-rates.json, refreshInterval=1440.
[junit4:junit4]   2> 6906 T52 oass.IndexSchema.readSchema default search field in schema is text
[junit4:junit4]   2> 6911 T52 oass.IndexSchema.readSchema unique key field: id
[junit4:junit4]   2> 6944 T52 oass.FileExchangeRateProvider.reload Reloading exchange rates from file currency.xml
[junit4:junit4]   2> 6952 T52 oass.FileExchangeRateProvider.reload Reloading exchange rates from file currency.xml
[junit4:junit4]   2> 6959 T52 oass.OpenExchangeRatesOrgProvider.reload Reloading exchange rates from open-exchange-rates.json
[junit4:junit4]   2> 6962 T52 oass.OpenExchangeRatesOrgProvider.reload Reloading exchange rates from open-exchange-rates.json
[junit4:junit4]   2> 6965 T52 oasc.SolrCore.<init> [collection1] Opening new SolrCore at /usr/home/hudson/hudson-slave/workspace/Lucene-Solr-Tests-4.x-java7/solr/build/solr-core/test-files/solr/collection1/, dataDir=./org.apache.solr.cloud.BasicDistributedZk2Test-1348146943103/control/data/
[junit4:junit4]   2> 6970 T52 oasc.JmxMonitoredMap.<init> JMX monitoring is enabled. Adding Solr mbeans to JMX Server: com.sun.jmx.mbeanserver.JmxMBeanServer@170f0424
[junit4:junit4]   2> 7021 T52 oasc.SolrCore.getNewIndexDir WARNING New index directory detected: old=null new=./org.apache.solr.cloud.BasicDistributedZk2Test-1348146943103/control/data/index/
[junit4:junit4]   2> 7023 T52 oasc.SolrCore.initIndex WARNING [collection1] Solr index directory './org.apache.solr.cloud.BasicDistributedZk2Test-1348146943103/control/data/index' doesn't exist. Creating new index...
[junit4:junit4]   2> 7024 T52 oasc.CachingDirectoryFactory.get return new directory for /usr/home/hudson/hudson-slave/workspace/Lucene-Solr-Tests-4.x-java7/solr/build/solr-core/test/J1/./org.apache.solr.cloud.BasicDistributedZk2Test-1348146943103/control/data/index forceNew:false
[junit4:junit4]   2> 7040 T52 oasc.SolrDeletionPolicy.onCommit SolrDeletionPolicy.onCommit: commits:num=1
[junit4:junit4]   2> 		commit{dir=NRTCachingDirectory(org.apache.lucene.store.NIOFSDirectory@/usr/home/hudson/hudson-slave/workspace/Lucene-Solr-Tests-4.x-java7/solr/build/solr-core/test/J1/org.apache.solr.cloud.BasicDistributedZk2Test-1348146943103/control/data/index lockFactory=org.apache.lucene.store.NativeFSLockFactory@231d8cb8; maxCacheMB=48.0 maxMergeSizeMB=4.0),segFN=segments_1,generation=1,filenames=[segments_1]
[junit4:junit4]   2> 7041 T52 oasc.SolrDeletionPolicy.updateCommits newest commit = 1
[junit4:junit4]   2> 7044 T52 oasc.SolrCore.initWriters created xml: solr.XMLResponseWriter
[junit4:junit4]   2> 7048 T52 oasup.UpdateRequestProcessorChain.init inserting DistributedUpdateProcessorFactory into updateRequestProcessorChain "dedupe"
[junit4:junit4]   2> 7049 T52 oasup.UpdateRequestProcessorChain.init inserting DistributedUpdateProcessorFactory into updateRequestProcessorChain "dedupe-allfields"
[junit4:junit4]   2> 7051 T52 oasup.UpdateRequestProcessorChain.init inserting DistributedUpdateProcessorFactory into updateRequestProcessorChain "stored_sig"
[junit4:junit4]   2> 7052 T52 oasup.UpdateRequestProcessorChain.init inserting DistributedUpdateProcessorFactory into updateRequestProcessorChain "uniq-fields"
[junit4:junit4]   2> 7054 T52 oasup.UpdateRequestProcessorChain.init inserting DistributedUpdateProcessorFactory into updateRequestProcessorChain "distrib-dup-test-chain-implicit"
[junit4:junit4]   2> 7055 T52 oasc.RequestHandlers.initHandlersFromConfig adding lazy requestHandler: solr.ReplicationHandler
[junit4:junit4]   2> 7056 T52 oasc.RequestHandlers.initHandlersFromConfig created /replication: solr.ReplicationHandler
[junit4:junit4]   2> 7058 T52 oasc.RequestHandlers.initHandlersFromConfig created standard: solr.StandardRequestHandler
[junit4:junit4]   2> 7059 T52 oasc.RequestHandlers.initHandlersFromConfig created /get: solr.RealTimeGetHandler
[junit4:junit4]   2> 7060 T52 oasc.RequestHandlers.initHandlersFromConfig created dismax: solr.SearchHandler
[junit4:junit4]   2> 7062 T52 oasc.RequestHandlers.initHandlersFromConfig created mock: org.apache.solr.core.MockQuerySenderListenerReqHandler
[junit4:junit4]   2> 7063 T52 oasc.RequestHandlers.initHandlersFromConfig created /admin/: org.apache.solr.handler.admin.AdminHandlers
[junit4:junit4]   2> 7065 T52 oasc.RequestHandlers.initHandlersFromConfig created defaults: solr.StandardRequestHandler
[junit4:junit4]   2> 7066 T52 oasc.RequestHandlers.initHandlersFromConfig adding lazy requestHandler: solr.StandardRequestHandler
[junit4:junit4]   2> 7067 T52 oasc.RequestHandlers.initHandlersFromConfig created lazy: solr.StandardRequestHandler
[junit4:junit4]   2> 7069 T52 oasc.RequestHandlers.initHandlersFromConfig created /update: solr.UpdateRequestHandler
[junit4:junit4]   2> 7070 T52 oasc.RequestHandlers.initHandlersFromConfig created /terms: org.apache.solr.handler.component.SearchHandler
[junit4:junit4]   2> 7071 T52 oasc.RequestHandlers.initHandlersFromConfig created spellCheckCompRH: org.apache.solr.handler.component.SearchHandler
[junit4:junit4]   2> 7073 T52 oasc.RequestHandlers.initHandlersFromConfig created spellCheckCompRH_Direct: org.apache.solr.handler.component.SearchHandler
[junit4:junit4]   2> 7074 T52 oasc.RequestHandlers.initHandlersFromConfig created spellCheckWithWordbreak: org.apache.solr.handler.component.SearchHandler
[junit4:junit4]   2> 7075 T52 oasc.RequestHandlers.initHandlersFromConfig created spellCheckWithWordbreak_Direct: org.apache.solr.handler.component.SearchHandler
[junit4:junit4]   2> 7077 T52 oasc.RequestHandlers.initHandlersFromConfig created spellCheckCompRH1: org.apache.solr.handler.component.SearchHandler
[junit4:junit4]   2> 7078 T52 oasc.RequestHandlers.initHandlersFromConfig created tvrh: org.apache.solr.handler.component.SearchHandler
[junit4:junit4]   2> 7080 T52 oasc.RequestHandlers.initHandlersFromConfig created /mlt: solr.MoreLikeThisHandler
[junit4:junit4]   2> 7081 T52 oasc.RequestHandlers.initHandlersFromConfig created /debug/dump: solr.DumpRequestHandler
[junit4:junit4]   2> 7089 T52 oashl.XMLLoader.init xsltCacheLifetimeSeconds=60
[junit4:junit4]   2> 7098 T52 oasc.SolrCore.initDeprecatedSupport WARNING solrconfig.xml uses deprecated <admin/gettableFiles>, Please update your config to use the ShowFileRequestHandler.
[junit4:junit4]   2> 7103 T52 oasc.SolrCore.initDeprecatedSupport WARNING adding ShowFileRequestHandler with hidden files: [SCHEMA.XML, OLD_SYNONYMS.TXT, STOPWORDS.TXT, PROTWORDS.TXT, OPEN-EXCHANGE-RATES.JSON, SYNONYMS.TXT, CURRENCY.XML, MAPPING-ISOLATIN1ACCENT.TXT]
[junit4:junit4]   2> 7114 T52 oass.SolrIndexSearcher.<init> Opening Searcher@45c9d650 main
[junit4:junit4]   2> 7154 T52 oasu.CommitTracker.<init> Hard AutoCommit: disabled
[junit4:junit4]   2> 7155 T52 oasu.CommitTracker.<init> Soft AutoCommit: disabled
[junit4:junit4]   2> 7156 T52 oashc.SpellCheckComponent.inform Initializing spell checkers
[junit4:junit4]   2> 7195 T52 oass.DirectSolrSpellChecker.init init: {name=direct,classname=DirectSolrSpellChecker,field=lowerfilt,minQueryLength=3}
[junit4:junit4]   2> 7282 T76 oasc.SolrCore.registerSearcher [collection1] Registered new searcher Searcher@45c9d650 main{StandardDirectoryReader(segments_1:1)}
[junit4:junit4]   2> 7294 T59 oazs.PrepRequestProcessor.pRequest Got user-level KeeperException when processing sessionid:0x139e3d1d6370002 type:create cxid:0x5c zxid:0xfffffffffffffffe txntype:unknown reqpath:n/a Error Path:/solr/overseer/queue Error:KeeperErrorCode = NoNode for /solr/overseer/queue
[junit4:junit4]   2> 7308 T52 oasc.CoreContainer.register registering core: collection1
[junit4:junit4]   2> 7309 T52 oasc.ZkController.register Register shard - core:collection1 address:http://127.0.0.1:12784/solr shardId:control_shard
[junit4:junit4]   2> 7349 T52 oascsi.HttpClientUtil.createClient Creating new http client, config:maxConnections=10000&maxConnectionsPerHost=20&connTimeout=30000&socketTimeout=30000&retry=false
[junit4:junit4]   2> 7376 T52 oascc.SolrZkClient.makePath makePath: /collections/control_collection/leader_elect/control_shard/election
[junit4:junit4]   2> 7399 T59 oazs.PrepRequestProcessor.pRequest Got user-level KeeperException when processing sessionid:0x139e3d1d6370002 type:delete cxid:0x6c zxid:0xfffffffffffffffe txntype:unknown reqpath:n/a Error Path:/solr/collections/control_collection/leaders Error:KeeperErrorCode = NoNode for /solr/collections/control_collection/leaders
[junit4:junit4]   2> 7403 T52 oasc.ShardLeaderElectionContext.runLeaderProcess Running the leader process.
[junit4:junit4]   2> 7405 T59 oazs.PrepRequestProcessor.pRequest Got user-level KeeperException when processing sessionid:0x139e3d1d6370002 type:create cxid:0x6f zxid:0xfffffffffffffffe txntype:unknown reqpath:n/a Error Path:/solr/overseer Error:KeeperErrorCode = NodeExists for /solr/overseer
[junit4:junit4]   2> 7407 T74 oascc.ZkStateReader.updateClusterState Updating cloud state from ZooKeeper... 
[junit4:junit4]   2> 7436 T59 oazs.PrepRequestProcessor.pRequest Got user-level KeeperException when processing sessionid:0x139e3d1d6370002 type:create cxid:0x73 zxid:0xfffffffffffffffe txntype:unknown reqpath:n/a Error Path:/solr/overseer/queue-work Error:KeeperErrorCode = NoNode for /solr/overseer/queue-work
[junit4:junit4]   2> 7487 T73 oascc.ZkStateReader$2.process A cluster state change has occurred - updating...
[junit4:junit4]   2> 7911 T52 oasc.ShardLeaderElectionContext.waitForReplicasToComeUp Enough replicas found to continue.
[junit4:junit4]   2> 7913 T52 oasc.ShardLeaderElectionContext.runLeaderProcess I may be the new leader - try and sync
[junit4:junit4]   2> 7914 T52 oasc.SyncStrategy.sync Sync replicas to http://127.0.0.1:12784/solr/collection1/
[junit4:junit4]   2> 7915 T52 oasc.SyncStrategy.syncReplicas Sync Success - now sync replicas to me
[junit4:junit4]   2> 7916 T52 oasc.SyncStrategy.syncToMe http://127.0.0.1:12784/solr/collection1/ has no replicas
[junit4:junit4]   2> 7917 T52 oasc.ShardLeaderElectionContext.runLeaderProcess I am the new leader: http://127.0.0.1:12784/solr/collection1/
[junit4:junit4]   2> 7919 T52 oascc.SolrZkClient.makePath makePath: /collections/control_collection/leaders/control_shard
[junit4:junit4]   2> 7933 T59 oazs.PrepRequestProcessor.pRequest Got user-level KeeperException when processing sessionid:0x139e3d1d6370002 type:create cxid:0x91 zxid:0xfffffffffffffffe txntype:unknown reqpath:n/a Error Path:/solr/overseer Error:KeeperErrorCode = NodeExists for /solr/overseer
[junit4:junit4]   2> 8013 T74 oascc.ZkStateReader.updateClusterState Updating cloud state from ZooKeeper... 
[junit4:junit4]   2> 8029 T73 oascc.ZkStateReader$2.process A cluster state change has occurred - updating...
[junit4:junit4]   2> 8041 T52 oasc.ZkController.register We are http://127.0.0.1:12784/solr/collection1/ and leader is http://127.0.0.1:12784/solr/collection1/
[junit4:junit4]   2> 8050 T52 oasc.ZkController.register No LogReplay needed for core=collection1 baseURL=http://127.0.0.1:12784/solr
[junit4:junit4]   2> 8051 T52 oasc.ZkController.checkRecovery I am the leader, no recovery necessary
[junit4:junit4]   2> 8057 T52 oascc.ZkStateReader.updateClusterState Updating cloud state from ZooKeeper... 
[junit4:junit4]   2> 8059 T52 oass.SolrDispatchFilter.init user.dir=/usr/home/hudson/hudson-slave/workspace/Lucene-Solr-Tests-4.x-java7/solr/build/solr-core/test/J1
[junit4:junit4]   2> 8060 T52 oass.SolrDispatchFilter.init SolrDispatchFilter.init() done
[junit4:junit4]   2> 8236 T52 oascsi.HttpClientUtil.createClient Creating new http client, config:maxConnections=128&maxConnectionsPerHost=32&followRedirects=false
[junit4:junit4]   2> 8541 T74 oascc.ZkStateReader.updateClusterState Updating cloud state from ZooKeeper... 
[junit4:junit4]   2> 8574 T73 oascc.ZkStateReader$2.process A cluster state change has occurred - updating...
[junit4:junit4]   2> 8586 T52 oejs.Server.doStart jetty-8.1.2.v20120308
[junit4:junit4]   2> 8602 T52 oejs.AbstractConnector.doStart Started SocketConnector@0.0.0.0:14978
[junit4:junit4]   2> 8603 T52 oasc.SolrResourceLoader.locateSolrHome JNDI not configured for solr (NoInitialContextEx)
[junit4:junit4]   2> 8604 T52 oasc.SolrResourceLoader.locateSolrHome using system property solr.solr.home: /usr/home/hudson/hudson-slave/workspace/Lucene-Solr-Tests-4.x-java7/solr/build/solr-core/test/J1/./solrtest-jetty1-1348146951376
[junit4:junit4]   2> 8605 T52 oasc.SolrResourceLoader.<init> new SolrResourceLoader for deduced Solr Home: '/usr/home/hudson/hudson-slave/workspace/Lucene-Solr-Tests-4.x-java7/solr/build/solr-core/test/J1/./solrtest-jetty1-1348146951376/'
[junit4:junit4]   2> 8672 T52 oass.SolrDispatchFilter.init SolrDispatchFilter.init()
[junit4:junit4]   2> 8673 T52 oasc.SolrResourceLoader.locateSolrHome JNDI not configured for solr (NoInitialContextEx)
[junit4:junit4]   2> 8674 T52 oasc.SolrResourceLoader.locateSolrHome using system property solr.solr.home: /usr/home/hudson/hudson-slave/workspace/Lucene-Solr-Tests-4.x-java7/solr/build/solr-core/test/J1/./solrtest-jetty1-1348146951376
[junit4:junit4]   2> 8675 T52 oasc.CoreContainer$Initializer.initialize looking for solr.xml: /usr/home/hudson/hudson-slave/workspace/Lucene-Solr-Tests-4.x-java7/solr/build/solr-core/test/J1/./solrtest-jetty1-1348146951376/solr.xml
[junit4:junit4]   2> 8675 T52 oasc.CoreContainer.<init> New CoreContainer 864753675
[junit4:junit4]   2> 8676 T52 oasc.CoreContainer.load Loading CoreContainer using Solr Home: '/usr/home/hudson/hudson-slave/workspace/Lucene-Solr-Tests-4.x-java7/solr/build/solr-core/test/J1/./solrtest-jetty1-1348146951376/'
[junit4:junit4]   2> 8677 T52 oasc.SolrResourceLoader.<init> new SolrResourceLoader for directory: '/usr/home/hudson/hudson-slave/workspace/Lucene-Solr-Tests-4.x-java7/solr/build/solr-core/test/J1/./solrtest-jetty1-1348146951376/'
[junit4:junit4]   2> 8733 T52 oasc.CoreContainer.load Registering Log Listener
[junit4:junit4]   2> 8762 T52 oasc.CoreContainer.initZooKeeper Zookeeper client=127.0.0.1:18135/solr
[junit4:junit4]   2> 8763 T52 oaz.ZooKeeper.<init> Initiating client connection, connectString=127.0.0.1:18135/solr sessionTimeout=5000 watcher=org.apache.solr.common.cloud.ConnectionManager@6ada79a9
[junit4:junit4]   2> 8765 T86 oaz.ClientCnxn$SendThread.startConnect Opening socket connection to server /127.0.0.1:18135
[junit4:junit4]   2> 8765 T52 oascc.ConnectionManager.waitForConnected Waiting for client to connect to ZooKeeper
[junit4:junit4]   2> 8771 T86 oaz.ClientCnxn$SendThread.primeConnection Socket connection established to localhost/127.0.0.1:18135, initiating session
[junit4:junit4]   2> 8772 T54 oazs.NIOServerCnxn$Factory.run Accepted socket connection from /140.211.11.196:46401
[junit4:junit4]   2> 8774 T54 oazs.NIOServerCnxn.readConnectRequest Client attempting to establish new session at /140.211.11.196:46401
[junit4:junit4]   2> 8777 T58 oazs.NIOServerCnxn.finishSessionInit Established session 0x139e3d1d6370003 with negotiated timeout 5000 for client /140.211.11.196:46401
[junit4:junit4]   2> 8777 T86 oaz.ClientCnxn$SendThread.readConnectResult Session establishment complete on server localhost/127.0.0.1:18135, sessionid = 0x139e3d1d6370003, negotiated timeout = 5000
[junit4:junit4]   2> 8778 T87 oascc.ConnectionManager.process Watcher org.apache.solr.common.cloud.ConnectionManager@6ada79a9 name:ZooKeeperConnection Watcher:127.0.0.1:18135/solr got event WatchedEvent state:SyncConnected type:None path:null path:null type:None
[junit4:junit4]   2> 8779 T52 oascc.ConnectionManager.waitForConnected Client is connected to ZooKeeper
[junit4:junit4]   2> 8781 T59 oazs.PrepRequestProcessor.pRequest Got user-level KeeperException when processing sessionid:0x139e3d1d6370003 type:create cxid:0x1 zxid:0xfffffffffffffffe txntype:unknown reqpath:n/a Error Path:/solr/overseer Error:KeeperErrorCode = NodeExists for /solr/overseer
[junit4:junit4]   2> 8828 T59 oazs.PrepRequestProcessor.pRequest Got user-level KeeperException when processing sessionid:0x139e3d1d6370003 type:create cxid:0x2 zxid:0xfffffffffffffffe txntype:unknown reqpath:n/a Error Path:/solr/overseer Error:KeeperErrorCode = NodeExists for /solr/overseer
[junit4:junit4]   2> 8832 T52 oasc.ZkController.createEphemeralLiveNode Register node as live in ZooKeeper:/live_nodes/127.0.0.1:14978_solr
[junit4:junit4]   2> 8834 T59 oazs.PrepRequestProcessor.pRequest Got user-level KeeperException when processing sessionid:0x139e3d1d6370003 type:delete cxid:0x4 zxid:0xfffffffffffffffe txntype:unknown reqpath:n/a Error Path:/solr/live_nodes/127.0.0.1:14978_solr Error:KeeperErrorCode = NoNode for /solr/live_nodes/127.0.0.1:14978_solr
[junit4:junit4]   2> 8838 T52 oascc.SolrZkClient.makePath makePath: /live_nodes/127.0.0.1:14978_solr
[junit4:junit4]   2> 8869 T73 oascc.ZkStateReader$3.process Updating live nodes
[junit4:junit4]   2> 8871 T52 oashc.HttpShardHandlerFactory.getParameter Setting socketTimeout to: 0
[junit4:junit4]   2> 8872 T52 oashc.HttpShardHandlerFactory.getParameter Setting urlScheme to: http://
[junit4:junit4]   2> 8873 T52 oashc.HttpShardHandlerFactory.getParameter Setting connTimeout to: 0
[junit4:junit4]   2> 8874 T52 oashc.HttpShardHandlerFactory.getParameter Setting maxConnectionsPerHost to: 20
[junit4:junit4]   2> 8875 T52 oashc.HttpShardHandlerFactory.getParameter Setting corePoolSize to: 0
[junit4:junit4]   2> 8876 T52 oashc.HttpShardHandlerFactory.getParameter Setting maximumPoolSize to: 2147483647
[junit4:junit4]   2> 8877 T52 oashc.HttpShardHandlerFactory.getParameter Setting maxThreadIdleTime to: 5
[junit4:junit4]   2> 8878 T52 oashc.HttpShardHandlerFactory.getParameter Setting sizeOfQueue to: -1
[junit4:junit4]   2> 8879 T52 oashc.HttpShardHandlerFactory.getParameter Setting fairnessPolicy to: false
[junit4:junit4]   2> 8880 T52 oascsi.HttpClientUtil.createClient Creating new http client, config:maxConnectionsPerHost=20&maxConnections=10000&socketTimeout=0&connTimeout=0&retry=false
[junit4:junit4]   2> 8922 T52 oascc.ZkStateReader.createClusterStateWatchersAndUpdate Updating cluster state from ZooKeeper... 
[junit4:junit4]   2> 8948 T52 oasc.CoreContainer.create Creating SolrCore 'collection1' using instanceDir: /usr/home/hudson/hudson-slave/workspace/Lucene-Solr-Tests-4.x-java7/solr/build/solr-core/test/J1/./solrtest-jetty1-1348146951376/collection1
[junit4:junit4]   2> 8949 T52 oasc.ZkController.createCollectionZkNode Check for collection zkNode:collection1
[junit4:junit4]   2> 8962 T52 oasc.ZkController.createCollectionZkNode Collection zkNode exists
[junit4:junit4]   2> 8963 T52 oasc.ZkController.readConfigName Load collection config from:/collections/collection1
[junit4:junit4]   2> 8968 T52 oasc.SolrResourceLoader.<init> new SolrResourceLoader for directory: '/usr/home/hudson/hudson-slave/workspace/Lucene-Solr-Tests-4.x-java7/solr/build/solr-core/test/J1/./solrtest-jetty1-1348146951376/collection1/'
[junit4:junit4]   2> 8971 T52 oasc.SolrResourceLoader.replaceClassLoader Adding 'file:/usr/home/hudson/hudson-slave/workspace/Lucene-Solr-Tests-4.x-java7/solr/build/solr-core/test/J1/solrtest-jetty1-1348146951376/collection1/lib/README' to classloader
[junit4:junit4]   2> 8973 T52 oasc.SolrResourceLoader.replaceClassLoader Adding 'file:/usr/home/hudson/hudson-slave/workspace/Lucene-Solr-Tests-4.x-java7/solr/build/solr-core/test/J1/solrtest-jetty1-1348146951376/collection1/lib/classes/' to classloader
[junit4:junit4]   2> 9084 T52 oasc.SolrConfig.<init> Using Lucene MatchVersion: LUCENE_40
[junit4:junit4]   2> 9240 T52 oasc.SolrConfig.<init> Loaded SolrConfig: solrconfig.xml
[junit4:junit4]   2> 9343 T52 oass.IndexSchema.readSchema Reading Solr Schema
[junit4:junit4]   2> 9371 T52 oass.IndexSchema.readSchema Schema name=test
[junit4:junit4]   2> 10626 T52 oass.OpenExchangeRatesOrgProvider.init Initialized with rates=open-exchange-rates.json, refreshInterval=1440.
[junit4:junit4]   2> 10651 T52 oass.IndexSchema.readSchema default search field in schema is text
[junit4:junit4]   2> 10660 T52 oass.IndexSchema.readSchema unique key field: id
[junit4:junit4]   2> 10720 T52 oass.FileExchangeRateProvider.reload Reloading exchange rates from file currency.xml
[junit4:junit4]   2> 10737 T52 oass.FileExchangeRateProvider.reload Reloading exchange rates from file currency.xml
[junit4:junit4]   2> 10748 T52 oass.OpenExchangeRatesOrgProvider.reload Reloading exchange rates from open-exchange-rates.json
[junit4:junit4]   2> 10753 T52 oass.OpenExchangeRatesOrgProvider.reload Reloading exchange rates from open-exchange-rates.json
[junit4:junit4]   2> 10757 T52 oasc.SolrCore.<init> [collection1] Opening new SolrCore at /usr/home/hudson/hudson-slave/workspace/Lucene-Solr-Tests-4.x-java7/solr/build/solr-core/test/J1/./solrtest-jetty1-1348146951376/collection1/, dataDir=./org.apache.solr.cloud.BasicDistributedZk2Test-1348146943103/jetty1/
[junit4:junit4]   2> 10758 T52 oasc.JmxMonitoredMap.<init> JMX monitoring is enabled. Adding Solr mbeans to JMX Server: com.sun.jmx.mbeanserver.JmxMBeanServer@170f0424
[junit4:junit4]   2> 10761 T52 oasc.SolrCore.getNewIndexDir WARNING New index directory detected: old=null new=./org.apache.solr.cloud.BasicDistributedZk2Test-1348146943103/jetty1/index/
[junit4:junit4]   2> 10763 T52 oasc.SolrCore.initIndex WARNING [collection1] Solr index directory './org.apache.solr.cloud.BasicDistributedZk2Test-1348146943103/jetty1/index' doesn't exist. Creating new index...
[junit4:junit4]   2> 10765 T52 oasc.CachingDirectoryFactory.get return new directory for /usr/home/hudson/hudson-slave/workspace/Lucene-Solr-Tests-4.x-java7/solr/build/solr-core/test/J1/./org.apache.solr.cloud.BasicDistributedZk2Test-1348146943103/jetty1/index forceNew:false
[junit4:junit4]   2> 10781 T52 oasc.SolrDeletionPolicy.onCommit SolrDeletionPolicy.onCommit: commits:num=1
[junit4:junit4]   2> 		commit{dir=NRTCachingDirectory(org.apache.lucene.store.NIOFSDirectory@/usr/home/hudson/hudson-slave/workspace/Lucene-Solr-Tests-4.x-java7/solr/build/solr-core/test/J1/org.apache.solr.cloud.BasicDistributedZk2Test-1348146943103/jetty1/index lockFactory=org.apache.lucene.store.NativeFSLockFactory@6ef784bf; maxCacheMB=48.0 maxMergeSizeMB=4.0),segFN=segments_1,generation=1,filenames=[segments_1]
[junit4:junit4]   2> 10782 T52 oasc.SolrDeletionPolicy.updateCommits newest commit = 1
[junit4:junit4]   2> 10784 T52 oasc.SolrCore.initWriters created xml: solr.XMLResponseWriter
[junit4:junit4]   2> 10789 T52 oasup.UpdateRequestProcessorChain.init inserting DistributedUpdateProcessorFactory into updateRequestProcessorChain "dedupe"
[junit4:junit4]   2> 10791 T52 oasup.UpdateRequestProcessorChain.init inserting DistributedUpdateProcessorFactory into updateRequestProcessorChain "dedupe-allfields"
[junit4:junit4]   2> 10792 T52 oasup.UpdateRequestProcessorChain.init inserting DistributedUpdateProcessorFactory into updateRequestProcessorChain "stored_sig"
[junit4:junit4]   2> 10793 T52 oasup.UpdateRequestProcessorChain.init inserting DistributedUpdateProcessorFactory into updateRequestProcessorChain "uniq-fields"
[junit4:junit4]   2> 10799 T52 oasup.UpdateRequestProcessorChain.init inserting DistributedUpdateProcessorFactory into updateRequestProcessorChain "distrib-dup-test-chain-implicit"
[junit4:junit4]   2> 10800 T52 oasc.RequestHandlers.initHandlersFromConfig adding lazy requestHandler: solr.ReplicationHandler
[junit4:junit4]   2> 10801 T52 oasc.RequestHandlers.initHandlersFromConfig created /replication: solr.ReplicationHandler
[junit4:junit4]   2> 10802 T52 oasc.RequestHandlers.initHandlersFromConfig created standard: solr.StandardRequestHandler
[junit4:junit4]   2> 10803 T52 oasc.RequestHandlers.initHandlersFromConfig created /get: solr.RealTimeGetHandler
[junit4:junit4]   2> 10805 T52 oasc.RequestHandlers.initHandlersFromConfig created dismax: solr.SearchHandler
[junit4:junit4]   2> 10806 T52 oasc.RequestHandlers.initHandlersFromConfig created mock: org.apache.solr.core.MockQuerySenderListenerReqHandler
[junit4:junit4]   2> 10807 T52 oasc.RequestHandlers.initHandlersFromConfig created /admin/: org.apache.solr.handler.admin.AdminHandlers
[junit4:junit4]   2> 10808 T52 oasc.RequestHandlers.initHandlersFromConfig created defaults: solr.StandardRequestHandler
[junit4:junit4]   2> 10808 T52 oasc.RequestHandlers.initHandlersFromConfig adding lazy requestHandler: solr.StandardRequestHandler
[junit4:junit4]   2> 10809 T52 oasc.RequestHandlers.initHandlersFromConfig created lazy: solr.StandardRequestHandler
[junit4:junit4]   2> 10810 T52 oasc.RequestHandlers.initHandlersFromConfig created /update: solr.UpdateRequestHandler
[junit4:junit4]   2> 10811 T52 oasc.RequestHandlers.initHandlersFromConfig created /terms: org.apache.solr.handler.component.SearchHandler
[junit4:junit4]   2> 10812 T52 oasc.RequestHandlers.initHandlersFromConfig created spellCheckCompRH: org.apache.solr.handler.component.SearchHandler
[junit4:junit4]   2> 10813 T52 oasc.RequestHandlers.initHandlersFromConfig created spellCheckCompRH_Direct: org.apache.solr.handler.component.SearchHandler
[junit4:junit4]   2> 10815 T52 oasc.RequestHandlers.initHandlersFromConfig created spellCheckWithWordbreak: org.apache.solr.handler.component.SearchHandler
[junit4:junit4]   2> 10816 T52 oasc.RequestHandlers.initHandlersFromConfig created spellCheckWithWordbreak_Direct: org.apache.solr.handler.component.SearchHandler
[junit4:junit4]   2> 10817 T52 oasc.RequestHandlers.initHandlersFromConfig created spellCheckCompRH1: org.apache.solr.handler.component.SearchHandler
[junit4:junit4]   2> 10818 T52 oasc.RequestHandlers.initHandlersFromConfig created tvrh: org.apache.solr.handler.component.SearchHandler
[junit4:junit4]   2> 10819 T52 oasc.RequestHandlers.initHandlersFromConfig created /mlt: solr.MoreLikeThisHandler
[junit4:junit4]   2> 10820 T52 oasc.RequestHandlers.initHandlersFromConfig created /debug/dump: solr.DumpRequestHandler
[junit4:junit4]   2> 10828 T52 oashl.XMLLoader.init xsltCacheLifetimeSeconds=60
[junit4:junit4]   2> 10837 T52 oasc.SolrCore.initDeprecatedSupport WARNING solrconfig.xml uses deprecated <admin/gettableFiles>, Please update your config to use the ShowFileRequestHandler.
[junit4:junit4]   2> 10840 T52 oasc.SolrCore.initDeprecatedSupport WARNING adding ShowFileRequestHandler with hidden files: [SCHEMA.XML, OLD_SYNONYMS.TXT, STOPWORDS.TXT, PROTWORDS.TXT, OPEN-EXCHANGE-RATES.JSON, SYNONYMS.TXT, CURRENCY.XML, MAPPING-ISOLATIN1ACCENT.TXT]
[junit4:junit4]   2> 10849 T52 oass.SolrIndexSearcher.<init> Opening Searcher@264ce1fb main
[junit4:junit4]   2> 10852 T52 oasu.CommitTracker.<init> Hard AutoCommit: disabled
[junit4:junit4]   2> 10853 T52 oasu.CommitTracker.<init> Soft AutoCommit: disabled
[junit4:junit4]   2> 10855 T52 oashc.SpellCheckComponent.inform Initializing spell checkers
[junit4:junit4]   2> 10870 T52 oass.DirectSolrSpellChecker.init init: {name=direct,classname=DirectSolrSpellChecker,field=lowerfilt,minQueryLength=3}
[junit4:junit4]   2> 10945 T88 oasc.SolrCore.registerSearcher [collection1] Registered new searcher Searcher@264ce1fb main{StandardDirectoryReader(segments_1:1)}
[junit4:junit4]   2> 11155 T74 oascc.ZkStateReader.updateClusterState Updating cloud state from ZooKeeper... 
[junit4:junit4]   2> 11185 T87 oascc.ZkStateReader$2.process A cluster state change has occurred - updating...
[junit4:junit4]   2> 11186 T73 oascc.ZkStateReader$2.process A cluster state change has occurred - updating...
[junit4:junit4]   2> 11457 T52 oasc.CoreContainer.register registering core: collection1
[junit4:junit4]   2> 11458 T52 oasc.ZkController.register Register shard - core:collection1 address:http://127.0.0.1:14978/solr shardId:shard1
[junit4:junit4]   2> 11460 T52 oascc.SolrZkClient.makePath makePath: /collections/collection1/leader_elect/shard1/election
[junit4:junit4]   2> 11485 T59 oazs.PrepRequestProcessor.pRequest Got user-level KeeperException when processing sessionid:0x139e3d1d6370003 type:delete cxid:0x42 zxid:0xfffffffffffffffe txntype:unknown reqpath:n/a Error Path:/solr/collections/collection1/leaders Error:KeeperErrorCode = NoNode for /solr/collections/collection1/leaders
[junit4:junit4]   2> 11487 T52 oasc.ShardLeaderElectionContext.runLeaderProcess Running the leader process.
[junit4:junit4]   2> 11489 T59 oazs.PrepRequestProcessor.pRequest Got user-level KeeperException when processing sessionid:0x139e3d1d6370003 type:create cxid:0x43 zxid:0xfffffffffffffffe txntype:unknown reqpath:n/a Error Path:/solr/overseer Error:KeeperErrorCode = NodeExists for /solr/overseer
[junit4:junit4]   2> 11494 T52 oasc.ShardLeaderElectionContext.waitForReplicasToComeUp Enough replicas found to continue.
[junit4:junit4]   2> 11495 T52 oasc.ShardLeaderElectionContext.runLeaderProcess I may be the new leader - try and sync
[junit4:junit4]   2> 11496 T52 oasc.SyncStrategy.sync Sync replicas to http://127.0.0.1:14978/solr/collection1/
[junit4:junit4]   2> 11497 T52 oasc.SyncStrategy.syncReplicas Sync Success - now sync replicas to me
[junit4:junit4]   2> 11498 T52 oasc.SyncStrategy.syncToMe http://127.0.0.1:14978/solr/collection1/ has no replicas
[junit4:junit4]   2> 11499 T52 oasc.ShardLeaderElectionContext.runLeaderProcess I am the new leader: http://127.0.0.1:14978/solr/collection1/
[junit4:junit4]   2> 11500 T52 oascc.SolrZkClient.makePath makePath: /collections/collection1/leaders/shard1
[junit4:junit4]   2> 11513 T59 oazs.PrepRequestProcessor.pRequest Got user-level KeeperException when processing sessionid:0x139e3d1d6370003 type:create cxid:0x4d zxid:0xfffffffffffffffe txntype:unknown reqpath:n/a Error Path:/solr/overseer Error:KeeperErrorCode = NodeExists for /solr/overseer
[junit4:junit4]   2> 11697 T74 oascc.ZkStateReader.updateClusterState Updating cloud state from ZooKeeper... 
[junit4:junit4]   2> 11724 T87 oascc.ZkStateReader$2.process A cluster state change has occurred - updating...
[junit4:junit4]   2> 11724 T73 oascc.ZkStateReader$2.process A cluster state change has occurred - updating...
[junit4:junit4]   2> 11772 T52 oasc.ZkController.register We are http://127.0.0.1:14978/solr/collection1/ and leader is http://127.0.0.1:14978/solr/collection1/
[junit4:junit4]   2> 11773 T52 oasc.ZkController.register No LogReplay needed for core=collection1 baseURL=http://127.0.0.1:14978/solr
[junit4:junit4]   2> 11773 T52 oasc.ZkController.checkRecovery I am the leader, no recovery necessary
[junit4:junit4]   2> 11777 T52 oascc.ZkStateReader.updateClusterState Updating cloud state from ZooKeeper... 
[junit4:junit4]   2> 11779 T52 oass.SolrDispatchFilter.init user.dir=/usr/home/hudson/hudson-slave/workspace/Lucene-Solr-Tests-4.x-java7/solr/build/solr-core/test/J1
[junit4:junit4]   2> 11779 T52 oass.SolrDispatchFilter.init SolrDispatchFilter.init() done
[junit4:junit4]   2> 11780 T52 oascsi.HttpClientUtil.createClient Creating new http client, config:maxConnections=128&maxConnectionsPerHost=32&followRedirects=false
[junit4:junit4]   2> 12079 T52 oejs.Server.doStart jetty-8.1.2.v20120308
[junit4:junit4]   2> 12118 T52 oejs.AbstractConnector.doStart Started SocketConnector@0.0.0.0:42159
[junit4:junit4]   2> 12120 T52 oasc.SolrResourceLoader.locateSolrHome JNDI not configured for solr (NoInitialContextEx)
[junit4:junit4]   2> 12121 T52 oasc.SolrResourceLoader.locateSolrHome using system property solr.solr.home: /usr/home/hudson/hudson-slave/workspace/Lucene-Solr-Tests-4.x-java7/solr/build/solr-core/test/J1/./solrtest-jetty2-1348146954901
[junit4:junit4]   2> 12122 T52 oasc.SolrResourceLoader.<init> new SolrResourceLoader for deduced Solr Home: '/usr/home/hudson/hudson-slave/workspace/Lucene-Solr-Tests-4.x-java7/solr/build/solr-core/test/J1/./solrtest-jetty2-1348146954901/'
[junit4:junit4]   2> 12188 T52 oass.SolrDispatchFilter.init SolrDispatchFilter.init()
[junit4:junit4]   2> 12189 T52 oasc.SolrResourceLoader.locateSolrHome JNDI not configured for solr (NoInitialContextEx)
[junit4:junit4]   2> 12190 T52 oasc.SolrResourceLoader.locateSolrHome using system property solr.solr.home: /usr/home/hudson/hudson-slave/workspace/Lucene-Solr-Tests-4.x-java7/solr/build/solr-core/test/J1/./solrtest-jetty2-1348146954901
[junit4:junit4]   2> 12191 T52 oasc.CoreContainer$Initializer.initialize looking for solr.xml: /usr/home/hudson/hudson-slave/workspace/Lucene-Solr-Tests-4.x-java7/solr/build/solr-core/test/J1/./solrtest-jetty2-1348146954901/solr.xml
[junit4:junit4]   2> 12191 T52 oasc.CoreContainer.<init> New CoreContainer 881106514
[junit4:junit4]   2> 12192 T52 oasc.CoreContainer.load Loading CoreContainer using Solr Home: '/usr/home/hudson/hudson-slave/workspace/Lucene-Solr-Tests-4.x-java7/solr/build/solr-core/test/J1/./solrtest-jetty2-1348146954901/'
[junit4:junit4]   2> 12193 T52 oasc.SolrResourceLoader.<init> new SolrResourceLoader for directory: '/usr/home/hudson/hudson-slave/workspace/Lucene-Solr-Tests-4.x-java7/solr/build/solr-core/test/J1/./solrtest-jetty2-1348146954901/'
[junit4:junit4]   2> 12232 T52 oasc.CoreContainer.load Registering Log Listener
[junit4:junit4]   2> 12239 T74 oascc.ZkStateReader.updateClusterState Updating cloud state from ZooKeeper... 
[junit4:junit4]   2> 12251 T52 oasc.CoreContainer.initZooKeeper Zookeeper client=127.0.0.1:18135/solr
[junit4:junit4]   2> 12253 T52 oaz.ZooKeeper.<init> Initiating client connection, connectString=127.0.0.1:18135/solr sessionTimeout=5000 watcher=org.apache.solr.common.cloud.ConnectionManager@220d53c
[junit4:junit4]   2> 12254 T98 oaz.ClientCnxn$SendThread.startConnect Opening socket connection to server /127.0.0.1:18135
[junit4:junit4]   2> 12254 T52 oascc.ConnectionManager.waitForConnected Waiting for client to connect to ZooKeeper
[junit4:junit4]   2> 12256 T98 oaz.ClientCnxn$SendThread.primeConnection Socket connection established to localhost/127.0.0.1:18135, initiating session
[junit4:junit4]   2> 12257 T54 oazs.NIOServerCnxn$Factory.run Accepted socket connection from /140.211.11.196:39933
[junit4:junit4]   2> 12258 T54 oazs.NIOServerCnxn.readConnectRequest Client attempting to establish new session at /140.211.11.196:39933
[junit4:junit4]   2> 12261 T58 oazs.NIOServerCnxn.finishSessionInit Established session 0x139e3d1d6370004 with negotiated timeout 5000 for client /140.211.11.196:39933
[junit4:junit4]   2> 12261 T98 oaz.ClientCnxn$SendThread.readConnectResult Session establishment complete on server localhost/127.0.0.1:18135, sessionid = 0x139e3d1d6370004, negotiated timeout = 5000
[junit4:junit4]   2> 12263 T99 oascc.ConnectionManager.process Watcher org.apache.solr.common.cloud.ConnectionManager@220d53c name:ZooKeeperConnection Watcher:127.0.0.1:18135/solr got event WatchedEvent state:SyncConnected type:None path:null path:null type:None
[junit4:junit4]   2> 12263 T52 oascc.ConnectionManager.waitForConnected Client is connected to ZooKeeper
[junit4:junit4]   2> 12265 T87 oascc.ZkStateReader$2.process A cluster state change has occurred - updating...
[junit4:junit4]   2> 12265 T59 oazs.PrepRequestProcessor.pRequest Got user-level KeeperException when processing sessionid:0x139e3d1d6370004 type:create cxid:0x1 zxid:0xfffffffffffffffe txntype:unknown reqpath:n/a Error Path:/solr/overseer Error:KeeperErrorCode = NodeExists for /solr/overseer
[junit4:junit4]   2> 12265 T73 oascc.ZkStateReader$2.process A cluster state change has occurred - updating...
[junit4:junit4]   2> 12273 T59 oazs.PrepRequestProcessor.pRequest Got user-level KeeperException when processing sessionid:0x139e3d1d6370004 type:create cxid:0x2 zxid:0xfffffffffffffffe txntype:unknown reqpath:n/a Error Path:/solr/overseer Error:KeeperErrorCode = NodeExists for /solr/overseer
[junit4:junit4]   2> 12278 T52 oasc.ZkController.createEphemeralLiveNode Register node as live in ZooKeeper:/live_nodes/127.0.0.1:42159_solr
[junit4:junit4]   2> 12280 T59 oazs.PrepRequestProcessor.pRequest Got user-level KeeperException when processing sessionid:0x139e3d1d6370004 type:delete cxid:0x4 zxid:0xfffffffffffffffe txntype:unknown reqpath:n/a Error Path:/solr/live_nodes/127.0.0.1:42159_solr Error:KeeperErrorCode = NoNode for /solr/live_nodes/127.0.0.1:42159_solr
[junit4:junit4]   2> 12282 T52 oascc.SolrZkClient.makePath makePath: /live_nodes/127.0.0.1:42159_solr
[junit4:junit4]   2> 12288 T87 oascc.ZkStateReader$3.process Updating live nodes
[junit4:junit4]   2> 12289 T73 oascc.ZkStateReader$3.process Updating live nodes
[junit4:junit4]   2> 12292 T52 oashc.HttpShardHandlerFactory.getParameter Setting socketTimeout to: 0
[junit4:junit4]   2> 12294 T52 oashc.HttpShardHandlerFactory.getParameter Setting urlScheme to: http://
[junit4:junit4]   2> 12295 T52 oashc.HttpShardHandlerFactory.getParameter Setting connTimeout to: 0
[junit4:junit4]   2> 12296 T52 oashc.HttpShardHandlerFactory.getParameter Setting maxConnectionsPerHost to: 20
[junit4:junit4]   2> 12297 T52 oashc.HttpShardHandlerFactory.getParameter Setting corePoolSize to: 0
[junit4:junit4]   2> 12298 T52 oashc.HttpShardHandlerFactory.getParameter Setting maximumPoolSize to: 2147483647
[junit4:junit4]   2> 12299 T52 oashc.HttpShardHandlerFactory.getParameter Setting maxThreadIdleTime to: 5
[junit4:junit4]   2> 12300 T52 oashc.HttpShardHandlerFactory.getParameter Setting sizeOfQueue to: -1
[junit4:junit4]   2> 12301 T52 oashc.HttpShardHandlerFactory.getParameter Setting fairnessPolicy to: false
[junit4:junit4]   2> 12302 T52 oascsi.HttpClientUtil.createClient Creating new http client, config:maxConnectionsPerHost=20&maxConnections=10000&socketTimeout=0&connTimeout=0&retry=false
[junit4:junit4]   2> 12331 T52 oascc.ZkStateReader.createClusterStateWatchersAndUpdate Updating cluster state from ZooKeeper... 
[junit4:junit4]   2> 12346 T52 oasc.CoreContainer.create Creating SolrCore 'collection1' using instanceDir: /usr/home/hudson/hudson-slave/workspace/Lucene-Solr-Tests-4.x-java7/solr/build/solr-core/test/J1/./solrtest-jetty2-1348146954901/collection1
[junit4:junit4]   2> 12346 T52 oasc.ZkController.createCollectionZkNode Check for collection zkNode:collection1
[junit4:junit4]   2> 12348 T52 oasc.ZkController.createCollectionZkNode Collection zkNode exists
[junit4:junit4]   2> 12349 T52 oasc.ZkController.readConfigName Load collection config from:/collections/collection1
[junit4:junit4]   2> 12352 T52 oasc.SolrResourceLoader.<init> new SolrResourceLoader for directory: '/usr/home/hudson/hudson-slave/workspace/Lucene-Solr-Tests-4.x-java7/solr/build/solr-core/test/J1/./solrtest-jetty2-1348146954901/collection1/'
[junit4:junit4]   2> 12355 T52 oasc.SolrResourceLoader.replaceClassLoader Adding 'file:/usr/home/hudson/hudson-slave/workspace/Lucene-Solr-Tests-4.x-java7/solr/build/solr-core/test/J1/solrtest-jetty2-1348146954901/collection1/lib/classes/' to classloader
[junit4:junit4]   2> 12356 T52 oasc.SolrResourceLoader.replaceClassLoader Adding 'file:/usr/home/hudson/hudson-slave/workspace/Lucene-Solr-Tests-4.x-java7/solr/build/solr-core/test/J1/solrtest-jetty2-1348146954901/collection1/lib/README' to classloader
[junit4:junit4]   2> 12457 T52 oasc.SolrConfig.<init> Using Lucene MatchVersion: LUCENE_40
[junit4:junit4]   2> 12572 T52 oasc.SolrConfig.<init> Loaded SolrConfig: solrconfig.xml
[junit4:junit4]   2> 12673 T52 oass.IndexSchema.readSchema Reading Solr Schema
[junit4:junit4]   2> 12691 T52 oass.IndexSchema.readSchema Schema name=test
[junit4:junit4]   2> 13848 T52 oass.OpenExchangeRatesOrgProvider.init Initialized with rates=open-exchange-rates.json, refreshInterval=1440.
[junit4:junit4]   2> 13866 T52 oass.IndexSchema.readSchema default search field in schema is text
[junit4:junit4]   2> 13886 T52 oass.IndexSchema.readSchema unique key field: id
[junit4:junit4]   2> 13932 T52 oass.FileExchangeRateProvider.reload Reloading exchange rates from file currency.xml
[junit4:junit4]   2> 13943 T52 oass.FileExchangeRateProvider.reload Reloading exchange rates from file currency.xml
[junit4:junit4]   2> 13954 T52 oass.OpenExchangeRatesOrgProvider.reload Reloading exchange rates from open-exchange-rates.json
[junit4:junit4]   2> 13958 T52 oass.OpenExchangeRatesOrgProvider.reload Reloading exchange rates from open-exchange-rates.json
[junit4:junit4]   2> 13964 T52 oasc.SolrCore.<init> [collection1] Opening new SolrCore at /usr/home/hudson/hudson-slave/workspace/Lucene-Solr-Tests-4.x-java7/solr/build/solr-core/test/J1/./solrtest-jetty2-1348146954901/collection1/, dataDir=./org.apache.solr.cloud.BasicDistributedZk2Test-1348146943103/jetty2/
[junit4:junit4]   2> 13965 T52 oasc.JmxMonitoredMap.<init> JMX monitoring is enabled. Adding Solr mbeans to JMX Server: com.sun.jmx.mbeanserver.JmxMBeanServer@170f0424
[junit4:junit4]   2> 13967 T52 oasc.SolrCore.getNewIndexDir WARNING New index directory detected: old=null new=./org.apache.solr.cloud.BasicDistributedZk2Test-1348146943103/jetty2/index/
[junit4:junit4]   2> 13968 T52 oasc.SolrCore.initIndex WARNING [collection1] Solr index directory './org.apache.solr.cloud.BasicDistributedZk2Test-1348146943103/jetty2/index' doesn't exist. Creating new index...
[junit4:junit4]   2> 13969 T52 oasc.CachingDirectoryFactory.get return new directory for /usr/home/hudson/hudson-slave/workspace/Lucene-Solr-Tests-4.x-java7/solr/build/solr-core/test/J1/./org.apache.solr.cloud.BasicDistributedZk2Test-1348146943103/jetty2/index forceNew:false
[junit4:junit4]   2> 13997 T52 oasc.SolrDeletionPolicy.onCommit SolrDeletionPolicy.onCommit: commits:num=1
[junit4:junit4]   2> 		commit{dir=NRTCachingDirectory(org.apache.lucene.store.NIOFSDirectory@/usr/home/hudson/hudson-slave/workspace/Lucene-Solr-Tests-4.x-java7/solr/build/solr-core/test/J1/org.apache.solr.cloud.BasicDistributedZk2Test-1348146943103/jetty2/index lockFactory=org.apache.lucene.store.NativeFSLockFactory@6f8242b2; maxCacheMB=48.0 maxMergeSizeMB=4.0),segFN=segments_1,generation=1,filenames=[segments_1]
[junit4:junit4]   2> 13998 T52 oasc.SolrDeletionPolicy.updateCommits newest commit = 1
[junit4:junit4]   2> 14000 T52 oasc.SolrCore.initWriters created xml: solr.XMLResponseWriter
[junit4:junit4]   2> 14004 T52 oasup.UpdateRequestProcessorChain.init inserting DistributedUpdateProcessorFactory into updateRequestProcessorChain "dedupe"
[junit4:junit4]   2> 14005 T52 oasup.UpdateRequestProcessorChain.init inserting DistributedUpdateProcessorFactory into updateRequestProcessorChain "dedupe-allfields"
[junit4:junit4]   2> 14006 T52 oasup.UpdateRequestProcessorChain.init inserting DistributedUpdateProcessorFactory into updateRequestProcessorChain "stored_sig"
[junit4:junit4]   2> 14007 T52 oasup.UpdateRequestProcessorChain.init inserting DistributedUpdateProcessorFactory into updateRequestProcessorChain "uniq-fields"
[junit4:junit4]   2> 14008 T52 oasup.UpdateRequestProcessorChain.init inserting DistributedUpdateProcessorFactory into updateRequestProcessorChain "distrib-dup-test-chain-implicit"
[junit4:junit4]   2> 14009 T52 oasc.RequestHandlers.initHandlersFromConfig adding lazy requestHandler: solr.ReplicationHandler
[junit4:junit4]   2> 14010 T52 oasc.RequestHandlers.initHandlersFromConfig created /replication: solr.ReplicationHandler
[junit4:junit4]   2> 14011 T52 oasc.RequestHandlers.initHandlersFromConfig created standard: solr.StandardRequestHandler
[junit4:junit4]   2> 14012 T52 oasc.RequestHandlers.initHandlersFromConfig created /get: solr.RealTimeGetHandler
[junit4:junit4]   2> 14013 T52 oasc.RequestHandlers.initHandlersFromConfig created dismax: solr.SearchHandler
[junit4:junit4]   2> 14014 T52 oasc.RequestHandlers.initHandlersFromConfig created mock: org.apache.solr.core.MockQuerySenderListenerReqHandler
[junit4:junit4]   2> 14015 T52 oasc.RequestHandlers.initHandlersFromConfig created /admin/: org.apache.solr.handler.admin.AdminHandlers
[junit4:junit4]   2> 14016 T52 oasc.RequestHandlers.initHandlersFromConfig created defaults: solr.StandardRequestHandler
[junit4:junit4]   2> 14017 T52 oasc.RequestHandlers.initHandlersFromConfig adding lazy requestHandler: solr.StandardRequestHandler
[junit4:junit4]   2> 14018 T52 oasc.RequestHandlers.initHandlersFromConfig created lazy: solr.StandardRequestHandler
[junit4:junit4]   2> 14019 T52 oasc.RequestHandlers.initHandlersFromConfig created /update: solr.UpdateRequestHandler
[junit4:junit4]   2> 14020 T52 oasc.RequestHandlers.initHandlersFromConfig created /terms: org.apache.solr.handler.component.SearchHandler
[junit4:junit4]   2> 14021 T52 oasc.RequestHandlers.initHandlersFromConfig created spellCheckCompRH: org.apache.solr.handler.component.SearchHandler
[junit4:junit4]   2> 14022 T52 oasc.RequestHandlers.initHandlersFromConfig created spellCheckCompRH_Direct: org.apache.solr.handler.component.SearchHandler
[junit4:junit4]   2> 14024 T52 oasc.RequestHandlers.initHandlersFromConfig created spellCheckWithWordbreak: org.apache.solr.handler.component.SearchHandler
[junit4:junit4]   2> 14025 T52 oasc.RequestHandlers.initHandlersFromConfig created spellCheckWithWordbreak_Direct: org.apache.solr.handler.component.SearchHandler
[junit4:junit4]   2> 14026 T52 oasc.RequestHandlers.initHandlersFromConfig created spellCheckCompRH1: org.apache.solr.handler.component.SearchHandler
[junit4:junit4]   2> 14027 T52 oasc.RequestHandlers.initHandlersFromConfig created tvrh: org.apache.solr.handler.component.SearchHandler
[junit4:junit4]   2> 14028 T52 oasc.RequestHandlers.initHandlersFromConfig created /mlt: solr.MoreLikeThisHandler
[junit4:junit4]   2> 14029 T52 oasc.RequestHandlers.initHandlersFromConfig created /debug/dump: solr.DumpRequestHandler
[junit4:junit4]   2> 14037 T52 oashl.XMLLoader.init xsltCacheLifetimeSeconds=60
[junit4:junit4]   2> 14046 T52 oasc.SolrCore.initDeprecatedSupport WARNING solrconfig.xml uses deprecated <admin/gettableFiles>, Please update your config to use the ShowFileRequestHandler.
[junit4:junit4]   2> 14049 T52 oasc.SolrCore.initDeprecatedSupport WARNING adding ShowFileRequestHandler with hidden files: [SCHEMA.XML, OLD_SYNONYMS.TXT, STOPWORDS.TXT, PROTWORDS.TXT, OPEN-EXCHANGE-RATES.JSON, SYNONYMS.TXT, CURRENCY.XML, MAPPING-ISOLATIN1ACCENT.TXT]
[junit4:junit4]   2> 14059 T52 oass.SolrIndexSearcher.<init> Opening Searcher@224298f8 main
[junit4:junit4]   2> 14061 T52 oasu.CommitTracker.<init> Hard AutoCommit: disabled
[junit4:junit4]   2> 14062 T52 oasu.CommitTracker.<init> Soft AutoCommit: disabled
[junit4:junit4]   2> 14063 T52 oashc.SpellCheckComponent.inform Initializing spell checkers
[junit4:junit4]   2> 14083 T52 oass.DirectSolrSpellChecker.init init: {name=direct,classname=DirectSolrSpellChecker,field=lowerfilt,minQueryLength=3}
[junit4:junit4]   2> 14157 T100 oasc.SolrCore.registerSearcher [collection1] Registered new searcher Searcher@224298f8 main{StandardDirectoryReader(segments_1:1)}
[junit4:junit4]   2> 14299 T74 oascc.ZkStateReader.updateClusterState Updating cloud state from ZooKeeper... 
[junit4:junit4]   2> 14320 T99 oascc.ZkStateReader$2.process A cluster state change has occurred - updating...
[junit4:junit4]   2> 14320 T73 oascc.ZkStateReader$2.process A cluster state change has occurred - updating...
[junit4:junit4]   2> 14320 T87 oascc.ZkStateReader$2.process A cluster state change has occurred - updating...
[junit4:junit4]   2> 14670 T52 oasc.CoreContainer.register registering core: collection1
[junit4:junit4]   2> 14671 T52 oasc.ZkController.register Register shard - core:collection1 address:http://127.0.0.1:42159/solr shardId:shard2
[junit4:junit4]   2> 14672 T52 oascc.SolrZkClient.makePath makePath: /collections/collection1/leader_elect/shard2/election
[junit4:junit4]   2> 14698 T59 oazs.PrepRequestProcessor.pRequest Got user-level KeeperException when processing sessionid:0x139e3d1d6370004 type:delete cxid:0x41 zxid:0xfffffffffffffffe txntype:unknown reqpath:n/a Error Path:/solr/collections/collection1/leaders/shard2 Error:KeeperErrorCode = NoNode for /solr/collections/collection1/leaders/shard2
[junit4:junit4]   2> 14702 T52 oasc.ShardLeaderElectionContext.runLeaderProcess Running the leader process.
[junit4:junit4]   2> 14704 T59 oazs.PrepRequestProcessor.pRequest Got user-level KeeperException when processing sessionid:0x139e3d1d6370004 type:create cxid:0x42 zxid:0xfffffffffffffffe txntype:unknown reqpath:n/a Error Path:/solr/overseer Error:KeeperErrorCode = NodeExists for /solr/overseer
[junit4:junit4]   2> 14709 T52 oasc.ShardLeaderElectionContext.waitForReplicasToComeUp Enough replicas found to continue.
[junit4:junit4]   2> 14710 T52 oasc.ShardLeaderElectionContext.runLeaderProcess I may be the new leader - try and sync
[junit4:junit4]   2> 14711 T52 oasc.SyncStrategy.sync Sync replicas to http://127.0.0.1:42159/solr/collection1/
[junit4:junit4]   2> 14712 T52 oasc.SyncStrategy.syncReplicas Sync Success - now sync replicas to me
[junit4:junit4]   2> 14713 T52 oasc.SyncStrategy.syncToMe http://127.0.0.1:42159/solr/collection1/ has no replicas
[junit4:junit4]   2> 14714 T52 oasc.ShardLeaderElectionContext.runLeaderProcess I am the new leader: http://127.0.0.1:42159/solr/collection1/
[junit4:junit4]   2> 14715 T52 oascc.SolrZkClient.makePath makePath: /collections/collection1/leaders/shard2
[junit4:junit4]   2> 14725 T59 oazs.PrepRequestProcessor.pRequest Got user-level KeeperException when processing sessionid:0x139e3d1d6370004 type:create cxid:0x4b zxid:0xfffffffffffffffe txntype:unknown reqpath:n/a Error Path:/solr/overseer Error:KeeperErrorCode = NodeExists for /solr/overseer
[junit4:junit4]   2> 14837 T74 oascc.ZkStateReader.updateClusterState Updating cloud state from ZooKeeper... 
[junit4:junit4]   2> 14859 T73 oascc.ZkStateReader$2.process A cluster state change has occurred - updating...
[junit4:junit4]   2> 14859 T99 oascc.ZkStateReader$2.process A cluster state change has occurred - updating...
[junit4:junit4]   2> 14859 T87 oascc.ZkStateReader$2.process A cluster state change has occurred - updating...
[junit4:junit4]   2> 14885 T52 oasc.ZkController.register We are http://127.0.0.1:42159/solr/collection1/ and leader is http://127.0.0.1:42159/solr/collection1/
[junit4:junit4]   2> 14886 T52 oasc.ZkController.register No LogReplay needed for core=collection1 baseURL=http://127.0.0.1:42159/solr
[junit4:junit4]   2> 14887 T52 oasc.ZkController.checkRecovery I am the leader, no recovery necessary
[junit4:junit4]   2> 14894 T52 oascc.ZkStateReader.updateClusterState Updating cloud state from ZooKeeper... 
[junit4:junit4]   2> 14897 T52 oass.SolrDispatchFilter.init user.dir=/usr/home/hudson/hudson-slave/workspace/Lucene-Solr-Tests-4.x-java7/solr/build/solr-core/test/J1
[junit4:junit4]   2> 14898 T52 oass.SolrDispatchFilter.init SolrDispatchFilter.init() done
[junit4:junit4]   2> 14899 T52 oascsi.HttpClientUtil.createClient Creating new http client, config:maxConnections=128&maxConnectionsPerHost=32&followRedirects=false
[junit4:junit4]   2> 15210 T52 oejs.Server.doStart jetty-8.1.2.v20120308
[junit4:junit4]   2> 15216 T52 oejs.AbstractConnector.doStart Started SocketConnector@0.0.0.0:10792
[junit4:junit4]   2> 15218 T52 oasc.SolrResourceLoader.locateSolrHome JNDI not configured for solr (NoInitialContextEx)
[junit4:junit4]   2> 15218 T52 oasc.SolrResourceLoader.locateSolrHome using system property solr.solr.home: /usr/home/hudson/hudson-slave/workspace/Lucene-Solr-Tests-4.x-java7/solr/build/solr-core/test/J1/./solrtest-jetty3-1348146958028
[junit4:junit4]   2> 15219 T52 oasc.SolrResourceLoader.<init> new SolrResourceLoader for deduced Solr Home: '/usr/home/hudson/hudson-slave/workspace/Lucene-Solr-Tests-4.x-java7/solr/build/solr-core/test/J1/./solrtest-jetty3-1348146958028/'
[junit4:junit4]   2> 15286 T52 oass.SolrDispatchFilter.init SolrDispatchFilter.init()
[junit4:junit4]   2> 15288 T52 oasc.SolrResourceLoader.locateSolrHome JNDI not configured for solr (NoInitialContextEx)
[junit4:junit4]   2> 15289 T52 oasc.SolrResourceLoader.locateSolrHome using system property solr.solr.home: /usr/home/hudson/hudson-slave/workspace/Lucene-Solr-Tests-4.x-java7/solr/build/solr-core/test/J1/./solrtest-jetty3-1348146958028
[junit4:junit4]   2> 15289 T52 oasc.CoreContainer$Initializer.initialize looking for solr.xml: /usr/home/hudson/hudson-slave/workspace/Lucene-Solr-Tests-4.x-java7/solr/build/solr-core/test/J1/./solrtest-jetty3-1348146958028/solr.xml
[junit4:junit4]   2> 15290 T52 oasc.CoreContainer.<init> New CoreContainer 1608835877
[junit4:junit4]   2> 15291 T52 oasc.CoreContainer.load Loading CoreContainer using Solr Home: '/usr/home/hudson/hudson-slave/workspace/Lucene-Solr-Tests-4.x-java7/solr/build/solr-core/test/J1/./solrtest-jetty3-1348146958028/'
[junit4:junit4]   2> 15292 T52 oasc.SolrResourceLoader.<init> new SolrResourceLoader for directory: '/usr/home/hudson/hudson-slave/workspace/Lucene-Solr-Tests-4.x-java7/solr/build/solr-core/test/J1/./solrtest-jetty3-1348146958028/'
[junit4:junit4]   2> 15350 T52 oasc.CoreContainer.load Registering Log Listener
[junit4:junit4]   2> 15373 T52 oasc.CoreContainer.initZooKeeper Zookeeper client=127.0.0.1:18135/solr
[junit4:junit4]   2> 15374 T52 oaz.ZooKeeper.<init> Initiating client connection, connectString=127.0.0.1:18135/solr sessionTimeout=5000 watcher=org.apache.solr.common.cloud.ConnectionManager@bb47f26
[junit4:junit4]   2> 15376 T110 oaz.ClientCnxn$SendThread.startConnect Opening socket connection to server /127.0.0.1:18135
[junit4:junit4]   2> 15376 T52 oascc.ConnectionManager.waitForConnected Waiting for client to connect to ZooKeeper
[junit4:junit4]   2> 15378 T74 oascc.ZkStateReader.updateClusterState Updating cloud state from ZooKeeper... 
[junit4:junit4]   2> 15379 T54 oazs.NIOServerCnxn$Factory.run Accepted socket connection from /140.211.11.196:57028
[junit4:junit4]   2> 15378 T110 oaz.ClientCnxn$SendThread.primeConnection Socket connection established to localhost/127.0.0.1:18135, initiating session
[junit4:junit4]   2> 15380 T54 oazs.NIOServerCnxn.readConnectRequest Client attempting to establish new session at /140.211.11.196:57028
[junit4:junit4]   2> 15383 T58 oazs.NIOServerCnxn.finishSessionInit Established session 0x139e3d1d6370005 with negotiated timeout 5000 for client /140.211.11.196:57028
[junit4:junit4]   2> 15384 T110 oaz.ClientCnxn$SendThread.readConnectResult Session establishment complete on server localhost/127.0.0.1:18135, sessionid = 0x139e3d1d6370005, negotiated timeout = 5000
[junit4:junit4]   2> 15385 T111 oascc.ConnectionManager.process Watcher org.apache.solr.common.cloud.ConnectionManager@bb47f26 name:ZooKeeperConnection Watcher:127.0.0.1:18135/solr got event WatchedEvent state:SyncConnected type:None path:null path:null type:None
[junit4:junit4]   2> 15386 T52 oascc.ConnectionManager.waitForConnected Client is connected to ZooKeeper
[junit4:junit4]   2> 15388 T59 oazs.PrepRequestProcessor.pRequest Got user-level KeeperException when processing sessionid:0x139e3d1d6370005 type:create cxid:0x1 zxid:0xfffffffffffffffe txntype:unknown reqpath:n/a Error Path:/solr/overseer Error:KeeperErrorCode = NodeExists for /solr/overseer
[junit4:junit4]   2> 15399 T59 oazs.PrepRequestProcessor.pRequest Got user-level KeeperException when processing sessionid:0x139e3d1d6370005 type:create cxid:0x2 zxid:0xfffffffffffffffe txntype:unknown reqpath:n/a Error Path:/solr/overseer Error:KeeperErrorCode = NodeExists for /solr/overseer
[junit4:junit4]   2> 15409 T52 oasc.ZkController.createEphemeralLiveNode Register node as live in ZooKeeper:/live_nodes/127.0.0.1:10792_solr
[junit4:junit4]   2> 15410 T59 oazs.PrepRequestProcessor.pRequest Got user-level KeeperException when processing sessionid:0x139e3d1d6370005 type:delete cxid:0x4 zxid:0xfffffffffffffffe txntype:unknown reqpath:n/a Error Path:/solr/live_nodes/127.0.0.1:10792_solr Error:KeeperErrorCode = NoNode for /solr/live_nodes/127.0.0.1:10792_solr
[junit4:junit4]   2> 15412 T52 oascc.SolrZkClient.makePath makePath: /live_nodes/127.0.0.1:10792_solr
[junit4:junit4]   2> 15419 T99 oascc.ZkStateReader$3.process Updating live nodes
[junit4:junit4]   2> 15419 T87 oascc.ZkStateReader$3.process Updating live nodes
[junit4:junit4]   2> 15423 T52 oashc.HttpShardHandlerFactory.getParameter Setting socketTimeout to: 0
[junit4:junit4]   2> 15424 T52 oashc.HttpShardHandlerFactory.getParameter Setting urlScheme to: http://
[junit4:junit4]   2> 15425 T52 oashc.HttpShardHandlerFactory.getParameter Setting connTimeout to: 0
[junit4:junit4]   2> 15426 T52 oashc.HttpShardHandlerFactory.getParameter Setting maxConnectionsPerHost to: 20
[junit4:junit4]   2> 15427 T52 oashc.HttpShardHandlerFactory.getParameter Setting corePoolSize to: 0
[junit4:junit4]   2> 15428 T52 oashc.HttpShardHandlerFactory.getParameter Setting maximumPoolSize to: 2147483647
[junit4:junit4]   2> 15429 T52 oashc.HttpShardHandlerFactory.getParameter Setting maxThreadIdleTime to: 5
[junit4:junit4]   2> 15430 T52 oashc.HttpShardHandlerFactory.getParameter Setting sizeOfQueue to: -1
[junit4:junit4]   2> 15431 T52 oashc.HttpShardHandlerFactory.getParameter Setting fairnessPolicy to: false
[junit4:junit4]   2> 15431 T52 oascsi.HttpClientUtil.createClient Creating new http client, config:maxConnectionsPerHost=20&maxConnections=10000&socketTimeout=0&connTimeout=0&retry=false
[junit4:junit4]   2> 15433 T73 oascc.ZkStateReader$3.process Updating live nodes
[junit4:junit4]   2> 15435 T99 oascc.ZkStateReader$2.process A cluster state change has occurred - updating...
[junit4:junit4]   2> 15436 T87 oascc.ZkStateReader$2.process A cluster state change has occurred - updating...
[junit4:junit4]   2> 15443 T73 oascc.ZkStateReader$2.process A cluster state change has occurred - updating...
[junit4:junit4]   2> 15465 T52 oascc.ZkStateReader.createClusterStateWatchersAndUpdate Updating cluster state from ZooKeeper... 
[junit4:junit4]   2> 15481 T52 oasc.CoreContainer.create Creating SolrCore 'collection1' using instanceDir: /usr/home/hudson/hudson-slave/workspace/Lucene-Solr-Tests-4.x-java7/solr/build/solr-core/test/J1/./solrtest-jetty3-1348146958028/collection1
[junit4:junit4]   2> 15482 T52 oasc.ZkController.createCollectionZkNode Check for collection zkNode:collection1
[junit4:junit4]   2> 15486 T52 oasc.ZkController.createCollectionZkNode Collection zkNode exists
[junit4:junit4]   2> 15486 T52 oasc.ZkController.readConfigName Load collection config from:/collections/collection1
[junit4:junit4]   2> 15489 T52 oasc.SolrResourceLoader.<init> new SolrResourceLoader for directory: '/usr/home/hudson/hudson-slave/workspace/Lucene-Solr-Tests-4.x-java7/solr/build/solr-core/test/J1/./solrtest-jetty3-1348146958028/collection1/'
[junit4:junit4]   2> 15491 T52 oasc.SolrResourceLoader.replaceClassLoader Adding 'file:/usr/home/hudson/hudson-slave/workspace/Lucene-Solr-Tests-4.x-java7/solr/build/solr-core/test/J1/solrtest-jetty3-1348146958028/collection1/lib/README' to classloader
[junit4:junit4]   2> 15493 T52 oasc.SolrResourceLoader.replaceClassLoader Adding 'file:/usr/home/hudson/hudson-slave/workspace/Lucene-Solr-Tests-4.x-java7/solr/build/solr-core/test/J1/solrtest-jetty3-1348146958028/collection1/lib/classes/' to classloader
[junit4:junit4]   2> 15595 T52 oasc.SolrConfig.<init> Using Lucene MatchVersion: LUCENE_40
[junit4:junit4]   2> 15708 T52 oasc.SolrConfig.<init> Loaded SolrConfig: solrconfig.xml
[junit4:junit4]   2> 15810 T52 oass.IndexSchema.readSchema Reading Solr Schema
[junit4:junit4]   2> 15832 T52 oass.IndexSchema.readSchema Schema name=test
[junit4:junit4]   2> 16758 T52 oass.OpenExchangeRatesOrgProvider.init Initialized with rates=open-exchange-rates.json, refreshInterval=1440.
[junit4:junit4]   2> 16773 T52 oass.IndexSchema.readSchema default search field in schema is text
[junit4:junit4]   2> 16777 T52 oass.IndexSchema.readSchema unique key field: id
[junit4:junit4]   2> 16810 T52 oass.FileExchangeRateProvider.reload Reloading exchange rates from file currency.xml
[junit4:junit4]   2> 16817 T52 oass.FileExchangeRateProvider.reload Reloading exchange rates from file currency.xml
[junit4:junit4]   2> 16824 T52 oass.OpenExchangeRatesOrgProvider.reload Reloading exchange rates from open-exchange-rates.json
[junit4:junit4]   2> 16827 T52 oass.OpenExchangeRatesOrgProvider.reload Reloading exchange rates from open-exchange-rates.json
[junit4:junit4]   2> 16830 T52 oasc.SolrCore.<init> [collection1] Opening new SolrCore at /usr/home/hudson/hudson-slave/workspace/Lucene-Solr-Tests-4.x-java7/solr/build/solr-core/test/J1/./solrtest-jetty3-1348146958028/collection1/, dataDir=./org.apache.solr.cloud.BasicDistributedZk2Test-1348146943103/jetty3/
[junit4:junit4]   2> 16831 T52 oasc.JmxMonitoredMap.<init> JMX monitoring is enabled. Adding Solr mbeans to JMX Server: com.sun.jmx.mbeanserver.JmxMBeanServer@170f0424
[junit4:junit4]   2> 16832 T52 oasc.SolrCore.getNewIndexDir WARNING New index directory detected: old=null new=./org.apache.solr.cloud.BasicDistributedZk2Test-1348146943103/jetty3/index/
[junit4:junit4]   2> 16833 T52 oasc.SolrCore.initIndex WARNING [collection1] Solr index directory './org.apache.solr.cloud.BasicDistributedZk2Test-1348146943103/jetty3/index' doesn't exist. Creating new index...
[junit4:junit4]   2> 16834 T52 oasc.CachingDirectoryFactory.get return new directory for /usr/home/hudson/hudson-slave/workspace/Lucene-Solr-Tests-4.x-java7/solr/build/solr-core/test/J1/./org.apache.solr.cloud.BasicDistributedZk2Test-1348146943103/jetty3/index forceNew:false
[junit4:junit4]   2> 16842 T52 oasc.SolrDeletionPolicy.onCommit SolrDeletionPolicy.onCommit: commits:num=1
[junit4:junit4]   2> 		commit{dir=NRTCachingDirectory(org.apache.lucene.store.NIOFSDirectory@/usr/home/hudson/hudson-slave/workspace/Lucene-Solr-Tests-4.x-java7/solr/build/solr-core/test/J1/org.apache.solr.cloud.BasicDistributedZk2Test-1348146943103/jetty3/index lockFactory=org.apache.lucene.store.NativeFSLockFactory@7a231ee2; maxCacheMB=48.0 maxMergeSizeMB=4.0),segFN=segments_1,generation=1,filenames=[segments_1]
[junit4:junit4]   2> 16843 T52 oasc.SolrDeletionPolicy.updateCommits newest commit = 1
[junit4:junit4]   2> 16845 T52 oasc.SolrCore.initWriters created xml: solr.XMLResponseWriter
[junit4:junit4]   2> 16848 T52 oasup.UpdateRequestProcessorChain.init inserting DistributedUpdateProcessorFactory into updateRequestProcessorChain "dedupe"
[junit4:junit4]   2> 16849 T52 oasup.UpdateRequestProcessorChain.init inserting DistributedUpdateProcessorFactory into updateRequestProcessorChain "dedupe-allfields"
[junit4:junit4]   2> 16850 T52 oasup.UpdateRequestProcessorChain.init inserting DistributedUpdateProcessorFactory into updateRequestProcessorChain "stored_sig"
[junit4:junit4]   2> 16851 T52 oasup.UpdateRequestProcessorChain.init inserting DistributedUpdateProcessorFactory into updateRequestProcessorChain "uniq-fields"
[junit4:junit4]   2> 16852 T52 oasup.UpdateRequestProcessorChain.init inserting DistributedUpdateProcessorFactory into updateRequestProcessorChain "distrib-dup-test-chain-implicit"
[junit4:junit4]   2> 16852 T52 oasc.RequestHandlers.initHandlersFromConfig adding lazy requestHandler: solr.ReplicationHandler
[junit4:junit4]   2> 16853 T52 oasc.RequestHandlers.initHandlersFromConfig created /replication: solr.ReplicationHandler
[junit4:junit4]   2> 16854 T52 oasc.RequestHandlers.initHandlersFromConfig created standard: solr.StandardRequestHandler
[junit4:junit4]   2> 16855 T52 oasc.RequestHandlers.initHandlersFromConfig created /get: solr.RealTimeGetHandler
[junit4:junit4]   2> 16856 T52 oasc.RequestHandlers.initHandlersFromConfig created dismax: solr.SearchHandler
[junit4:junit4]   2> 16858 T52 oasc.RequestHandlers.initHandlersFromConfig created mock: org.apache.solr.core.MockQuerySenderListenerReqHandler
[junit4:junit4]   2> 16859 T52 oasc.RequestHandlers.initHandlersFromConfig created /admin/: org.apache.solr.handler.admin.AdminHandlers
[junit4:junit4]   2> 16860 T52 oasc.RequestHandlers.initHandlersFromConfig created defaults: solr.StandardRequestHandler
[junit4:junit4]   2> 16860 T52 oasc.RequestHandlers.initHandlersFromConfig adding lazy requestHandler: solr.StandardRequestHandler
[junit4:junit4]   2> 16861 T52 oasc.RequestHandlers.initHandlersFromConfig created lazy: solr.StandardRequestHandler
[junit4:junit4]   2> 16862 T52 oasc.RequestHandlers.initHandlersFromConfig created /update: solr.UpdateRequestHandler
[junit4:junit4]   2> 16863 T52 oasc.RequestHandlers.initHandlersFromConfig created /terms: org.apache.solr.handler.component.SearchHandler
[junit4:junit4]   2> 16864 T52 oasc.RequestHandlers.initHandlersFromConfig created spellCheckCompRH: org.apache.solr.handler.component.SearchHandler
[junit4:junit4]   2> 16865 T52 oasc.RequestHandlers.initHandlersFromConfig created spellCheckCompRH_Direct: org.apache.solr.handler.component.SearchHandler
[junit4:junit4]   2> 16866 T52 oasc.RequestHandlers.initHandlersFromConfig created spellCheckWithWordbreak: org.apache.solr.handler.component.SearchHandler
[junit4:junit4]   2> 16867 T52 oasc.RequestHandlers.initHandlersFromConfig created spellCheckWithWordbreak_Direct: org.apache.solr.handler.component.SearchHandler
[junit4:junit4]   2> 16868 T52 oasc.RequestHandlers.initHandlersFromConfig created spellCheckCompRH1: org.apache.solr.handler.component.SearchHandler
[junit4:junit4]   2> 16869 T52 oasc.RequestHandlers.initHandlersFromConfig created tvrh: org.apache.solr.handler.component.SearchHandler
[junit4:junit4]   2> 16870 T52 oasc.RequestHandlers.initHandlersFromConfig created /mlt: solr.MoreLikeThisHandler
[junit4:junit4]   2> 16871 T52 oasc.RequestHandlers.initHandlersFromConfig created /debug/dump: solr.DumpRequestHandler
[junit4:junit4]   2> 16877 T52 oashl.XMLLoader.init xsltCacheLifetimeSeconds=60
[junit4:junit4]   2> 16884 T52 oasc.SolrCore.initDeprecatedSupport WARNING solrconfig.xml uses deprecated <admin/gettableFiles>, Please update your config to use the ShowFileRequestHandler.
[junit4:junit4]   2> 16887 T52 oasc.SolrCore.initDeprecatedSupport WARNING adding ShowFileRequestHandler with hidden files: [SCHEMA.XML, OLD_SYNONYMS.TXT, STOPWORDS.TXT, PROTWORDS.TXT, OPEN-EXCHANGE-RATES.JSON, SYNONYMS.TXT, CURRENCY.XML, MAPPING-ISOLATIN1ACCENT.TXT]
[junit4:junit4]   2> 16892 T52 oass.SolrIndexSearcher.<init> Opening Searcher@8ea25fa main
[junit4:junit4]   2> 16894 T52 oasu.CommitTracker.<init> Hard AutoCommit: disabled
[junit4:junit4]   2> 16895 T52 oasu.CommitTracker.<init> Soft AutoCommit: disabled
[junit4:junit4]   2> 16896 T52 oashc.SpellCheckComponent.inform Initializing spell checkers
[junit4:junit4]   2> 16906 T52 oass.DirectSolrSpellChecker.init init: {name=direct,classname=DirectSolrSpellChecker,field=lowerfilt,minQueryLength=3}
[junit4:junit4]   2> 16967 T112 oasc.SolrCore.registerSearcher [collection1] Registered new searcher Searcher@8ea25fa main{StandardDirectoryReader(segments_1:1)}
[junit4:junit4]   2> 17474 T74 oascc.ZkStateReader.updateClusterState Updating cloud state from ZooKeeper... 
[junit4:junit4]   2> 17489 T99 oascc.ZkStateReader$2.process A cluster state change has occurred - updating...
[junit4:junit4]   2> 17489 T73 oascc.ZkStateReader$2.process A cluster state change has occurred - updating...
[junit4:junit4]   2> 17489 T111 oascc.ZkStateReader$2.process A cluster state change has occurred - updating...
[junit4:junit4]   2> 17489 T87 oascc.ZkStateReader$2.process A cluster state change has occurred - updating...
[junit4:junit4]   2> 17979 T52 oasc.CoreContainer.register registering core: collection1
[junit4:junit4]   2> 17979 T52 oasc.ZkController.register Register shard - core:collection1 address:http://127.0.0.1:10792/solr shardId:shard1
[junit4:junit4]   2> 17983 T52 oasc.ZkController.register We are http://127.0.0.1:10792/solr/collection1/ and leader is http://127.0.0.1:14978/solr/collection1/
[junit4:junit4]   2> 17984 T52 oasc.ZkController.register No LogReplay needed for core=collection1 baseURL=http://127.0.0.1:10792/solr
[junit4:junit4]   2> 17984 T52 oasc.ZkController.checkRecovery Core needs to recover:collection1
[junit4:junit4]   2> 17985 T52 oasu.DefaultSolrCoreState.doRecovery Running recovery - first canceling any ongoing recovery
[junit4:junit4]   2> ASYNC  NEW_CORE C3 name=collection1 org.apache.solr.core.SolrCore@60d1a45a url=http://127.0.0.1:10792/solr/collection1 node=127.0.0.1:10792_solr
[junit4:junit4]   2> 17991 T113 C3 P10792 oasc.RecoveryStrategy.run Starting recovery process.  core=collection1 recoveringAfterStartup=true
[junit4:junit4]   2> 17991 T52 oascc.ZkStateReader.updateClusterState Updating cloud state from ZooKeeper... 
[junit4:junit4]   2> 17992 T113 C3 P10792 oasc.RecoveryStrategy.doRecovery ###### startupVersions=[]
[junit4:junit4]   2> 17993 T52 oass.SolrDispatchFilter.init user.dir=/usr/home/hudson/hudson-slave/workspace/Lucene-Solr-Tests-4.x-java7/solr/build/solr-core/test/J1
[junit4:junit4]   2> 17994 T52 oass.SolrDispatchFilter.init SolrDispatchFilter.init() done
[junit4:junit4]   2> 17994 T52 oascsi.HttpClientUtil.createClient Creating new http client, config:maxConnections=128&maxConnectionsPerHost=32&followRedirects=false
[junit4:junit4]   2> 18007 T113 C3 P10792 oasc.RecoveryStrategy.doRecovery Attempting to PeerSync from http://127.0.0.1:14978/solr/collection1/ core=collection1 - recoveringAfterStartup=true
[junit4:junit4]   2> 18017 T113 C3 P10792 oascsi.HttpClientUtil.createClient Creating new http client, config:maxConnectionsPerHost=20&maxConnections=10000&connTimeout=30000&socketTimeout=30000&retry=false
[junit4:junit4]   2> 18035 T113 C3 P10792 oasu.PeerSync.sync PeerSync: core=collection1 url=http://127.0.0.1:10792/solr START replicas=[http://127.0.0.1:14978/solr/collection1/] nUpdates=100
[junit4:junit4]   2> 18051 T113 C3 P10792 oasu.PeerSync.sync WARNING no frame of reference to tell of we've missed updates
[junit4:junit4]   2> 18052 T113 C3 P10792 oasc.RecoveryStrategy.doRecovery PeerSync Recovery was not successful - trying replication. core=collection1
[junit4:junit4]   2> 18052 T113 C3 P10792 oasc.RecoveryStrategy.doRecovery Starting Replication Recovery. core=collection1
[junit4:junit4]   2> 18053 T113 C3 P10792 oascsi.HttpClientUtil.createClient Creating new http client, config:maxConnections=128&maxConnectionsPerHost=32&followRedirects=false
[junit4:junit4]   2> 18169 T52 oejs.Server.doStart jetty-8.1.2.v20120308
[junit4:junit4]   2> 18172 T52 oejs.AbstractConnector.doStart Started SocketConnector@0.0.0.0:28102
[junit4:junit4]   2> 18172 T52 oasc.SolrResourceLoader.locateSolrHome JNDI not configured for solr (NoInitialContextEx)
[junit4:junit4]   2> 18173 T52 oasc.SolrResourceLoader.locateSolrHome using system property solr.solr.home: /usr/home/hudson/hudson-slave/workspace/Lucene-Solr-Tests-4.x-java7/solr/build/solr-core/test/J1/./solrtest-jetty4-1348146961106
[junit4:junit4]   2> 18173 T52 oasc.SolrResourceLoader.<init> new SolrResourceLoader for deduced Solr Home: '/usr/home/hudson/hudson-slave/workspace/Lucene-Solr-Tests-4.x-java7/solr/build/solr-core/test/J1/./solrtest-jetty4-1348146961106/'
[junit4:junit4]   2> 18219 T52 oass.SolrDispatchFilter.init SolrDispatchFilter.init()
[junit4:junit4]   2> 18219 T52 oasc.SolrResourceLoader.locateSolrHome JNDI not configured for solr (NoInitialContextEx)
[junit4:junit4]   2> 18220 T52 oasc.SolrResourceLoader.locateSolrHome using system property solr.solr.home: /usr/home/hudson/hudson-slave/workspace/Lucene-Solr-Tests-4.x-java7/solr/build/solr-core/test/J1/./solrtest-jetty4-1348146961106
[junit4:junit4]   2> 18220 T52 oasc.CoreContainer$Initializer.initialize looking for solr.xml: /usr/home/hudson/hudson-slave/workspace/Lucene-Solr-Tests-4.x-java7/solr/build/solr-core/test/J1/./solrtest-jetty4-1348146961106/solr.xml
[junit4:junit4]   2> 18220 T52 oasc.CoreContainer.<init> New CoreContainer 1930633816
[junit4:junit4]   2> 18221 T52 oasc.CoreContainer.load Loading CoreContainer using Solr Home: '/usr/home/hudson/hudson-slave/workspace/Lucene-Solr-Tests-4.x-java7/solr/build/solr-core/test/J1/./solrtest-jetty4-1348146961106/'
[junit4:junit4]   2> 18221 T52 oasc.SolrResourceLoader.<init> new SolrResourceLoader for directory: '/usr/home/hudson/hudson-slave/workspace/Lucene-Solr-Tests-4.x-java7/solr/build/solr-core/test/J1/./solrtest-jetty4-1348146961106/'
[junit4:junit4]   2> 18251 T52 oasc.CoreContainer.load Registering Log Listener
[junit4:junit4]   2> 18266 T52 oasc.CoreContainer.initZooKeeper Zookeeper client=127.0.0.1:18135/solr
[junit4:junit4]   2> 18267 T52 oaz.ZooKeeper.<init> Initiating client connection, connectString=127.0.0.1:18135/solr sessionTimeout=5000 watcher=org.apache.solr.common.cloud.ConnectionManager@22889c88
[junit4:junit4]   2> 18268 T124 oaz.ClientCnxn$SendThread.startConnect Opening socket connection to server /127.0.0.1:18135
[junit4:junit4]   2> 18268 T52 oascc.ConnectionManager.waitForConnected Waiting for client to connect to ZooKeeper
[junit4:junit4]   2> 18269 T124 oaz.ClientCnxn$SendThread.primeConnection Socket connection established to localhost/127.0.0.1:18135, initiating session
[junit4:junit4]   2> 18269 T54 oazs.NIOServerCnxn$Factory.run Accepted socket connection from /140.211.11.196:32639
[junit4:junit4]   2> 18270 T54 oazs.NIOServerCnxn.readConnectRequest Client attempting to establish new session at /140.211.11.196:32639
[junit4:junit4]   2> 18272 T58 oazs.NIOServerCnxn.finishSessionInit Established session 0x139e3d1d6370006 with negotiated timeout 5000 for client /140.211.11.196:32639
[junit4:junit4]   2> 18272 T124 oaz.ClientCnxn$SendThread.readConnectResult Session establishment complete on server localhost/127.0.0.1:18135, sessionid = 0x139e3d1d6370006, negotiated timeout = 5000
[junit4:junit4]   2> 18272 T125 oascc.ConnectionManager.process Watcher org.apache.solr.common.cloud.ConnectionManager@22889c88 name:ZooKeeperConnection Watcher:127.0.0.1:18135/solr got event WatchedEvent state:SyncConnected type:None path:null path:null type:None
[junit4:junit4]   2> 18273 T52 oascc.ConnectionManager.waitForConnected Client is connected to ZooKeeper
[junit4:junit4]   2> 18273 T59 oazs.PrepRequestProcessor.pRequest Got user-level KeeperException when processing sessionid:0x139e3d1d6370006 type:create cxid:0x1 zxid:0xfffffffffffffffe txntype:unknown reqpath:n/a Error Path:/solr/overseer Error:KeeperErrorCode = NodeExists for /solr/overseer
[junit4:junit4]   2> 18275 T59 oazs.PrepRequestProcessor.pRequest Got user-level KeeperException when processing sessionid:0x139e3d1d6370006 type:create cxid:0x2 zxid:0xfffffffffffffffe txntype:unknown reqpath:n/a Error Path:/solr/overseer Error:KeeperErrorCode = NodeExists for /solr/overseer
[junit4:junit4]   2> 18276 T52 oasc.ZkController.createEphemeralLiveNode Register node as live in ZooKeeper:/live_nodes/127.0.0.1:28102_solr
[junit4:junit4]   2> 18277 T59 oazs.PrepRequestProcessor.pRequest Got user-level KeeperException when processing sessionid:0x139e3d1d6370006 type:delete cxid:0x4 zxid:0xfffffffffffffffe txntype:unknown reqpath:n/a Error Path:/solr/live_nodes/127.0.0.1:28102_solr Error:KeeperErrorCode = NoNode for /solr/live_nodes/127.0.0.1:28102_solr
[junit4:junit4]   2> 18286 T52 oascc.SolrZkClient.makePath makePath: /live_nodes/127.0.0.1:28102_solr
[junit4:junit4]   2> 18288 T99 oascc.ZkStateReader$3.process Updating live nodes
[junit4:junit4]   2> 18288 T87 oascc.ZkStateReader$3.process Updating live nodes
[junit4:junit4]   2> 18288 T111 oascc.ZkStateReader$3.process Updating live nodes
[junit4:junit4]   2> 18288 T73 oascc.ZkStateReader$3.process Updating live nodes
[junit4:junit4]   2> 18290 T52 oashc.HttpShardHandlerFactory.getParameter Setting socketTimeout to: 0
[junit4:junit4]   2> 18290 T52 oashc.HttpShardHandlerFactory.getParameter Setting urlScheme to: http://
[junit4:junit4]   2> 18291 T52 oashc.HttpShardHandlerFactory.getParameter Setting connTimeout to: 0
[junit4:junit4]   2> 18292 T52 oashc.HttpShardHandlerFactory.getParameter Setting maxConnectionsPerHost to: 20
[junit4:junit4]   2> 18292 T52 oashc.HttpShardHandlerFactory.getParameter Setting corePoolSize to: 0
[junit4:junit4]   2> 18293 T52 oashc.HttpShardHandlerFactory.getParameter Setting maximumPoolSize to: 2147483647
[junit4:junit4]   2> 18293 T52 oashc.HttpShardHandlerFactory.getParameter Setting maxThreadIdleTime to: 5
[junit4:junit4]   2> 18294 T52 oashc.HttpShardHandlerFactory.getParameter Setting sizeOfQueue to: -1
[junit4:junit4]   2> 18295 T52 oashc.HttpShardHandlerFactory.getParameter Setting fairnessPolicy to: false
[junit4:junit4]   2> 18295 T52 oascsi.HttpClientUtil.createClient Creating new http client, config:maxConnectionsPerHost=20&maxConnections=10000&socketTimeout=0&connTimeout=0&retry=false
[junit4:junit4]   2> 18320 T52 oascc.ZkStateReader.createClusterStateWatchersAndUpdate Updating cluster state from ZooKeeper... 
[junit4:junit4]   2> 18334 T52 oasc.CoreContainer.create Creating SolrCore 'collection1' using instanceDir: /usr/home/hudson/hudson-slave/workspace/Lucene-Solr-Tests-4.x-java7/solr/build/solr-core/test/J1/./solrtest-jetty4-1348146961106/collection1
[junit4:junit4]   2> 18334 T52 oasc.ZkController.createCollectionZkNode Check for collection zkNode:collection1
[junit4:junit4]   2> 18336 T52 oasc.ZkController.createCollectionZkNode Collection zkNode exists
[junit4:junit4]   2> 18337 T52 oasc.ZkController.readConfigName Load collection config from:/collections/collection1
[junit4:junit4]   2> 18339 T52 oasc.SolrResourceLoader.<init> new SolrResourceLoader for directory: '/usr/home/hudson/hudson-slave/workspace/Lucene-Solr-Tests-4.x-java7/solr/build/solr-core/test/J1/./solrtest-jetty4-1348146961106/collection1/'
[junit4:junit4]   2> 18341 T52 oasc.SolrResourceLoader.replaceClassLoader Adding 'file:/usr/home/hudson/hudson-slave/workspace/Lucene-Solr-Tests-4.x-java7/solr/build/solr-core/test/J1/solrtest-jetty4-1348146961106/collection1/lib/README' to classloader
[junit4:junit4]   2> 18342 T52 oasc.SolrResourceLoader.replaceClassLoader Adding 'file:/usr/home/hudson/hudson-slave/workspace/Lucene-Solr-Tests-4.x-java7/solr/build/solr-core/test/J1/solrtest-jetty4-1348146961106/collection1/lib/classes/' to classloader
[junit4:junit4]   2> 18457 T52 oasc.SolrConfig.<init> Using Lucene MatchVersion: LUCENE_40
[junit4:junit4]   2> 18496 T74 oascc.ZkStateReader.updateClusterState Updating cloud state from ZooKeeper... 
[junit4:junit4]   2> 18512 T99 oascc.ZkStateReader$2.process A cluster state change has occurred - updating...
[junit4:junit4]   2> 18512 T125 oascc.ZkStateReader$2.process A cluster state change has occurred - updating...
[junit4:junit4]   2> 18512 T111 oascc.ZkStateReader$2.process A cluster state change has occurred - updating...
[junit4:junit4]   2> 18512 T87 oascc.ZkStateReader$2.process A cluster state change has occurred - updating...
[junit4:junit4]   2> 18512 T73 oascc.ZkStateReader$2.process A cluster state change has occurred - updating...
[junit4:junit4]   2> 18547 T52 oasc.SolrConfig.<init> Loaded SolrConfig: solrconfig.xml
[junit4:junit4]   2> 18649 T52 oass.IndexSchema.readSchema Reading Solr Schema
[junit4:junit4]   2> 18682 T52 oass.IndexSchema.readSchema Schema name=test
[junit4:junit4]   2> ASYNC  NEW_CORE C4 name=collection1 org.apache.solr.core.SolrCore@1dd48dfa url=http://127.0.0.1:14978/solr/collection1 node=127.0.0.1:14978_solr
[junit4:junit4]   2> 19286 T79 C4 P14978 REQ /get {distrib=false&qt=/get&wt=javabin&version=2&getVersions=100} status=0 QTime=13 
[junit4:junit4]   2> 19535 T52 oass.OpenExchangeRatesOrgProvider.init Initialized with rates=open-exchange-rates.json, refreshInterval=1440.
[junit4:junit4]   2> 19549 T52 oass.IndexSchema.readSchema default search field in schema is text
[junit4:junit4]   2> 19553 T52 oass.IndexSchema.readSchema unique key field: id
[junit4:junit4]   2> 19582 T52 oass.FileExchangeRateProvider.reload Reloading exchange rates from file currency.xml
[junit4:junit4]   2> 19602 T52 oass.FileExchangeRateProvider.reload Reloading exchange rates from file currency.xml
[junit4:junit4]   2> 19608 T52 oass.OpenExchangeRatesOrgProvider.reload Reloading exchange rates from open-exchange-rates.json
[junit4:junit4]   2> 19611 T52 oass.OpenExchangeRatesOrgProvider.reload Reloading exchange rates from open-exchange-rates.json
[junit4:junit4]   2> 19627 T52 oasc.SolrCore.<init> [collection1] Opening new SolrCore at /usr/home/hudson/hudson-slave/workspace/Lucene-Solr-Tests-4.x-java7/solr/build/solr-core/test/J1/./solrtest-jetty4-1348146961106/collection1/, dataDir=./org.apache.solr.cloud.BasicDistributedZk2Test-1348146943103/jetty4/
[junit4:junit4]   2> 19627 T52 oasc.JmxMonitoredMap.<init> JMX monitoring is enabled. Adding Solr mbeans to JMX Server: com.sun.jmx.mbeanserver.JmxMBeanServer@170f0424
[junit4:junit4]   2> 19629 T52 oasc.SolrCore.getNewIndexDir WARNING New index directory detected: old=null new=./org.apache.solr.cloud.BasicDistributedZk2Test-1348146943103/jetty4/index/
[junit4:junit4]   2> 19630 T52 oasc.SolrCore.initIndex WARNING [collection1] Solr index directory './org.apache.solr.cloud.BasicDistributedZk2Test-1348146943103/jetty4/index' doesn't exist. Creating new index...
[junit4:junit4]   2> 19631 T52 oasc.CachingDirectoryFactory.get return new directory for /usr/home/hudson/hudson-slave/workspace/Lucene-Solr-Tests-4.x-java7/solr/build/solr-core/test/J1/./org.apache.solr.cloud.BasicDistributedZk2Test-1348146943103/jetty4/index forceNew:false
[junit4:junit4]   2> 19640 T52 oasc.SolrDeletionPolicy.onCommit SolrDeletionPolicy.onCommit: commits:num=1
[junit4:junit4]   2> 		commit{dir=NRTCachingDirectory(org.apache.lucene.store.NIOFSDirectory@/usr/home/hudson/hudson-slave/workspace/Lucene-Solr-Tests-4.x-java7/solr/build/solr-core/test/J1/org.apache.solr.cloud.BasicDistributedZk2Test-1348146943103/jetty4/index lockFactory=org.apache.lucene.store.NativeFSLockFactory@532b3afd; maxCacheMB=48.0 maxMergeSizeMB=4.0),segFN=segments_1,generation=1,filenames=[segments_1]
[junit4:junit4]   2> 19641 T52 oasc.SolrDeletionPolicy.updateCommits newest commit = 1
[junit4:junit4]   2> 19642 T52 oasc.SolrCore.initWriters created xml: solr.XMLResponseWriter
[junit4:junit4]   2> 19653 T52 oasup.UpdateRequestProcessorChain.init inserting DistributedUpdateProcessorFactory into updateRequestProcessorChain "dedupe"
[junit4:junit4]   2> 19654 T52 oasup.UpdateRequestProcessorChain.init inserting DistributedUpdateProcessorFactory into updateRequestProcessorChain "dedupe-allfields"
[junit4:junit4]   2> 19655 T52 oasup.UpdateRequestProcessorChain.init inserting DistributedUpdateProcessorFactory into updateRequestProcessorChain "stored_sig"
[junit4:junit4]   2> 19655 T52 oasup.UpdateRequestProcessorChain.init inserting DistributedUpdateProcessorFactory into updateRequestProcessorChain "uniq-fields"
[junit4:junit4]   2> 19657 T52 oasup.UpdateRequestProcessorChain.init inserting DistributedUpdateProcessorFactory into updateRequestProcessorChain "distrib-dup-test-chain-implicit"
[junit4:junit4]   2> 19657 T52 oasc.RequestHandlers.initHandlersFromConfig adding lazy requestHandler: solr.ReplicationHandler
[junit4:junit4]   2> 19658 T52 oasc.RequestHandlers.initHandlersFromConfig created /replication: solr.ReplicationHandler
[junit4:junit4]   2> 19659 T52 oasc.RequestHandlers.initHandlersFromConfig created standard: solr.StandardRequestHandler
[junit4:junit4]   2> 19660 T52 oasc.RequestHandlers.initHandlersFromConfig created /get: solr.RealTimeGetHandler
[junit4:junit4]   2> 19661 T52 oasc.RequestHandlers.initHandlersFromConfig created dismax: solr.SearchHandler
[junit4:junit4]   2> 19662 T52 oasc.RequestHandlers.initHandlersFromConfig created mock: org.apache.solr.core.MockQuerySenderListenerReqHandler
[junit4:junit4]   2> 19663 T52 oasc.RequestHandlers.initHandlersFromConfig created /admin/: org.apache.solr.handler.admin.AdminHandlers
[junit4:junit4]   2> 19664 T52 oasc.RequestHandlers.initHandlersFromConfig created defaults: solr.StandardRequestHandler
[junit4:junit4]   2> 19665 T52 oasc.RequestHandlers.initHandlersFromConfig adding lazy requestHandler: solr.StandardRequestHandler
[junit4:junit4]   2> 19666 T52 oasc.RequestHandlers.initHandlersFromConfig created lazy: solr.StandardRequestHandler
[junit4:junit4]   2> 19667 T52 oasc.RequestHandlers.initHandlersFromConfig created /update: solr.UpdateRequestHandler
[junit4:junit4]   2> 19668 T52 oasc.RequestHandlers.initHandlersFromConfig created /terms: org.apache.solr.handler.component.SearchHandler
[junit4:junit4]   2> 19669 T52 oasc.RequestHandlers.initHandlersFromConfig created spellCheckCompRH: org.apache.solr.handler.component.SearchHandler
[junit4:junit4]   2> 19670 T52 oasc.RequestHandlers.initHandlersFromConfig created spellCheckCompRH_Direct: org.apache.solr.handler.component.SearchHandler
[junit4:junit4]   2> 19671 T52 oasc.RequestHandlers.initHandlersFromConfig created spellCheckWithWordbreak: org.apache.solr.handler.component.SearchHandler
[junit4:junit4]   2> 19672 T52 oasc.RequestHandlers.initHandlersFromConfig created spellCheckWithWordbreak_Direct: org.apache.solr.handler.component.SearchHandler
[junit4:junit4]   2> 19673 T52 oasc.RequestHandlers.initHandlersFromConfig created spellCheckCompRH1: org.apache.solr.handler.component.SearchHandler
[junit4:junit4]   2> 19674 T52 oasc.RequestHandlers.initHandlersFromConfig created tvrh: org.apache.solr.handler.component.SearchHandler
[junit4:junit4]   2> 19675 T52 oasc.RequestHandlers.initHandlersFromConfig created /mlt: solr.MoreLikeThisHandler
[junit4:junit4]   2> 19676 T52 oasc.RequestHandlers.initHandlersFromConfig created /debug/dump: solr.DumpRequestHandler
[junit4:junit4]   2> 19680 T52 oashl.XMLLoader.init xsltCacheLifetimeSeconds=60
[junit4:junit4]   2> 19685 T52 oasc.SolrCore.initDeprecatedSupport WARNING solrconfig.xml uses deprecated <admin/gettableFiles>, Please update your config to use the ShowFileRequestHandler.
[junit4:junit4]   2> 19687 T52 oasc.SolrCore.initDeprecatedSupport WARNING adding ShowFileRequestHandler with hidden files: [SCHEMA.XML, OLD_SYNONYMS.TXT, STOPWORDS.TXT, PROTWORDS.TXT, OPEN-EXCHANGE-RATES.JSON, SYNONYMS.TXT, CURRENCY.XML, MAPPING-ISOLATIN1ACCENT.TXT]
[junit4:junit4]   2> 19692 T52 oass.SolrIndexSearcher.<init> Opening Searcher@5786ed37 main
[junit4:junit4]   2> 19694 T52 oasu.CommitTracker.<init> Hard AutoCommit: disabled
[junit4:junit4]   2> 19695 T52 oasu.CommitTracker.<init> Soft AutoCommit: disabled
[junit4:junit4]   2> 19696 T52 oashc.SpellCheckComponent.inform Initializing spell checkers
[junit4:junit4]   2> 19714 T52 oass.DirectSolrSpellChecker.init init: {name=direct,classname=DirectSolrSpellChecker,field=lowerfilt,minQueryLength=3}
[junit4:junit4]   2> 19795 T126 oasc.SolrCore.registerSearcher [collection1] Registered new searcher Searcher@5786ed37 main{StandardDirectoryReader(segments_1:1)}
[junit4:junit4]   2> 20023 T74 oascc.ZkStateReader.updateClusterState Updating cloud state from ZooKeeper... 
[junit4:junit4]   2> 20037 T99 oascc.ZkStateReader$2.process A cluster state change has occurred - updating...
[junit4:junit4]   2> 20037 T111 oascc.ZkStateReader$2.process A cluster state change has occurred - updating...
[junit4:junit4]   2> 20037 T73 oascc.ZkStateReader$2.process A cluster state change has occurred - updating...
[junit4:junit4]   2> 20037 T125 oascc.ZkStateReader$2.process A cluster state change has occurred - updating...
[junit4:junit4]   2> 20037 T87 oascc.ZkStateReader$2.process A cluster state change has occurred - updating...
[junit4:junit4]   2> 20305 T52 oasc.CoreContainer.register registering core: collection1
[junit4:junit4]   2> 20305 T52 oasc.ZkController.register Register shard - core:collection1 address:http://127.0.0.1:28102/solr shardId:shard2
[junit4:junit4]   2> 20311 T52 oasc.ZkController.register We are http://127.0.0.1:28102/solr/collection1/ and leader is http://127.0.0.1:42159/solr/collection1/
[junit4:junit4]   2> 20312 T52 oasc.ZkController.register No LogReplay needed for core=collection1 baseURL=http://127.0.0.1:28102/solr
[junit4:junit4]   2> 20313 T52 oasc.ZkController.checkRecovery Core needs to recover:collection1
[junit4:junit4]   2> 20313 T52 oasu.DefaultSolrCoreState.doRecovery Running recovery - first canceling any ongoing recovery
[junit4:junit4]   2> ASYNC  NEW_CORE C5 name=collection1 org.apache.solr.core.SolrCore@436e1b34 url=http://127.0.0.1:28102/solr/collection1 node=127.0.0.1:28102_solr
[junit4:junit4]   2> 20315 T127 C5 P28102 oasc.RecoveryStrategy.run Starting recovery process.  core=collection1 recoveringAfterStartup=true
[junit4:junit4]   2> 20316 T127 C5 P28102 oasc.RecoveryStrategy.doRecovery ###### startupVersions=[]
[junit4:junit4]   2> 20315 T52 oascc.ZkStateReader.updateClusterState Updating cloud state from ZooKeeper... 
[junit4:junit4]   2> 20317 T127 C5 P28102 oasc.RecoveryStrategy.doRecovery Attempting to PeerSync from http://127.0.0.1:42159/solr/collection1/ core=collection1 - recoveringAfterStartup=true
[junit4:junit4]   2> 20318 T127 C5 P28102 oasu.PeerSync.sync PeerSync: core=collection1 url=http://127.0.0.1:28102/solr START replicas=[http://127.0.0.1:42159/solr/collection1/] nUpdates=100
[junit4:junit4]   2> 20318 T52 oass.SolrDispatchFilter.init user.dir=/usr/home/hudson/hudson-slave/workspace/Lucene-Solr-Tests-4.x-java7/solr/build/solr-core/test/J1
[junit4:junit4]   2> 20319 T127 C5 P28102 oasu.PeerSync.sync WARNING no frame of reference to tell of we've missed updates
[junit4:junit4]   2> 20319 T52 oass.SolrDispatchFilter.init SolrDispatchFilter.init() done
[junit4:junit4]   2> 20320 T127 C5 P28102 oasc.RecoveryStrategy.doRecovery PeerSync Recovery was not successful - trying replication. core=collection1
[junit4:junit4]   2> 20321 T127 C5 P28102 oasc.RecoveryStrategy.doRecovery Starting Replication Recovery. core=collection1
[junit4:junit4]   2> 20321 T52 oascsi.HttpClientUtil.createClient Creating new http client, config:maxConnections=128&maxConnectionsPerHost=32&followRedirects=false
[junit4:junit4]   2> 20322 T127 C5 P28102 oascsi.HttpClientUtil.createClient Creating new http client, config:maxConnections=128&maxConnectionsPerHost=32&followRedirects=false
[junit4:junit4]   2> ASYNC  NEW_CORE C6 name=collection1 org.apache.solr.core.SolrCore@382cb2b0 url=http://127.0.0.1:42159/solr/collection1 node=127.0.0.1:42159_solr
[junit4:junit4]   2> 20331 T91 C6 P42159 REQ /get {distrib=false&qt=/get&wt=javabin&version=2&getVersions=100} status=0 QTime=0 
[junit4:junit4]   2> 20356 T52 oaz.ZooKeeper.<init> Initiating client connection, connectString=127.0.0.1:18135/solr sessionTimeout=10000 watcher=org.apache.solr.common.cloud.ConnectionManager@662d167e
[junit4:junit4]   2> 20357 T129 oaz.ClientCnxn$SendThread.startConnect Opening socket connection to server /127.0.0.1:18135
[junit4:junit4]   2> 20357 T52 oascc.ConnectionManager.waitForConnected Waiting for client to connect to ZooKeeper
[junit4:junit4]   2> 20358 T129 oaz.ClientCnxn$SendThread.primeConnection Socket connection established to localhost/127.0.0.1:18135, initiating session
[junit4:junit4]   2> 20359 T54 oazs.NIOServerCnxn$Factory.run Accepted socket connection from /140.211.11.196:35479
[junit4:junit4]   2> 20359 T54 oazs.NIOServerCnxn.readConnectRequest Client attempting to establish new session at /140.211.11.196:35479
[junit4:junit4]   2> 20361 T58 oazs.NIOServerCnxn.finishSessionInit Established session 0x139e3d1d6370007 with negotiated timeout 10000 for client /140.211.11.196:35479
[junit4:junit4]   2> 20361 T129 oaz.ClientCnxn$SendThread.readConnectResult Session establishment complete on server localhost/127.0.0.1:18135, sessionid = 0x139e3d1d6370007, negotiated timeout = 10000
[junit4:junit4]   2> 20362 T130 oascc.ConnectionManager.process Watcher org.apache.solr.common.cloud.ConnectionManager@662d167e name:ZooKeeperConnection Watcher:127.0.0.1:18135/solr got event WatchedEvent state:SyncConnected type:None path:null path:null type:None
[junit4:junit4]   2> 20362 T52 oascc.ConnectionManager.waitForConnected Client is connected to ZooKeeper
[junit4:junit4]   2> 20364 T52 oascc.ZkStateReader.createClusterStateWatchersAndUpdate Updating cluster state from ZooKeeper... 
[junit4:junit4]   2> 20370 T52 oasc.ChaosMonkey.monkeyLog monkey: init - expire sessions:true cause connection loss:true
[junit4:junit4]   2> 20372 T52 oascsi.HttpClientUtil.createClient Creating new http client, config:
[junit4:junit4]   2> 20394 T52 oascc.ZkStateReader.updateClusterState Updating cloud state from ZooKeeper... 
[junit4:junit4]   2> ASYNC  NEW_CORE C7 name=collection1 org.apache.solr.core.SolrCore@33c06b38 url=http://127.0.0.1:12784/solr/collection1 node=127.0.0.1:12784_solr
[junit4:junit4]   2> 20502 T64 C7 P12784 oascsi.HttpClientUtil.createClient Creating new http client, config:maxConnections=500&maxConnectionsPerHost=16
[junit4:junit4]   2> 20546 T64 C7 P12784 oasc.SolrDeletionPolicy.onInit SolrDeletionPolicy.onInit: commits:num=1
[junit4:junit4]   2> 		commit{dir=NRTCachingDirectory(org.apache.lucene.store.NIOFSDirectory@/usr/home/hudson/hudson-slave/workspace/Lucene-Solr-Tests-4.x-java7/solr/build/solr-core/test/J1/org.apache.solr.cloud.BasicDistributedZk2Test-1348146943103/control/data/index lockFactory=org.apache.lucene.store.NativeFSLockFactory@231d8cb8; maxCacheMB=48.0 maxMergeSizeMB=4.0),segFN=segments_1,generation=1,filenames=[segments_1]
[junit4:junit4]   2> 20547 T64 C7 P12784 oasc.SolrDeletionPolicy.updateCommits newest commit = 1
[junit4:junit4]   2> 20550 T74 oascc.ZkStateReader.updateClusterState Updating cloud state from ZooKeeper... 
[junit4:junit4]   2> 20567 T130 oascc.ZkStateReader$2.process A cluster state change has occurred - updating...
[junit4:junit4]   2> 20567 T99 oascc.ZkStateReader$2.process A cluster state change has occurred - updating...
[junit4:junit4]   2> 20567 T87 oascc.ZkStateReader$2.process A cluster state change has occurred - updating...
[junit4:junit4]   2> 20567 T125 oascc.ZkStateReader$2.process A cluster state change has occurred - updating...
[junit4:junit4]   2> 20567 T73 oascc.ZkStateReader$2.process A cluster state change has occurred - updating...
[junit4:junit4]   2> 20567 T111 oascc.ZkStateReader$2.process A cluster state change has occurred - updating...
[junit4:junit4]   2> 20589 T64 C7 P12784 /update {wt=javabin&version=2} {add=[1 (1413634550544728064)]} 0 101
[junit4:junit4]   2> 20591 T52 oaz.ZooKeeper.<init> Initiating client connection, connectString=127.0.0.1:18135/solr sessionTimeout=10000 watcher=org.apache.solr.common.cloud.ConnectionManager@1b6ac76b
[junit4:junit4]   2> 20593 T131 oaz.ClientCnxn$SendThread.startConnect Opening socket connection to server /127.0.0.1:18135
[junit4:junit4]   2> 20593 T52 oascc.ConnectionManager.waitForConnected Waiting for client to connect to ZooKeeper
[junit4:junit4]   2> 20594 T131 oaz.ClientCnxn$SendThread.primeConnection Socket connection established to localhost/127.0.0.1:18135, initiating session
[junit4:junit4]   2> 20594 T54 oazs.NIOServerCnxn$Factory.run Accepted socket connection from /140.211.11.196:14075
[junit4:junit4]   2> 20595 T54 oazs.NIOServerCnxn.readConnectRequest Client attempting to establish new session at /140.211.11.196:14075
[junit4:junit4]   2> 20597 T58 oazs.NIOServerCnxn.finishSessionInit Established session 0x139e3d1d6370008 with negotiated timeout 10000 for client /140.211.11.196:14075
[junit4:junit4]   2> 20597 T131 oaz.ClientCnxn$SendThread.readConnectResult Session establishment complete on server localhost/127.0.0.1:18135, sessionid = 0x139e3d1d6370008, negotiated timeout = 10000
[junit4:junit4]   2> 20598 T132 oascc.ConnectionManager.process Watcher org.apache.solr.common.cloud.ConnectionManager@1b6ac76b name:ZooKeeperConnection Watcher:127.0.0.1:18135/solr got event WatchedEvent state:SyncConnected type:None path:null path:null type:None
[junit4:junit4]   2> 20598 T52 oascc.ConnectionManager.waitForConnected Client is connected to ZooKeeper
[junit4:junit4]   2> 20600 T52 oascc.ZkStateReader.createClusterStateWatchersAndUpdate Updating cluster state from ZooKeeper... 
[junit4:junit4]   2> 20686 T81 C4 P14978 oasc.SolrDeletionPolicy.onInit SolrDeletionPolicy.onInit: commits:num=1
[junit4:junit4]   2> 		commit{dir=NRTCachingDirectory(org.apache.lucene.store.NIOFSDirectory@/usr/home/hudson/hudson-slave/workspace/Lucene-Solr-Tests-4.x-java7/solr/build/solr-core/test/J1/org.apache.solr.cloud.BasicDistributedZk2Test-1348146943103/jetty1/index lockFactory=org.apache.lucene.store.NativeFSLockFactory@6ef784bf; maxCacheMB=48.0 maxMergeSizeMB=4.0),segFN=segments_1,generation=1,filenames=[segments_1]
[junit4:junit4]   2> 20687 T81 C4 P14978 oasc.SolrDeletionPolicy.updateCommits newest commit = 1
[junit4:junit4]   2>  C3_STATE=coll:collection1 core:collection1 props:{shard=shard1, roles=null, state=recovering, core=collection1, collection=collection1, node_name=127.0.0.1:10792_solr, base_url=http://127.0.0.1:10792/solr}
[junit4:junit4]   2> 20714 T103 C3 P10792 oasc.SolrDeletionPolicy.onInit SolrDeletionPolicy.onInit: commits:num=1
[junit4:junit4]   2> 		commit{dir=NRTCachingDirectory(org.apache.lucene.store.NIOFSDirectory@/usr/home/hudson/hudson-slave/workspace/Lucene-Solr-Tests-4.x-java7/solr/build/solr-core/test/J1/org.apache.solr.cloud.BasicDistributedZk2Test-1348146943103/jetty3/index lockFactory=org.apache.lucene.store.NativeFSLockFactory@7a231ee2; maxCacheMB=48.0 maxMergeSizeMB=4.0),segFN=segments_1,generation=1,filenames=[segments_1]
[junit4:junit4]   2> 20715 T103 C3 P10792 oasc.SolrDeletionPolicy.updateCommits newest commit = 1
[junit4:junit4]   2> 20724 T103 C3 P10792 REQ /update {update.distrib=FROMLEADER&distrib.from=http://127.0.0.1:14978/solr/collection1/&wt=javabin&version=2} status=0 QTime=16 
[junit4:junit4]   2> 20726 T81 C4 P14978 REQ /update {distrib.from=http://127.0.0.1:42159/solr/collection1/&update.distrib=TOLEADER&wt=javabin&version=2} status=0 QTime=47 
[junit4:junit4]   2> 20727 T94 C6 P42159 /update {wt=javabin&version=2} {add=[1]} 0 102
[junit4:junit4]   2> 20728 T52 oasc.AbstractDistribZkTestBase.waitForRecoveriesToFinish Wait for recoveries to finish - collection: collection1 failOnTimeout:true timeout (sec):1800
[junit4:junit4]   2> 20729 T52 oascc.ZkStateReader.updateClusterState Updating cloud state from ZooKeeper... 
[junit4:junit4]   2> 21434 T113 C3 P10792 oasc.RecoveryStrategy.doRecovery Begin buffering updates. core=collection1
[junit4:junit4]   2> 21434 T113 C3 P10792 oasu.UpdateLog.bufferUpdates Starting to buffer updates. FSUpdateLog{state=ACTIVE, tlog=tlog{file=./org.apache.solr.cloud.BasicDistributedZk2Test-1348146943103/jetty3/tlog/tlog.0000000000000000000 refcount=1}}
[junit4:junit4]   2> 21435 T113 C3 P10792 oasc.RecoveryStrategy.replicate Attempting to replicate from http://127.0.0.1:14978/solr/collection1/. core=collection1
[junit4:junit4]   2> 21436 T113 C3 P10792 oascsi.HttpClientUtil.createClient Creating new http client, config:maxConnections=128&maxConnectionsPerHost=32&followRedirects=false
[junit4:junit4]   2> 21462 T82 C4 P14978 oasu.DirectUpdateHandler2.commit start commit{flags=0,_version_=0,optimize=false,openSearcher=true,waitSearcher=true,expungeDeletes=false,softCommit=false}
[junit4:junit4]   2> 21618 T82 C4 P14978 oasc.SolrDeletionPolicy.onCommit SolrDeletionPolicy.onCommit: commits:num=2
[junit4:junit4]   2> 		commit{dir=NRTCachingDirectory(org.apache.lucene.store.NIOFSDirectory@/usr/home/hudson/hudson-slave/workspace/Lucene-Solr-Tests-4.x-java7/solr/build/solr-core/test/J1/org.apache.solr.cloud.BasicDistributedZk2Test-1348146943103/jetty1/index lockFactory=org.apache.lucene.store.NativeFSLockFactory@6ef784bf; maxCacheMB=48.0 maxMergeSizeMB=4.0),segFN=segments_1,generation=1,filenames=[segments_1]
[junit4:junit4]   2> 		commit{dir=NRTCachingDirectory(org.apache.lucene.store.NIOFSDirectory@/usr/home/hudson/hudson-slave/workspace/Lucene-Solr-Tests-4.x-java7/solr/build/solr-core/test/J1/org.apache.solr.cloud.BasicDistributedZk2Test-1348146943103/jetty1/index lockFactory=org.apache.lucene.store.NativeFSLockFactory@6ef784bf; maxCacheMB=48.0 maxMergeSizeMB=4.0),segFN=segments_2,generation=2,filenames=[_0_Asserting_0.tim, _0.fnm, _0_Pulsing40_0.tim, _0_Asserting_0.tip, _0_Memory_0.ram, _0_nrm.cfs, _0_Pulsing40_1.prx, _0_Pulsing40_0.prx, _0_Pulsing40_0.frq, _0_Asserting_0.prx, _0_Asserting_0.frq, _0_Pulsing40_1.frq, _0_Pulsing40_1.tip, _0_Pulsing40_1.tim, _0_nrm.cfe, _0_Pulsing40_0.tip, segments_2, _0.fdx, _0.si, _0.fdt]
[junit4:junit4]   2> 21619 T82 C4 P14978 oasc.SolrDeletionPolicy.updateCommits newest commit = 2
[junit4:junit4]   2> 21649 T82 C4 P14978 oass.SolrIndexSearcher.<init> Opening Searcher@a4f4f54 main
[junit4:junit4]   2> 21651 T82 C4 P14978 oasu.DirectUpdateHandler2.commit end_commit_flush
[junit4:junit4]   2> 21654 T88 oasc.SolrCore.registerSearcher [collection1] Registered new searcher Searcher@a4f4f54 main{StandardDirectoryReader(segments_2:3 _0(4.0.0.2):C1)}
[junit4:junit4]   2> 21655 T82 C4 P14978 /update {waitSearcher=true&commit=true&commit_end_point=true&wt=javabin&softCommit=false&version=2} {commit=} 0 193
[junit4:junit4]   2> 21714 T113 C3 P10792 oash.ReplicationHandler.inform Commits will be reserved for  10000
[junit4:junit4]   2> 21715 T113 C3 P10792 oascsi.HttpClientUtil.createClient Creating new http client, config:connTimeout=5000&socketTimeout=20000&allowCompression=false&maxConnections=10000&maxConnectionsPerHost=10000
[junit4:junit4]   2> 21733 T52 oascc.ZkStateReader.updateClusterState Updating cloud state from ZooKeeper... 
[junit4:junit4]   2> 21744 T113 C3 P10792 oash.SnapPuller.<init>  No value set for 'pollInterval'. Timer Task not started.
[junit4:junit4]   2> 21811 T84 C4 P14978 oash.ReplicationHandler.inform Commits will be reserved for  10000
[junit4:junit4]   2> 21811 T84 C4 P14978 REQ /replication {command=indexversion&wt=javabin&qt=/replication&version=2} status=0 QTime=64 
[junit4:junit4]   2> 21813 T113 C3 P10792 oash.SnapPuller.fetchLatestIndex Master's generation: 2
[junit4:junit4]   2> 21814 T113 C3 P10792 oash.SnapPuller.fetchLatestIndex Slave's generation: 1
[junit4:junit4]   2> 21814 T113 C3 P10792 oash.SnapPuller.fetchLatestIndex Starting replication process
[junit4:junit4]   2> 21822 T84 C4 P14978 REQ /replication {command=filelist&generation=2&wt=javabin&qt=/replication&version=2} status=0 QTime=4 
[junit4:junit4]   2> 21825 T113 C3 P10792 oash.SnapPuller.fetchLatestIndex Number of files in latest index in master: 20
[junit4:junit4]   2> 21835 T113 C3 P10792 oash.SnapPuller.fetchLatestIndex Starting download to ./org.apache.solr.cloud.BasicDistributedZk2Test-1348146943103/jetty3/index.20120920081604925 fullCopy=true
[junit4:junit4]   2> 21852 T84 C4 P14978 REQ /replication {file=_0_Asserting_0.tim&command=filecontent&checksum=true&generation=2&qt=/replication&wt=filestream} status=0 QTime=6 
[junit4:junit4]   2> 21872 T84 C4 P14978 REQ /replication {file=_0_Pulsing40_0.tim&command=filecontent&checksum=true&generation=2&qt=/replication&wt=filestream} status=0 QTime=0 
[junit4:junit4]   2> 21878 T84 C4 P14978 REQ /replication {file=_0.fnm&command=filecontent&checksum=true&generation=2&qt=/replication&wt=filestream} status=0 QTime=1 
[junit4:junit4]   2> 21884 T84 C4 P14978 REQ /replication {file=_0_Asserting_0.tip&command=filecontent&checksum=true&generation=2&qt=/replication&wt=filestream} status=0 QTime=1 
[junit4:junit4]   2> 21890 T84 C4 P14978 REQ /replication {file=_0_Memory_0.ram&command=filecontent&checksum=true&generation=2&qt=/replication&wt=filestream} status=0 QTime=1 
[junit4:junit4]   2> 21896 T84 C4 P14978 REQ /replication {file=_0_nrm.cfs&command=filecontent&checksum=true&generation=2&qt=/replication&wt=filestream} status=0 QTime=0 
[junit4:junit4]   2> 21903 T84 C4 P14978 REQ /replication {file=_0_Pulsing40_0.prx&command=filecontent&checksum=true&generation=2&qt=/replication&wt=filestream} status=0 QTime=1 
[junit4:junit4]   2> 21909 T84 C4 P14978 REQ /replication {file=_0_Pulsing40_1.prx&command=filecontent&checksum=true&generation=2&qt=/replication&wt=filestream} status=0 QTime=1 
[junit4:junit4]   2> 21916 T84 C4 P14978 REQ /replication {file=_0_Pulsing40_0.frq&command=filecontent&checksum=true&generation=2&qt=/replication&wt=filestream} status=0 QTime=1 
[junit4:junit4]   2> 21935 T84 C4 P14978 REQ /replication {file=_0_Asserting_0.prx&command=filecontent&checksum=true&generation=2&qt=/replication&wt=filestream} status=0 QTime=0 
[junit4:junit4]   2> 21941 T84 C4 P14978 REQ /replication {file=_0_Asserting_0.frq&command=filecontent&checksum=true&generation=2&qt=/replication&wt=filestream} status=0 QTime=1 
[junit4:junit4]   2> 21947 T84 C4 P14978 REQ /replication {file=_0_Pulsing40_1.tip&command=filecontent&checksum=true&generation=2&qt=/replication&wt=filestream} status=0 QTime=1 
[junit4:junit4]   2> 21960 T84 C4 P14978 REQ /replication {file=_0_Pulsing40_1.frq&command=filecontent&checksum=true&generation=2&qt=/replication&wt=filestream} status=0 QTime=8 
[junit4:junit4]   2> 21967 T84 C4 P14978 REQ /replication {file=_0_Pulsing40_1.tim&command=filecontent&checksum=true&generation=2&qt=/replication&wt=filestream} status=0 QTime=0 
[junit4:junit4]   2> 21974 T84 C4 P14978 REQ /replication {file=_0_nrm.cfe&command=filecontent&checksum=true&generation=2&qt=/replication&wt=filestream} status=0 QTime=1 
[junit4:junit4]   2> 21980 T84 C4 P14978 REQ /replication {file=segments_2&command=filecontent&checksum=true&generation=2&qt=/replication&wt=filestream} status=0 QTime=1 
[junit4:junit4]   2> 21986 T84 C4 P14978 REQ /replication {file=_0_Pulsing40_0.tip&command=filecontent&checksum=true&generation=2&qt=/replication&wt=filestream} status=0 QTime=1 
[junit4:junit4]   2> 21992 T84 C4 P14978 REQ /replication {file=_0.fdx&command=filecontent&checksum=true&generation=2&qt=/replication&wt=filestream} status=0 QTime=1 
[junit4:junit4]   2> 22008 T84 C4 P14978 REQ /replication {file=_0.si&command=filecontent&checksum=true&generation=2&qt=/replication&wt=filestream} status=0 QTime=0 
[junit4:junit4]   2> 22014 T84 C4 P14978 REQ /replication {file=_0.fdt&command=filecontent&checksum=true&generation=2&qt=/replication&wt=filestream} status=0 QTime=1 
[junit4:junit4]   2> 22016 T113 C3 P10792 oash.SnapPuller.fetchLatestIndex Total time taken for download : 0 secs
[junit4:junit4]   2> 22016 T113 C3 P10792 oash.SnapPuller.modifyIndexProps New index installed. Updating index properties... index=index.20120920081604925
[junit4:junit4]   2> 22028 T113 C3 P10792 oasu.DefaultSolrCoreState.newIndexWriter Creating new IndexWriter...
[junit4:junit4]   2> 22029 T113 C3 P10792 oasu.DefaultSolrCoreState.newIndexWriter Waiting until IndexWriter is unused... core=collection1
[junit4:junit4]   2> 22029 T113 C3 P10792 oasu.DefaultSolrCoreState.newIndexWriter Rollback old IndexWriter... core=collection1
[junit4:junit4]   2> 22035 T113 C3 P10792 oasc.SolrCore.getNewIndexDir WARNING New index directory detected: old=./org.apache.solr.cloud.BasicDistributedZk2Test-1348146943103/jetty3/index/ new=./org.apache.solr.cloud.BasicDistributedZk2Test-1348146943103/jetty3/index.20120920081604925
[junit4:junit4]   2> 22042 T113 C3 P10792 oasc.CachingDirectoryFactory.get return new directory for /usr/home/hudson/hudson-slave/workspace/Lucene-Solr-Tests-4.x-java7/solr/build/solr-core/test/J1/./org.apache.solr.cloud.BasicDistributedZk2Test-1348146943103/jetty3/index.20120920081604925 forceNew:true
[junit4:junit4]   2> 22056 T113 C3 P10792 oasc.SolrDeletionPolicy.onInit SolrDeletionPolicy.onInit: commits:num=1
[junit4:junit4]   2> 		commit{dir=NRTCachingDirectory(org.apache.lucene.store.NIOFSDirectory@/usr/home/hudson/hudson-slave/workspace/Lucene-Solr-Tests-4.x-java7/solr/build/solr-core/test/J1/org.apache.solr.cloud.BasicDistributedZk2Test-1348146943103/jetty3/index.20120920081604925 lockFactory=org.apache.lucene.store.NativeFSLockFactory@72f05a6e; maxCacheMB=48.0 maxMergeSizeMB=4.0),segFN=segments_2,generation=2,filenames=[_0_Asserting_0.tim, _0.fnm, _0_Pulsing40_0.tim, _0_Asserting_0.tip, _0_Memory_0.ram, _0_nrm.cfs, _0_Pulsing40_1.prx, _0_Pulsing40_0.prx, _0_Pulsing40_0.frq, _0_Asserting_0.prx, _0_Asserting_0.frq, _0_Pulsing40_1.tip, _0_Pulsing40_1.frq, _0_Pulsing40_1.tim, _0_nrm.cfe, _0_Pulsing40_0.tip, segments_2, _0.fdx, _0.si, _0.fdt]
[junit4:junit4]   2> 22056 T113 C3 P10792 oasc.SolrDeletionPolicy.updateCommits newest commit = 2
[junit4:junit4]   2> 22057 T113 C3 P10792 oasu.DefaultSolrCoreState.newIndexWriter New IndexWriter is ready to be used.
[junit4:junit4]   2> 22071 T113 C3 P10792 oass.SolrIndexSearcher.<init> Opening Searcher@750ecc6b main
[junit4:junit4]   2> 22075 T112 oasc.SolrCore.registerSearcher [collection1] Registered new searcher Searcher@750ecc6b main{StandardDirectoryReader(segments_2:3:nrt _0(4.0.0.2):C1)}
[junit4:junit4]   2> 22076 T112 oasc.CachingDirectoryFactory.close Closing directory:/usr/home/hudson/hudson-slave/workspace/Lucene-Solr-Tests-4.x-java7/solr/build/solr-core/test/J1/./org.apache.solr.cloud.BasicDistributedZk2Test-1348146943103/jetty3/index
[junit4:junit4]   2> 22076 T112 oash.SnapPuller$2.onClose removing old index directory ./org.apache.solr.cloud.BasicDistributedZk2Test-1348146943103/jetty3/index
[junit4:junit4]   2> 22079 T113 C3 P10792 oasu.DirectUpdateHandler2.commit start commit{flags=0,_version_=0,optimize=false,openSearcher=false,waitSearcher=false,expungeDeletes=false,softCommit=false}
[junit4:junit4]   2> 22081 T113 C3 P10792 oasu.DirectUpdateHandler2.commit end_commit_flush
[junit4:junit4]   2> 22087 T113 C3 P10792 oasc.RecoveryStrategy.replay Replaying buffered documents. core=collection1
[junit4:junit4]   2> 22088 T136 C3 P10792 oasu.UpdateLog$LogReplayer.doReplay WARNING Starting log replay tlog{file=./org.apache.solr.cloud.BasicDistributedZk2Test-1348146943103/jetty3/tlog/tlog.0000000000000000000 refcount=2} active=true starting pos=434
[junit4:junit4]   2> 22093 T136 C3 P10792 oasu.DirectUpdateHandler2.commit start commit{flags=2,_version_=0,optimize=false,openSearcher=true,waitSearcher=true,expungeDeletes=false,softCommit=false}
[junit4:junit4]   2> 22095 T136 C3 P10792 oass.SolrIndexSearcher.<init> Opening Searcher@7126317a main
[junit4:junit4]   2> 22097 T136 C3 P10792 oasu.DirectUpdateHandler2.commit end_commit_flush
[junit4:junit4]   2> 22099 T112 oasc.SolrCore.registerSearcher [collection1] Registered new searcher Searcher@7126317a main{StandardDirectoryReader(segments_2:3:nrt _0(4.0.0.2):C1)}
[junit4:junit4]   2> 22100 T136 C3 P10792 oasu.UpdateLog$LogReplayer.run WARNING Log replay finished. recoveryInfo=RecoveryInfo{adds=0 deletes=0 deleteByQuery=0 errors=0 positionOfStart=434}
[junit4:junit4]   2> 22101 T113 C3 P10792 oasc.RecoveryStrategy.doRecovery Replication Recovery was successful - registering as Active. core=collection1
[junit4:junit4]   2> 22103 T113 C3 P10792 oasc.RecoveryStrategy.doRecovery Finished recovery process. core=collection1
[junit4:junit4]   2> 22583 T74 oascc.ZkStateReader.updateClusterState Updating cloud state from ZooKeeper... 
[junit4:junit4]   2> 22599 T130 oascc.ZkStateReader$2.process A cluster state change has occurred - updating...
[junit4:junit4]   2> 22599 T87 oascc.ZkStateReader$2.process A cluster state change has occurred - updating...
[junit4:junit4]   2> 22599 T73 oascc.ZkStateReader$2.process A cluster state change has occurred - updating...
[junit4:junit4]   2> 22599 T132 oascc.ZkStateReader$2.process A cluster state change has occurred - updating...
[junit4:junit4]   2> 22599 T125 oascc.ZkStateReader$2.process A cluster state change has occurred - updating...
[junit4:junit4]   2> 22599 T111 oascc.ZkStateReader$2.process A cluster state change has occurred - updating...
[junit4:junit4]   2> 22599 T99 oascc.ZkStateReader$2.process A cluster state change has occurred - updating...
[junit4:junit4]   2> 22735 T52 oascc.ZkStateReader.updateClusterState Updating cloud state from ZooKeeper... 
[junit4:junit4]   2>  C5_STATE=coll:collection1 core:collection1 props:{shard=shard2, roles=null, state=recovering, core=collection1, collection=collection1, node_name=127.0.0.1:28102_solr, base_url=http://127.0.0.1:28102/solr}
[junit4:junit4]   2> 23350 T127 C5 P28102 oasc.RecoveryStrategy.doRecovery Begin buffering updates. core=collection1
[junit4:junit4]   2> 23350 T127 C5 P28102 oasu.UpdateLog.bufferUpdates Starting to buffer updates. FSUpdateLog{state=ACTIVE, tlog=null}
[junit4:junit4]   2> 23351 T127 C5 P28102 oasc.RecoveryStrategy.replicate Attempting to replicate from http://127.0.0.1:42159/solr/collection1/. core=collection1
[junit4:junit4]   2> 23351 T127 C5 P28102 oascsi.HttpClientUtil.createClient Creating new http client, config:maxConnections=128&maxConnectionsPerHost=32&followRedirects=false
[junit4:junit4]   2> 23370 T95 C6 P42159 oasu.DirectUpdateHandler2.commit start commit{flags=0,_version_=0,optimize=false,openSearcher=true,waitSearcher=true,expungeDeletes=false,softCommit=false}
[junit4:junit4]   2> 23378 T95 C6 P42159 oasc.SolrDeletionPolicy.onInit SolrDeletionPolicy.onInit: commits:num=1
[junit4:junit4]   2> 		commit{dir=NRTCachingDirectory(org.apache.lucene.store.NIOFSDirectory@/usr/home/hudson/hudson-slave/workspace/Lucene-Solr-Tests-4.x-java7/solr/build/solr-core/test/J1/org.apache.solr.cloud.BasicDistributedZk2Test-1348146943103/jetty2/index lockFactory=org.apache.lucene.store.NativeFSLockFactory@6f8242b2; maxCacheMB=48.0 maxMergeSizeMB=4.0),segFN=segments_1,generation=1,filenames=[segments_1]
[junit4:junit4]   2> 23380 T95 C6 P42159 oasc.SolrDeletionPolicy.updateCommits newest commit = 1
[junit4:junit4]   2> 23382 T95 C6 P42159 oass.SolrIndexSearcher.<init> Opening Searcher@6e89c15d main
[junit4:junit4]   2> 23384 T95 C6 P42159 oasu.DirectUpdateHandler2.commit end_commit_flush
[junit4:junit4]   2> 23386 T100 oasc.SolrCore.registerSearcher [collection1] Registered new searcher Searcher@6e89c15d main{StandardDirectoryReader(segments_1:1)}
[junit4:junit4]   2> 23387 T95 C6 P42159 /update {waitSearcher=true&commit=true&commit_end_point=true&wt=javabin&softCommit=false&version=2} {commit=} 0 17
[junit4:junit4]   2> 23389 T127 C5 P28102 oash.ReplicationHandler.inform Commits will be reserved for  10000
[junit4:junit4]   2> 23389 T127 C5 P28102 oash.SnapPuller.<init>  No value set for 'pollInterval'. Timer Task not started.
[junit4:junit4]   2> 23393 T96 C6 P42159 oash.ReplicationHandler.inform Commits will be reserved for  10000
[junit4:junit4]   2> 23394 T96 C6 P42159 REQ /replication {command=indexversion&wt=javabin&qt=/replication&version=2} status=0 QTime=2 
[junit4:junit4]   2> 23400 T127 C5 P28102 oasc.SolrDeletionPolicy.onInit SolrDeletionPolicy.onInit: commits:num=1
[junit4:junit4]   2> 		commit{dir=NRTCachingDirectory(org.apache.lucene.store.NIOFSDirectory@/usr/home/hudson/hudson-slave/workspace/Lucene-Solr-Tests-4.x-java7/solr/build/solr-core/test/J1/org.apache.solr.cloud.BasicDistributedZk2Test-1348146943103/jetty4/index lockFactory=org.apache.lucene.store.NativeFSLockFactory@532b3afd; maxCacheMB=48.0 maxMergeSizeMB=4.0),segFN=segments_1,generation=1,filenames=[segments_1]
[junit4:junit4]   2> 23401 T127 C5 P28102 oasc.SolrDeletionPolicy.updateCommits newest commit = 1
[junit4:junit4]   2> 23402 T127 C5 P28102 oasu.DirectUpdateHandler2.commit start commit{flags=0,_version_=0,optimize=false,openSearcher=true,waitSearcher=true,expungeDeletes=false,softCommit=false}
[junit4:junit4]   2> 23406 T127 C5 P28102 oasc.SolrDeletionPolicy.onCommit SolrDeletionPolicy.onCommit: commits:num=2
[junit4:junit4]   2> 		commit{dir=NRTCachingDirectory(org.apache.lucene.store.NIOFSDirectory@/usr/home/hudson/hudson-slave/workspace/Lucene-Solr-Tests-4.x-java7/solr/build/solr-core/test/J1/org.apache.solr.cloud.BasicDistributedZk2Test-1348146943103/jetty4/index lockFactory=org.apache.lucene.store.NativeFSLockFactory@532b3afd; maxCacheMB=48.0 maxMergeSizeMB=4.0),segFN=segments_1,generation=1,filenames=[segments_1]
[junit4:junit4]   2> 		commit{dir=NRTCachingDirectory(org.apache.lucene.store.NIOFSDirectory@/usr/home/hudson/hudson-slave/workspace/Lucene-Solr-Tests-4.x-java7/solr/build/solr-core/test/J1/org.apache.solr.cloud.BasicDistributedZk2Test-1348146943103/jetty4/index lockFactory=org.apache.lucene.store.NativeFSLockFactory@532b3afd; maxCacheMB=48.0 maxMergeSizeMB=4.0),segFN=segments_2,generation=2,filenames=[segments_2]
[junit4:junit4]   2> 23406 T127 C5 P28102 oasc.SolrDeletionPolicy.updateCommits newest commit = 2
[junit4:junit4]   2> 23410 T127 C5 P28102 oass.SolrIndexSearcher.<init> Opening Searcher@13df208f main
[junit4:junit4]   2> 23411 T127 C5 P28102 oasu.DirectUpdateHandler2.commit end_commit_flush
[junit4:junit4]   2> 23413 T126 oasc.SolrCore.registerSearcher [collection1] Registered new searcher Searcher@13df208f main{StandardDirectoryReader(segments_2:2)}
[junit4:junit4]   2> 23414 T127 C5 P28102 oasc.RecoveryStrategy.replay No replay needed. core=collection1
[junit4:junit4]   2> 23414 T127 C5 P28102 oasc.RecoveryStrategy.doRecovery Replication Recovery was successful - registering as Active. core=collection1
[junit4:junit4]   2> 23417 T127 C5 P28102 oasc.RecoveryStrategy.doRecovery Finished recovery process. core=collection1
[junit4:junit4]   2> 23610 T74 oascc.ZkStateReader.updateClusterState Updating cloud state from ZooKeeper... 
[junit4:junit4]   2> 23661 T130 oascc.ZkStateReader$2.process A cluster state change has occurred - updating...
[junit4:junit4]   2> 23661 T125 oascc.ZkStateReader$2.process A cluster state change has occurred - updating...
[junit4:junit4]   2> 23661 T99 oascc.ZkStateReader$2.process A cluster state change has occurred - updating...
[junit4:junit4]   2> 23661 T73 oascc.ZkStateReader$2.process A cluster state change has occurred - updating...
[junit4:junit4]   2> 23661 T111 oascc.ZkStateReader$2.process A cluster state change has occurred - updating...
[junit4:junit4]   2> 23661 T132 oascc.ZkStateReader$2.process A cluster state change has occurred - updating...
[junit4:junit4]   2> 23661 T87 oascc.ZkStateReader$2.process A cluster state change has occurred - updating...
[junit4:junit4]   2> 23738 T52 oascc.ZkStateReader.updateClusterState Updating cloud state from ZooKeeper... 
[junit4:junit4]   2> 23743 T64 C7 P12784 oasu.DirectUpdateHandler2.commit start commit{flags=0,_version_=0,optimize=false,openSearcher=true,waitSearcher=true,expungeDeletes=false,softCommit=false}
[junit4:junit4]   2> 24081 T64 C7 P12784 oasc.SolrDeletionPolicy.onCommit SolrDeletionPolicy.onCommit: commits:num=2
[junit4:junit4]   2> 		commit{dir=NRTCachingDirectory(org.apache.lucene.store.NIOFSDirectory@/usr/home/hudson/hudson-slave/workspace/Lucene-Solr-Tests-4.x-java7/solr/build/solr-core/test/J1/org.apache.solr.cloud.BasicDistributedZk2Test-1348146943103/control/data/index lockFactory=org.apache.lucene.store.NativeFSLockFactory@231d8cb8; maxCacheMB=48.0 maxMergeSizeMB=4.0),segFN=segments_1,generation=1,filenames=[segments_1]
[junit4:junit4]   2> 		commit{dir=NRTCachingDirectory(org.apache.lucene.store.NIOFSDirectory@/usr/home/hudson/hudson-slave/workspace/Lucene-Solr-Tests-4.x-java7/solr/build/solr-core/test/J1/org.apache.solr.cloud.BasicDistributedZk2Test-1348146943103/control/data/index lockFactory=org.apache.lucene.store.NativeFSLockFactory@231d8cb8; maxCacheMB=48.0 maxMergeSizeMB=4.0),segFN=segments_2,generation=2,filenames=[_0_Asserting_0.tim, _0.fnm, _0_Pulsing40_0.tim, _0_Asserting_0.tip, _0_Memory_0.ram, _0_nrm.cfs, _0_Pulsing40_1.prx, _0_Pulsing40_0.prx, _0_Pulsing40_0.frq, _0_Asserting_0.prx, _0_Asserting_0.frq, _0_Pulsing40_1.frq, _0_Pulsing40_1.tip, _0_Pulsing40_1.tim, _0_nrm.cfe, _0_Pulsing40_0.tip, segments_2, _0.fdx, _0.si, _0.fdt]
[junit4:junit4]   2> 24082 T64 C7 P12784 oasc.SolrDeletionPolicy.updateCommits newest commit = 2
[junit4:junit4]   2> 24104 T64 C7 P12784 oass.SolrIndexSearcher.<init> Opening Searcher@22aeabd4 main
[junit4:junit4]   2> 24106 T64 C7 P12784 oasu.DirectUpdateHandler2.commit end_commit_flush
[junit4:junit4]   2> 24109 T76 oasc.SolrCore.registerSearcher [collection1] Registered new searcher Searcher@22aeabd4 main{StandardDirectoryReader(segments_2:3 _0(4.0.0.2):C1)}
[junit4:junit4]   2> 24110 T64 C7 P12784 /update {waitSearcher=true&wt=javabin&commit=true&softCommit=false&version=2} {commit=} 0 367
[junit4:junit4]   2> 24113 T83 C4 P14978 oasu.DirectUpdateHandler2.commit start commit{flags=0,_version_=0,optimize=false,openSearcher=true,waitSearcher=true,expungeDeletes=false,softCommit=false}
[junit4:junit4]   2> 24123 T83 C4 P14978 oass.SolrIndexSearcher.<init> Opening Searcher@2f546050 main
[junit4:junit4]   2> 24125 T83 C4 P14978 oasu.DirectUpdateHandler2.commit end_commit_flush
[junit4:junit4]   2> 24127 T88 oasc.SolrCore.registerSearcher [collection1] Registered new searcher Searcher@2f546050 main{StandardDirectoryReader(segments_2:3 _0(4.0.0.2):C1)}
[junit4:junit4]   2> 24128 T83 C4 P14978 oasu.SolrCmdDistributor.distribCommit Distrib commit to:[StdNode: http://127.0.0.1:10792/solr/collection1/, StdNode: http://127.0.0.1:42159/solr/collection1/, StdNode: http://127.0.0.1:28102/solr/collection1/]
[junit4:junit4]   2> 24132 T97 C6 P42159 oasu.DirectUpdateHandler2.commit start commit{flags=0,_version_=0,optimize=false,openSearcher=true,waitSearcher=true,expungeDeletes=false,softCommit=false}
[junit4:junit4]   2>  C3_STATE=coll:collection1 core:collection1 props:{shard=shard1, roles=null, state=active, core=collection1, collection=collection1, node_name=127.0.0.1:10792_solr, base_url=http://127.0.0.1:10792/solr}
[junit4:junit4]   2> 24134 T103 C3 P10792 oasu.DirectUpdateHandler2.commit start commit{flags=0,_version_=0,optimize=false,openSearcher=true,waitSearcher=true,expungeDeletes=false,softCommit=false}
[junit4:junit4]   2> 24137 T103 C3 P10792 oass.SolrIndexSearcher.<init> Opening Searcher@40ca2376 main
[junit4:junit4]   2> 24139 T103 C3 P10792 oasu.DirectUpdateHandler2.commit end_commit_flush
[junit4:junit4]   2> 24140 T97 C6 P42159 oass.SolrIndexSearcher.<init> Opening Searcher@577dd24d main
[junit4:junit4]   2> 24140 T97 C6 P42159 oasu.DirectUpdateHandler2.commit end_commit_flush
[junit4:junit4]   2>  C5_STATE=coll:collection1 core:collection1 props:{shard=shard2, roles=null, state=active, core=collection1, collection=collection1, node_name=127.0.0.1:28102_solr, base_url=http://127.0.0.1:28102/solr}
[junit4:junit4]   2> 24143 T117 C5 P28102 oasu.DirectUpdateHandler2.commit start commit{flags=0,_version_=0,optimize=false,openSearcher=true,waitSearcher=true,expungeDeletes=false,softCommit=false}
[junit4:junit4]   2> 24143 T112 oasc.SolrCore.registerSearcher [collection1] Registered new searcher Searcher@40ca2376 main{StandardDirectoryReader(segments_2:3:nrt _0(4.0.0.2):C1)}
[junit4:junit4]   2> 24145 T100 oasc.SolrCore.registerSearcher [collection1] Registered new searcher Searcher@577dd24d main{StandardDirectoryReader(segments_1:1)}
[junit4:junit4]   2> 24145 T103 C3 P10792 /update {waitSearcher=true&commit=true&wt=javabin&commit_end_point=true&expungeDeletes=false&softCommit=false&version=2} {commit=} 0 11
[junit4:junit4]   2> 24146 T97 C6 P42159 /update {waitSearcher=true&commit=true&wt=javabin&commit_end_point=true&expungeDeletes=false&softCommit=false&version=2} {commit=} 0 14
[junit4:junit4]   2> 24148 T117 C5 P28102 oass.SolrIndexSearcher.<init> Opening Searcher@d6934df main
[junit4:junit4]   2> 24149 T117 C5 P28102 oasu.DirectUpdateHandler2.commit end_commit_flush
[junit4:junit4]   2> 24151 T126 oasc.SolrCore.registerSearcher [collection1] Registered new searcher Searcher@d6934df main{StandardDirectoryReader(segments_2:2)}
[junit4:junit4]   2> 24151 T117 C5 P28102 /update {waitSearcher=true&commit=true&wt=javabin&commit_end_point=true&expungeDeletes=false&softCommit=false&version=2} {commit=} 0 9
[junit4:junit4]   2> 24153 T83 C4 P14978 /update {waitSearcher=true&wt=javabin&commit=true&softCommit=false&version=2} {commit=} 0 40
[junit4:junit4]   2> 24267 T67 C7 P12784 REQ /select {fl=id,score&shard.url=127.0.0.1:12784/solr/collection1/&NOW=1348146967274&start=0&q=*:*&distrib=false&isShard=true&wt=javabin&fsv=true&rows=10&version=2} hits=1 status=0 QTime=87 
[junit4:junit4]   2> 24312 T67 C7 P12784 REQ /select {shard.url=127.0.0.1:12784/solr/collection1/&NOW=1348146967274&q=*:*&ids=1&distrib=false&isShard=true&wt=javabin&version=2} status=0 QTime=1 
[junit4:junit4]   2> 24315 T64 C7 P12784 REQ /select {wt=javabin&q=*:*&version=2} hits=1 status=0 QTime=140 
[junit4:junit4]   2> 24317 T52 oaz.ZooKeeper.<init> Initiating client connection, connectString=127.0.0.1:18135/solr sessionTimeout=10000 watcher=org.apache.solr.common.cloud.ConnectionManager@40d44732
[junit4:junit4]   2> 24318 T140 oaz.ClientCnxn$SendThread.startConnect Opening socket connection to server /127.0.0.1:18135
[junit4:junit4]   2> 24318 T52 oascc.ConnectionManager.waitForConnected Waiting for client to connect to ZooKeeper
[junit4:junit4]   2> 24320 T140 oaz.ClientCnxn$SendThread.primeConnection Socket connection established to localhost/127.0.0.1:18135, initiating session
[junit4:junit4]   2> 24320 T54 oazs.NIOServerCnxn$Factory.run Accepted socket connection from /140.211.11.196:31265
[junit4:junit4]   2> 24321 T54 oazs.NIOServerCnxn.readConnectRequest Client attempting to establish new session at /140.211.11.196:31265
[junit4:junit4]   2> 24328 T58 oazs.NIOServerCnxn.finishSessionInit Established session 0x139e3d1d6370009 with negotiated timeout 10000 for client /140.211.11.196:31265
[junit4:junit4]   2> 24328 T140 oaz.ClientCnxn$SendThread.readConnectResult Session establishment complete on server localhost/127.0.0.1:18135, sessionid = 0x139e3d1d6370009, negotiated timeout = 10000
[junit4:junit4]   2> 24329 T141 oascc.ConnectionManager.process Watcher org.apache.solr.common.cloud.ConnectionManager@40d44732 name:ZooKeeperConnection Watcher:127.0.0.1:18135/solr got event WatchedEvent state:SyncConnected type:None path:null path:null type:None
[junit4:junit4]   2> 24329 T52 oascc.ConnectionManager.waitForConnected Client is connected to ZooKeeper
[junit4:junit4]   2> 24331 T52 oascc.ZkStateReader.createClusterStateWatchersAndUpdate Updating cluster state from ZooKeeper... 
[junit4:junit4]   2> 24336 T59 oazs.PrepRequestProcessor.pRequest Processed session termination for sessionid: 0x139e3d1d6370009
[junit4:junit4]   2> 24353 T141 oaz.ClientCnxn$EventThread.run EventThread shut down
[junit4:junit4]   2> 24353 T52 oaz.ZooKeeper.close Session: 0x139e3d1d6370009 closed
[junit4:junit4]   2> 24353 T54 oazs.NIOServerCnxn.closeSock Closed socket connection for client /140.211.11.196:31265 which had sessionid 0x139e3d1d6370009
[junit4:junit4]   2> 24357 T85 C4 P14978 REQ /select {distrib=false&wt=javabin&q=*:*&version=2} hits=1 status=0 QTime=1 
[junit4:junit4]   2> 24362 T92 C6 P42159 REQ /select {distrib=false&wt=javabin&q=*:*&version=2} hits=0 status=0 QTime=0 
[junit4:junit4]   2> 24373 T93 C6 P42159 REQ /select {fl=id,score&shard.url=127.0.0.1:42159/solr/collection1/|127.0.0.1:28102/solr/collection1/&NOW=1348146967465&start=0&q=*:*&distrib=false&isShard=true&wt=javabin&fsv=true&rows=10&version=2} hits=0 status=0 QTime=0 
[junit4:junit4]   2> 24373 T105 C3 P10792 REQ /select {fl=id,score&shard.url=127.0.0.1:14978/solr/collection1/|127.0.0.1:10792/solr/collection1/&NOW=1348146967465&start=0&q=*:*&distrib=false&isShard=true&wt=javabin&fsv=true&rows=10&version=2} hits=1 status=0 QTime=0 
[junit4:junit4]   2> 24381 T105 C3 P10792 REQ /select {shard.url=127.0.0.1:14978/solr/collection1/|127.0.0.1:10792/solr/collection1/&NOW=1348146967465&q=*:*&ids=1&distrib=false&isShard=true&wt=javabin&version=2} status=0 QTime=1 
[junit4:junit4]   2> 24383 T104 C3 P10792 REQ /select {wt=javabin&q=*:*&version=2} hits=1 status=0 QTime=17 
[junit4:junit4]   2> 24401 T64 C7 P12784 /update {wt=javabin&version=2} {add=[2 (1413634554583842816)]} 0 10
[junit4:junit4]   2> 24430 T117 C5 P28102 REQ /update {distrib.from=http://127.0.0.1:42159/solr/collection1/&update.distrib=FROMLEADER&wt=javabin&version=2} status=0 QTime=10 
[junit4:junit4]   2> 24432 T94 C6 P42159 /update {wt=javabin&version=2} {add=[2 (1413634554599571456)]} 0 26
[junit4:junit4]   2> 24442 T64 C7 P12784 /update {wt=javabin&version=2} {add=[3 (1413634554631028736)]} 0 6
[junit4:junit4]   2> 24462 T117 C5 P28102 REQ /update {distrib.from=http://127.0.0.1:42159/solr/collection1/&update.distrib=FROMLEADER&wt=javabin&version=2} status=0 QTime=6 
[junit4:junit4]   2> 24464 T94 C6 P42159 /update {wt=javabin&version=2} {add=[3 (1413634554641514496)]} 0 17
[junit4:junit4]   2> 24474 T64 C7 P12784 /update {wt=javabin&version=2} {add=[4 (1413634554664583168)]} 0 6
[junit4:junit4]   2> 24506 T103 C3 P10792 REQ /update {distrib.from=http://127.0.0.1:14978/solr/collection1/&update.distrib=FROMLEADER&wt=javabin&version=2} status=0 QTime=9 
[junit4:junit4]   2> 24507 T83 C4 P14978 /update {wt=javabin&version=2} {add=[4 (1413634554676117504)]} 0 28
[junit4:junit4]   2> 24517 T64 C7 P12784 /update {wt=javabin&version=2} {add=[5 (1413634554709671936)]} 0 5
[junit4:junit4]   2> 24537 T117 C5 P28102 REQ /update {distrib.from=http://127.0.0.1:42159/solr/collection1/&update.distrib=FROMLEADER&wt=javabin&version=2} status=0 QTime=6 
[junit4:junit4]   2> 24538 T94 C6 P42159 /update {wt=javabin&version=2} {add=[5 (1413634554720157696)]} 0 17
[junit4:junit4]   2> 24548 T64 C7 P12784 /update {wt=javabin&version=2} {add=[6 (1413634554742177792)]} 0 5
[junit4:junit4]   2> 24571 T117 C5 P28102 REQ /update {distrib.from=http://127.0.0.1:42159/solr/collection1/&update.distrib=FROMLEADER&wt=javabin&version=2} status=0 QTime=6 
[junit4:junit4]   2> 24572 T94 C6 P42159 /update {wt=javabin&version=2} {add=[6 (1413634554753712128)]} 0 19
[junit4:junit4]   2> 24583 T64 C7 P12784 /update {wt=javabin&version=2} {add=[7 (1413634554778877952)]} 0 6
[junit4:junit4]   2> 24609 T117 C5 P28102 REQ /update {update.distrib=FROMLEADER&distrib.from=http://127.0.0.1:42159/solr/collection1/&wt=javabin&version=2} status=0 QTime=6 
[junit4:junit4]   2> 24610 T97 C6 P42159 REQ /update {distrib.from=http://127.0.0.1:14978/solr/collection1/&update.distrib=TOLEADER&wt=javabin&version=2} status=0 QTime=17 
[junit4:junit4]   2> 24611 T83 C4 P14978 /update {wt=javabin&version=2} {add=[7]} 0 24
[junit4:junit4]   2> 24622 T64 C7 P12784 /update {wt=javabin&version=2} {add=[8 (1413634554819772416)]} 0 6
[junit4:junit4]   2> 24641 T103 C3 P10792 REQ /update {distrib.from=http://127.0.0.1:14978/solr/collection1/&update.distrib=FROMLEADER&wt=javabin&version=2} status=0 QTime=6 
[junit4:junit4]   2> 24643 T83 C4 P14978 /update {wt=javabin&version=2} {add=[8 (1413634554830258176)]} 0 16
[junit4:junit4]   2> 24654 T64 C7 P12784 /update {wt=javabin&version=2} {add=[9 (1413634554853326848)]} 0 6
[junit4:junit4]   2> 24673 T117 C5 P28102 REQ /update {distrib.from=http://127.0.0.1:42159/solr/collection1/&update.distrib=FROMLEADER&wt=javabin&version=2} status=0 QTime=6 
[junit4:junit4]   2> 24675 T94 C6 P42159 /update {wt=javabin&version=2} {add=[9 (1413634554862764032)]} 0 17
[junit4:junit4]   2> 24685 T64 C7 P12784 /update {wt=javabin&version=2} {add=[10 (1413634554885832704)]} 0 6
[junit4:junit4]   2> 24709 T103 C3 P10792 REQ /update {distrib.from=http://127.0.0.1:14978/solr/collection1/&update.distrib=FROMLEADER&wt=javabin&version=2} status=0 QTime=6 
[junit4:junit4]   2> 24710 T83 C4 P14978 /update {wt=javabin&version=2} {add=[10 (1413634554897367040)]} 0 20
[junit4:junit4]   2> 24772 T64 C7 P12784 /update {wt=javabin&version=2} {add=[11 (1413634554922532864)]} 0 57
[junit4:junit4]   2> 24795 T103 C3 P10792 REQ /update {distrib.from=http://127.0.0.1:14978/solr/collection1/&update.distrib=FROMLEADER&wt=javabin&version=2} status=0 QTime=6 
[junit4:junit4]   2> 24796 T83 C4 P14978 /update {wt=javabin&version=2} {add=[11 (1413634554987544576)]} 0 20
[junit4:junit4]   2> 24808 T64 C7 P12784 /update {wt=javabin&version=2} {add=[12 (1413634555012710400)]} 0 7
[junit4:junit4]   2> 24831 T103 C3 P10792 REQ /update {distrib.from=http://127.0.0.1:14978/solr/collection1/&update.distrib=FROMLEADER&wt=javabin&version=2} status=0 QTime=6 
[junit4:junit4]   2> 24832 T83 C4 P14978 /update {wt=javabin&version=2} {add=[12 (1413634555026341888)]} 0 19
[junit4:junit4]   2> 24843 T64 C7 P12784 /update {wt=javabin&version=2} {add=[13 (1413634555051507712)]} 0 6
[junit4:junit4]   2> 24866 T103 C3 P10792 REQ /update {distrib.from=http://127.0.0.1:14978/solr/collection1/&update.distrib=FROMLEADER&wt=javabin&version=2} status=0 QTime=6 
[junit4:junit4]   2> 24868 T83 C4 P14978 /update {wt=javabin&version=2} {add=[13 (1413634555061993472)]} 0 21
[junit4:junit4]   2> 24879 T64 C7 P12784 /update {wt=javabin&version=2} {add=[14 (1413634555089256448)]} 0 6
[junit4:junit4]   2> 24902 T103 C3 P10792 REQ /update {distrib.from=http://127.0.0.1:14978/solr/collection1/&update.distrib=FROMLEADER&wt=javabin&version=2} status=0 QTime=6 
[junit4:junit4]   2> 24904 T83 C4 P14978 /update {wt=javabin&version=2} {add=[14 (1413634555100790784)]} 0 20
[junit4:junit4]   2> 24915 T64 C7 P12784 /update {wt=javabin&version=2} {add=[15 (1413634555127005184)]} 0 6
[junit4:junit4]   2> 24938 T103 C3 P10792 REQ /update {update.distrib=FROMLEADER&distrib.from=http://127.0.0.1:14978/solr/collection1/&wt=javabin&version=2} status=0 QTime=5 
[junit4:junit4]   2> 24940 T81 C4 P14978 REQ /update {distrib.from=http://127.0.0.1:42159/solr/collection1/&update.distrib=TOLEADER&wt=javabin&version=2} status=0 QTime=17 
[junit4:junit4]   2> 24941 T94 C6 P42159 /update {wt=javabin&version=2} {add=[15]} 0 22
[junit4:junit4]   2> 24957 T64 C7 P12784 /update {wt=javabin&version=2} {add=[16 (1413634555172093952)]} 0 5
[junit4:junit4]   2> 24980 T103 C3 P10792 REQ /update {update.distrib=FROMLEADER&distrib.from=http://127.0.0.1:14978/solr/collection1/&wt=javabin&version=2} status=0 QTime=5 
[junit4:junit4]   2> 24982 T81 C4 P14978 REQ /update {distrib.from=http://127.0.0.1:42159/solr/collection1/&update.distrib=TOLEADER&wt=javabin&version=2} status=0 QTime=16 
[junit4:junit4]   2> 24983 T94 C6 P42159 /update {wt=javabin&version=2} {add=[16]} 0 21
[junit4:junit4]   2> 25009 T64 C7 P12784 /update {wt=javabin&version=2} {add=[17 (1413634555215085568)]} 0 20
[junit4:junit4]   2> 25059 T117 C5 P28102 REQ /update {distrib.from=http://127.0.0.1:42159/solr/collection1/&update.distrib=FROMLEADER&wt=javabin&version=2} status=0 QTime=20 
[junit4:junit4]   2> 25061 T94 C6 P42159 /update {wt=javabin&version=2} {add=[17 (1413634555242348544)]} 0 46
[junit4:junit4]   2> 25070 T64 C7 P12784 /update {wt=javabin&version=2} {add=[100 (1413634555289534464)]} 0 5
[junit4:junit4]   2> 25206 T103 C3 P10792 REQ /update {distrib.from=http://127.0.0.1:14978/solr/collection1/&update.distrib=FROMLEADER&wt=javabin&version=2} status=0 QTime=50 
[junit4:junit4]   2> 25207 T83 C4 P14978 /update {wt=javabin&version=2} {add=[100 (1413634555300020224)]} 0 133
[junit4:junit4]   2> 25216 T64 C7 P12784 /update {wt=javabin&version=2} {add=[101 (1413634555444723712)]} 0 4
[junit4:junit4]   2> 25235 T103 C3 P10792 REQ /update {distrib.from=http://127.0.0.1:14978/solr/collection1/&update.distrib=FROMLEADER&wt=javabin&version=2} status=0 QTime=5 
[junit4:junit4]   2> 25236 T83 C4 P14978 /update {wt=javabin&version=2} {add=[101 (1413634555452063744)]} 0 16
[junit4:junit4]   2> 25244 T64 C7 P12784 /update {wt=javabin&version=2} {add=[102 (1413634555474083840)]} 0 3
[junit4:junit4]   2> 25259 T103 C3 P10792 REQ /update {distrib.from=http://127.0.0.1:14978/solr/collection1/&update.distrib=FROMLEADER&wt=javabin&version=2} status=0 QTime=3 
[junit4:junit4]   2> 25260 T83 C4 P14978 /update {wt=javabin&version=2} {add=[102 (1413634555482472448)]} 0 11
[junit4:junit4]   2> 25303 T64 C7 P12784 /update {wt=javabin&version=2} {add=[103 (1413634555499249664)]} 0 39
[junit4:junit4]   2> 25314 T117 C5 P28102 REQ /update {distrib.from=http://127.0.0.1:42159/solr/collection1/&update.distrib=FROMLEADER&wt=javabin&version=2} status=0 QTime=3 
[junit4:junit4]   2> 25315 T94 C6 P42159 /update {wt=javabin&version=2} {add=[103 (1413634555543289856)]} 0 8
[junit4:junit4]   2> 25322 T64 C7 P12784 /update {wt=javabin&version=2} {add=[104 (1413634555555872768)]} 0 4
[junit4:junit4]   2> 25333 T117 C5 P28102 REQ /update {distrib.from=http://127.0.0.1:42159/solr/collection1/&update.distrib=FROMLEADER&wt=javabin&version=2} status=0 QTime=3 
[junit4:junit4]   2> 25334 T94 C6 P42159 /update {wt=javabin&version=2} {add=[104 (1413634555563212800)]} 0 9
[junit4:junit4]   2> 25340 T64 C7 P12784 /update {wt=javabin&version=2} {add=[105 (1413634555575795712)]} 0 3
[junit4:junit4]   2> 25395 T117 C5 P28102 REQ /update {distrib.from=http://127.0.0.1:42159/solr/collection1/&update.distrib=FROMLEADER&wt=javabin&version=2} status=0 QTime=22 
[junit4:junit4]   2> 25396 T94 C6 P42159 /update {wt=javabin&version=2} {add=[105 (1413634555582087168)]} 0 53
[junit4:junit4]   2> 25403 T64 C7 P12784 /update {wt=javabin&version=2} {add=[106 (1413634555641856000)]} 0 3
[junit4:junit4]   2> 25434 T117 C5 P28102 REQ /update {update.distrib=FROMLEADER&distrib.from=http://127.0.0.1:42159/solr/collection1/&wt=javabin&version=2} status=0 QTime=19 
[junit4:junit4]   2> 25435 T97 C6 P42159 REQ /update {distrib.from=http://127.0.0.1:14978/solr/collection1/&update.distrib=TOLEADER&wt=javabin&version=2} status=0 QTime=26 
[junit4:junit4]   2> 25436 T83 C4 P14978 /update {wt=javabin&version=2} {add=[106]} 0 30
[junit4:junit4]   2> 25442 T64 C7 P12784 /update {wt=javabin&version=2} {add=[107 (1413634555682750464)]} 0 3
[junit4:junit4]   2> 25454 T103 C3 P10792 REQ /update {distrib.from=http://127.0.0.1:14978/solr/collection1/&update.distrib=FROMLEADER&wt=javabin&version=2} status=0 QTime=3 
[junit4:junit4]   2> 25455 T83 C4 P14978 /update {wt=javabin&version=2} {add=[107 (1413634555689041920)]} 0 10
[junit4:junit4]   2> 25461 T64 C7 P12784 /update {wt=javabin&version=2} {add=[108 (1413634555702673408)]} 0 3
[junit4:junit4]   2> 25472 T103 C3 P10792 REQ /update {distrib.from=http://127.0.0.1:14978/solr/collection1/&update.distrib=FROMLEADER&wt=javabin&version=2} status=0 QTime=3 
[junit4:junit4]   2> 25473 T83 C4 P14978 /update {wt=javabin&version=2} {add=[108 (1413634555708964864)]} 0 9
[junit4:junit4]   2> 25479 T64 C7 P12784 /update {wt=javabin&version=2} {add=[109 (1413634555721547776)]} 0 3
[junit4:junit4]   2> 25491 T103 C3 P10792 REQ /update {distrib.from=http://127.0.0.1:14978/solr/collection1/&update.distrib=FROMLEADER&wt=javabin&version=2} status=0 QTime=3 
[junit4:junit4]   2> 25492 T83 C4 P14978 /update {wt=javabin&version=2} {add=[109 (1413634555728887808)]} 0 8
[junit4:junit4]   2> 25498 T64 C7 P12784 /update {wt=javabin&version=2} {add=[110 (1413634555741470720)]} 0 3
[junit4:junit4]   2> 25508 T103 C3 P10792 REQ /update {distrib.from=http://127.0.0.1:14978/solr/collection1/&update.distrib=FROMLEADER&wt=javabin&version=2} status=0 QTime=2 
[junit4:junit4]   2> 25509 T83 C4 P14978 /update {wt=javabin&version=2} {add=[110 (1413634555747762176)]} 0 8
[junit4:junit4]   2> 25515 T64 C7 P12784 /update {wt=javabin&version=2} {add=[111 (1413634555759296512)]} 0 3
[junit4:junit4]   2> 25526 T103 C3 P10792 REQ /update {distrib.from=http://127.0.0.1:14978/solr/collection1/&update.distrib=FROMLEADER&wt=javabin&version=2} status=0 QTime=3 
[junit4:junit4]   2> 25527 T83 C4 P14978 /update {wt=javabin&version=2} {add=[111 (1413634555765587968)]} 0 9
[junit4:junit4]   2> 25532 T64 C7 P12784 /update {wt=javabin&version=2} {add=[112 (1413634555778170880)]} 0 2
[junit4:junit4]   2> 25543 T117 C5 P28102 REQ /update {distrib.from=http://127.0.0.1:42159/solr/collection1/&update.distrib=FROMLEADER&wt=javabin&version=2} status=0 QTime=2 
[junit4:junit4]   2> 25544 T94 C6 P42159 /update {wt=javabin&version=2} {add=[112 (1413634555783413760)]} 0 9
[junit4:junit4]   2> 25565 T64 C7 P12784 /update {wt=javabin&version=2} {add=[113 (1413634555795996672)]} 0 18
[junit4:junit4]   2> 25581 T103 C3 P10792 REQ /update {update.distrib=FROMLEADER&distrib.from=http://127.0.0.1:14978/solr/collection1/&wt=javabin&version=2} status=0 QTime=3 
[junit4:junit4]   2> 25581 T81 C4 P14978 REQ /update {distrib.from=http://127.0.0.1:42159/solr/collection1/&update.distrib=TOLEADER&wt=javabin&version=2} status=0 QTime=10 
[junit4:junit4]   2> 25583 T94 C6 P42159 /update {wt=javabin&version=2} {add=[113]} 0 15
[junit4:junit4]   2> 25590 T64 C7 P12784 /update {wt=javabin&version=2} {add=[114 (1413634555836891136)]} 0 4
[junit4:junit4]   2> 25603 T103 C3 P10792 REQ /update {update.distrib=FROMLEADER&distrib.from=http://127.0.0.1:14978/solr/collection1/&wt=javabin&version=2} status=0 QTime=2 
[junit4:junit4]   2> 25604 T81 C4 P14978 REQ /update {distrib.from=http://127.0.0.1:42159/solr/collection1/&update.distrib=TOLEADER&wt=javabin&version=2} status=0 QTime=8 
[junit4:junit4]   2> 25605 T94 C6 P42159 /update {wt=javabin&version=2} {add=[114]} 0 12
[junit4:junit4]   2> 25610 T64 C7 P12784 /update {wt=javabin&version=2} {add=[115 (1413634555859959808)]} 0 2
[junit4:junit4]   2> 25620 T117 C5 P28102 REQ /update {distrib.from=http://127.0.0.1:42159/solr/collection1/&update.distrib=FROMLEADER&wt=javabin&version=2} status=0 QTime=2 
[junit4:junit4]   2> 25621 T94 C6 P42159 /update {wt=javabin&version=2} {add=[115 (1413634555865202688)]} 0 8
[junit4:junit4]   2> 25626 T64 C7 P12784 /update {wt=javabin&version=2} {add=[116 (1413634555876737024)]} 0 2
[junit4:junit4]   2> 25636 T117 C5 P28102 REQ /update {distrib.from=http://127.0.0.1:42159/solr/collection1/&update.distrib=FROMLEADER&wt=javabin&version=2} status=0 QTime=2 
[junit4:junit4]   2> 25637 T94 C6 P42159 /update {wt=javabin&version=2} {add=[116 (1413634555881979904)]} 0 8
[junit4:junit4]   2> 25642 T64 C7 P12784 /update {wt=javabin&version=2} {add=[117 (1413634555892465664)]} 0 2
[junit4:junit4]   2> 25652 T117 C5 P28102 REQ /update {distrib.from=http://127.0.0.1:42159/solr/collection1/&update.distrib=FROMLEADER&wt=javabin&version=2} status=0 QTime=3 
[junit4:junit4]   2> 25652 T94 C6 P42159 /update {wt=javabin&version=2} {add=[117 (1413634555897708544)]} 0 7
[junit4:junit4]   2> 25657 T64 C7 P12784 /update {wt=javabin&version=2} {add=[118 (1413634555909242880)]} 0 2
[junit4:junit4]   2> 25694 T103 C3 P10792 REQ /update {update.distrib=FROMLEADER&distrib.from=http://127.0.0.1:14978/solr/collection1/&wt=javabin&version=2} status=0 QTime=14 
[junit4:junit4]   2> 25695 T81 C4 P14978 REQ /update {distrib.from=http://127.0.0.1:42159/solr/collection1/&update.distrib=TOLEADER&wt=javabin&version=2} status=0 QTime=32 
[junit4:junit4]   2> 25695 T94 C6 P42159 /update {wt=javabin&version=2} {add=[118]} 0 35
[junit4:junit4]   2> 25700 T64 C7 P12784 /update {wt=javabin&version=2} {add=[119 (1413634555954331648)]} 0 2
[junit4:junit4]   2> 25710 T117 C5 P28102 REQ /update {distrib.from=http://127.0.0.1:42159/solr/collection1/&update.distrib=FROMLEADER&wt=javabin&version=2} status=0 QTime=2 
[junit4:junit4]   2> 25711 T94 C6 P42159 /update {wt=javabin&version=2} {add=[119 (1413634555959574528)]} 0 8
[junit4:junit4]   2> 25717 T64 C7 P12784 /update {wt=javabin&version=2} {add=[120 (1413634555971108864)]} 0 3
[junit4:junit4]   2> 25731 T117 C5 P28102 REQ /update {update.distrib=FROMLEADER&distrib.from=http://127.0.0.1:42159/solr/collection1/&wt=javabin&version=2} status=0 QTime=3 
[junit4:junit4]   2> 25732 T97 C6 P42159 R

[...truncated too long message...]

ding=US-ASCII
[junit4:junit4] FAILURE  134s J1 | SyncSliceTest.testDistribSearch <<<
[junit4:junit4]    > Throwable #1: java.lang.AssertionError: There are still nodes recoverying
[junit4:junit4]    > 	at __randomizedtesting.SeedInfo.seed([1ABF24B33B3E58A2:9B59AAAB4C61389E]:0)
[junit4:junit4]    > 	at org.junit.Assert.fail(Assert.java:93)
[junit4:junit4]    > 	at org.apache.solr.cloud.AbstractDistribZkTestBase.waitForRecoveriesToFinish(AbstractDistribZkTestBase.java:154)
[junit4:junit4]    > 	at org.apache.solr.cloud.AbstractFullDistribZkTestBase.waitForRecoveriesToFinish(AbstractFullDistribZkTestBase.java:560)
[junit4:junit4]    > 	at org.apache.solr.cloud.AbstractFullDistribZkTestBase.waitForThingsToLevelOut(AbstractFullDistribZkTestBase.java:1135)
[junit4:junit4]    > 	at org.apache.solr.cloud.SyncSliceTest.doTest(SyncSliceTest.java:162)
[junit4:junit4]    > 	at org.apache.solr.BaseDistributedSearchTestCase.testDistribSearch(BaseDistributedSearchTestCase.java:695)
[junit4:junit4]    > 	at sun.reflect.NativeMethodAccessorImpl.invoke0(Native Method)
[junit4:junit4]    > 	at sun.reflect.NativeMethodAccessorImpl.invoke(NativeMethodAccessorImpl.java:57)
[junit4:junit4]    > 	at sun.reflect.DelegatingMethodAccessorImpl.invoke(DelegatingMethodAccessorImpl.java:43)
[junit4:junit4]    > 	at java.lang.reflect.Method.invoke(Method.java:601)
[junit4:junit4]    > 	at com.carrotsearch.randomizedtesting.RandomizedRunner.invoke(RandomizedRunner.java:1559)
[junit4:junit4]    > 	at com.carrotsearch.randomizedtesting.RandomizedRunner.access$600(RandomizedRunner.java:79)
[junit4:junit4]    > 	at com.carrotsearch.randomizedtesting.RandomizedRunner$6.evaluate(RandomizedRunner.java:737)
[junit4:junit4]    > 	at com.carrotsearch.randomizedtesting.RandomizedRunner$7.evaluate(RandomizedRunner.java:773)
[junit4:junit4]    > 	at com.carrotsearch.randomizedtesting.RandomizedRunner$8.evaluate(RandomizedRunner.java:787)
[junit4:junit4]    > 	at com.carrotsearch.randomizedtesting.rules.SystemPropertiesRestoreRule$1.evaluate(SystemPropertiesRestoreRule.java:53)
[junit4:junit4]    > 	at org.apache.lucene.util.TestRuleSetupTeardownChained$1.evaluate(TestRuleSetupTeardownChained.java:50)
[junit4:junit4]    > 	at org.apache.lucene.util.TestRuleFieldCacheSanity$1.evaluate(TestRuleFieldCacheSanity.java:51)
[junit4:junit4]    > 	at org.apache.lucene.util.AbstractBeforeAfterRule$1.evaluate(AbstractBeforeAfterRule.java:45)
[junit4:junit4]    > 	at com.carrotsearch.randomizedtesting.rules.SystemPropertiesInvariantRule$1.evaluate(SystemPropertiesInvariantRule.java:55)
[junit4:junit4]    > 	at org.apache.lucene.util.TestRuleThreadAndTestName$1.evaluate(TestRuleThreadAndTestName.java:48)
[junit4:junit4]    > 	at org.apache.lucene.util.TestRuleIgnoreAfterMaxFailures$1.evaluate(TestRuleIgnoreAfterMaxFailures.java:70)
[junit4:junit4]    > 	at org.apache.lucene.util.TestRuleMarkFailure$1.evaluate(TestRuleMarkFailure.java:48)
[junit4:junit4]    > 	at com.carrotsearch.randomizedtesting.rules.StatementAdapter.evaluate(StatementAdapter.java:36)
[junit4:junit4]    > 	at com.carrotsearch.randomizedtesting.ThreadLeakControl$StatementRunner.run(ThreadLeakControl.java:358)
[junit4:junit4]    > 	at com.carrotsearch.randomizedtesting.ThreadLeakControl.forkTimeoutingTask(ThreadLeakControl.java:782)
[junit4:junit4]    > 	at com.carrotsearch.randomizedtesting.ThreadLeakControl$3.evaluate(ThreadLeakControl.java:442)
[junit4:junit4]    > 	at com.carrotsearch.randomizedtesting.RandomizedRunner.runSingleTest(RandomizedRunner.java:746)
[junit4:junit4]    > 	at com.carrotsearch.randomizedtesting.RandomizedRunner$3.evaluate(RandomizedRunner.java:648)
[junit4:junit4]    > 	at com.carrotsearch.randomizedtesting.RandomizedRunner$4.evaluate(RandomizedRunner.java:682)
[junit4:junit4]    > 	at com.carrotsearch.randomizedtesting.RandomizedRunner$5.evaluate(RandomizedRunner.java:693)
[junit4:junit4]    > 	at com.carrotsearch.randomizedtesting.rules.StatementAdapter.evaluate(StatementAdapter.java:36)
[junit4:junit4]    > 	at com.carrotsearch.randomizedtesting.rules.SystemPropertiesRestoreRule$1.evaluate(SystemPropertiesRestoreRule.java:53)
[junit4:junit4]    > 	at org.apache.lucene.util.AbstractBeforeAfterRule$1.evaluate(AbstractBeforeAfterRule.java:45)
[junit4:junit4]    > 	at org.apache.lucene.util.TestRuleStoreClassName$1.evaluate(TestRuleStoreClassName.java:42)
[junit4:junit4]    > 	at com.carrotsearch.randomizedtesting.rules.SystemPropertiesInvariantRule$1.evaluate(SystemPropertiesInvariantRule.java:55)
[junit4:junit4]    > 	at com.carrotsearch.randomizedtesting.rules.NoShadowingOrOverridesOnMethodsRule$1.evaluate(NoShadowingOrOverridesOnMethodsRule.java:39)
[junit4:junit4]    > 	at com.carrotsearch.randomizedtesting.rules.NoShadowingOrOverridesOnMethodsRule$1.evaluate(NoShadowingOrOverridesOnMethodsRule.java:39)
[junit4:junit4]    > 	at com.carrotsearch.randomizedtesting.rules.StatementAdapter.evaluate(StatementAdapter.java:36)
[junit4:junit4]    > 	at org.apache.lucene.util.TestRuleAssertionsRequired$1.evaluate(TestRuleAssertionsRequired.java:43)
[junit4:junit4]    > 	at org.apache.lucene.util.TestRuleMarkFailure$1.evaluate(TestRuleMarkFailure.java:48)
[junit4:junit4]    > 	at org.apache.lucene.util.TestRuleIgnoreAfterMaxFailures$1.evaluate(TestRuleIgnoreAfterMaxFailures.java:70)
[junit4:junit4]    > 	at org.apache.lucene.util.TestRuleIgnoreTestSuites$1.evaluate(TestRuleIgnoreTestSuites.java:55)
[junit4:junit4]    > 	at com.carrotsearch.randomizedtesting.rules.StatementAdapter.evaluate(StatementAdapter.java:36)
[junit4:junit4]    > 	at com.carrotsearch.randomizedtesting.ThreadLeakControl$StatementRunner.run(ThreadLeakControl.java:358)
[junit4:junit4]    > 	at java.lang.Thread.run(Thread.java:722)
[junit4:junit4]   2> 134184 T1347 oas.SolrTestCaseJ4.deleteCore ###deleteCore
[junit4:junit4]   2> NOTE: test params are: codec=Lucene40: {range_facet_l=PostingsFormat(name=NestedPulsing), text=PostingsFormat(name=MockSep), _version_=PostingsFormat(name=MockRandom), rnd_b=PostingsFormat(name=Memory doPackFST= false), intDefault=PostingsFormat(name=MockRandom), timestamp=PostingsFormat(name=NestedPulsing), id=PostingsFormat(name=Memory doPackFST= false), a_t=PostingsFormat(name=NestedPulsing), range_facet_sl=PostingsFormat(name=Memory doPackFST= false), range_facet_si=PostingsFormat(name=NestedPulsing), other_tl1=PostingsFormat(name=MockRandom), multiDefault=PostingsFormat(name=NestedPulsing), a_si=PostingsFormat(name=MockRandom)}, sim=DefaultSimilarity, locale=ar_BH, timezone=Pacific/Noumea
[junit4:junit4]   2> NOTE: FreeBSD 9.0-RELEASE amd64/Oracle Corporation 1.7.0_06 (64-bit)/cpus=16,threads=1,free=289560688,total=527433728
[junit4:junit4]   2> NOTE: All tests run in this JVM: [EchoParamsTest, IndexSchemaTest, SolrCoreTest, UUIDFieldTest, URLClassifyProcessorTest, IndexReaderFactoryTest, XsltUpdateRequestHandlerTest, BasicDistributedZk2Test, TestPhraseSuggestions, TestHashPartitioner, TestCodecSupport, MultiTermTest, RAMDirectoryFactoryTest, FullSolrCloudDistribCmdsTest, TermVectorComponentDistributedTest, TestSurroundQueryParser, TestUtils, BasicZkTest, OpenExchangeRatesOrgProviderTest, ShowFileRequestHandlerTest, TestSolrDeletionPolicy2, TestRealTimeGet, TestRecovery, TestSolrXMLSerializer, LegacyHTMLStripCharFilterTest, DocumentBuilderTest, TestSort, TestSolrDeletionPolicy1, TestMultiCoreConfBootstrap, SolrInfoMBeanTest, PolyFieldTest, DebugComponentTest, TestQuerySenderListener, TestQueryUtils, PathHierarchyTokenizerFactoryTest, HighlighterTest, TestReversedWildcardFilterFactory, TermVectorComponentTest, TestDocumentBuilder, BasicFunctionalityTest, TestUpdate, StatsComponentTest, StandardRequestHandlerTest, LukeRequestHandlerTest, TestOmitPositions, TestCSVResponseWriter, TestDFRSimilarityFactory, TimeZoneUtilsTest, RecoveryZkTest, TestRTGBase, SuggesterTest, TestLRUCache, IndexSchemaRuntimeFieldTest, DocumentAnalysisRequestHandlerTest, DirectUpdateHandlerTest, TestBinaryField, SpellCheckCollatorTest, SoftAutoCommitTest, ZkSolrClientTest, DistributedTermsComponentTest, TestJoin, SignatureUpdateProcessorFactoryTest, TestJmxIntegration, TestFunctionQuery, TestRemoteStreaming, QueryEqualityTest, TestCSVLoader, MoreLikeThisHandlerTest, MBeansHandlerTest, CurrencyFieldTest, TestPseudoReturnFields, QueryParsingTest, XmlUpdateRequestHandlerTest, SuggesterWFSTTest, DirectUpdateHandlerOptimizeTest, SolrPluginUtilsTest, JSONWriterTest, RequiredFieldsTest, TestArbitraryIndexDir, SuggesterTSTTest, UpdateParamsTest, NotRequiredUniqueKeyTest, TestFoldingMultitermQuery, SolrCoreCheckLockOnStartupTest, TestPropInject, PrimitiveFieldTypeTest, FieldMutatingUpdateProcessorTest, SOLR749Test, TestMergePolicyConfig, TestDocSet, SolrIndexConfigTest, TestQuerySenderNoQuery, TestSolrCoreProperties, TestBM25SimilarityFactory, TestPluginEnable, PrimUtilsTest, ResourceLoaderTest, TestSystemIdResolver, ZkNodePropsTest, TestCollationKeyRangeQueries, SyncSliceTest]
[junit4:junit4] Completed on J1 in 134.21s, 1 test, 1 failure <<< FAILURES!

[...truncated 11 lines...]
BUILD FAILED
/usr/home/hudson/hudson-slave/workspace/Lucene-Solr-Tests-4.x-java7/build.xml:32: The following error occurred while executing this line:
/usr/home/hudson/hudson-slave/workspace/Lucene-Solr-Tests-4.x-java7/solr/build.xml:146: The following error occurred while executing this line:
/usr/home/hudson/hudson-slave/workspace/Lucene-Solr-Tests-4.x-java7/lucene/module-build.xml:63: The following error occurred while executing this line:
/usr/home/hudson/hudson-slave/workspace/Lucene-Solr-Tests-4.x-java7/lucene/common-build.xml:1140: The following error occurred while executing this line:
/usr/home/hudson/hudson-slave/workspace/Lucene-Solr-Tests-4.x-java7/lucene/common-build.xml:813: There were test failures: 230 suites, 951 tests, 2 failures, 7 ignored (2 assumptions)

Total time: 32 minutes 11 seconds
Build step 'Invoke Ant' marked build as failure
Recording test results
Email was triggered for: Failure
Sending email for trigger: Failure



Mime
View raw message