lucene-dev mailing list archives

Site index · List index
Message view « Date » · « Thread »
Top « Date » · « Thread »
From Apache Jenkins Server <jenk...@builds.apache.org>
Subject [JENKINS-MAVEN] Lucene-Solr-Maven-trunk #596: POMs out of sync
Date Sat, 01 Sep 2012 17:57:14 GMT
Build: https://builds.apache.org/job/Lucene-Solr-Maven-trunk/596/

1 tests failed.
FAILED:  org.apache.solr.cloud.BasicDistributedZkTest.testDistribSearch

Error Message:
ERROR: [doc=1000] multiple values encountered for non multiValued field val_i: [10, 20]

Stack Trace:
org.apache.solr.common.SolrException: ERROR: [doc=1000] multiple values encountered for non multiValued field val_i: [10, 20]
	at __randomizedtesting.SeedInfo.seed([7E2203A7FCCB28B9:FFC48DBF8B944885]:0)
	at org.apache.solr.client.solrj.impl.HttpSolrServer.request(HttpSolrServer.java:402)
	at org.apache.solr.client.solrj.impl.HttpSolrServer.request(HttpSolrServer.java:182)
	at org.apache.solr.client.solrj.request.AbstractUpdateRequest.process(AbstractUpdateRequest.java:117)
	at org.apache.solr.client.solrj.SolrServer.add(SolrServer.java:122)
	at org.apache.solr.client.solrj.SolrServer.add(SolrServer.java:107)
	at org.apache.solr.cloud.BasicDistributedZkTest.doOptimisticLockingAndUpdating(BasicDistributedZkTest.java:677)
	at org.apache.solr.cloud.BasicDistributedZkTest.doTest(BasicDistributedZkTest.java:304)
	at org.apache.solr.BaseDistributedSearchTestCase.testDistribSearch(BaseDistributedSearchTestCase.java:691)
	at sun.reflect.NativeMethodAccessorImpl.invoke0(Native Method)
	at sun.reflect.NativeMethodAccessorImpl.invoke(NativeMethodAccessorImpl.java:57)
	at sun.reflect.DelegatingMethodAccessorImpl.invoke(DelegatingMethodAccessorImpl.java:43)
	at java.lang.reflect.Method.invoke(Method.java:616)
	at com.carrotsearch.randomizedtesting.RandomizedRunner.invoke(RandomizedRunner.java:1559)
	at com.carrotsearch.randomizedtesting.RandomizedRunner.access$600(RandomizedRunner.java:79)
	at com.carrotsearch.randomizedtesting.RandomizedRunner$6.evaluate(RandomizedRunner.java:737)
	at com.carrotsearch.randomizedtesting.RandomizedRunner$7.evaluate(RandomizedRunner.java:773)
	at com.carrotsearch.randomizedtesting.RandomizedRunner$8.evaluate(RandomizedRunner.java:787)
	at com.carrotsearch.randomizedtesting.rules.SystemPropertiesRestoreRule$1.evaluate(SystemPropertiesRestoreRule.java:53)
	at org.apache.lucene.util.TestRuleSetupTeardownChained$1.evaluate(TestRuleSetupTeardownChained.java:50)
	at org.apache.lucene.util.TestRuleFieldCacheSanity$1.evaluate(TestRuleFieldCacheSanity.java:51)
	at org.apache.lucene.util.AbstractBeforeAfterRule$1.evaluate(AbstractBeforeAfterRule.java:45)
	at com.carrotsearch.randomizedtesting.rules.SystemPropertiesInvariantRule$1.evaluate(SystemPropertiesInvariantRule.java:55)
	at org.apache.lucene.util.TestRuleThreadAndTestName$1.evaluate(TestRuleThreadAndTestName.java:48)
	at org.apache.lucene.util.TestRuleIgnoreAfterMaxFailures$1.evaluate(TestRuleIgnoreAfterMaxFailures.java:70)
	at org.apache.lucene.util.TestRuleMarkFailure$1.evaluate(TestRuleMarkFailure.java:48)
	at com.carrotsearch.randomizedtesting.rules.StatementAdapter.evaluate(StatementAdapter.java:36)
	at com.carrotsearch.randomizedtesting.ThreadLeakControl$StatementRunner.run(ThreadLeakControl.java:345)
	at com.carrotsearch.randomizedtesting.ThreadLeakControl.forkTimeoutingTask(ThreadLeakControl.java:769)
	at com.carrotsearch.randomizedtesting.ThreadLeakControl$3.evaluate(ThreadLeakControl.java:429)
	at com.carrotsearch.randomizedtesting.RandomizedRunner.runSingleTest(RandomizedRunner.java:746)
	at com.carrotsearch.randomizedtesting.RandomizedRunner$3.evaluate(RandomizedRunner.java:648)
	at com.carrotsearch.randomizedtesting.RandomizedRunner$4.evaluate(RandomizedRunner.java:682)
	at com.carrotsearch.randomizedtesting.RandomizedRunner$5.evaluate(RandomizedRunner.java:693)
	at com.carrotsearch.randomizedtesting.rules.StatementAdapter.evaluate(StatementAdapter.java:36)
	at com.carrotsearch.randomizedtesting.rules.SystemPropertiesRestoreRule$1.evaluate(SystemPropertiesRestoreRule.java:53)
	at org.apache.lucene.util.AbstractBeforeAfterRule$1.evaluate(AbstractBeforeAfterRule.java:45)
	at org.apache.lucene.util.TestRuleStoreClassName$1.evaluate(TestRuleStoreClassName.java:42)
	at com.carrotsearch.randomizedtesting.rules.SystemPropertiesInvariantRule$1.evaluate(SystemPropertiesInvariantRule.java:55)
	at com.carrotsearch.randomizedtesting.rules.NoShadowingOrOverridesOnMethodsRule$1.evaluate(NoShadowingOrOverridesOnMethodsRule.java:39)
	at com.carrotsearch.randomizedtesting.rules.NoShadowingOrOverridesOnMethodsRule$1.evaluate(NoShadowingOrOverridesOnMethodsRule.java:39)
	at org.apache.lucene.util.TestRuleAssertionsRequired$1.evaluate(TestRuleAssertionsRequired.java:40)
	at org.apache.lucene.util.TestRuleMarkFailure$1.evaluate(TestRuleMarkFailure.java:48)
	at org.apache.lucene.util.TestRuleIgnoreAfterMaxFailures$1.evaluate(TestRuleIgnoreAfterMaxFailures.java:70)
	at org.apache.lucene.util.TestRuleIgnoreTestSuites$1.evaluate(TestRuleIgnoreTestSuites.java:55)
	at com.carrotsearch.randomizedtesting.rules.StatementAdapter.evaluate(StatementAdapter.java:36)
	at com.carrotsearch.randomizedtesting.ThreadLeakControl$StatementRunner.run(ThreadLeakControl.java:345)
	at java.lang.Thread.run(Thread.java:679)




Build Log:
[...truncated 2702 lines...]
1702 T3 oasc.SolrCore.finalize SEVERE REFCOUNT ERROR: unreferenced org.apache.solr.core.SolrCore@9be1041 (collection1) has a reference count of 1
1702 T3 oasc.CoreContainer.finalize SEVERE CoreContainer was not shutdown prior to finalize(), indicates a bug -- POSSIBLE RESOURCE LEAK!!!  instance=836597558
2211 T10 oasc.SolrCore.initIndex SEVERE [collection1] Solr index directory '/usr/home/hudson/hudson-slave/workspace/Lucene-Solr-Maven-trunk/maven-build/solr/core/target/test/./solrtest-SolrCoreCheckLockOnStartupTest-1346521123821/index/' is locked.  Throwing exception
Tests run: 2, Failures: 0, Errors: 0, Skipped: 0, Time elapsed: 2.704 sec
Running org.apache.solr.handler.component.TermVectorComponentTest
Creating dataDir: /usr/home/hudson/hudson-slave/workspace/Lucene-Solr-Maven-trunk/maven-build/solr/core/target/test/./solrtest-TermVectorComponentTest-1346521124488
430 T3 oasc.SolrCore.finalize SEVERE REFCOUNT ERROR: unreferenced org.apache.solr.core.SolrCore@588491b8 (collection1) has a reference count of 1
431 T3 oasc.CoreContainer.finalize SEVERE CoreContainer was not shutdown prior to finalize(), indicates a bug -- POSSIBLE RESOURCE LEAK!!!  instance=1295708292
Tests run: 3, Failures: 0, Errors: 0, Skipped: 0, Time elapsed: 1.831 sec
Running org.apache.solr.TestDocumentBuilder
doc1: SolrInputDocument[field1=value1, field2=value1, field3=value2, field4=15, field5=[45, 33, 20]]
clone: SolrInputDocument[field1=value1, field2=value1, field3=value2, field4=15, field5=[45, 33, 20]]
Tests run: 1, Failures: 0, Errors: 0, Skipped: 0, Time elapsed: 0.031 sec
Running org.apache.solr.schema.UUIDFieldTest
Tests run: 1, Failures: 0, Errors: 0, Skipped: 0, Time elapsed: 0.021 sec
Running org.apache.solr.TestDistributedGrouping
Tests run: 1, Failures: 0, Errors: 0, Skipped: 0, Time elapsed: 16.589 sec
Running org.apache.solr.schema.CurrencyFieldTest
Creating dataDir: /usr/home/hudson/hudson-slave/workspace/Lucene-Solr-Maven-trunk/maven-build/solr/core/target/test/./solrtest-CurrencyFieldTest-1346521142934
Tests run: 8, Failures: 0, Errors: 0, Skipped: 1, Time elapsed: 0.949 sec
Running org.apache.solr.core.TestArbitraryIndexDir
Tests run: 1, Failures: 0, Errors: 0, Skipped: 0, Time elapsed: 0.682 sec
Running org.apache.solr.internal.csv.ExtendedBufferedReaderTest
Tests run: 8, Failures: 0, Errors: 0, Skipped: 0, Time elapsed: 0.012 sec
Running org.apache.solr.cloud.ClusterStateTest
Tests run: 1, Failures: 0, Errors: 0, Skipped: 0, Time elapsed: 0.038 sec
Running org.apache.solr.search.TestRangeQuery
Creating dataDir: /usr/home/hudson/hudson-slave/workspace/Lucene-Solr-Maven-trunk/maven-build/solr/core/target/test/./solrtest-TestRangeQuery-1346521144612
Tests run: 2, Failures: 0, Errors: 0, Skipped: 0, Time elapsed: 3.398 sec
Running org.apache.solr.AnalysisAfterCoreReloadTest
Tests run: 1, Failures: 0, Errors: 0, Skipped: 0, Time elapsed: 1.36 sec
Running org.apache.solr.update.processor.UniqFieldsUpdateProcessorFactoryTest
Creating dataDir: /usr/home/hudson/hudson-slave/workspace/Lucene-Solr-Maven-trunk/maven-build/solr/core/target/test/./solrtest-UniqFieldsUpdateProcessorFactoryTest-1346521149371
Tests run: 1, Failures: 0, Errors: 0, Skipped: 0, Time elapsed: 0.55 sec
Running org.apache.solr.internal.csv.writer.CSVWriterTest
Tests run: 2, Failures: 0, Errors: 0, Skipped: 0, Time elapsed: 0.002 sec
Running org.apache.solr.schema.DateFieldTest
Tests run: 8, Failures: 0, Errors: 0, Skipped: 1, Time elapsed: 0.038 sec
Running org.apache.solr.client.solrj.embedded.MergeIndexesEmbeddedTest
!!!! WARNING: best effort to remove /usr/home/hudson/hudson-slave/workspace/Lucene-Solr-Maven-trunk/maven-build/solr/core/target/test/./org.apache.solr.client.solrj.embedded.MergeIndexesEmbeddedTest-1346521149963 FAILED !!!!!
!!!! WARNING: best effort to remove /usr/home/hudson/hudson-slave/workspace/Lucene-Solr-Maven-trunk/maven-build/solr/core/target/test/./org.apache.solr.client.solrj.embedded.MergeIndexesEmbeddedTest-1346521150552 FAILED !!!!!
Tests run: 2, Failures: 0, Errors: 0, Skipped: 0, Time elapsed: 0.954 sec
Running org.apache.solr.handler.component.DistributedQueryElevationComponentTest
Tests run: 1, Failures: 0, Errors: 0, Skipped: 0, Time elapsed: 1.315 sec
Running org.apache.solr.core.TestJmxIntegration
Tests run: 3, Failures: 0, Errors: 0, Skipped: 1, Time elapsed: 0.89 sec
Running org.apache.solr.core.CoreContainerCoreInitFailuresTest
189 T246 oasc.SolrException.log SEVERE Exception during parsing file: solrconfig.xml:org.xml.sax.SAXParseException; systemId: solrres:/solrconfig.xml; lineNumber: 1; columnNumber: 1; Content is not allowed in prolog.
		at com.sun.org.apache.xerces.internal.util.ErrorHandlerWrapper.createSAXParseException(ErrorHandlerWrapper.java:198)
		at com.sun.org.apache.xerces.internal.util.ErrorHandlerWrapper.fatalError(ErrorHandlerWrapper.java:177)
		at com.sun.org.apache.xerces.internal.impl.XMLErrorReporter.reportError(XMLErrorReporter.java:391)
		at com.sun.org.apache.xerces.internal.impl.XMLScanner.reportFatalError(XMLScanner.java:1404)
		at com.sun.org.apache.xerces.internal.impl.XMLDocumentScannerImpl$PrologDriver.next(XMLDocumentScannerImpl.java:1014)
		at com.sun.org.apache.xerces.internal.impl.XMLDocumentScannerImpl.next(XMLDocumentScannerImpl.java:625)
		at com.sun.org.apache.xerces.internal.impl.XMLNSDocumentScannerImpl.next(XMLNSDocumentScannerImpl.java:116)
		at com.sun.org.apache.xerces.internal.impl.XMLDocumentFragmentScannerImpl.scanDocument(XMLDocumentFragmentScannerImpl.java:488)
		at com.sun.org.apache.xerces.internal.parsers.XML11Configuration.parse(XML11Configuration.java:819)
		at com.sun.org.apache.xerces.internal.parsers.XML11Configuration.parse(XML11Configuration.java:748)
		at com.sun.org.apache.xerces.internal.parsers.XMLParser.parse(XMLParser.java:123)
		at com.sun.org.apache.xerces.internal.parsers.DOMParser.parse(DOMParser.java:239)
		at com.sun.org.apache.xerces.internal.jaxp.DocumentBuilderImpl.parse(DocumentBuilderImpl.java:288)
		at org.apache.solr.core.Config.<init>(Config.java:129)
		at org.apache.solr.core.Config.<init>(Config.java:78)
		at org.apache.solr.core.SolrConfig.<init>(SolrConfig.java:117)
		at org.apache.solr.core.SolrCore.reload(SolrCore.java:366)
		at org.apache.solr.core.CoreContainer.reload(CoreContainer.java:1016)
		at org.apache.solr.core.CoreContainerCoreInitFailuresTest.testFlowBadFromStart(CoreContainerCoreInitFailuresTest.java:257)
		at sun.reflect.NativeMethodAccessorImpl.invoke0(Native Method)
		at sun.reflect.NativeMethodAccessorImpl.invoke(NativeMethodAccessorImpl.java:57)
		at sun.reflect.DelegatingMethodAccessorImpl.invoke(DelegatingMethodAccessorImpl.java:43)
		at java.lang.reflect.Method.invoke(Method.java:616)
		at com.carrotsearch.randomizedtesting.RandomizedRunner.invoke(RandomizedRunner.java:1559)
		at com.carrotsearch.randomizedtesting.RandomizedRunner.access$600(RandomizedRunner.java:79)
		at com.carrotsearch.randomizedtesting.RandomizedRunner$6.evaluate(RandomizedRunner.java:737)
		at com.carrotsearch.randomizedtesting.RandomizedRunner$7.evaluate(RandomizedRunner.java:773)
		at com.carrotsearch.randomizedtesting.RandomizedRunner$8.evaluate(RandomizedRunner.java:787)
		at com.carrotsearch.randomizedtesting.rules.SystemPropertiesRestoreRule$1.evaluate(SystemPropertiesRestoreRule.java:53)
		at org.apache.lucene.util.TestRuleSetupTeardownChained$1.evaluate(TestRuleSetupTeardownChained.java:50)
		at org.apache.lucene.util.TestRuleFieldCacheSanity$1.evaluate(TestRuleFieldCacheSanity.java:51)
		at org.apache.lucene.util.AbstractBeforeAfterRule$1.evaluate(AbstractBeforeAfterRule.java:45)
		at com.carrotsearch.randomizedtesting.rules.SystemPropertiesInvariantRule$1.evaluate(SystemPropertiesInvariantRule.java:55)
		at org.apache.lucene.util.TestRuleThreadAndTestName$1.evaluate(TestRuleThreadAndTestName.java:48)
		at org.apache.lucene.util.TestRuleIgnoreAfterMaxFailures$1.evaluate(TestRuleIgnoreAfterMaxFailures.java:70)
		at org.apache.lucene.util.TestRuleMarkFailure$1.evaluate(TestRuleMarkFailure.java:48)
		at com.carrotsearch.randomizedtesting.rules.StatementAdapter.evaluate(StatementAdapter.java:36)
		at com.carrotsearch.randomizedtesting.ThreadLeakControl$StatementRunner.run(ThreadLeakControl.java:345)
		at com.carrotsearch.randomizedtesting.ThreadLeakControl.forkTimeoutingTask(ThreadLeakControl.java:769)
		at com.carrotsearch.randomizedtesting.ThreadLeakControl$3.evaluate(ThreadLeakControl.java:429)
		at com.carrotsearch.randomizedtesting.RandomizedRunner.runSingleTest(RandomizedRunner.java:746)
		at com.carrotsearch.randomizedtesting.RandomizedRunner$3.evaluate(RandomizedRunner.java:648)
		at com.carrotsearch.randomizedtesting.RandomizedRunner$4.evaluate(RandomizedRunner.java:682)
		at com.carrotsearch.randomizedtesting.RandomizedRunner$5.evaluate(RandomizedRunner.java:693)
		at com.carrotsearch.randomizedtesting.rules.StatementAdapter.evaluate(StatementAdapter.java:36)
		at com.carrotsearch.randomizedtesting.rules.SystemPropertiesRestoreRule$1.evaluate(SystemPropertiesRestoreRule.java:53)
		at org.apache.lucene.util.AbstractBeforeAfterRule$1.evaluate(AbstractBeforeAfterRule.java:45)
		at org.apache.lucene.util.TestRuleStoreClassName$1.evaluate(TestRuleStoreClassName.java:42)
		at com.carrotsearch.randomizedtesting.rules.SystemPropertiesInvariantRule$1.evaluate(SystemPropertiesInvariantRule.java:55)
		at com.carrotsearch.randomizedtesting.rules.NoShadowingOrOverridesOnMethodsRule$1.evaluate(NoShadowingOrOverridesOnMethodsRule.java:39)
		at com.carrotsearch.randomizedtesting.rules.NoShadowingOrOverridesOnMethodsRule$1.evaluate(NoShadowingOrOverridesOnMethodsRule.java:39)
		at org.apache.lucene.util.TestRuleAssertionsRequired$1.evaluate(TestRuleAssertionsRequired.java:40)
		at org.apache.lucene.util.TestRuleMarkFailure$1.evaluate(TestRuleMarkFailure.java:48)
		at org.apache.lucene.util.TestRuleIgnoreAfterMaxFailures$1.evaluate(TestRuleIgnoreAfterMaxFailures.java:70)
		at org.apache.lucene.util.TestRuleIgnoreTestSuites$1.evaluate(TestRuleIgnoreTestSuites.java:55)
		at com.carrotsearch.randomizedtesting.rules.StatementAdapter.evaluate(StatementAdapter.java:36)
		at com.carrotsearch.randomizedtesting.ThreadLeakControl$StatementRunner.run(ThreadLeakControl.java:345)
		at java.lang.Thread.run(Thread.java:679)
	
Tests run: 2, Failures: 0, Errors: 0, Skipped: 0, Time elapsed: 0.243 sec
Running org.apache.solr.update.processor.StatelessScriptUpdateProcessorFactoryTest
Creating dataDir: /usr/home/hudson/hudson-slave/workspace/Lucene-Solr-Maven-trunk/maven-build/solr/core/target/test/./solrtest-StatelessScriptUpdateProcessorFactoryTest-1346521153452
112 T3 oasc.SolrCore.finalize SEVERE REFCOUNT ERROR: unreferenced org.apache.solr.core.SolrCore@6ca44faa (col_bad) has a reference count of 1
Tests run: 7, Failures: 0, Errors: 0, Skipped: 0, Time elapsed: 1.031 sec
Running org.apache.solr.schema.NumericFieldsTest
Creating dataDir: /usr/home/hudson/hudson-slave/workspace/Lucene-Solr-Maven-trunk/maven-build/solr/core/target/test/./solrtest-NumericFieldsTest-1346521154390
Tests run: 1, Failures: 0, Errors: 0, Skipped: 0, Time elapsed: 0.205 sec
Running org.apache.solr.cloud.TestHashPartitioner
Tests run: 1, Failures: 0, Errors: 0, Skipped: 0, Time elapsed: 0.377 sec
Running org.apache.solr.spelling.IndexBasedSpellCheckerTest
Creating dataDir: /usr/home/hudson/hudson-slave/workspace/Lucene-Solr-Maven-trunk/maven-build/solr/core/target/test/./solrtest-IndexBasedSpellCheckerTest-1346521154980
Tests run: 5, Failures: 0, Errors: 0, Skipped: 0, Time elapsed: 1.103 sec
Running org.apache.solr.update.PeerSyncTest
Tests run: 1, Failures: 0, Errors: 0, Skipped: 0, Time elapsed: 2.885 sec
Running org.apache.solr.core.TestCoreContainer
Creating dataDir: /usr/home/hudson/hudson-slave/workspace/Lucene-Solr-Maven-trunk/maven-build/solr/core/target/test/./solrtest-TestCoreContainer-1346521158968
Tests run: 2, Failures: 0, Errors: 0, Skipped: 0, Time elapsed: 2.129 sec
Running org.apache.solr.schema.MultiTermTest
Creating dataDir: /usr/home/hudson/hudson-slave/workspace/Lucene-Solr-Maven-trunk/maven-build/solr/core/target/test/./solrtest-MultiTermTest-1346521161100
Tests run: 3, Failures: 0, Errors: 0, Skipped: 0, Time elapsed: 0.233 sec
Running org.apache.solr.search.TestElisionMultitermQuery
Creating dataDir: /usr/home/hudson/hudson-slave/workspace/Lucene-Solr-Maven-trunk/maven-build/solr/core/target/test/./solrtest-TestElisionMultitermQuery-1346521161333
Tests run: 1, Failures: 0, Errors: 0, Skipped: 0, Time elapsed: 0.244 sec
Running org.apache.solr.client.solrj.embedded.LargeVolumeBinaryJettyTest
Creating dataDir: /usr/home/hudson/hudson-slave/workspace/Lucene-Solr-Maven-trunk/maven-build/solr/core/target/test/./solrtest-LargeVolumeBinaryJettyTest-1346521161578
Tests run: 1, Failures: 0, Errors: 0, Skipped: 0, Time elapsed: 1.206 sec
Running org.apache.solr.spelling.DirectSolrSpellCheckerTest
Creating dataDir: /usr/home/hudson/hudson-slave/workspace/Lucene-Solr-Maven-trunk/maven-build/solr/core/target/test/./solrtest-DirectSolrSpellCheckerTest-1346521162787
Tests run: 2, Failures: 0, Errors: 0, Skipped: 0, Time elapsed: 0.704 sec
Running org.apache.solr.analysis.TestCharFilters
Creating dataDir: /usr/home/hudson/hudson-slave/workspace/Lucene-Solr-Maven-trunk/maven-build/solr/core/target/test/./solrtest-TestCharFilters-1346521163484
Tests run: 2, Failures: 0, Errors: 0, Skipped: 0, Time elapsed: 0.103 sec
Running org.apache.solr.client.solrj.SolrExampleXMLTest
Creating dataDir: /usr/home/hudson/hudson-slave/workspace/Lucene-Solr-Maven-trunk/maven-build/solr/core/target/test/./solrtest-SolrExampleXMLTest-1346521163592
Tests run: 22, Failures: 0, Errors: 0, Skipped: 0, Time elapsed: 4.776 sec
Running org.apache.solr.servlet.DirectSolrConnectionTest
Tests run: 2, Failures: 0, Errors: 0, Skipped: 0, Time elapsed: 0.292 sec
Running org.apache.solr.core.TestMergePolicyConfig
Creating dataDir: /usr/home/hudson/hudson-slave/workspace/Lucene-Solr-Maven-trunk/maven-build/solr/core/target/test/./solrtest-TestMergePolicyConfig-1346521168662
Tests run: 1, Failures: 0, Errors: 0, Skipped: 0, Time elapsed: 0.423 sec
Running org.apache.solr.search.TestFoldingMultitermQuery
Creating dataDir: /usr/home/hudson/hudson-slave/workspace/Lucene-Solr-Maven-trunk/maven-build/solr/core/target/test/./solrtest-TestFoldingMultitermQuery-1346521169100
Tests run: 18, Failures: 0, Errors: 0, Skipped: 0, Time elapsed: 1.092 sec
Running org.apache.solr.client.solrj.TestLBHttpSolrServer
Tests run: 3, Failures: 0, Errors: 0, Skipped: 0, Time elapsed: 36.952 sec
Running org.apache.solr.spelling.suggest.SuggesterFSTTest
Creating dataDir: /usr/home/hudson/hudson-slave/workspace/Lucene-Solr-Maven-trunk/maven-build/solr/core/target/test/./solrtest-SuggesterFSTTest-1346521207134
NOTE: per solr.test.leavedatadir, dataDir will not be removed: /usr/home/hudson/hudson-slave/workspace/Lucene-Solr-Maven-trunk/maven-build/solr/core/target/test/./solrtest-SuggesterFSTTest-1346521207134
Tests run: 4, Failures: 0, Errors: 0, Skipped: 0, Time elapsed: 0.827 sec
Running org.apache.solr.TestGroupingSearch
Creating dataDir: /usr/home/hudson/hudson-slave/workspace/Lucene-Solr-Maven-trunk/maven-build/solr/core/target/test/./solrtest-TestGroupingSearch-1346521207965
Tests run: 12, Failures: 0, Errors: 0, Skipped: 0, Time elapsed: 1.935 sec
Running org.apache.solr.common.util.NamedListTest
Tests run: 1, Failures: 0, Errors: 0, Skipped: 0, Time elapsed: 0.011 sec
Running org.apache.solr.handler.JsonLoaderTest
Creating dataDir: /usr/home/hudson/hudson-slave/workspace/Lucene-Solr-Maven-trunk/maven-build/solr/core/target/test/./solrtest-JsonLoaderTest-1346521209905
Tests run: 6, Failures: 0, Errors: 0, Skipped: 0, Time elapsed: 0.4 sec
Running org.apache.solr.util.DateMathParserTest
Tests run: 8, Failures: 0, Errors: 0, Skipped: 0, Time elapsed: 0.078 sec
Running org.apache.solr.schema.PrimitiveFieldTypeTest
Tests run: 1, Failures: 0, Errors: 0, Skipped: 0, Time elapsed: 0.479 sec
Running org.apache.solr.core.RAMDirectoryFactoryTest
Tests run: 1, Failures: 0, Errors: 0, Skipped: 0, Time elapsed: 0.019 sec
Running org.apache.solr.core.AlternateDirectoryTest
Creating dataDir: /usr/home/hudson/hudson-slave/workspace/Lucene-Solr-Maven-trunk/maven-build/solr/core/target/test/./solrtest-AlternateDirectoryTest-1346521210885
Tests run: 1, Failures: 0, Errors: 0, Skipped: 0, Time elapsed: 0.354 sec
Running org.apache.solr.client.solrj.embedded.SolrExampleStreamingTest
Creating dataDir: /usr/home/hudson/hudson-slave/workspace/Lucene-Solr-Maven-trunk/maven-build/solr/core/target/test/./solrtest-SolrExampleStreamingTest-1346521211246
ASYNC  NEW_CORE C0 name=collection1 org.apache.solr.core.SolrCore@2336fb6f
3893 T533 C0 oasc.SolrException.log SEVERE org.apache.solr.common.SolrException: Document contains multiple values for uniqueKey field: id=[DOCID, DOCID2]
		at org.apache.solr.update.AddUpdateCommand.getIndexedId(AddUpdateCommand.java:91)
		at org.apache.solr.update.processor.DistributedUpdateProcessor.versionAdd(DistributedUpdateProcessor.java:460)
		at org.apache.solr.update.processor.DistributedUpdateProcessor.processAdd(DistributedUpdateProcessor.java:342)
		at org.apache.solr.handler.loader.XMLLoader.processUpdate(XMLLoader.java:230)
		at org.apache.solr.handler.loader.XMLLoader.load(XMLLoader.java:157)
		at org.apache.solr.handler.UpdateRequestHandler$1.load(UpdateRequestHandler.java:92)
		at org.apache.solr.handler.ContentStreamHandlerBase.handleRequestBody(ContentStreamHandlerBase.java:74)
		at org.apache.solr.handler.RequestHandlerBase.handleRequest(RequestHandlerBase.java:129)
		at org.apache.solr.core.SolrCore.execute(SolrCore.java:1692)
		at org.apache.solr.servlet.SolrDispatchFilter.execute(SolrDispatchFilter.java:454)
		at org.apache.solr.servlet.SolrDispatchFilter.doFilter(SolrDispatchFilter.java:275)
		at org.eclipse.jetty.servlet.ServletHandler$CachedChain.doFilter(ServletHandler.java:1337)
		at org.eclipse.jetty.servlet.ServletHandler.doHandle(ServletHandler.java:484)
		at org.eclipse.jetty.server.session.SessionHandler.doHandle(SessionHandler.java:231)
		at org.eclipse.jetty.server.handler.ScopedHandler.handle(ScopedHandler.java:119)
		at org.eclipse.jetty.server.handler.GzipHandler.handle(GzipHandler.java:267)
		at org.eclipse.jetty.server.handler.ContextHandler.doHandle(ContextHandler.java:1067)
		at org.eclipse.jetty.servlet.ServletHandler.doScope(ServletHandler.java:413)
		at org.eclipse.jetty.server.session.SessionHandler.doScope(SessionHandler.java:192)
		at org.eclipse.jetty.server.handler.ContextHandler.doScope(ContextHandler.java:999)
		at org.eclipse.jetty.server.handler.ScopedHandler.handle(ScopedHandler.java:117)
		at org.eclipse.jetty.server.handler.HandlerWrapper.handle(HandlerWrapper.java:111)
		at org.eclipse.jetty.server.Server.handle(Server.java:351)
		at org.eclipse.jetty.server.AbstractHttpConnection.handleRequest(AbstractHttpConnection.java:454)
		at org.eclipse.jetty.server.BlockingHttpConnection.handleRequest(BlockingHttpConnection.java:47)
		at org.eclipse.jetty.server.AbstractHttpConnection.content(AbstractHttpConnection.java:900)
		at org.eclipse.jetty.server.AbstractHttpConnection$RequestHandler.content(AbstractHttpConnection.java:954)
		at org.eclipse.jetty.http.HttpParser.parseNext(HttpParser.java:952)
		at org.eclipse.jetty.http.HttpParser.parseAvailable(HttpParser.java:235)
		at org.eclipse.jetty.server.BlockingHttpConnection.handle(BlockingHttpConnection.java:66)
		at org.eclipse.jetty.server.bio.SocketConnector$ConnectorEndPoint.run(SocketConnector.java:254)
		at org.eclipse.jetty.util.thread.QueuedThreadPool.runJob(QueuedThreadPool.java:599)
		at org.eclipse.jetty.util.thread.QueuedThreadPool$3.run(QueuedThreadPool.java:534)
		at java.lang.Thread.run(Thread.java:679)
	
Tests run: 22, Failures: 0, Errors: 0, Skipped: 0, Time elapsed: 11.506 sec
Running org.apache.solr.handler.DocumentAnalysisRequestHandlerTest
Creating dataDir: /usr/home/hudson/hudson-slave/workspace/Lucene-Solr-Maven-trunk/maven-build/solr/core/target/test/./solrtest-DocumentAnalysisRequestHandlerTest-1346521222752
Tests run: 4, Failures: 0, Errors: 0, Skipped: 0, Time elapsed: 0.542 sec
Running org.apache.solr.handler.TestCSVLoader
Creating dataDir: /usr/home/hudson/hudson-slave/workspace/Lucene-Solr-Maven-trunk/maven-build/solr/core/target/test/./solrtest-TestCSVLoader-1346521223293
Tests run: 5, Failures: 0, Errors: 0, Skipped: 0, Time elapsed: 0.731 sec
Running org.apache.solr.client.solrj.SolrExampleBinaryTest
Creating dataDir: /usr/home/hudson/hudson-slave/workspace/Lucene-Solr-Maven-trunk/maven-build/solr/core/target/test/./solrtest-SolrExampleBinaryTest-1346521224030
ASYNC  NEW_CORE C1 name=collection1 org.apache.solr.core.SolrCore@558d8140
993 T559 C1 oasc.SolrException.log SEVERE org.apache.solr.common.SolrException: Document contains multiple values for uniqueKey field: id=[DOCID, DOCID2]
		at org.apache.solr.update.AddUpdateCommand.getIndexedId(AddUpdateCommand.java:91)
		at org.apache.solr.update.processor.DistributedUpdateProcessor.versionAdd(DistributedUpdateProcessor.java:460)
		at org.apache.solr.update.processor.DistributedUpdateProcessor.processAdd(DistributedUpdateProcessor.java:342)
		at org.apache.solr.handler.loader.JavabinLoader$1.update(JavabinLoader.java:86)
		at org.apache.solr.client.solrj.request.JavaBinUpdateRequestCodec$1.readOuterMostDocIterator(JavaBinUpdateRequestCodec.java:140)
		at org.apache.solr.client.solrj.request.JavaBinUpdateRequestCodec$1.readIterator(JavaBinUpdateRequestCodec.java:120)
		at org.apache.solr.common.util.JavaBinCodec.readVal(JavaBinCodec.java:221)
		at org.apache.solr.client.solrj.request.JavaBinUpdateRequestCodec$1.readNamedList(JavaBinUpdateRequestCodec.java:105)
		at org.apache.solr.common.util.JavaBinCodec.readVal(JavaBinCodec.java:186)
		at org.apache.solr.common.util.JavaBinCodec.unmarshal(JavaBinCodec.java:112)
		at org.apache.solr.client.solrj.request.JavaBinUpdateRequestCodec.unmarshal(JavaBinUpdateRequestCodec.java:147)
		at org.apache.solr.handler.loader.JavabinLoader.parseAndLoadDocs(JavabinLoader.java:96)
		at org.apache.solr.handler.loader.JavabinLoader.load(JavabinLoader.java:55)
		at org.apache.solr.handler.UpdateRequestHandler$1.load(UpdateRequestHandler.java:92)
		at org.apache.solr.handler.ContentStreamHandlerBase.handleRequestBody(ContentStreamHandlerBase.java:74)
		at org.apache.solr.handler.RequestHandlerBase.handleRequest(RequestHandlerBase.java:129)
		at org.apache.solr.core.SolrCore.execute(SolrCore.java:1692)
		at org.apache.solr.servlet.SolrDispatchFilter.execute(SolrDispatchFilter.java:454)
		at org.apache.solr.servlet.SolrDispatchFilter.doFilter(SolrDispatchFilter.java:275)
		at org.eclipse.jetty.servlet.ServletHandler$CachedChain.doFilter(ServletHandler.java:1337)
		at org.eclipse.jetty.servlet.ServletHandler.doHandle(ServletHandler.java:484)
		at org.eclipse.jetty.server.session.SessionHandler.doHandle(SessionHandler.java:231)
		at org.eclipse.jetty.server.handler.ScopedHandler.handle(ScopedHandler.java:119)
		at org.eclipse.jetty.server.handler.GzipHandler.handle(GzipHandler.java:267)
		at org.eclipse.jetty.server.handler.ContextHandler.doHandle(ContextHandler.java:1067)
		at org.eclipse.jetty.servlet.ServletHandler.doScope(ServletHandler.java:413)
		at org.eclipse.jetty.server.session.SessionHandler.doScope(SessionHandler.java:192)
		at org.eclipse.jetty.server.handler.ContextHandler.doScope(ContextHandler.java:999)
		at org.eclipse.jetty.server.handler.ScopedHandler.handle(ScopedHandler.java:117)
		at org.eclipse.jetty.server.handler.HandlerWrapper.handle(HandlerWrapper.java:111)
		at org.eclipse.jetty.server.Server.handle(Server.java:351)
		at org.eclipse.jetty.server.AbstractHttpConnection.handleRequest(AbstractHttpConnection.java:454)
		at org.eclipse.jetty.server.BlockingHttpConnection.handleRequest(BlockingHttpConnection.java:47)
		at org.eclipse.jetty.server.AbstractHttpConnection.content(AbstractHttpConnection.java:900)
		at org.eclipse.jetty.server.AbstractHttpConnection$RequestHandler.content(AbstractHttpConnection.java:954)
		at org.eclipse.jetty.http.HttpParser.parseNext(HttpParser.java:952)
		at org.eclipse.jetty.http.HttpParser.parseAvailable(HttpParser.java:235)
		at org.eclipse.jetty.server.BlockingHttpConnection.handle(BlockingHttpConnection.java:66)
		at org.eclipse.jetty.server.bio.SocketConnector$ConnectorEndPoint.run(SocketConnector.java:254)
		at org.eclipse.jetty.util.thread.QueuedThreadPool.runJob(QueuedThreadPool.java:599)
		at org.eclipse.jetty.util.thread.QueuedThreadPool$3.run(QueuedThreadPool.java:534)
		at java.lang.Thread.run(Thread.java:679)
	
Tests run: 22, Failures: 0, Errors: 0, Skipped: 0, Time elapsed: 4.588 sec
Running org.apache.solr.handler.admin.CoreAdminHandlerTest
Creating dataDir: /usr/home/hudson/hudson-slave/workspace/Lucene-Solr-Maven-trunk/maven-build/solr/core/target/test/./solrtest-CoreAdminHandlerTest-1346521228616
Tests run: 1, Failures: 0, Errors: 0, Skipped: 0, Time elapsed: 1.024 sec
Running org.apache.solr.TestRandomFaceting
Creating dataDir: /usr/home/hudson/hudson-slave/workspace/Lucene-Solr-Maven-trunk/maven-build/solr/core/target/test/./solrtest-TestRandomFaceting-1346521229639
Tests run: 1, Failures: 0, Errors: 0, Skipped: 0, Time elapsed: 10.696 sec
Running org.apache.solr.search.TestStressLucene
Tests run: 1, Failures: 0, Errors: 0, Skipped: 0, Time elapsed: 1.365 sec
Running org.apache.solr.client.solrj.impl.CloudSolrServerTest
Creating dataDir: /usr/home/hudson/hudson-slave/workspace/Lucene-Solr-Maven-trunk/maven-build/solr/core/target/test/./solrtest-CloudSolrServerTest-1346521241726
49636 T753 oasc.SolrException.log SEVERE Sync Failed
ASYNC  NEW_CORE C2 name=collection1 org.apache.solr.core.SolrCore@bce81f5 url=http://127.0.0.1:39273/solr/collection1 node=127.0.0.1:39273_solr
49644 T753 C2 P39273 oasu.DirectUpdateHandler2.closeWriter SEVERE Error in final commit java.io.FileNotFoundException: _0.fdx
	at org.apache.lucene.store.FSDirectory.fileLength(FSDirectory.java:266)
	at org.apache.lucene.index.SegmentInfo.sizeInBytes(SegmentInfo.java:102)
	at org.apache.lucene.index.IndexWriter.prepareFlushedSegment(IndexWriter.java:2139)
	at org.apache.lucene.index.DocumentsWriter.publishFlushedSegment(DocumentsWriter.java:495)
	at org.apache.lucene.index.DocumentsWriter.finishFlush(DocumentsWriter.java:474)
	at org.apache.lucene.index.DocumentsWriterFlushQueue$SegmentFlushTicket.publish(DocumentsWriterFlushQueue.java:201)
	at org.apache.lucene.index.DocumentsWriterFlushQueue.innerPurge(DocumentsWriterFlushQueue.java:119)
	at org.apache.lucene.index.DocumentsWriterFlushQueue.tryPurge(DocumentsWriterFlushQueue.java:148)
	at org.apache.lucene.index.DocumentsWriter.doFlush(DocumentsWriter.java:435)
	at org.apache.lucene.index.DocumentsWriter.flushAllThreads(DocumentsWriter.java:551)
	at org.apache.lucene.index.IndexWriter.prepareCommit(IndexWriter.java:2624)
	at org.apache.lucene.index.IndexWriter.commitInternal(IndexWriter.java:2760)
	at org.apache.lucene.index.IndexWriter.commit(IndexWriter.java:2740)
	at org.apache.solr.update.DirectUpdateHandler2.closeWriter(DirectUpdateHandler2.java:715)
	at org.apache.solr.update.DefaultSolrCoreState.decref(DefaultSolrCoreState.java:153)
	at org.apache.solr.update.DirectUpdateHandler2.close(DirectUpdateHandler2.java:662)
	at org.apache.solr.core.SolrCore.close(SolrCore.java:899)
	at org.apache.solr.cloud.ShardLeaderElectionContext.runLeaderProcess(ElectionContext.java:207)
	at org.apache.solr.cloud.LeaderElector.runIamLeaderProcess(LeaderElector.java:159)
	at org.apache.solr.cloud.LeaderElector.checkIfIamLeader(LeaderElector.java:103)
	at org.apache.solr.cloud.LeaderElector.access$000(LeaderElector.java:57)
	at org.apache.solr.cloud.LeaderElector$1.process(LeaderElector.java:132)
	at org.apache.zookeeper.ClientCnxn$EventThread.processEvent(ClientCnxn.java:526)
	at org.apache.zookeeper.ClientCnxn$EventThread.run(ClientCnxn.java:502)

Tests run: 1, Failures: 0, Errors: 0, Skipped: 0, Time elapsed: 50.109 sec
Running org.apache.solr.schema.PreAnalyzedFieldTest
Tests run: 3, Failures: 0, Errors: 0, Skipped: 0, Time elapsed: 0.035 sec
Running org.apache.solr.client.solrj.request.TestUpdateRequestCodec
Tests run: 2, Failures: 0, Errors: 0, Skipped: 0, Time elapsed: 0.02 sec
Running org.apache.solr.core.TestSolrXMLSerializer
Tests run: 1, Failures: 0, Errors: 0, Skipped: 0, Time elapsed: 0.029 sec
Running org.apache.solr.cloud.TestMultiCoreConfBootstrap
Creating dataDir: /usr/home/hudson/hudson-slave/workspace/Lucene-Solr-Maven-trunk/maven-build/solr/core/target/test/./solrtest-TestMultiCoreConfBootstrap-1346521291901
!!!! WARNING: best effort to remove /usr/home/hudson/hudson-slave/workspace/Lucene-Solr-Maven-trunk/maven-build/solr/core/target/test/./solrtest-TestMultiCoreConfBootstrap-1346521291901 FAILED !!!!!
Tests run: 1, Failures: 0, Errors: 0, Skipped: 0, Time elapsed: 4.588 sec
Running org.apache.solr.search.TestIndexSearcher
Creating dataDir: /usr/home/hudson/hudson-slave/workspace/Lucene-Solr-Maven-trunk/maven-build/solr/core/target/test/./solrtest-TestIndexSearcher-1346521296486
Tests run: 2, Failures: 0, Errors: 0, Skipped: 0, Time elapsed: 1.575 sec
Running org.apache.solr.TestSolrCoreProperties
Tests run: 1, Failures: 0, Errors: 0, Skipped: 0, Time elapsed: 0.172 sec
Running org.apache.solr.update.SoftAutoCommitTest
Tests run: 3, Failures: 0, Errors: 0, Skipped: 0, Time elapsed: 9.138 sec
Running org.apache.solr.request.TestFaceting
Creating dataDir: /usr/home/hudson/hudson-slave/workspace/Lucene-Solr-Maven-trunk/maven-build/solr/core/target/test/./solrtest-TestFaceting-1346521307374
Tests run: 3, Failures: 0, Errors: 0, Skipped: 0, Time elapsed: 5.45 sec
Running org.apache.solr.cloud.ZkNodePropsTest
Tests run: 1, Failures: 0, Errors: 0, Skipped: 0, Time elapsed: 0.018 sec
Running org.apache.solr.client.solrj.SolrQueryTest
Tests run: 9, Failures: 0, Errors: 0, Skipped: 0, Time elapsed: 0.04 sec
Running org.apache.solr.client.solrj.util.ClientUtilsTest
Tests run: 1, Failures: 0, Errors: 0, Skipped: 0, Time elapsed: 0.012 sec
Running org.apache.solr.handler.component.StatsComponentTest
ASYNC  NEW_CORE C3 name=collection1 org.apache.solr.core.SolrCore@47c6d17d
1008 T888 C3 oasc.SolrException.log SEVERE org.apache.solr.common.SolrException: Stats can only facet on single-valued fields, not: foo_ss
		at org.apache.solr.handler.component.SimpleStats.getFieldCacheStats(StatsComponent.java:261)
		at org.apache.solr.handler.component.SimpleStats.getStatsFields(StatsComponent.java:227)
		at org.apache.solr.handler.component.SimpleStats.getStatsCounts(StatsComponent.java:201)
		at org.apache.solr.handler.component.StatsComponent.process(StatsComponent.java:70)
		at org.apache.solr.handler.component.SearchHandler.handleRequestBody(SearchHandler.java:206)
		at org.apache.solr.handler.RequestHandlerBase.handleRequest(RequestHandlerBase.java:129)
		at org.apache.solr.core.SolrCore.execute(SolrCore.java:1692)
		at org.apache.solr.util.TestHarness.query(TestHarness.java:351)
		at org.apache.solr.util.TestHarness.query(TestHarness.java:333)
		at org.apache.solr.util.AbstractSolrTestCase.assertQEx(AbstractSolrTestCase.java:290)
		at org.apache.solr.handler.component.StatsComponentTest.testStatsFacetMultivaluedErrorHandling(StatsComponentTest.java:363)
		at sun.reflect.NativeMethodAccessorImpl.invoke0(Native Method)
		at sun.reflect.NativeMethodAccessorImpl.invoke(NativeMethodAccessorImpl.java:57)
		at sun.reflect.DelegatingMethodAccessorImpl.invoke(DelegatingMethodAccessorImpl.java:43)
		at java.lang.reflect.Method.invoke(Method.java:616)
		at com.carrotsearch.randomizedtesting.RandomizedRunner.invoke(RandomizedRunner.java:1559)
		at com.carrotsearch.randomizedtesting.RandomizedRunner.access$600(RandomizedRunner.java:79)
		at com.carrotsearch.randomizedtesting.RandomizedRunner$6.evaluate(RandomizedRunner.java:737)
		at com.carrotsearch.randomizedtesting.RandomizedRunner$7.evaluate(RandomizedRunner.java:773)
		at com.carrotsearch.randomizedtesting.RandomizedRunner$8.evaluate(RandomizedRunner.java:787)
		at com.carrotsearch.randomizedtesting.rules.SystemPropertiesRestoreRule$1.evaluate(SystemPropertiesRestoreRule.java:53)
		at org.apache.lucene.util.TestRuleSetupTeardownChained$1.evaluate(TestRuleSetupTeardownChained.java:50)
		at org.apache.lucene.util.TestRuleFieldCacheSanity$1.evaluate(TestRuleFieldCacheSanity.java:51)
		at org.apache.lucene.util.AbstractBeforeAfterRule$1.evaluate(AbstractBeforeAfterRule.java:45)
		at com.carrotsearch.randomizedtesting.rules.SystemPropertiesInvariantRule$1.evaluate(SystemPropertiesInvariantRule.java:55)
		at org.apache.lucene.util.TestRuleThreadAndTestName$1.evaluate(TestRuleThreadAndTestName.java:48)
		at org.apache.lucene.util.TestRuleIgnoreAfterMaxFailures$1.evaluate(TestRuleIgnoreAfterMaxFailures.java:70)
		at org.apache.lucene.util.TestRuleMarkFailure$1.evaluate(TestRuleMarkFailure.java:48)
		at com.carrotsearch.randomizedtesting.rules.StatementAdapter.evaluate(StatementAdapter.java:36)
		at com.carrotsearch.randomizedtesting.ThreadLeakControl$StatementRunner.run(ThreadLeakControl.java:345)
		at com.carrotsearch.randomizedtesting.ThreadLeakControl.forkTimeoutingTask(ThreadLeakControl.java:769)
		at com.carrotsearch.randomizedtesting.ThreadLeakControl$3.evaluate(ThreadLeakControl.java:429)
		at com.carrotsearch.randomizedtesting.RandomizedRunner.runSingleTest(RandomizedRunner.java:746)
		at com.carrotsearch.randomizedtesting.RandomizedRunner$3.evaluate(RandomizedRunner.java:648)
		at com.carrotsearch.randomizedtesting.RandomizedRunner$4.evaluate(RandomizedRunner.java:682)
		at com.carrotsearch.randomizedtesting.RandomizedRunner$5.evaluate(RandomizedRunner.java:693)
		at com.carrotsearch.randomizedtesting.rules.StatementAdapter.evaluate(StatementAdapter.java:36)
		at com.carrotsearch.randomizedtesting.rules.SystemPropertiesRestoreRule$1.evaluate(SystemPropertiesRestoreRule.java:53)
		at org.apache.lucene.util.AbstractBeforeAfterRule$1.evaluate(AbstractBeforeAfterRule.java:45)
		at org.apache.lucene.util.TestRuleStoreClassName$1.evaluate(TestRuleStoreClassName.java:42)
		at com.carrotsearch.randomizedtesting.rules.SystemPropertiesInvariantRule$1.evaluate(SystemPropertiesInvariantRule.java:55)
		at com.carrotsearch.randomizedtesting.rules.NoShadowingOrOverridesOnMethodsRule$1.evaluate(NoShadowingOrOverridesOnMethodsRule.java:39)
		at com.carrotsearch.randomizedtesting.rules.NoShadowingOrOverridesOnMethodsRule$1.evaluate(NoShadowingOrOverridesOnMethodsRule.java:39)
		at org.apache.lucene.util.TestRuleAssertionsRequired$1.evaluate(TestRuleAssertionsRequired.java:40)
		at org.apache.lucene.util.TestRuleMarkFailure$1.evaluate(TestRuleMarkFailure.java:48)
		at org.apache.lucene.util.TestRuleIgnoreAfterMaxFailures$1.evaluate(TestRuleIgnoreAfterMaxFailures.java:70)
		at org.apache.lucene.util.TestRuleIgnoreTestSuites$1.evaluate(TestRuleIgnoreTestSuites.java:55)
		at com.carrotsearch.randomizedtesting.rules.StatementAdapter.evaluate(StatementAdapter.java:36)
		at com.carrotsearch.randomizedtesting.ThreadLeakControl$StatementRunner.run(ThreadLeakControl.java:345)
		at java.lang.Thread.run(Thread.java:679)
	
Tests run: 7, Failures: 0, Errors: 0, Skipped: 0, Time elapsed: 3.975 sec
Running org.apache.solr.search.similarities.TestDFRSimilarityFactory
Creating dataDir: /usr/home/hudson/hudson-slave/workspace/Lucene-Solr-Maven-trunk/maven-build/solr/core/target/test/./solrtest-TestDFRSimilarityFactory-1346521316869
Tests run: 3, Failures: 0, Errors: 0, Skipped: 0, Time elapsed: 0.099 sec
Running org.apache.solr.update.AutoCommitTest
Tests run: 3, Failures: 0, Errors: 0, Skipped: 0, Time elapsed: 7.798 sec
Running org.apache.solr.analysis.LegacyHTMLStripCharFilterTest
Tests run: 13, Failures: 0, Errors: 0, Skipped: 1, Time elapsed: 0.281 sec
Running org.apache.solr.search.similarities.TestLMJelinekMercerSimilarityFactory
Creating dataDir: /usr/home/hudson/hudson-slave/workspace/Lucene-Solr-Maven-trunk/maven-build/solr/core/target/test/./solrtest-TestLMJelinekMercerSimilarityFactory-1346521325053
Tests run: 2, Failures: 0, Errors: 0, Skipped: 0, Time elapsed: 0.112 sec
Running org.apache.solr.cloud.FullSolrCloudDistribCmdsTest
Creating dataDir: /usr/home/hudson/hudson-slave/workspace/Lucene-Solr-Maven-trunk/maven-build/solr/core/target/test/./solrtest-FullSolrCloudDistribCmdsTest-1346521325180
ASYNC  NEW_CORE C4 name=collection1 org.apache.solr.core.SolrCore@1b1129ba url=http://127.0.0.1:54859/solr/collection1 node=127.0.0.1:54859_solr
33764 T980 C4 P54859 oasc.SolrException.log SEVERE java.lang.RuntimeException: No registered leader was found, collection:collection1 slice:shard1
		at org.apache.solr.common.cloud.ZkStateReader.getLeaderProps(ZkStateReader.java:413)
		at org.apache.solr.common.cloud.ZkStateReader.getLeaderProps(ZkStateReader.java:399)
		at org.apache.solr.update.processor.DistributedUpdateProcessor.setupRequest(DistributedUpdateProcessor.java:189)
		at org.apache.solr.update.processor.DistributedUpdateProcessor.processAdd(DistributedUpdateProcessor.java:333)
		at org.apache.solr.handler.loader.XMLLoader.processUpdate(XMLLoader.java:230)
		at org.apache.solr.handler.loader.XMLLoader.load(XMLLoader.java:157)
		at org.apache.solr.handler.UpdateRequestHandler$1.load(UpdateRequestHandler.java:92)
		at org.apache.solr.handler.ContentStreamHandlerBase.handleRequestBody(ContentStreamHandlerBase.java:74)
		at org.apache.solr.handler.RequestHandlerBase.handleRequest(RequestHandlerBase.java:129)
		at org.apache.solr.core.SolrCore.execute(SolrCore.java:1692)
		at org.apache.solr.servlet.SolrDispatchFilter.execute(SolrDispatchFilter.java:454)
		at org.apache.solr.servlet.SolrDispatchFilter.doFilter(SolrDispatchFilter.java:275)
		at org.eclipse.jetty.servlet.ServletHandler$CachedChain.doFilter(ServletHandler.java:1337)
		at org.eclipse.jetty.servlet.ServletHandler.doHandle(ServletHandler.java:484)
		at org.eclipse.jetty.server.session.SessionHandler.doHandle(SessionHandler.java:231)
		at org.eclipse.jetty.server.handler.ScopedHandler.handle(ScopedHandler.java:119)
		at org.eclipse.jetty.server.handler.GzipHandler.handle(GzipHandler.java:267)
		at org.eclipse.jetty.server.handler.ContextHandler.doHandle(ContextHandler.java:1067)
		at org.eclipse.jetty.servlet.ServletHandler.doScope(ServletHandler.java:413)
		at org.eclipse.jetty.server.session.SessionHandler.doScope(SessionHandler.java:192)
		at org.eclipse.jetty.server.handler.ContextHandler.doScope(ContextHandler.java:999)
		at org.eclipse.jetty.server.handler.ScopedHandler.handle(ScopedHandler.java:117)
		at org.eclipse.jetty.server.handler.HandlerWrapper.handle(HandlerWrapper.java:111)
		at org.eclipse.jetty.server.Server.handle(Server.java:351)
		at org.eclipse.jetty.server.AbstractHttpConnection.handleRequest(AbstractHttpConnection.java:454)
		at org.eclipse.jetty.server.BlockingHttpConnection.handleRequest(BlockingHttpConnection.java:47)
		at org.eclipse.jetty.server.AbstractHttpConnection.content(AbstractHttpConnection.java:900)
		at org.eclipse.jetty.server.AbstractHttpConnection$RequestHandler.content(AbstractHttpConnection.java:954)
		at org.eclipse.jetty.http.HttpParser.parseNext(HttpParser.java:952)
		at org.eclipse.jetty.http.HttpParser.parseAvailable(HttpParser.java:235)
		at org.eclipse.jetty.server.BlockingHttpConnection.handle(BlockingHttpConnection.java:66)
		at org.eclipse.jetty.server.bio.SocketConnector$ConnectorEndPoint.run(SocketConnector.java:254)
		at org.eclipse.jetty.util.thread.QueuedThreadPool.runJob(QueuedThreadPool.java:599)
		at org.eclipse.jetty.util.thread.QueuedThreadPool$3.run(QueuedThreadPool.java:534)
		at java.lang.Thread.run(Thread.java:679)
	
33769 T980 C4 P54859 oasc.SolrException.log SEVERE null:java.lang.RuntimeException: No registered leader was found, collection:collection1 slice:shard1
		at org.apache.solr.common.cloud.ZkStateReader.getLeaderProps(ZkStateReader.java:413)
		at org.apache.solr.common.cloud.ZkStateReader.getLeaderProps(ZkStateReader.java:399)
		at org.apache.solr.update.processor.DistributedUpdateProcessor.setupRequest(DistributedUpdateProcessor.java:189)
		at org.apache.solr.update.processor.DistributedUpdateProcessor.processAdd(DistributedUpdateProcessor.java:333)
		at org.apache.solr.handler.loader.XMLLoader.processUpdate(XMLLoader.java:230)
		at org.apache.solr.handler.loader.XMLLoader.load(XMLLoader.java:157)
		at org.apache.solr.handler.UpdateRequestHandler$1.load(UpdateRequestHandler.java:92)
		at org.apache.solr.handler.ContentStreamHandlerBase.handleRequestBody(ContentStreamHandlerBase.java:74)
		at org.apache.solr.handler.RequestHandlerBase.handleRequest(RequestHandlerBase.java:129)
		at org.apache.solr.core.SolrCore.execute(SolrCore.java:1692)
		at org.apache.solr.servlet.SolrDispatchFilter.execute(SolrDispatchFilter.java:454)
		at org.apache.solr.servlet.SolrDispatchFilter.doFilter(SolrDispatchFilter.java:275)
		at org.eclipse.jetty.servlet.ServletHandler$CachedChain.doFilter(ServletHandler.java:1337)
		at org.eclipse.jetty.servlet.ServletHandler.doHandle(ServletHandler.java:484)
		at org.eclipse.jetty.server.session.SessionHandler.doHandle(SessionHandler.java:231)
		at org.eclipse.jetty.server.handler.ScopedHandler.handle(ScopedHandler.java:119)
		at org.eclipse.jetty.server.handler.GzipHandler.handle(GzipHandler.java:267)
		at org.eclipse.jetty.server.handler.ContextHandler.doHandle(ContextHandler.java:1067)
		at org.eclipse.jetty.servlet.ServletHandler.doScope(ServletHandler.java:413)
		at org.eclipse.jetty.server.session.SessionHandler.doScope(SessionHandler.java:192)
		at org.eclipse.jetty.server.handler.ContextHandler.doScope(ContextHandler.java:999)
		at org.eclipse.jetty.server.handler.ScopedHandler.handle(ScopedHandler.java:117)
		at org.eclipse.jetty.server.handler.HandlerWrapper.handle(HandlerWrapper.java:111)
		at org.eclipse.jetty.server.Server.handle(Server.java:351)
		at org.eclipse.jetty.server.AbstractHttpConnection.handleRequest(AbstractHttpConnection.java:454)
		at org.eclipse.jetty.server.BlockingHttpConnection.handleRequest(BlockingHttpConnection.java:47)
		at org.eclipse.jetty.server.AbstractHttpConnection.content(AbstractHttpConnection.java:900)
		at org.eclipse.jetty.server.AbstractHttpConnection$RequestHandler.content(AbstractHttpConnection.java:954)
		at org.eclipse.jetty.http.HttpParser.parseNext(HttpParser.java:952)
		at org.eclipse.jetty.http.HttpParser.parseAvailable(HttpParser.java:235)
		at org.eclipse.jetty.server.BlockingHttpConnection.handle(BlockingHttpConnection.java:66)
		at org.eclipse.jetty.server.bio.SocketConnector$ConnectorEndPoint.run(SocketConnector.java:254)
		at org.eclipse.jetty.util.thread.QueuedThreadPool.runJob(QueuedThreadPool.java:599)
		at org.eclipse.jetty.util.thread.QueuedThreadPool$3.run(QueuedThreadPool.java:534)
		at java.lang.Thread.run(Thread.java:679)
	
ASYNC  NEW_CORE C5 name=collection1 org.apache.solr.core.SolrCore@409335e1 url=http://127.0.0.1:52733/solr/collection1 node=127.0.0.1:52733_solr
33976 T955 C5 P52733 oasc.SolrException.log SEVERE null:org.eclipse.jetty.io.EofException
		at org.eclipse.jetty.server.HttpOutput.write(HttpOutput.java:154)
		at org.eclipse.jetty.server.HttpOutput.write(HttpOutput.java:101)
		at org.apache.solr.common.util.FastOutputStream.flush(FastOutputStream.java:204)
		at org.apache.solr.common.util.FastOutputStream.flushBuffer(FastOutputStream.java:197)
		at org.apache.solr.common.util.JavaBinCodec.marshal(JavaBinCodec.java:94)
		at org.apache.solr.response.BinaryResponseWriter.write(BinaryResponseWriter.java:49)
		at org.apache.solr.servlet.SolrDispatchFilter.writeResponse(SolrDispatchFilter.java:403)
		at org.apache.solr.servlet.SolrDispatchFilter.doFilter(SolrDispatchFilter.java:288)
		at org.eclipse.jetty.servlet.ServletHandler$CachedChain.doFilter(ServletHandler.java:1337)
		at org.eclipse.jetty.servlet.ServletHandler.doHandle(ServletHandler.java:484)
		at org.eclipse.jetty.server.session.SessionHandler.doHandle(SessionHandler.java:231)
		at org.eclipse.jetty.server.handler.ScopedHandler.handle(ScopedHandler.java:119)
		at org.eclipse.jetty.server.handler.GzipHandler.handle(GzipHandler.java:267)
		at org.eclipse.jetty.server.handler.ContextHandler.doHandle(ContextHandler.java:1067)
		at org.eclipse.jetty.servlet.ServletHandler.doScope(ServletHandler.java:413)
		at org.eclipse.jetty.server.session.SessionHandler.doScope(SessionHandler.java:192)
		at org.eclipse.jetty.server.handler.ContextHandler.doScope(ContextHandler.java:999)
		at org.eclipse.jetty.server.handler.ScopedHandler.handle(ScopedHandler.java:117)
		at org.eclipse.jetty.server.handler.HandlerWrapper.handle(HandlerWrapper.java:111)
		at org.eclipse.jetty.server.Server.handle(Server.java:351)
		at org.eclipse.jetty.server.AbstractHttpConnection.handleRequest(AbstractHttpConnection.java:454)
		at org.eclipse.jetty.server.BlockingHttpConnection.handleRequest(BlockingHttpConnection.java:47)
		at org.eclipse.jetty.server.AbstractHttpConnection.content(AbstractHttpConnection.java:900)
		at org.eclipse.jetty.server.AbstractHttpConnection$RequestHandler.content(AbstractHttpConnection.java:954)
		at org.eclipse.jetty.http.HttpParser.parseNext(HttpParser.java:952)
		at org.eclipse.jetty.http.HttpParser.parseAvailable(HttpParser.java:235)
		at org.eclipse.jetty.server.BlockingHttpConnection.handle(BlockingHttpConnection.java:66)
		at org.eclipse.jetty.server.bio.SocketConnector$ConnectorEndPoint.run(SocketConnector.java:254)
		at org.eclipse.jetty.util.thread.QueuedThreadPool.runJob(QueuedThreadPool.java:599)
		at org.eclipse.jetty.util.thread.QueuedThreadPool$3.run(QueuedThreadPool.java:534)
		at java.lang.Thread.run(Thread.java:679)
	
33980 T955 C5 P52733 oasc.SolrException.log SEVERE null:org.eclipse.jetty.io.EofException
		at org.eclipse.jetty.server.HttpOutput.write(HttpOutput.java:154)
		at org.eclipse.jetty.server.HttpOutput.write(HttpOutput.java:101)
		at org.apache.solr.common.util.FastOutputStream.flush(FastOutputStream.java:204)
		at org.apache.solr.common.util.FastOutputStream.flushBuffer(FastOutputStream.java:197)
		at org.apache.solr.common.util.JavaBinCodec.marshal(JavaBinCodec.java:94)
		at org.apache.solr.response.BinaryResponseWriter.write(BinaryResponseWriter.java:49)
		at org.apache.solr.servlet.SolrDispatchFilter.writeResponse(SolrDispatchFilter.java:403)
		at org.apache.solr.servlet.SolrDispatchFilter.doFilter(SolrDispatchFilter.java:288)
		at org.eclipse.jetty.servlet.ServletHandler$CachedChain.doFilter(ServletHandler.java:1337)
		at org.eclipse.jetty.servlet.ServletHandler.doHandle(ServletHandler.java:484)
		at org.eclipse.jetty.server.session.SessionHandler.doHandle(SessionHandler.java:231)
		at org.eclipse.jetty.server.handler.ScopedHandler.handle(ScopedHandler.java:119)
		at org.eclipse.jetty.server.handler.GzipHandler.handle(GzipHandler.java:267)
		at org.eclipse.jetty.server.handler.ContextHandler.doHandle(ContextHandler.java:1067)
		at org.eclipse.jetty.servlet.ServletHandler.doScope(ServletHandler.java:413)
		at org.eclipse.jetty.server.session.SessionHandler.doScope(SessionHandler.java:192)
		at org.eclipse.jetty.server.handler.ContextHandler.doScope(ContextHandler.java:999)
		at org.eclipse.jetty.server.handler.ScopedHandler.handle(ScopedHandler.java:117)
		at org.eclipse.jetty.server.handler.HandlerWrapper.handle(HandlerWrapper.java:111)
		at org.eclipse.jetty.server.Server.handle(Server.java:351)
		at org.eclipse.jetty.server.AbstractHttpConnection.handleRequest(AbstractHttpConnection.java:454)
		at org.eclipse.jetty.server.BlockingHttpConnection.handleRequest(BlockingHttpConnection.java:47)
		at org.eclipse.jetty.server.AbstractHttpConnection.content(AbstractHttpConnection.java:900)
		at org.eclipse.jetty.server.AbstractHttpConnection$RequestHandler.content(AbstractHttpConnection.java:954)
		at org.eclipse.jetty.http.HttpParser.parseNext(HttpParser.java:952)
		at org.eclipse.jetty.http.HttpParser.parseAvailable(HttpParser.java:235)
		at org.eclipse.jetty.server.BlockingHttpConnection.handle(BlockingHttpConnection.java:66)
		at org.eclipse.jetty.server.bio.SocketConnector$ConnectorEndPoint.run(SocketConnector.java:254)
		at org.eclipse.jetty.util.thread.QueuedThreadPool.runJob(QueuedThreadPool.java:599)
		at org.eclipse.jetty.util.thread.QueuedThreadPool$3.run(QueuedThreadPool.java:534)
		at java.lang.Thread.run(Thread.java:679)
	
Tests run: 1, Failures: 0, Errors: 0, Skipped: 0, Time elapsed: 37.029 sec
Running org.apache.solr.search.TestPseudoReturnFields
Creating dataDir: /usr/home/hudson/hudson-slave/workspace/Lucene-Solr-Maven-trunk/maven-build/solr/core/target/test/./solrtest-TestPseudoReturnFields-1346521362196
Tests run: 13, Failures: 0, Errors: 0, Skipped: 0, Time elapsed: 0.751 sec
Running org.apache.solr.client.solrj.response.TermsResponseTest
Creating dataDir: /usr/home/hudson/hudson-slave/workspace/Lucene-Solr-Maven-trunk/maven-build/solr/core/target/test/./solrtest-TermsResponseTest-1346521362945
Tests run: 1, Failures: 0, Errors: 0, Skipped: 0, Time elapsed: 0.714 sec
Running org.apache.solr.handler.admin.LoggingHandlerTest
Creating dataDir: /usr/home/hudson/hudson-slave/workspace/Lucene-Solr-Maven-trunk/maven-build/solr/core/target/test/./solrtest-LoggingHandlerTest-1346521363660
Tests run: 1, Failures: 0, Errors: 0, Skipped: 0, Time elapsed: 0.559 sec
Running org.apache.solr.util.SimplePostToolTest
Entering crawl at level 0 (1 links total, 1 new)
POSTed web resource http://example.com (depth: 0)
Entering crawl at level 1 (2 links total, 2 new)
POSTed web resource http://example.com/page2 (depth: 1)
POSTed web resource http://example.com/page1 (depth: 1)
Entering crawl at level 2 (2 links total, 2 new)
SimplePostTool: WARNING: The URL http://example.com/disallowed returned a HTTP result status of 403
POSTed web resource http://example.com/page1/foo (depth: 2)
Entering crawl at level 3 (1 links total, 1 new)
POSTed web resource http://example.com/page1/foo/bar (depth: 3)
Entering crawl at level 0 (1 links total, 1 new)
POSTed web resource http://example.com (depth: 0)
Entering crawl at level 1 (2 links total, 2 new)
POSTed web resource http://example.com/page2 (depth: 1)
POSTed web resource http://example.com/page1 (depth: 1)
Entering crawl at level 0 (1 links total, 1 new)
POSTed web resource http://example.com (depth: 0)
Entering crawl at level 1 (2 links total, 2 new)
POSTed web resource http://example.com/page2 (depth: 1)
POSTed web resource http://example.com/page1 (depth: 1)
Entering crawl at level 2 (2 links total, 2 new)
POSTed web resource http://example.com/disallowed (depth: 2)
POSTed web resource http://example.com/page1/foo (depth: 2)
Entering crawl at level 3 (1 links total, 1 new)
POSTed web resource http://example.com/page1/foo/bar (depth: 3)
Indexing directory /usr/home/hudson/hudson-slave/workspace/Lucene-Solr-Maven-trunk/maven-build/solr/core/target/test-classes/exampledocs (2 files, depth=0)
POSTing file example.txt (text/plain)
POSTing file example.html (text/html)
Tests run: 11, Failures: 0, Errors: 0, Skipped: 0, Time elapsed: 0.78 sec
Running org.apache.solr.schema.RequiredFieldsTest
Creating dataDir: /usr/home/hudson/hudson-slave/workspace/Lucene-Solr-Maven-trunk/maven-build/solr/core/target/test/./solrtest-RequiredFieldsTest-1346521364998
Tests run: 3, Failures: 0, Errors: 0, Skipped: 0, Time elapsed: 0.39 sec
Running org.apache.solr.cloud.ChaosMonkeySafeLeaderTest
Tests run: 1, Failures: 0, Errors: 0, Skipped: 1, Time elapsed: 0 sec
Running org.apache.solr.handler.component.BadComponentTest
Creating dataDir: /usr/home/hudson/hudson-slave/workspace/Lucene-Solr-Maven-trunk/maven-build/solr/core/target/test/./solrtest-BadComponentTest-1346521365389
Tests run: 1, Failures: 0, Errors: 0, Skipped: 0, Time elapsed: 0.296 sec
Running org.apache.solr.client.solrj.SolrExceptionTest
Tests run: 1, Failures: 0, Errors: 0, Skipped: 0, Time elapsed: 0.017 sec
Running org.apache.solr.common.util.TestHash
Tests run: 2, Failures: 0, Errors: 0, Skipped: 0, Time elapsed: 0.088 sec
Running org.apache.solr.handler.admin.SystemInfoHandlerTest
Tests run: 1, Failures: 0, Errors: 0, Skipped: 0, Time elapsed: 0.014 sec
Running org.apache.solr.spelling.suggest.SuggesterWFSTTest
Creating dataDir: /usr/home/hudson/hudson-slave/workspace/Lucene-Solr-Maven-trunk/maven-build/solr/core/target/test/./solrtest-SuggesterWFSTTest-1346521365806
NOTE: per solr.test.leavedatadir, dataDir will not be removed: /usr/home/hudson/hudson-slave/workspace/Lucene-Solr-Maven-trunk/maven-build/solr/core/target/test/./solrtest-SuggesterWFSTTest-1346521365806
Tests run: 4, Failures: 0, Errors: 0, Skipped: 0, Time elapsed: 0.814 sec
Running org.apache.solr.spelling.suggest.SuggesterTest
Creating dataDir: /usr/home/hudson/hudson-slave/workspace/Lucene-Solr-Maven-trunk/maven-build/solr/core/target/test/./solrtest-SuggesterTest-1346521366622
NOTE: per solr.test.leavedatadir, dataDir will not be removed: /usr/home/hudson/hudson-slave/workspace/Lucene-Solr-Maven-trunk/maven-build/solr/core/target/test/./solrtest-SuggesterTest-1346521366622
Tests run: 4, Failures: 0, Errors: 0, Skipped: 0, Time elapsed: 0.77 sec
Running org.apache.solr.client.solrj.embedded.TestSolrProperties
Tests run: 1, Failures: 0, Errors: 0, Skipped: 0, Time elapsed: 0.674 sec
Running org.apache.solr.update.processor.URLClassifyProcessorTest
Tests run: 7, Failures: 0, Errors: 0, Skipped: 0, Time elapsed: 0.052 sec
Running org.apache.solr.search.similarities.TestDefaultSimilarityFactory
Creating dataDir: /usr/home/hudson/hudson-slave/workspace/Lucene-Solr-Maven-trunk/maven-build/solr/core/target/test/./solrtest-TestDefaultSimilarityFactory-1346521368126
Tests run: 2, Failures: 0, Errors: 0, Skipped: 0, Time elapsed: 0.105 sec
Running org.apache.solr.schema.IndexSchemaTest
Creating dataDir: /usr/home/hudson/hudson-slave/workspace/Lucene-Solr-Maven-trunk/maven-build/solr/core/target/test/./solrtest-IndexSchemaTest-1346521368231
Tests run: 3, Failures: 0, Errors: 0, Skipped: 0, Time elapsed: 0.758 sec
Running org.apache.solr.EchoParamsTest
Creating dataDir: /usr/home/hudson/hudson-slave/workspace/Lucene-Solr-Maven-trunk/maven-build/solr/core/target/test/./solrtest-EchoParamsTest-1346521368988
Tests run: 1, Failures: 0, Errors: 0, Skipped: 0, Time elapsed: 0.107 sec
Running org.apache.solr.search.TestRecovery
Creating dataDir: /usr/home/hudson/hudson-slave/workspace/Lucene-Solr-Maven-trunk/maven-build/solr/core/target/test/./solrtest-TestRecovery-1346521369098
Tests run: 9, Failures: 0, Errors: 0, Skipped: 0, Time elapsed: 5.393 sec
Running org.apache.solr.util.PrimUtilsTest
Tests run: 2, Failures: 0, Errors: 0, Skipped: 0, Time elapsed: 0.036 sec
Running org.apache.solr.client.solrj.embedded.JettyWebappTest
Tests run: 1, Failures: 0, Errors: 0, Skipped: 0, Time elapsed: 1.173 sec
Running org.apache.solr.highlight.HighlighterTest
Creating dataDir: /usr/home/hudson/hudson-slave/workspace/Lucene-Solr-Maven-trunk/maven-build/solr/core/target/test/./solrtest-HighlighterTest-1346521375700
Tests run: 27, Failures: 0, Errors: 0, Skipped: 0, Time elapsed: 1.3 sec
Running org.apache.solr.search.function.SortByFunctionTest
Tests run: 2, Failures: 0, Errors: 0, Skipped: 0, Time elapsed: 0.907 sec
Running org.apache.solr.client.solrj.response.QueryResponseTest
Tests run: 3, Failures: 0, Errors: 0, Skipped: 0, Time elapsed: 0.062 sec
Running org.apache.solr.core.TestSolrDeletionPolicy1
Creating dataDir: /usr/home/hudson/hudson-slave/workspace/Lucene-Solr-Maven-trunk/maven-build/solr/core/target/test/./solrtest-TestSolrDeletionPolicy1-1346521377995
Tests run: 3, Failures: 0, Errors: 0, Skipped: 0, Time elapsed: 0.635 sec
Running org.apache.solr.search.TestStressVersions
Creating dataDir: /usr/home/hudson/hudson-slave/workspace/Lucene-Solr-Maven-trunk/maven-build/solr/core/target/test/./solrtest-TestStressVersions-1346521378613
Tests run: 1, Failures: 0, Errors: 0, Skipped: 0, Time elapsed: 2.816 sec
Running org.apache.solr.SampleTest
Creating dataDir: /usr/home/hudson/hudson-slave/workspace/Lucene-Solr-Maven-trunk/maven-build/solr/core/target/test/./solrtest-SampleTest-1346521381432
Tests run: 2, Failures: 0, Errors: 0, Skipped: 0, Time elapsed: 0.296 sec
Running org.apache.solr.update.processor.UpdateRequestProcessorFactoryTest
Tests run: 2, Failures: 0, Errors: 0, Skipped: 0, Time elapsed: 0.646 sec
Running org.apache.solr.search.SpatialFilterTest
Creating dataDir: /usr/home/hudson/hudson-slave/workspace/Lucene-Solr-Maven-trunk/maven-build/solr/core/target/test/./solrtest-SpatialFilterTest-1346521382373
Tests run: 3, Failures: 0, Errors: 0, Skipped: 0, Time elapsed: 0.702 sec
Running org.apache.solr.util.TestNumberUtils
Tests run: 1, Failures: 0, Errors: 0, Skipped: 0, Time elapsed: 0.153 sec
Running org.apache.solr.core.IndexReaderFactoryTest
Tests run: 1, Failures: 0, Errors: 0, Skipped: 0, Time elapsed: 0.289 sec
Running org.apache.solr.internal.csv.writer.CSVConfigTest
Tests run: 7, Failures: 0, Errors: 0, Skipped: 0, Time elapsed: 0.001 sec
Running org.apache.solr.schema.OpenExchangeRatesOrgProviderTest
Tests run: 5, Failures: 0, Errors: 0, Skipped: 0, Time elapsed: 0.051 sec
Running org.apache.solr.internal.csv.CSVPrinterTest
Tests run: 6, Failures: 0, Errors: 0, Skipped: 0, Time elapsed: 0.386 sec
Running org.apache.solr.core.TestPropInject
Tests run: 2, Failures: 0, Errors: 0, Skipped: 0, Time elapsed: 0.747 sec
Running org.apache.solr.search.QueryEqualityTest
Creating dataDir: /usr/home/hudson/hudson-slave/workspace/Lucene-Solr-Maven-trunk/maven-build/solr/core/target/test/./solrtest-QueryEqualityTest-1346521384714
Tests run: 60, Failures: 0, Errors: 0, Skipped: 0, Time elapsed: 0.594 sec
Running org.apache.solr.update.processor.ScriptEngineTest
Tests run: 6, Failures: 0, Errors: 0, Skipped: 1, Time elapsed: 0.054 sec
Running org.apache.solr.handler.component.TermVectorComponentDistributedTest
Tests run: 1, Failures: 0, Errors: 0, Skipped: 0, Time elapsed: 5.355 sec
Running org.apache.solr.util.DOMUtilTest
Tests run: 1, Failures: 0, Errors: 0, Skipped: 0, Time elapsed: 0.017 sec
Running org.apache.solr.handler.component.TermsComponentTest
Creating dataDir: /usr/home/hudson/hudson-slave/workspace/Lucene-Solr-Maven-trunk/maven-build/solr/core/target/test/./solrtest-TermsComponentTest-1346521390732
Tests run: 13, Failures: 0, Errors: 0, Skipped: 0, Time elapsed: 0.434 sec
Running org.apache.solr.client.solrj.response.FacetFieldTest
Tests run: 1, Failures: 0, Errors: 0, Skipped: 0, Time elapsed: 0.009 sec
Running org.apache.solr.search.TestExtendedDismaxParser
Tests run: 10, Failures: 0, Errors: 0, Skipped: 0, Time elapsed: 4.492 sec
Running org.apache.solr.search.TestRTGBase
Tests run: 0, Failures: 0, Errors: 0, Skipped: 0, Time elapsed: 0.005 sec
Running org.apache.solr.schema.TestOmitPositions
Creating dataDir: /usr/home/hudson/hudson-slave/workspace/Lucene-Solr-Maven-trunk/maven-build/solr/core/target/test/./solrtest-TestOmitPositions-1346521395679
Tests run: 2, Failures: 0, Errors: 0, Skipped: 0, Time elapsed: 0.535 sec
Running org.apache.solr.response.TestPHPSerializedResponseWriter
Creating dataDir: /usr/home/hudson/hudson-slave/workspace/Lucene-Solr-Maven-trunk/maven-build/solr/core/target/test/./solrtest-TestPHPSerializedResponseWriter-1346521396215
Tests run: 2, Failures: 0, Errors: 0, Skipped: 0, Time elapsed: 0.59 sec
Running org.apache.solr.util.TestUtils
Tests run: 3, Failures: 0, Errors: 0, Skipped: 0, Time elapsed: 0.019 sec
Running org.apache.solr.servlet.CacheHeaderTest
Creating dataDir: /usr/home/hudson/hudson-slave/workspace/Lucene-Solr-Maven-trunk/maven-build/solr/core/target/test/./solrtest-CacheHeaderTest-1346521396827
Tests run: 5, Failures: 0, Errors: 0, Skipped: 0, Time elapsed: 0.742 sec
Running org.apache.solr.search.TestStressRecovery
Creating dataDir: /usr/home/hudson/hudson-slave/workspace/Lucene-Solr-Maven-trunk/maven-build/solr/core/target/test/./solrtest-TestStressRecovery-1346521397569
Tests run: 1, Failures: 0, Errors: 0, Skipped: 0, Time elapsed: 13.325 sec
Running org.apache.solr.handler.admin.ShowFileRequestHandlerTest
Creating dataDir: /usr/home/hudson/hudson-slave/workspace/Lucene-Solr-Maven-trunk/maven-build/solr/core/target/test/./solrtest-ShowFileRequestHandlerTest-1346521410895
Tests run: 2, Failures: 0, Errors: 0, Skipped: 0, Time elapsed: 0.693 sec
Running org.apache.solr.MinimalSchemaTest
Creating dataDir: /usr/home/hudson/hudson-slave/workspace/Lucene-Solr-Maven-trunk/maven-build/solr/core/target/test/./solrtest-MinimalSchemaTest-1346521411588
Tests run: 3, Failures: 0, Errors: 0, Skipped: 0, Time elapsed: 0.467 sec
Running org.apache.solr.handler.FieldAnalysisRequestHandlerTest
Creating dataDir: /usr/home/hudson/hudson-slave/workspace/Lucene-Solr-Maven-trunk/maven-build/solr/core/target/test/./solrtest-FieldAnalysisRequestHandlerTest-1346521412067
Tests run: 4, Failures: 0, Errors: 0, Skipped: 0, Time elapsed: 0.678 sec
Running org.apache.solr.BasicFunctionalityTest
Creating dataDir: /usr/home/hudson/hudson-slave/workspace/Lucene-Solr-Maven-trunk/maven-build/solr/core/target/test/./solrtest-BasicFunctionalityTest-1346521412739
Tests run: 23, Failures: 0, Errors: 0, Skipped: 1, Time elapsed: 1.349 sec
Running org.apache.solr.spelling.FileBasedSpellCheckerTest
Creating dataDir: /usr/home/hudson/hudson-slave/workspace/Lucene-Solr-Maven-trunk/maven-build/solr/core/target/test/./solrtest-FileBasedSpellCheckerTest-1346521414081
Tests run: 3, Failures: 0, Errors: 0, Skipped: 0, Time elapsed: 0.662 sec
Running org.apache.solr.schema.TestBinaryField
Tests run: 1, Failures: 0, Errors: 0, Skipped: 0, Time elapsed: 0.263 sec
Running org.apache.solr.util.FileUtilsTest
Tests run: 1, Failures: 0, Errors: 0, Skipped: 0, Time elapsed: 0.062 sec
Running org.apache.solr.internal.csv.CSVStrategyTest
Tests run: 5, Failures: 0, Errors: 0, Skipped: 0, Time elapsed: 0.001 sec
Running org.apache.solr.common.params.ModifiableSolrParamsTest
Tests run: 5, Failures: 0, Errors: 0, Skipped: 0, Time elapsed: 0.071 sec
Running org.apache.solr.SolrInfoMBeanTest
Creating dataDir: /usr/home/hudson/hudson-slave/workspace/Lucene-Solr-Maven-trunk/maven-build/solr/core/target/test/./solrtest-SolrInfoMBeanTest-1346521415143
Tests run: 1, Failures: 0, Errors: 0, Skipped: 0, Time elapsed: 0.397 sec
Running org.apache.solr.handler.StandardRequestHandlerTest
Tests run: 1, Failures: 0, Errors: 0, Skipped: 0, Time elapsed: 1.083 sec
Running org.apache.solr.handler.PingRequestHandlerTest
Creating dataDir: /usr/home/hudson/hudson-slave/workspace/Lucene-Solr-Maven-trunk/maven-build/solr/core/target/test/./solrtest-PingRequestHandlerTest-1346521416625
Tests run: 5, Failures: 0, Errors: 0, Skipped: 0, Time elapsed: 0.537 sec
Running org.apache.solr.schema.PolyFieldTest
Creating dataDir: /usr/home/hudson/hudson-slave/workspace/Lucene-Solr-Maven-trunk/maven-build/solr/core/target/test/./solrtest-PolyFieldTest-1346521417163
Tests run: 4, Failures: 0, Errors: 0, Skipped: 0, Time elapsed: 0.581 sec
Running org.apache.solr.client.solrj.embedded.MultiCoreEmbeddedTest
Tests run: 1, Failures: 0, Errors: 0, Skipped: 0, Time elapsed: 0.449 sec
Running org.apache.solr.spelling.suggest.TestPhraseSuggestions
Creating dataDir: /usr/home/hudson/hudson-slave/workspace/Lucene-Solr-Maven-trunk/maven-build/solr/core/target/test/./solrtest-TestPhraseSuggestions-1346521418207
Tests run: 1, Failures: 0, Errors: 0, Skipped: 0, Time elapsed: 0.144 sec
Running org.apache.solr.cloud.ClusterStateUpdateTest
Creating dataDir: /usr/home/hudson/hudson-slave/workspace/Lucene-Solr-Maven-trunk/maven-build/solr/core/target/test/./solrtest-ClusterStateUpdateTest-1346521418353
Tests run: 1, Failures: 0, Errors: 0, Skipped: 0, Time elapsed: 9.89 sec
Running org.apache.solr.handler.TestReplicationHandler
replicate slave to master
23498 T1599 oasc.SolrException.log SEVERE SnapPull failed :org.apache.solr.common.SolrException: Unable to download _8_nrm.cfe completely. Downloaded 0!=87
		at org.apache.solr.handler.SnapPuller$FileFetcher.cleanup(SnapPuller.java:1129)
		at org.apache.solr.handler.SnapPuller$FileFetcher.fetchFile(SnapPuller.java:1013)
		at org.apache.solr.handler.SnapPuller.downloadIndexFiles(SnapPuller.java:629)
		at org.apache.solr.handler.SnapPuller.fetchLatestIndex(SnapPuller.java:333)
		at org.apache.solr.handler.ReplicationHandler.doFetch(ReplicationHandler.java:297)
		at org.apache.solr.handler.ReplicationHandler$1.run(ReplicationHandler.java:178)
	
30767 T1677 oash.SnapPuller.fetchLatestIndex SEVERE Master at: http://localhost:41357/solr is not available. Index fetch failed. Exception: org.apache.solr.client.solrj.SolrServerException: IOException occured when talking to server at: http://localhost:41357/solr
Tests run: 1, Failures: 0, Errors: 0, Skipped: 0, Time elapsed: 30.957 sec
Running org.apache.solr.schema.IndexSchemaRuntimeFieldTest
Creating dataDir: /usr/home/hudson/hudson-slave/workspace/Lucene-Solr-Maven-trunk/maven-build/solr/core/target/test/./solrtest-IndexSchemaRuntimeFieldTest-1346521459188
Tests run: 1, Failures: 0, Errors: 0, Skipped: 0, Time elapsed: 0.496 sec
Running org.apache.solr.client.solrj.embedded.SolrExampleEmbeddedTest
Creating dataDir: /usr/home/hudson/hudson-slave/workspace/Lucene-Solr-Maven-trunk/maven-build/solr/core/target/test/./solrtest-SolrExampleEmbeddedTest-1346521459693
Tests run: 22, Failures: 0, Errors: 0, Skipped: 0, Time elapsed: 4.028 sec
Running org.apache.solr.handler.component.SearchHandlerTest
Creating dataDir: /usr/home/hudson/hudson-slave/workspace/Lucene-Solr-Maven-trunk/maven-build/solr/core/target/test/./solrtest-SearchHandlerTest-1346521463724
Tests run: 1, Failures: 0, Errors: 0, Skipped: 0, Time elapsed: 0.366 sec
Running org.apache.solr.highlight.HighlighterConfigTest
Tests run: 1, Failures: 0, Errors: 0, Skipped: 0, Time elapsed: 0.396 sec
Running org.apache.solr.analysis.PathHierarchyTokenizerFactoryTest
Creating dataDir: /usr/home/hudson/hudson-slave/workspace/Lucene-Solr-Maven-trunk/maven-build/solr/core/target/test/./solrtest-PathHierarchyTokenizerFactoryTest-1346521464481
Tests run: 2, Failures: 0, Errors: 0, Skipped: 0, Time elapsed: 0.612 sec
Running org.apache.solr.core.TestBadConfig
Creating dataDir: /usr/home/hudson/hudson-slave/workspace/Lucene-Solr-Maven-trunk/maven-build/solr/core/target/test/./solrtest-TestBadConfig-1346521465094
Creating dataDir: /usr/home/hudson/hudson-slave/workspace/Lucene-Solr-Maven-trunk/maven-build/solr/core/target/test/./solrtest-TestBadConfig-1346521465111
390 T1715 oasup.StatelessScriptUpdateProcessorFactory.inform SEVERE Unable to initialize scripts: Unable to evaluate script: a-file-name-that-does-not-exist.js Ignoring exception matching \Qa-file-name-that-does-not-exist.js\E
Creating dataDir: /usr/home/hudson/hudson-slave/workspace/Lucene-Solr-Maven-trunk/maven-build/solr/core/target/test/./solrtest-TestBadConfig-1346521465489
495 T3 oasc.CoreContainer.finalize SEVERE CoreContainer was not shutdown prior to finalize(), indicates a bug -- POSSIBLE RESOURCE LEAK!!!  instance=1961895924
755 T1715 oasup.StatelessScriptUpdateProcessorFactory.inform SEVERE Unable to initialize scripts: Unable to evaluate script: currency.xml Ignoring exception matching \Qcurrency.xml\E
Creating dataDir: /usr/home/hudson/hudson-slave/workspace/Lucene-Solr-Maven-trunk/maven-build/solr/core/target/test/./solrtest-TestBadConfig-1346521465851
878 T3 oasc.CoreContainer.finalize SEVERE CoreContainer was not shutdown prior to finalize(), indicates a bug -- POSSIBLE RESOURCE LEAK!!!  instance=2099581263
Creating dataDir: /usr/home/hudson/hudson-slave/workspace/Lucene-Solr-Maven-trunk/maven-build/solr/core/target/test/./solrtest-TestBadConfig-1346521466224
1480 T1715 oasup.StatelessScriptUpdateProcessorFactory.inform SEVERE Unable to initialize scripts: No ScriptEngine found by name: giberish -- supported names: js, rhino, JavaScript, javascript, ECMAScript, ecmascript Ignoring exception matching \Qgiberish\E
Tests run: 5, Failures: 0, Errors: 0, Skipped: 0, Time elapsed: 1.497 sec
Running org.apache.solr.search.TestSolrJ
Tests run: 1, Failures: 0, Errors: 0, Skipped: 0, Time elapsed: 0.016 sec
Running org.apache.solr.update.DirectUpdateHandlerOptimizeTest
90 T3 oasc.CoreContainer.finalize SEVERE CoreContainer was not shutdown prior to finalize(), indicates a bug -- POSSIBLE RESOURCE LEAK!!!  instance=41245030
Tests run: 1, Failures: 0, Errors: 0, Skipped: 0, Time elapsed: 0.429 sec
Running org.apache.solr.cloud.LeaderElectionIntegrationTest
Creating dataDir: /usr/home/hudson/hudson-slave/workspace/Lucene-Solr-Maven-trunk/maven-build/solr/core/target/test/./solrtest-LeaderElectionIntegrationTest-1346521467035
Creating dataDir: /usr/home/hudson/hudson-slave/workspace/Lucene-Solr-Maven-trunk/maven-build/solr/core/target/test/./solrtest-LeaderElectionIntegrationTest-1346521479463
18021 T1776 oasc.SolrException.log SEVERE Sync Failed
18041 T1779 oasc.SolrException.log SEVERE Sync Failed
18048 T1782 oasc.SolrException.log SEVERE Sync Failed
18055 T1785 oasc.SolrException.log SEVERE Sync Failed
Tests run: 2, Failures: 0, Errors: 0, Skipped: 0, Time elapsed: 24.074 sec
Running org.apache.solr.core.SolrCoreTest
Creating dataDir: /usr/home/hudson/hudson-slave/workspace/Lucene-Solr-Maven-trunk/maven-build/solr/core/target/test/./solrtest-SolrCoreTest-1346521491110
Creating dataDir: /usr/home/hudson/hudson-slave/workspace/Lucene-Solr-Maven-trunk/maven-build/solr/core/target/test/./solrtest-SolrCoreTest-1346521491449
Creating dataDir: /usr/home/hudson/hudson-slave/workspace/Lucene-Solr-Maven-trunk/maven-build/solr/core/target/test/./solrtest-SolrCoreTest-1346521491863
Creating dataDir: /usr/home/hudson/hudson-slave/workspace/Lucene-Solr-Maven-trunk/maven-build/solr/core/target/test/./solrtest-SolrCoreTest-1346521493234
Creating dataDir: /usr/home/hudson/hudson-slave/workspace/Lucene-Solr-Maven-trunk/maven-build/solr/core/target/test/./solrtest-SolrCoreTest-1346521493837
Creating dataDir: /usr/home/hudson/hudson-slave/workspace/Lucene-Solr-Maven-trunk/maven-build/solr/core/target/test/./solrtest-SolrCoreTest-1346521494262
Tests run: 6, Failures: 0, Errors: 0, Skipped: 0, Time elapsed: 3.567 sec
Running org.apache.solr.handler.XmlUpdateRequestHandlerTest
Creating dataDir: /usr/home/hudson/hudson-slave/workspace/Lucene-Solr-Maven-trunk/maven-build/solr/core/target/test/./solrtest-XmlUpdateRequestHandlerTest-1346521494693
Tests run: 3, Failures: 0, Errors: 0, Skipped: 0, Time elapsed: 0.369 sec
Running org.apache.solr.analysis.TestReversedWildcardFilterFactory
Creating dataDir: /usr/home/hudson/hudson-slave/workspace/Lucene-Solr-Maven-trunk/maven-build/solr/core/target/test/./solrtest-TestReversedWildcardFilterFactory-1346521495058
Tests run: 4, Failures: 0, Errors: 0, Skipped: 0, Time elapsed: 0.377 sec
Running org.apache.solr.search.TestQueryTypes
Tests run: 1, Failures: 0, Errors: 0, Skipped: 0, Time elapsed: 0.522 sec
Running org.apache.solr.search.ReturnFieldsTest
Creating dataDir: /usr/home/hudson/hudson-slave/workspace/Lucene-Solr-Maven-trunk/maven-build/solr/core/target/test/./solrtest-ReturnFieldsTest-1346521495959
Tests run: 10, Failures: 0, Errors: 0, Skipped: 0, Time elapsed: 0.363 sec
Running org.apache.solr.highlight.FastVectorHighlighterTest
Creating dataDir: /usr/home/hudson/hudson-slave/workspace/Lucene-Solr-Maven-trunk/maven-build/solr/core/target/test/./solrtest-FastVectorHighlighterTest-1346521496322
Tests run: 2, Failures: 0, Errors: 0, Skipped: 0, Time elapsed: 0.343 sec
Running org.apache.solr.update.TestIndexingPerformance
Tests run: 1, Failures: 0, Errors: 0, Skipped: 0, Time elapsed: 0.389 sec
Running org.apache.solr.util.SolrPluginUtilsTest
Creating dataDir: /usr/home/hudson/hudson-slave/workspace/Lucene-Solr-Maven-trunk/maven-build/solr/core/target/test/./solrtest-SolrPluginUtilsTest-1346521497057
Tests run: 7, Failures: 0, Errors: 0, Skipped: 0, Time elapsed: 0.402 sec
Running org.apache.solr.common.util.ContentStreamTest
Tests run: 3, Failures: 0, Errors: 0, Skipped: 0, Time elapsed: 0.035 sec
Running org.apache.solr.response.TestCSVResponseWriter
Creating dataDir: /usr/home/hudson/hudson-slave/workspace/Lucene-Solr-Maven-trunk/maven-build/solr/core/target/test/./solrtest-TestCSVResponseWriter-1346521497496
Tests run: 1, Failures: 0, Errors: 0, Skipped: 0, Time elapsed: 0.339 sec
Running org.apache.solr.internal.csv.CharBufferTest
Tests run: 13, Failures: 0, Errors: 0, Skipped: 0, Time elapsed: 0.001 sec
Running org.apache.solr.request.JSONWriterTest
Creating dataDir: /usr/home/hudson/hudson-slave/workspace/Lucene-Solr-Maven-trunk/maven-build/solr/core/target/test/./solrtest-JSONWriterTest-1346521497838
Tests run: 3, Failures: 0, Errors: 0, Skipped: 0, Time elapsed: 0.324 sec
Running org.apache.solr.util.TestSystemIdResolver
Tests run: 1, Failures: 0, Errors: 0, Skipped: 0, Time elapsed: 0.03 sec
Running org.apache.solr.client.solrj.embedded.SolrExampleStreamingBinaryTest
Creating dataDir: /usr/home/hudson/hudson-slave/workspace/Lucene-Solr-Maven-trunk/maven-build/solr/core/target/test/./solrtest-SolrExampleStreamingBinaryTest-1346521498196
ASYNC  NEW_CORE C6 name=collection1 org.apache.solr.core.SolrCore@148f730c
4358 T1874 C6 oasc.SolrException.log SEVERE org.apache.solr.common.SolrException: Document contains multiple values for uniqueKey field: id=[DOCID, DOCID2]
		at org.apache.solr.update.AddUpdateCommand.getIndexedId(AddUpdateCommand.java:91)
		at org.apache.solr.update.processor.DistributedUpdateProcessor.versionAdd(DistributedUpdateProcessor.java:460)
		at org.apache.solr.update.processor.DistributedUpdateProcessor.processAdd(DistributedUpdateProcessor.java:342)
		at org.apache.solr.handler.loader.JavabinLoader$1.update(JavabinLoader.java:86)
		at org.apache.solr.client.solrj.request.JavaBinUpdateRequestCodec$1.readOuterMostDocIterator(JavaBinUpdateRequestCodec.java:140)
		at org.apache.solr.client.solrj.request.JavaBinUpdateRequestCodec$1.readIterator(JavaBinUpdateRequestCodec.java:120)
		at org.apache.solr.common.util.JavaBinCodec.readVal(JavaBinCodec.java:221)
		at org.apache.solr.client.solrj.request.JavaBinUpdateRequestCodec$1.readNamedList(JavaBinUpdateRequestCodec.java:105)
		at org.apache.solr.common.util.JavaBinCodec.readVal(JavaBinCodec.java:186)
		at org.apache.solr.common.util.JavaBinCodec.unmarshal(JavaBinCodec.java:112)
		at org.apache.solr.client.solrj.request.JavaBinUpdateRequestCodec.unmarshal(JavaBinUpdateRequestCodec.java:147)
		at org.apache.solr.handler.loader.JavabinLoader.parseAndLoadDocs(JavabinLoader.java:96)
		at org.apache.solr.handler.loader.JavabinLoader.load(JavabinLoader.java:55)
		at org.apache.solr.handler.UpdateRequestHandler$1.load(UpdateRequestHandler.java:92)
		at org.apache.solr.handler.ContentStreamHandlerBase.handleRequestBody(ContentStreamHandlerBase.java:74)
		at org.apache.solr.handler.RequestHandlerBase.handleRequest(RequestHandlerBase.java:129)
		at org.apache.solr.core.SolrCore.execute(SolrCore.java:1692)
		at org.apache.solr.servlet.SolrDispatchFilter.execute(SolrDispatchFilter.java:454)
		at org.apache.solr.servlet.SolrDispatchFilter.doFilter(SolrDispatchFilter.java:275)
		at org.eclipse.jetty.servlet.ServletHandler$CachedChain.doFilter(ServletHandler.java:1337)
		at org.eclipse.jetty.servlet.ServletHandler.doHandle(ServletHandler.java:484)
		at org.eclipse.jetty.server.session.SessionHandler.doHandle(SessionHandler.java:231)
		at org.eclipse.jetty.server.handler.ScopedHandler.handle(ScopedHandler.java:119)
		at org.eclipse.jetty.server.handler.GzipHandler.handle(GzipHandler.java:267)
		at org.eclipse.jetty.server.handler.ContextHandler.doHandle(ContextHandler.java:1067)
		at org.eclipse.jetty.servlet.ServletHandler.doScope(ServletHandler.java:413)
		at org.eclipse.jetty.server.session.SessionHandler.doScope(SessionHandler.java:192)
		at org.eclipse.jetty.server.handler.ContextHandler.doScope(ContextHandler.java:999)
		at org.eclipse.jetty.server.handler.ScopedHandler.handle(ScopedHandler.java:117)
		at org.eclipse.jetty.server.handler.HandlerWrapper.handle(HandlerWrapper.java:111)
		at org.eclipse.jetty.server.Server.handle(Server.java:351)
		at org.eclipse.jetty.server.AbstractHttpConnection.handleRequest(AbstractHttpConnection.java:454)
		at org.eclipse.jetty.server.BlockingHttpConnection.handleRequest(BlockingHttpConnection.java:47)
		at org.eclipse.jetty.server.AbstractHttpConnection.content(AbstractHttpConnection.java:900)
		at org.eclipse.jetty.server.AbstractHttpConnection$RequestHandler.content(AbstractHttpConnection.java:954)
		at org.eclipse.jetty.http.HttpParser.parseNext(HttpParser.java:952)
		at org.eclipse.jetty.http.HttpParser.parseAvailable(HttpParser.java:235)
		at org.eclipse.jetty.server.BlockingHttpConnection.handle(BlockingHttpConnection.java:66)
		at org.eclipse.jetty.server.bio.SocketConnector$ConnectorEndPoint.run(SocketConnector.java:254)
		at org.eclipse.jetty.util.thread.QueuedThreadPool.runJob(QueuedThreadPool.java:599)
		at org.eclipse.jetty.util.thread.QueuedThreadPool$3.run(QueuedThreadPool.java:534)
		at java.lang.Thread.run(Thread.java:679)
	
Tests run: 22, Failures: 0, Errors: 0, Skipped: 0, Time elapsed: 10.982 sec
Running org.apache.solr.util.CircularListTest
Tests run: 1, Failures: 0, Errors: 0, Skipped: 0, Time elapsed: 0.023 sec
Running org.apache.solr.search.TestSort
Creating dataDir: /usr/home/hudson/hudson-slave/workspace/Lucene-Solr-Maven-trunk/maven-build/solr/core/target/test/./solrtest-TestSort-1346521509207
Tests run: 2, Failures: 0, Errors: 0, Skipped: 0, Time elapsed: 3.165 sec
Running org.apache.solr.core.TestSolrDeletionPolicy2
Creating dataDir: /usr/home/hudson/hudson-slave/workspace/Lucene-Solr-Maven-trunk/maven-build/solr/core/target/test/./solrtest-TestSolrDeletionPolicy2-1346521512371
Tests run: 1, Failures: 0, Errors: 0, Skipped: 0, Time elapsed: 0.37 sec
Running org.apache.solr.update.SolrIndexConfigTest
Tests run: 2, Failures: 0, Errors: 0, Skipped: 0, Time elapsed: 0.273 sec
Running org.apache.solr.core.RequestHandlersTest
Creating dataDir: /usr/home/hudson/hudson-slave/workspace/Lucene-Solr-Maven-trunk/maven-build/solr/core/target/test/./solrtest-RequestHandlersTest-1346521513012
Tests run: 3, Failures: 0, Errors: 0, Skipped: 0, Time elapsed: 0.421 sec
Running org.apache.solr.search.TestLRUCache
Tests run: 3, Failures: 0, Errors: 0, Skipped: 0, Time elapsed: 0.033 sec
Running org.apache.solr.search.TestFiltering
Creating dataDir: /usr/home/hudson/hudson-slave/workspace/Lucene-Solr-Maven-trunk/maven-build/solr/core/target/test/./solrtest-TestFiltering-1346521513471
Tests run: 2, Failures: 0, Errors: 0, Skipped: 0, Time elapsed: 2.134 sec
Running org.apache.solr.core.TestQuerySenderNoQuery
Creating dataDir: /usr/home/hudson/hudson-slave/workspace/Lucene-Solr-Maven-trunk/maven-build/solr/core/target/test/./solrtest-TestQuerySenderNoQuery-1346521515605
Tests run: 3, Failures: 0, Errors: 0, Skipped: 0, Time elapsed: 0.278 sec
Running org.apache.solr.servlet.SolrRequestParserTest
Creating dataDir: /usr/home/hudson/hudson-slave/workspace/Lucene-Solr-Maven-trunk/maven-build/solr/core/target/test/./solrtest-SolrRequestParserTest-1346521515882
Tests run: 4, Failures: 0, Errors: 0, Skipped: 0, Time elapsed: 0.981 sec
Running org.apache.solr.core.TestConfig
Creating dataDir: /usr/home/hudson/hudson-slave/workspace/Lucene-Solr-Maven-trunk/maven-build/solr/core/target/test/./solrtest-TestConfig-1346521516881
Tests run: 7, Failures: 0, Errors: 0, Skipped: 0, Time elapsed: 0.182 sec
Running org.apache.solr.search.similarities.TestPerFieldSimilarity
Creating dataDir: /usr/home/hudson/hudson-slave/workspace/Lucene-Solr-Maven-trunk/maven-build/solr/core/target/test/./solrtest-TestPerFieldSimilarity-1346521517057
Tests run: 7, Failures: 0, Errors: 0, Skipped: 0, Time elapsed: 0.114 sec
Running org.apache.solr.cloud.LeaderElectionTest
Creating dataDir: /usr/home/hudson/hudson-slave/workspace/Lucene-Solr-Maven-trunk/maven-build/solr/core/target/test/./solrtest-LeaderElectionTest-1346521517166
5647 T1969 oasc.SolrException.log SEVERE Failed setting watch:org.apache.zookeeper.KeeperException$NoNodeException: KeeperErrorCode = NoNode for /collections/collection1/leader_elect/shard1/election/88245634400387077-2-n_0000000003
		at org.apache.zookeeper.KeeperException.create(KeeperException.java:102)
		at org.apache.zookeeper.KeeperException.create(KeeperException.java:42)
		at org.apache.zookeeper.ZooKeeper.getData(ZooKeeper.java:927)
		at org.apache.solr.common.cloud.SolrZkClient$7.execute(SolrZkClient.java:301)
		at org.apache.solr.common.cloud.SolrZkClient$7.execute(SolrZkClient.java:298)
		at org.apache.solr.common.cloud.ZkCmdExecutor.retryOperation(ZkCmdExecutor.java:67)
		at org.apache.solr.common.cloud.SolrZkClient.getData(SolrZkClient.java:298)
		at org.apache.solr.cloud.LeaderElector.checkIfIamLeader(LeaderElector.java:120)
		at org.apache.solr.cloud.LeaderElector.access$000(LeaderElector.java:57)
		at org.apache.solr.cloud.LeaderElector$1.process(LeaderElector.java:132)
		at org.apache.zookeeper.ClientCnxn$EventThread.processEvent(ClientCnxn.java:526)
		at org.apache.zookeeper.ClientCnxn$EventThread.run(ClientCnxn.java:502)
	
7785 T1990 oasc.SolrException.log SEVERE Failed setting watch:org.apache.zookeeper.KeeperException$NoNodeException: KeeperErrorCode = NoNode for /collections/collection1/leader_elect/shard1/election/88245634400387085-10-n_0000000010
		at org.apache.zookeeper.KeeperException.create(KeeperException.java:102)
		at org.apache.zookeeper.KeeperException.create(KeeperException.java:42)
		at org.apache.zookeeper.ZooKeeper.getData(ZooKeeper.java:927)
		at org.apache.solr.common.cloud.SolrZkClient$7.execute(SolrZkClient.java:301)
		at org.apache.solr.common.cloud.SolrZkClient$7.execute(SolrZkClient.java:298)
		at org.apache.solr.common.cloud.ZkCmdExecutor.retryOperation(ZkCmdExecutor.java:67)
		at org.apache.solr.common.cloud.SolrZkClient.getData(SolrZkClient.java:298)
		at org.apache.solr.cloud.LeaderElector.checkIfIamLeader(LeaderElector.java:120)
		at org.apache.solr.cloud.LeaderElector.access$000(LeaderElector.java:57)
		at org.apache.solr.cloud.LeaderElector$1.process(LeaderElector.java:132)
		at org.apache.zookeeper.ClientCnxn$EventThread.processEvent(ClientCnxn.java:526)
		at org.apache.zookeeper.ClientCnxn$EventThread.run(ClientCnxn.java:502)
	
10603 T2005 oasc.LeaderElectionTest$ClientThread.run SEVERE setup failed org.apache.zookeeper.KeeperException$SessionExpiredException: KeeperErrorCode = Session expired for /collections/collection1/leader_elect/shard1/election
	at org.apache.zookeeper.KeeperException.create(KeeperException.java:118)
	at org.apache.zookeeper.KeeperException.create(KeeperException.java:42)
	at org.apache.zookeeper.ZooKeeper.exists(ZooKeeper.java:815)
	at org.apache.solr.common.cloud.SolrZkClient$4.execute(SolrZkClient.java:232)
	at org.apache.solr.common.cloud.SolrZkClient$4.execute(SolrZkClient.java:229)
	at org.apache.solr.common.cloud.ZkCmdExecutor.retryOperation(ZkCmdExecutor.java:67)
	at org.apache.solr.common.cloud.SolrZkClient.exists(SolrZkClient.java:229)
	at org.apache.solr.common.cloud.ZkCmdExecutor.ensureExists(ZkCmdExecutor.java:94)
	at org.apache.solr.common.cloud.ZkCmdExecutor.ensureExists(ZkCmdExecutor.java:88)
	at org.apache.solr.cloud.LeaderElector.setup(LeaderElector.java:279)
	at org.apache.solr.cloud.LeaderElectionTest$ClientThread.setupOnConnect(LeaderElectionTest.java:116)
	at org.apache.solr.cloud.LeaderElectionTest$ClientThread.run(LeaderElectionTest.java:125)
	at java.util.concurrent.Executors$RunnableAdapter.call(Executors.java:471)
	at java.util.concurrent.FutureTask$Sync.innerRun(FutureTask.java:334)
	at java.util.concurrent.FutureTask.run(FutureTask.java:166)
	at java.util.concurrent.ScheduledThreadPoolExecutor$ScheduledFutureTask.access$101(ScheduledThreadPoolExecutor.java:165)
	at java.util.concurrent.ScheduledThreadPoolExecutor$ScheduledFutureTask.run(ScheduledThreadPoolExecutor.java:266)
	at java.util.concurrent.ThreadPoolExecutor.runWorker(ThreadPoolExecutor.java:1110)
	at java.util.concurrent.ThreadPoolExecutor$Worker.run(ThreadPoolExecutor.java:603)
	at java.lang.Thread.run(Thread.java:679)

14105 T2020 oasc.LeaderElectionTest$ClientThread.run SEVERE setup failed org.apache.zookeeper.KeeperException$SessionExpiredException: KeeperErrorCode = Session expired for /collections/collection1/leader_elect/shard1/election
	at org.apache.zookeeper.KeeperException.create(KeeperException.java:118)
	at org.apache.zookeeper.KeeperException.create(KeeperException.java:42)
	at org.apache.zookeeper.ZooKeeper.exists(ZooKeeper.java:815)
	at org.apache.solr.common.cloud.SolrZkClient$4.execute(SolrZkClient.java:232)
	at org.apache.solr.common.cloud.SolrZkClient$4.execute(SolrZkClient.java:229)
	at org.apache.solr.common.cloud.ZkCmdExecutor.retryOperation(ZkCmdExecutor.java:67)
	at org.apache.solr.common.cloud.SolrZkClient.exists(SolrZkClient.java:229)
	at org.apache.solr.common.cloud.ZkCmdExecutor.ensureExists(ZkCmdExecutor.java:94)
	at org.apache.solr.common.cloud.ZkCmdExecutor.ensureExists(ZkCmdExecutor.java:88)
	at org.apache.solr.cloud.LeaderElector.setup(LeaderElector.java:279)
	at org.apache.solr.cloud.LeaderElectionTest$ClientThread.setupOnConnect(LeaderElectionTest.java:116)
	at org.apache.solr.cloud.LeaderElectionTest$ClientThread.run(LeaderElectionTest.java:125)
	at java.util.concurrent.Executors$RunnableAdapter.call(Executors.java:471)
	at java.util.concurrent.FutureTask$Sync.innerRun(FutureTask.java:334)
	at java.util.concurrent.FutureTask.run(FutureTask.java:166)
	at java.util.concurrent.ScheduledThreadPoolExecutor$ScheduledFutureTask.access$101(ScheduledThreadPoolExecutor.java:165)
	at java.util.concurrent.ScheduledThreadPoolExecutor$ScheduledFutureTask.run(ScheduledThreadPoolExecutor.java:266)
	at java.util.concurrent.ThreadPoolExecutor.runWorker(ThreadPoolExecutor.java:1110)
	at java.util.concurrent.ThreadPoolExecutor$Worker.run(ThreadPoolExecutor.java:603)
	at java.lang.Thread.run(Thread.java:679)

Tests run: 4, Failures: 0, Errors: 0, Skipped: 0, Time elapsed: 15.895 sec
Running org.apache.solr.update.processor.SignatureUpdateProcessorFactoryTest
Creating dataDir: /usr/home/hudson/hudson-slave/workspace/Lucene-Solr-Maven-trunk/maven-build/solr/core/target/test/./solrtest-SignatureUpdateProcessorFactoryTest-1346521533062
Tests run: 6, Failures: 0, Errors: 0, Skipped: 0, Time elapsed: 0.707 sec
Running org.apache.solr.schema.NotRequiredUniqueKeyTest
Creating dataDir: /usr/home/hudson/hudson-slave/workspace/Lucene-Solr-Maven-trunk/maven-build/solr/core/target/test/./solrtest-NotRequiredUniqueKeyTest-1346521533771
Tests run: 1, Failures: 0, Errors: 0, Skipped: 0, Time elapsed: 0.322 sec
Running org.apache.solr.cloud.BasicZkTest
azt beforeclass
Creating dataDir: /usr/home/hudson/hudson-slave/workspace/Lucene-Solr-Maven-trunk/maven-build/solr/core/target/test/./solrtest-BasicZkTest-1346521534092
Tests run: 1, Failures: 0, Errors: 0, Skipped: 0, Time elapsed: 16.857 sec
Running org.apache.solr.TestTrie
Creating dataDir: /usr/home/hudson/hudson-slave/workspace/Lucene-Solr-Maven-trunk/maven-build/solr/core/target/test/./solrtest-TestTrie-1346521550952
Tests run: 8, Failures: 0, Errors: 0, Skipped: 0, Time elapsed: 0.813 sec
Running org.apache.solr.client.solrj.embedded.LargeVolumeJettyTest
Creating dataDir: /usr/home/hudson/hudson-slave/workspace/Lucene-Solr-Maven-trunk/maven-build/solr/core/target/test/./solrtest-LargeVolumeJettyTest-1346521551769
Tests run: 1, Failures: 0, Errors: 0, Skipped: 0, Time elapsed: 0.816 sec
Running org.apache.solr.schema.BadIndexSchemaTest
Creating dataDir: /usr/home/hudson/hudson-slave/workspace/Lucene-Solr-Maven-trunk/maven-build/solr/core/target/test/./solrtest-BadIndexSchemaTest-1346521552579
Creating dataDir: /usr/home/hudson/hudson-slave/workspace/Lucene-Solr-Maven-trunk/maven-build/solr/core/target/test/./solrtest-BadIndexSchemaTest-1346521552632
Creating dataDir: /usr/home/hudson/hudson-slave/workspace/Lucene-Solr-Maven-trunk/maven-build/solr/core/target/test/./solrtest-BadIndexSchemaTest-1346521552684
Creating dataDir: /usr/home/hudson/hudson-slave/workspace/Lucene-Solr-Maven-trunk/maven-build/solr/core/target/test/./solrtest-BadIndexSchemaTest-1346521552734
Creating dataDir: /usr/home/hudson/hudson-slave/workspace/Lucene-Solr-Maven-trunk/maven-build/solr/core/target/test/./solrtest-BadIndexSchemaTest-1346521552792
Creating dataDir: /usr/home/hudson/hudson-slave/workspace/Lucene-Solr-Maven-trunk/maven-build/solr/core/target/test/./solrtest-BadIndexSchemaTest-1346521552843
322 T2106 oasc.SolrCore.initCodec SEVERE FieldType 'pulsing1' is configured with a postings format, but the codec does not support it: class org.apache.solr.core.SolrCore$3
Creating dataDir: /usr/home/hudson/hudson-slave/workspace/Lucene-Solr-Maven-trunk/maven-build/solr/core/target/test/./solrtest-BadIndexSchemaTest-1346521552902
Creating dataDir: /usr/home/hudson/hudson-slave/workspace/Lucene-Solr-Maven-trunk/maven-build/solr/core/target/test/./solrtest-BadIndexSchemaTest-1346521552951
Creating dataDir: /usr/home/hudson/hudson-slave/workspace/Lucene-Solr-Maven-trunk/maven-build/solr/core/target/test/./solrtest-BadIndexSchemaTest-1346521553000
Creating dataDir: /usr/home/hudson/hudson-slave/workspace/Lucene-Solr-Maven-trunk/maven-build/solr/core/target/test/./solrtest-BadIndexSchemaTest-1346521553048
489 T3 oasc.CoreContainer.finalize SEVERE CoreContainer was not shutdown prior to finalize(), indicates a bug -- POSSIBLE RESOURCE LEAK!!!  instance=1207529246
490 T3 oasc.SolrCore.finalize SEVERE REFCOUNT ERROR: unreferenced org.apache.solr.core.SolrCore@48ee3f7c (collection1) has a reference count of 1
Creating dataDir: /usr/home/hudson/hudson-slave/workspace/Lucene-Solr-Maven-trunk/maven-build/solr/core/target/test/./solrtest-BadIndexSchemaTest-1346521553101
572 T2106 oass.IndexSchema.readSchema SEVERE uniqueKey field (id) can not be the dest of a copyField (src=XXX)
Creating dataDir: /usr/home/hudson/hudson-slave/workspace/Lucene-Solr-Maven-trunk/maven-build/solr/core/target/test/./solrtest-BadIndexSchemaTest-1346521553150
621 T2106 oass.IndexSchema.readSchema SEVERE uniqueKey field (null) can not be configured with a default value (XXX)
Creating dataDir: /usr/home/hudson/hudson-slave/workspace/Lucene-Solr-Maven-trunk/maven-build/solr/core/target/test/./solrtest-BadIndexSchemaTest-1346521553199
670 T2106 oass.IndexSchema.readSchema SEVERE uniqueKey field (null) can not be configured to be multivalued
Creating dataDir: /usr/home/hudson/hudson-slave/workspace/Lucene-Solr-Maven-trunk/maven-build/solr/core/target/test/./solrtest-BadIndexSchemaTest-1346521553249
720 T2106 oass.IndexSchema.readSchema SEVERE FieldType 'sim1' is configured with a similarity, but the global similarity does not support it: class org.apache.solr.search.similarities.DefaultSimilarityFactory
Creating dataDir: /usr/home/hudson/hudson-slave/workspace/Lucene-Solr-Maven-trunk/maven-build/solr/core/target/test/./solrtest-BadIndexSchemaTest-1346521553300
Tests run: 9, Failures: 0, Errors: 0, Skipped: 0, Time elapsed: 0.781 sec
Running org.apache.solr.handler.component.QueryElevationComponentTest
Creating dataDir: /usr/home/hudson/hudson-slave/workspace/Lucene-Solr-Maven-trunk/maven-build/solr/core/target/test/./solrtest-QueryElevationComponentTest-1346521553364
Creating dataDir: /usr/home/hudson/hudson-slave/workspace/Lucene-Solr-Maven-trunk/maven-build/solr/core/target/test/./solrtest-QueryElevationComponentTest-1346521553673
Creating dataDir: /usr/home/hudson/hudson-slave/workspace/Lucene-Solr-Maven-trunk/maven-build/solr/core/target/test/./solrtest-QueryElevationComponentTest-1346521553975
Creating dataDir: /usr/home/hudson/hudson-slave/workspace/Lucene-Solr-Maven-trunk/maven-build/solr/core/target/test/./solrtest-QueryElevationComponentTest-1346521554206
Creating dataDir: /usr/home/hudson/hudson-slave/workspace/Lucene-Solr-Maven-trunk/maven-build/solr/core/target/test/./solrtest-QueryElevationComponentTest-1346521554580
Creating dataDir: /usr/home/hudson/hudson-slave/workspace/Lucene-Solr-Maven-trunk/maven-build/solr/core/target/test/./solrtest-QueryElevationComponentTest-1346521554926
Creating dataDir: /usr/home/hudson/hudson-slave/workspace/Lucene-Solr-Maven-trunk/maven-build/solr/core/target/test/./solrtest-QueryElevationComponentTest-1346521555219
Tests run: 7, Failures: 0, Errors: 0, Skipped: 0, Time elapsed: 2.145 sec
Running org.apache.solr.handler.component.DebugComponentTest
Creating dataDir: /usr/home/hudson/hudson-slave/workspace/Lucene-Solr-Maven-trunk/maven-build/solr/core/target/test/./solrtest-DebugComponentTest-1346521555508
Tests run: 2, Failures: 0, Errors: 0, Skipped: 0, Time elapsed: 0.523 sec
Running org.apache.solr.cloud.SyncSliceTest
Creating dataDir: /usr/home/hudson/hudson-slave/workspace/Lucene-Solr-Maven-trunk/maven-build/solr/core/target/test/./solrtest-SyncSliceTest-1346521556035
check const of shard1
client0
PROPS:shard=shard1
roles=null
leader=true
state=active
core=collection1
collection=collection1
node_name=127.0.0.1:41510_solr
base_url=http://127.0.0.1:41510/solr

 live:true
 num:4

client1
PROPS:shard=shard1
roles=null
state=active
core=collection1
collection=collection1
node_name=127.0.0.1:41512_solr
base_url=http://127.0.0.1:41512/solr

 live:true
 num:2

######shard1 is not consistent.  Got 4 from http://127.0.0.1:41510/solr/collection1lastClient and got 2 from http://127.0.0.1:41512/solr/collection1
######http://127.0.0.1:41510/solr/collection1: {numFound=4,start=0,docs=[SolrDocument{id=0, _version_=1411930204719284224}, SolrDocument{id=1, _version_=1411930204730818560}, SolrDocument{id=2, _version_=1411930204740255744}, SolrDocument{id=3, _version_=1411930204749692928}]}
######http://127.0.0.1:41512/solr/collection1: {numFound=2,start=0,docs=[SolrDocument{id=0, _version_=1411930204719284224}, SolrDocument{id=1, _version_=1411930204730818560}]}
###### sizes=4,2
###### Only in http://127.0.0.1:41510/solr/collection1: [{id=2, _version_=1411930204740255744}, {id=3, _version_=1411930204749692928}]
client2
PROPS:shard=shard1
roles=null
state=active
core=collection1
collection=collection1
node_name=127.0.0.1:41515_solr
base_url=http://127.0.0.1:41515/solr

 live:true
 num:3

client3
PROPS:shard=shard1
roles=null
state=active
core=collection1
collection=collection1
node_name=127.0.0.1:41518_solr
base_url=http://127.0.0.1:41518/solr

 live:true
 num:4

Control Docs:4
check const of shard1
client0
PROPS:shard=shard1
roles=null
leader=true
state=active
core=collection1
collection=collection1
node_name=127.0.0.1:41510_solr
base_url=http://127.0.0.1:41510/solr

 live:true
 num:4

client1
PROPS:shard=shard1
roles=null
state=active
core=collection1
collection=collection1
node_name=127.0.0.1:41512_solr
base_url=http://127.0.0.1:41512/solr

 live:true
 num:4

client2
PROPS:shard=shard1
roles=null
state=active
core=collection1
collection=collection1
node_name=127.0.0.1:41515_solr
base_url=http://127.0.0.1:41515/solr

 live:true
 num:4

client3
PROPS:shard=shard1
roles=null
state=active
core=collection1
collection=collection1
node_name=127.0.0.1:41518_solr
base_url=http://127.0.0.1:41518/solr

 live:true
 num:4

Control Docs:5
check const of shard1
client0
PROPS:shard=shard1
roles=null
state=active
core=collection1
collection=collection1
node_name=127.0.0.1:41510_solr
base_url=http://127.0.0.1:41510/solr

error contacting client: IOException occured when talking to server at: http://localhost:41510/solr/collection1

client1
PROPS:shard=shard1
roles=null
leader=true
state=active
core=collection1
collection=collection1
node_name=127.0.0.1:41512_solr
base_url=http://127.0.0.1:41512/solr

 live:true
 num:5

client2
PROPS:shard=shard1
roles=null
state=active
core=collection1
collection=collection1
node_name=127.0.0.1:41515_solr
base_url=http://127.0.0.1:41515/solr

 live:true
 num:5

client3
PROPS:shard=shard1
roles=null
state=active
core=collection1
collection=collection1
node_name=127.0.0.1:41518_solr
base_url=http://127.0.0.1:41518/solr

 live:true
 num:5

check const of shard1
client0
PROPS:shard=shard1
roles=null
state=active
core=collection1
collection=collection1
node_name=127.0.0.1:41510_solr
base_url=http://127.0.0.1:41510/solr

 live:true
 num:5

client1
PROPS:shard=shard1
leader=true
roles=null
state=active
core=collection1
collection=collection1
node_name=127.0.0.1:41512_solr
base_url=http://127.0.0.1:41512/solr

 live:true
 num:305

######shard1 is not consistent.  Got 5 from http://127.0.0.1:41510/solr/collection1lastClient and got 305 from http://127.0.0.1:41512/solr/collection1
######http://127.0.0.1:41510/solr/collection1: {numFound=5,start=0,docs=[SolrDocument{id=0, _version_=1411930204719284224}, SolrDocument{id=1, _version_=1411930204730818560}, SolrDocument{id=2, _version_=1411930204740255744}, SolrDocument{id=3, _version_=1411930204749692928}, SolrDocument{id=4, _version_=1411930207379521536}]}
######http://127.0.0.1:41512/solr/collection1: {numFound=305,start=0,docs=[SolrDocument{id=0, _version_=1411930204719284224}, SolrDocument{id=1, _version_=1411930204730818560}, SolrDocument{id=2, _version_=1411930204740255744}, SolrDocument{id=3, _version_=1411930204749692928}, SolrDocument{id=4, _version_=1411930207379521536}, SolrDocument{id=5, _version_=1411930228266106880}, SolrDocument{id=6, _version_=1411930228277641216}, SolrDocument{id=7, _version_=1411930228287078400}, SolrDocument{id=8, _version_=1411930228296515584}, SolrDocument{id=9, _version_=1411930228305952768}, SolrDocument{id=10, _version_=1411930228315389952}, SolrDocument{id=11, _version_=1411930228324827136}, SolrDocument{id=12, _version_=1411930228334264320}, SolrDocument{id=13, _version_=1411930228343701504}, SolrDocument{id=14, _version_=1411930228353138688}, SolrDocument{id=15, _version_=1411930228362575872}, SolrDocument{id=16, _version_=1411930228372013056}, SolrDocument{id=17, _version_=1411930228381450240}, SolrDocument{id=18, _version_=1411930228390887424}, SolrDocument{id=19, _version_=1411930228400324608}, SolrDocument{id=20, _version_=1411930228409761792}, SolrDocument{id=21, _version_=1411930228419198976}, SolrDocument{id=22, _version_=1411930228428636160}, SolrDocument{id=23, _version_=1411930228438073344}, SolrDocument{id=24, _version_=1411930228447510528}, SolrDocument{id=25, _version_=1411930228456947712}, SolrDocument{id=26, _version_=1411930228466384896}, SolrDocument{id=27, _version_=1411930228475822080}, SolrDocument{id=28, _version_=1411930228485259264}, SolrDocument{id=29, _version_=1411930228494696448}, SolrDocument{id=30, _version_=1411930228504133632}, SolrDocument{id=31, _version_=1411930228513570816}, SolrDocument{id=32, _version_=1411930228523008000}, SolrDocument{id=33, _version_=1411930228532445184}, SolrDocument{id=34, _version_=1411930228541882368}, SolrDocument{id=35, _version_=1411930228551319552}, SolrDocument{id=36, _version_=1411930228560756736}, SolrDocument{id=37, _version_=1411930228570193920}, SolrDocument{id=38, _version_=1411930228579631104}, SolrDocument{id=39, _version_=1411930228589068288}, SolrDocument{id=40, _version_=1411930228598505472}, SolrDocument{id=41, _version_=1411930228607942656}, SolrDocument{id=42, _version_=1411930228617379840}, SolrDocument{id=43, _version_=1411930228626817024}, SolrDocument{id=44, _version_=1411930228636254208}, SolrDocument{id=45, _version_=1411930228645691392}, SolrDocument{id=46, _version_=1411930228655128576}, SolrDocument{id=47, _version_=1411930228664565760}, SolrDocument{id=48, _version_=1411930228674002944}, SolrDocument{id=49, _version_=1411930228683440128}, SolrDocument{id=50, _version_=1411930228692877312}, SolrDocument{id=51, _version_=1411930228702314496}, SolrDocument{id=52, _version_=1411930228711751680}, SolrDocument{id=53, _version_=1411930228721188864}, SolrDocument{id=54, _version_=1411930228730626048}, SolrDocument{id=55, _version_=1411930228740063232}, SolrDocument{id=56, _version_=1411930228749500416}, SolrDocument{id=57, _version_=1411930228758937600}, SolrDocument{id=58, _version_=1411930228768374784}, SolrDocument{id=59, _version_=1411930228777811968}, SolrDocument{id=60, _version_=1411930228787249152}, SolrDocument{id=61, _version_=1411930228796686336}, SolrDocument{id=62, _version_=1411930228806123520}, SolrDocument{id=63, _version_=1411930228815560704}, SolrDocument{id=64, _version_=1411930228824997888}, SolrDocument{id=65, _version_=1411930228834435072}, SolrDocument{id=66, _version_=1411930228843872256}, SolrDocument{id=67, _version_=1411930228853309440}, SolrDocument{id=68, _version_=1411930228862746624}, SolrDocument{id=69, _version_=1411930228872183808}, SolrDocument{id=70, _version_=1411930228881620992}, SolrDocument{id=71, _version_=1411930228891058176}, SolrDocument{id=72, _version_=1411930228900495360}, SolrDocument{id=73, _version_=1411930228909932544}, SolrDocument{id=74, _version_=1411930228919369728}, SolrDocument{id=75, _version_=1411930228928806912}, SolrDocument{id=76, _version_=1411930228938244096}, SolrDocument{id=77, _version_=1411930228947681280}, SolrDocument{id=78, _version_=1411930228957118464}, SolrDocument{id=79, _version_=1411930228966555648}, SolrDocument{id=80, _version_=1411930228975992832}, SolrDocument{id=81, _version_=1411930228986478592}, SolrDocument{id=82, _version_=1411930228993818624}, SolrDocument{id=83, _version_=1411930229003255808}, SolrDocument{id=84, _version_=1411930229012692992}, SolrDocument{id=85, _version_=1411930229022130176}, SolrDocument{id=86, _version_=1411930229031567360}, SolrDocument{id=87, _version_=1411930229041004544}, SolrDocument{id=88, _version_=1411930229050441728}, SolrDocument{id=89, _version_=1411930229059878912}, SolrDocument{id=90, _version_=1411930229069316096}, SolrDocument{id=91, _version_=1411930229078753280}, SolrDocument{id=92, _version_=1411930229087141888}, SolrDocument{id=93, _version_=1411930229096579072}, SolrDocument{id=94, _version_=1411930229106016256}, SolrDocument{id=95, _version_=1411930229115453440}, SolrDocument{id=96, _version_=1411930229124890624}, SolrDocument{id=97, _version_=1411930229134327808}, SolrDocument{id=98, _version_=1411930229143764992}, SolrDocument{id=99, _version_=1411930229153202176}, SolrDocument{id=100, _version_=1411930229162639360}, SolrDocument{id=101, _version_=1411930229172076544}, SolrDocument{id=102, _version_=1411930229181513728}, SolrDocument{id=103, _version_=1411930229190950912}, SolrDocument{id=104, _version_=1411930229200388096}, SolrDocument{id=105, _version_=1411930229209825280}, SolrDocument{id=106, _version_=1411930229219262464}, SolrDocument{id=107, _version_=1411930229228699648}, SolrDocument{id=108, _version_=1411930229238136832}, SolrDocument{id=109, _version_=1411930229247574016}, SolrDocument{id=110, _version_=1411930229257011200}, SolrDocument{id=111, _version_=1411930229266448384}, SolrDocument{id=112, _version_=1411930229275885568}, SolrDocument{id=113, _version_=1411930229283225600}, SolrDocument{id=114, _version_=1411930229292662784}, SolrDocument{id=115, _version_=1411930229303148544}, SolrDocument{id=116, _version_=1411930229312585728}, SolrDocument{id=117, _version_=1411930229322022912}, SolrDocument{id=118, _version_=1411930229331460096}, SolrDocument{id=119, _version_=1411930229340897280}, SolrDocument{id=120, _version_=1411930229350334464}, SolrDocument{id=121, _version_=1411930229359771648}, SolrDocument{id=122, _version_=1411930229368160256}, SolrDocument{id=123, _version_=1411930229376548864}, SolrDocument{id=124, _version_=1411930229385986048}, SolrDocument{id=125, _version_=1411930229395423232}, SolrDocument{id=126, _version_=1411930229404860416}, SolrDocument{id=127, _version_=1411930229414297600}, SolrDocument{id=128, _version_=1411930229423734784}, SolrDocument{id=129, _version_=1411930229433171968}, SolrDocument{id=130, _version_=1411930229442609152}, SolrDocument{id=131, _version_=1411930229452046336}, SolrDocument{id=132, _version_=1411930229461483520}, SolrDocument{id=133, _version_=1411930229470920704}, SolrDocument{id=134, _version_=1411930229480357888}, SolrDocument{id=135, _version_=1411930229489795072}, SolrDocument{id=136, _version_=1411930229497135104}, SolrDocument{id=137, _version_=1411930229506572288}, SolrDocument{id=138, _version_=1411930229516009472}, SolrDocument{id=139, _version_=1411930229525446656}, SolrDocument{id=140, _version_=1411930229534883840}, SolrDocument{id=141, _version_=1411930229544321024}, SolrDocument{id=142, _version_=1411930229553758208}, SolrDocument{id=143, _version_=1411930229563195392}, SolrDocument{id=144, _version_=1411930229572632576}, SolrDocument{id=145, _version_=1411930229582069760}, SolrDocument{id=146, _version_=1411930229591506944}, SolrDocument{id=147, _version_=1411930229600944128}, SolrDocument{id=148, _version_=1411930229610381312}, SolrDocument{id=149, _version_=1411930229619818496}, SolrDocument{id=150, _version_=1411930229629255680}, SolrDocument{id=151, _version_=1411930229638692864}, SolrDocument{id=152, _version_=1411930229649178624}, SolrDocument{id=153, _version_=1411930229658615808}, SolrDocument{id=154, _version_=1411930229668052992}, SolrDocument{id=155, _version_=1411930229677490176}, SolrDocument{id=156, _version_=1411930229686927360}, SolrDocument{id=157, _version_=1411930229696364544}, SolrDocument{id=158, _version_=1411930229705801728}, SolrDocument{id=159, _version_=1411930229715238912}, SolrDocument{id=160, _version_=1411930229725724672}, SolrDocument{id=161, _version_=1411930229735161856}, SolrDocument{id=162, _version_=1411930229744599040}, SolrDocument{id=163, _version_=1411930229754036224}, SolrDocument{id=164, _version_=1411930229763473408}, SolrDocument{id=165, _version_=1411930229772910592}, SolrDocument{id=166, _version_=1411930229782347776}, SolrDocument{id=167, _version_=1411930229791784960}, SolrDocument{id=168, _version_=1411930229801222144}, SolrDocument{id=169, _version_=1411930229810659328}, SolrDocument{id=170, _version_=1411930229820096512}, SolrDocument{id=171, _version_=1411930229829533696}, SolrDocument{id=172, _version_=1411930229838970880}, SolrDocument{id=173, _version_=1411930229848408064}, SolrDocument{id=174, _version_=1411930229857845248}, SolrDocument{id=175, _version_=1411930229867282432}, SolrDocument{id=176, _version_=1411930229876719616}, SolrDocument{id=177, _version_=1411930229895593984}, SolrDocument{id=178, _version_=1411930229906079744}, SolrDocument{id=179, _version_=1411930229915516928}, SolrDocument{id=180, _version_=1411930229924954112}, SolrDocument{id=181, _version_=1411930229934391296}, SolrDocument{id=182, _version_=1411930229943828480}, SolrDocument{id=183, _version_=1411930229953265664}, SolrDocument{id=184, _version_=1411930229962702848}, SolrDocument{id=185, _version_=1411930229972140032}, SolrDocument{id=186, _version_=1411930229981577216}, SolrDocument{id=187, _version_=1411930229991014400}, SolrDocument{id=188, _version_=1411930230000451584}, SolrDocument{id=189, _version_=1411930230009888768}, SolrDocument{id=190, _version_=1411930230019325952}, SolrDocument{id=191, _version_=1411930230029811712}, SolrDocument{id=192, _version_=1411930230039248896}, SolrDocument{id=193, _version_=1411930230047637504}, SolrDocument{id=194, _version_=1411930230063366144}, SolrDocument{id=195, _version_=1411930230072803328}, SolrDocument{id=196, _version_=1411930230081191936}, SolrDocument{id=197, _version_=1411930230089580544}, SolrDocument{id=198, _version_=1411930230097969152}, SolrDocument{id=199, _version_=1411930230106357760}, SolrDocument{id=200, _version_=1411930230114746368}, SolrDocument{id=201, _version_=1411930230123134976}, SolrDocument{id=202, _version_=1411930230132572160}, SolrDocument{id=203, _version_=1411930230140960768}, SolrDocument{id=204, _version_=1411930230149349376}, SolrDocument{id=205, _version_=1411930230157737984}, SolrDocument{id=206, _version_=1411930230166126592}, SolrDocument{id=207, _version_=1411930230174515200}, SolrDocument{id=208, _version_=1411930230182903808}, SolrDocument{id=209, _version_=1411930230191292416}, SolrDocument{id=210, _version_=1411930230199681024}, SolrDocument{id=211, _version_=1411930230208069632}, SolrDocument{id=212, _version_=1411930230217506816}, SolrDocument{id=213, _version_=1411930230225895424}, SolrDocument{id=214, _version_=1411930230234284032}, SolrDocument{id=215, _version_=1411930230242672640}, SolrDocument{id=216, _version_=1411930230251061248}, SolrDocument{id=217, _version_=1411930230259449856}, SolrDocument{id=218, _version_=1411930230267838464}, SolrDocument{id=219, _version_=1411930230277275648}, SolrDocument{id=220, _version_=1411930230286712832}, SolrDocument{id=221, _version_=1411930230296150016}, SolrDocument{id=222, _version_=1411930230304538624}, SolrDocument{id=223, _version_=1411930230312927232}, SolrDocument{id=224, _version_=1411930230321315840}, SolrDocument{id=225, _version_=1411930230330753024}, SolrDocument{id=226, _version_=1411930230339141632}, SolrDocument{id=227, _version_=1411930230347530240}, SolrDocument{id=228, _version_=1411930230355918848}, SolrDocument{id=229, _version_=1411930230364307456}, SolrDocument{id=230, _version_=1411930230373744640}, SolrDocument{id=231, _version_=1411930230382133248}, SolrDocument{id=232, _version_=1411930230390521856}, SolrDocument{id=233, _version_=1411930230398910464}, SolrDocument{id=234, _version_=1411930230407299072}, SolrDocument{id=235, _version_=1411930230415687680}, SolrDocument{id=236, _version_=1411930230424076288}, SolrDocument{id=237, _version_=1411930230433513472}, SolrDocument{id=238, _version_=1411930230441902080}, SolrDocument{id=239, _version_=1411930230450290688}, SolrDocument{id=240, _version_=1411930230458679296}, SolrDocument{id=241, _version_=1411930230467067904}, SolrDocument{id=242, _version_=1411930230475456512}, SolrDocument{id=243, _version_=1411930230483845120}, SolrDocument{id=244, _version_=1411930230493282304}, SolrDocument{id=245, _version_=1411930230501670912}, SolrDocument{id=246, _version_=1411930230510059520}, SolrDocument{id=247, _version_=1411930230518448128}, SolrDocument{id=248, _version_=1411930230527885312}, SolrDocument{id=249, _version_=1411930230536273920}, SolrDocument{id=250, _version_=1411930230544662528}, SolrDocument{id=251, _version_=1411930230553051136}, SolrDocument{id=252, _version_=1411930230561439744}, SolrDocument{id=253, _version_=1411930230569828352}, SolrDocument{id=254, _version_=1411930230579265536}, SolrDocument{id=255, _version_=1411930230588702720}, SolrDocument{id=256, _version_=1411930230598139904}, SolrDocument{id=257, _version_=1411930230606528512}, SolrDocument{id=258, _version_=1411930230614917120}, SolrDocument{id=259, _version_=1411930230623305728}, SolrDocument{id=260, _version_=1411930230631694336}, SolrDocument{id=261, _version_=1411930230641131520}, SolrDocument{id=262, _version_=1411930230649520128}, SolrDocument{id=263, _version_=1411930230657908736}, SolrDocument{id=264, _version_=1411930230666297344}, SolrDocument{id=265, _version_=1411930230674685952}, SolrDocument{id=266, _version_=1411930230683074560}, SolrDocument{id=267, _version_=1411930230691463168}, SolrDocument{id=268, _version_=1411930230700900352}, SolrDocument{id=269, _version_=1411930230709288960}, SolrDocument{id=270, _version_=1411930230717677568}, SolrDocument{id=271, _version_=1411930230727114752}, SolrDocument{id=272, _version_=1411930230735503360}, SolrDocument{id=273, _version_=1411930230743891968}, SolrDocument{id=274, _version_=1411930230752280576}, SolrDocument{id=275, _version_=1411930230760669184}, SolrDocument{id=276, _version_=1411930230769057792}, SolrDocument{id=277, _version_=1411930230777446400}, SolrDocument{id=278, _version_=1411930230785835008}, SolrDocument{id=279, _version_=1411930230794223616}, SolrDocument{id=280, _version_=1411930230802612224}, SolrDocument{id=281, _version_=1411930230812049408}, SolrDocument{id=282, _version_=1411930230821486592}, SolrDocument{id=283, _version_=1411930230830923776}, SolrDocument{id=284, _version_=1411930230839312384}, SolrDocument{id=285, _version_=1411930230847700992}, SolrDocument{id=286, _version_=1411930230856089600}, SolrDocument{id=287, _version_=1411930230865526784}, SolrDocument{id=288, _version_=1411930230873915392}, SolrDocument{id=289, _version_=1411930230882304000}, SolrDocument{id=290, _version_=1411930230890692608}, SolrDocument{id=291, _version_=1411930230899081216}, SolrDocument{id=292, _version_=1411930230908518400}, SolrDocument{id=293, _version_=1411930230916907008}, SolrDocument{id=294, _version_=1411930230926344192}, SolrDocument{id=295, _version_=1411930230934732800}, SolrDocument{id=296, _version_=1411930230943121408}, SolrDocument{id=297, _version_=1411930230951510016}, SolrDocument{id=298, _version_=1411930230959898624}, SolrDocument{id=299, _version_=1411930230968287232}, SolrDocument{id=300, _version_=1411930230976675840}, SolrDocument{id=301, _version_=1411930230985064448}, SolrDocument{id=302, _version_=1411930230993453056}, SolrDocument{id=303, _version_=1411930231001841664}, SolrDocument{id=304, _version_=1411930231010230272}]}
###### sizes=5,305
###### Only in http://127.0.0.1:41512/solr/collection1: [{id=193, _version_=1411930230047637504}, {id=75, _version_=1411930228928806912}, {id=214, _version_=1411930230234284032}, {id=211, _version_=1411930230208069632}, {id=303, _version_=1411930231001841664}, {id=162, _version_=1411930229744599040}, {id=38, _version_=1411930228579631104}, {id=132, _version_=1411930229461483520}, {id=87, _version_=1411930229041004544}, {id=50, _version_=1411930228692877312}, {id=218, _version_=1411930230267838464}, {id=207, _version_=1411930230174515200}, {id=155, _version_=1411930229677490176}, {id=55, _version_=1411930228740063232}, {id=83, _version_=1411930229003255808}, {id=277, _version_=1411930230777446400}, {id=24, _version_=1411930228447510528}, {id=149, _version_=1411930229619818496}, {id=67, _version_=1411930228853309440}, {id=20, _version_=1411930228409761792}, {id=106, _version_=1411930229219262464}, {id=111, _version_=1411930229266448384}, {id=114, _version_=1411930229292662784}, {id=156, _version_=1411930229686927360}, {id=234, _version_=1411930230407299072}, {id=180, _version_=1411930229924954112}, {id=76, _version_=1411930228938244096}, {id=280, _version_=1411930230802612224}, {id=238, _version_=1411930230441902080}, {id=5, _version_=1411930228266106880}, {id=96, _version_=1411930229124890624}, {id=236, _version_=1411930230424076288}, {id=286, _version_=1411930230856089600}, {id=102, _version_=1411930229181513728}, {id=77, _version_=1411930228947681280}, {id=292, _version_=1411930230908518400}, {id=63, _version_=1411930228815560704}, {id=225, _version_=1411930230330753024}, {id=191, _version_=1411930230029811712}, {id=245, _version_=1411930230501670912}, {id=172, _version_=1411930229838970880}, {id=91, _version_=1411930229078753280}, {id=268, _version_=1411930230700900352}, {id=142, _version_=1411930229553758208}, {id=188, _version_=1411930230000451584}, {id=251, _version_=1411930230553051136}, {id=141, _version_=1411930229544321024}, {id=71, _version_=1411930228891058176}, {id=230, _version_=1411930230373744640}, {id=116, _version_=1411930229312585728}, {id=289, _version_=1411930230882304000}, {id=199, _version_=1411930230106357760}, {id=123, _version_=1411930229376548864}, {id=15, _version_=1411930228362575872}, {id=166, _version_=1411930229782347776}, {id=255, _version_=1411930230588702720}, {id=68, _version_=1411930228862746624}, {id=299, _version_=1411930230968287232}, {id=196, _version_=1411930230081191936}, {id=258, _version_=1411930230614917120}, {id=176, _version_=1411930229876719616}, {id=46, _version_=1411930228655128576}, {id=224, _version_=1411930230321315840}, {id=242, _version_=1411930230475456512}, {id=101, _version_=1411930229172076544}, {id=9, _version_=1411930228305952768}, {id=28, _version_=1411930228485259264}, {id=56, _version_=1411930228749500416}, {id=264, _version_=1411930230666297344}, {id=297, _version_=1411930230951510016}, {id=184, _version_=1411930229962702848}, {id=136, _version_=1411930229497135104}, {id=194, _version_=1411930230063366144}, {id=127, _version_=1411930229414297600}, {id=61, _version_=1411930228796686336}, {id=228, _version_=1411930230355918848}, {id=19, _version_=1411930228400324608}, {id=82, _version_=1411930228993818624}, {id=217, _version_=1411930230259449856}, {id=97, _version_=1411930229134327808}, {id=278, _version_=1411930230785835008}, {id=177, _version_=1411930229895593984}, {id=27, _version_=1411930228475822080}, {id=208, _version_=1411930230182903808}, {id=52, _version_=1411930228711751680}, {id=281, _version_=1411930230812049408}, {id=124, _version_=1411930229385986048}, {id=10, _version_=1411930228315389952}, {id=202, _version_=1411930230132572160}, {id=12, _version_=1411930228334264320}, {id=302, _version_=1411930230993453056}, {id=213, _version_=1411930230225895424}, {id=146, _version_=1411930229591506944}, {id=192, _version_=1411930230039248896}, {id=110, _version_=1411930229257011200}, {id=167, _version_=1411930229791784960}, {id=34, _version_=1411930228541882368}, {id=239, _version_=1411930230450290688}, {id=117, _version_=1411930229322022912}, {id=128, _version_=1411930229423734784}, {id=163, _version_=1411930229754036224}, {id=219, _version_=1411930230277275648}, {id=51, _version_=1411930228702314496}, {id=88, _version_=1411930229050441728}, {id=109, _version_=1411930229247574016}, {id=145, _version_=1411930229582069760}, {id=23, _version_=1411930228438073344}, {id=235, _version_=1411930230415687680}, {id=80, _version_=1411930228975992832}, {id=223, _version_=1411930230312927232}, {id=273, _version_=1411930230743891968}, {id=287, _version_=1411930230865526784}, {id=231, _version_=1411930230382133248}, {id=105, _version_=1411930229209825280}, {id=18, _version_=1411930228390887424}, {id=92, _version_=1411930229087141888}, {id=133, _version_=1411930229470920704}, {id=122, _version_=1411930229368160256}, {id=250, _version_=1411930230544662528}, {id=275, _version_=1411930230760669184}, {id=120, _version_=1411930229350334464}, {id=189, _version_=1411930230009888768}, {id=244, _version_=1411930230493282304}, {id=47, _version_=1411930228664565760}, {id=147, _version_=1411930229600944128}, {id=100, _version_=1411930229162639360}, {id=179, _version_=1411930229915516928}, {id=29, _version_=1411930228494696448}, {id=60, _version_=1411930228787249152}, {id=42, _version_=1411930228617379840}, {id=175, _version_=1411930229867282432}, {id=290, _version_=1411930230890692608}, {id=200, _version_=1411930230114746368}, {id=285, _version_=1411930230847700992}, {id=41, _version_=1411930228607942656}, {id=185, _version_=1411930229972140032}, {id=229, _version_=1411930230364307456}, {id=14, _version_=1411930228353138688}, {id=137, _version_=1411930229506572288}, {id=195, _version_=1411930230072803328}, {id=59, _version_=1411930228777811968}, {id=296, _version_=1411930230943121408}, {id=129, _version_=1411930229433171968}, {id=7, _version_=1411930228287078400}, {id=37, _version_=1411930228570193920}, {id=243, _version_=1411930230483845120}, {id=263, _version_=1411930230657908736}, {id=171, _version_=1411930229829533696}, {id=72, _version_=1411930228900495360}, {id=159, _version_=1411930229715238912}, {id=66, _version_=1411930228843872256}, {id=298, _version_=1411930230959898624}, {id=259, _version_=1411930230623305728}, {id=94, _version_=1411930229106016256}, {id=85, _version_=1411930229022130176}, {id=53, _version_=1411930228721188864}, {id=152, _version_=1411930229649178624}, {id=220, _version_=1411930230286712832}, {id=33, _version_=1411930228532445184}, {id=168, _version_=1411930229801222144}, {id=26, _version_=1411930228466384896}, {id=232, _version_=1411930230390521856}, {id=222, _version_=1411930230304538624}, {id=201, _version_=1411930230123134976}, {id=272, _version_=1411930230735503360}, {id=11, _version_=1411930228324827136}, {id=144, _version_=1411930229572632576}, {id=44, _version_=1411930228636254208}, {id=182, _version_=1411930229943828480}, {id=118, _version_=1411930229331460096}, {id=205, _version_=1411930230157737984}, {id=178, _version_=1411930229906079744}, {id=35, _version_=1411930228551319552}, {id=203, _version_=1411930230140960768}, {id=48, _version_=1411930228674002944}, {id=108, _version_=1411930229238136832}, {id=22, _version_=1411930228428636160}, {id=262, _version_=1411930230649520128}, {id=164, _version_=1411930229763473408}, {id=151, _version_=1411930229638692864}, {id=209, _version_=1411930230191292416}, {id=190, _version_=1411930230019325952}, {id=169, _version_=1411930229810659328}, {id=139, _version_=1411930229525446656}, {id=256, _version_=1411930230598139904}, {id=279, _version_=1411930230794223616}, {id=134, _version_=1411930229480357888}, {id=13, _version_=1411930228343701504}, {id=216, _version_=1411930230251061248}, {id=266, _version_=1411930230683074560}, {id=104, _version_=1411930229200388096}, {id=93, _version_=1411930229096579072}, {id=89, _version_=1411930229059878912}, {id=43, _version_=1411930228626817024}, {id=79, _version_=1411930228966555648}, {id=170, _version_=1411930229820096512}, {id=81, _version_=1411930228986478592}, {id=65, _version_=1411930228834435072}, {id=295, _version_=1411930230934732800}, {id=301, _version_=1411930230985064448}, {id=119, _version_=1411930229340897280}, {id=240, _version_=1411930230458679296}, {id=186, _version_=1411930229981577216}, {id=121, _version_=1411930229359771648}, {id=58, _version_=1411930228768374784}, {id=282, _version_=1411930230821486592}, {id=138, _version_=1411930229516009472}, {id=99, _version_=1411930229153202176}, {id=17, _version_=1411930228381450240}, {id=227, _version_=1411930230347530240}, {id=197, _version_=1411930230089580544}, {id=249, _version_=1411930230536273920}, {id=125, _version_=1411930229395423232}, {id=40, _version_=1411930228598505472}, {id=158, _version_=1411930229705801728}, {id=253, _version_=1411930230569828352}, {id=73, _version_=1411930228909932544}, {id=174, _version_=1411930229857845248}, {id=36, _version_=1411930228560756736}, {id=284, _version_=1411930230839312384}, {id=30, _version_=1411930228504133632}, {id=130, _version_=1411930229442609152}, {id=6, _version_=1411930228277641216}, {id=270, _version_=1411930230717677568}, {id=98, _version_=1411930229143764992}, {id=247, _version_=1411930230518448128}, {id=112, _version_=1411930229275885568}, {id=39, _version_=1411930228589068288}, {id=271, _version_=1411930230727114752}, {id=131, _version_=1411930229452046336}, {id=233, _version_=1411930230398910464}, {id=74, _version_=1411930228919369728}, {id=221, _version_=1411930230296150016}, {id=25, _version_=1411930228456947712}, {id=150, _version_=1411930229629255680}, {id=54, _version_=1411930228730626048}, {id=154, _version_=1411930229668052992}, {id=212, _version_=1411930230217506816}, {id=237, _version_=1411930230433513472}, {id=181, _version_=1411930229934391296}, {id=161, _version_=1411930229735161856}, {id=21, _version_=1411930228419198976}, {id=31, _version_=1411930228513570816}, {id=210, _version_=1411930230199681024}, {id=261, _version_=1411930230641131520}, {id=157, _version_=1411930229696364544}, {id=304, _version_=1411930231010230272}, {id=173, _version_=1411930229848408064}, {id=204, _version_=1411930230149349376}, {id=107, _version_=1411930229228699648}, {id=148, _version_=1411930229610381312}, {id=143, _version_=1411930229563195392}, {id=215, _version_=1411930230242672640}, {id=32, _version_=1411930228523008000}, {id=206, _version_=1411930230166126592}, {id=276, _version_=1411930230769057792}, {id=16, _version_=1411930228372013056}, {id=86, _version_=1411930229031567360}, {id=113, _version_=1411930229283225600}, {id=49, _version_=1411930228683440128}, {id=274, _version_=1411930230752280576}, {id=300, _version_=1411930230976675840}, {id=45, _version_=1411930228645691392}, {id=294, _version_=1411930230926344192}, {id=103, _version_=1411930229190950912}, {id=183, _version_=1411930229953265664}, {id=254, _version_=1411930230579265536}, {id=267, _version_=1411930230691463168}, {id=135, _version_=1411930229489795072}, {id=160, _version_=1411930229725724672}, {id=153, _version_=1411930229658615808}, {id=126, _version_=1411930229404860416}, {id=62, _version_=1411930228806123520}, {id=257, _version_=1411930230606528512}, {id=187, _version_=1411930229991014400}, {id=291, _version_=1411930230899081216}, {id=95, _version_=1411930229115453440}, {id=265, _version_=1411930230674685952}, {id=70, _version_=1411930228881620992}, {id=8, _version_=1411930228296515584}, {id=269, _version_=1411930230709288960}, {id=283, _version_=1411930230830923776}, {id=69, _version_=1411930228872183808}, {id=90, _version_=1411930229069316096}, {id=246, _version_=1411930230510059520}, {id=78, _version_=1411930228957118464}, {id=252, _version_=1411930230561439744}, {id=115, _version_=1411930229303148544}, {id=64, _version_=1411930228824997888}, {id=84, _version_=1411930229012692992}, {id=260, _version_=1411930230631694336}, {id=293, _version_=1411930230916907008}, {id=165, _version_=1411930229772910592}, {id=226, _version_=1411930230339141632}, {id=288, _version_=1411930230873915392}, {id=198, _version_=1411930230097969152}, {id=248, _version_=1411930230527885312}, {id=140, _version_=1411930229534883840}, {id=241, _version_=1411930230467067904}, {id=57, _version_=1411930228758937600}]
client2
PROPS:shard=shard1
roles=null
state=active
core=collection1
collection=collection1
node_name=127.0.0.1:41515_solr
base_url=http://127.0.0.1:41515/solr

 live:true
 num:305

client3
PROPS:shard=shard1
roles=null
state=active
core=collection1
collection=collection1
node_name=127.0.0.1:41518_solr
base_url=http://127.0.0.1:41518/solr

 live:true
 num:5

72201 T2179 oasc.SolrException.log SEVERE Sync request error: org.apache.solr.client.solrj.SolrServerException: IOException occured when talking to server at: http://127.0.0.1:41512/solr/collection1
ASYNC  NEW_CORE C7 name=collection1 org.apache.solr.core.SolrCore@afd5a3f url=http://127.0.0.1:41518/solr/collection1 node=127.0.0.1:41518_solr
87231 T2249 C7 P41518 oasc.SolrException.log SEVERE Error while trying to recover. core=collection1:org.apache.solr.client.solrj.SolrServerException: IOException occured when talking to server at: http://127.0.0.1:41512/solr
		at org.apache.solr.client.solrj.impl.HttpSolrServer.request(HttpSolrServer.java:414)
		at org.apache.solr.client.solrj.impl.HttpSolrServer.request(HttpSolrServer.java:182)
		at org.apache.solr.cloud.RecoveryStrategy.sendPrepRecoveryCmd(RecoveryStrategy.java:191)
		at org.apache.solr.cloud.RecoveryStrategy.doRecovery(RecoveryStrategy.java:320)
		at org.apache.solr.cloud.RecoveryStrategy.run(RecoveryStrategy.java:212)
	Caused by: org.apache.http.conn.ConnectTimeoutException: Connect to 127.0.0.1:41512 timed out
		at org.apache.http.conn.scheme.PlainSocketFactory.connectSocket(PlainSocketFactory.java:125)
		at org.apache.http.impl.conn.DefaultClientConnectionOperator.openConnection(DefaultClientConnectionOperator.java:148)
		at org.apache.http.impl.conn.AbstractPoolEntry.open(AbstractPoolEntry.java:150)
		at org.apache.http.impl.conn.AbstractPooledConnAdapter.open(AbstractPooledConnAdapter.java:121)
		at org.apache.http.impl.client.DefaultRequestDirector.tryConnect(DefaultRequestDirector.java:575)
		at org.apache.http.impl.client.DefaultRequestDirector.execute(DefaultRequestDirector.java:425)
		at org.apache.http.impl.client.AbstractHttpClient.execute(AbstractHttpClient.java:820)
		at org.apache.http.impl.client.AbstractHttpClient.execute(AbstractHttpClient.java:754)
		at org.apache.http.impl.client.AbstractHttpClient.execute(AbstractHttpClient.java:732)
		at org.apache.solr.client.solrj.impl.HttpSolrServer.request(HttpSolrServer.java:353)
		... 4 more
	
87232 T2249 C7 P41518 oasc.RecoveryStrategy.doRecovery SEVERE Recovery failed - trying again... core=collection1
ASYNC  NEW_CORE C8 name=collection1 org.apache.solr.core.SolrCore@e1d7084 url=http://127.0.0.1:41510/solr/collection1 node=127.0.0.1:41510_solr
87241 T2250 C8 P41510 oasc.SolrException.log SEVERE Error while trying to recover. core=collection1:org.apache.solr.client.solrj.SolrServerException: IOException occured when talking to server at: http://127.0.0.1:41512/solr
		at org.apache.solr.client.solrj.impl.HttpSolrServer.request(HttpSolrServer.java:414)
		at org.apache.solr.client.solrj.impl.HttpSolrServer.request(HttpSolrServer.java:182)
		at org.apache.solr.cloud.RecoveryStrategy.sendPrepRecoveryCmd(RecoveryStrategy.java:191)
		at org.apache.solr.cloud.RecoveryStrategy.doRecovery(RecoveryStrategy.java:320)
		at org.apache.solr.cloud.RecoveryStrategy.run(RecoveryStrategy.java:212)
	Caused by: org.apache.http.conn.ConnectTimeoutException: Connect to 127.0.0.1:41512 timed out
		at org.apache.http.conn.scheme.PlainSocketFactory.connectSocket(PlainSocketFactory.java:125)
		at org.apache.http.impl.conn.DefaultClientConnectionOperator.openConnection(DefaultClientConnectionOperator.java:148)
		at org.apache.http.impl.conn.AbstractPoolEntry.open(AbstractPoolEntry.java:150)
		at org.apache.http.impl.conn.AbstractPooledConnAdapter.open(AbstractPooledConnAdapter.java:121)
		at org.apache.http.impl.client.DefaultRequestDirector.tryConnect(DefaultRequestDirector.java:575)
		at org.apache.http.impl.client.DefaultRequestDirector.execute(DefaultRequestDirector.java:425)
		at org.apache.http.impl.client.AbstractHttpClient.execute(AbstractHttpClient.java:820)
		at org.apache.http.impl.client.AbstractHttpClient.execute(AbstractHttpClient.java:754)
		at org.apache.http.impl.client.AbstractHttpClient.execute(AbstractHttpClient.java:732)
		at org.apache.solr.client.solrj.impl.HttpSolrServer.request(HttpSolrServer.java:353)
		... 4 more
	
87242 T2250 C8 P41510 oasc.RecoveryStrategy.doRecovery SEVERE Recovery failed - trying again... core=collection1
90264 T2250 C8 P41510 oasc.SolrException.log SEVERE Error while trying to recover. core=collection1:java.lang.RuntimeException: No registered leader was found, collection:collection1 slice:shard1
		at org.apache.solr.common.cloud.ZkStateReader.getLeaderProps(ZkStateReader.java:413)
		at org.apache.solr.common.cloud.ZkStateReader.getLeaderProps(ZkStateReader.java:399)
		at org.apache.solr.cloud.RecoveryStrategy.doRecovery(RecoveryStrategy.java:296)
		at org.apache.solr.cloud.RecoveryStrategy.run(RecoveryStrategy.java:212)
	
90264 T2250 C8 P41510 oasc.RecoveryStrategy.doRecovery SEVERE Recovery failed - trying again... core=collection1
90283 T2249 C7 P41518 oasc.SolrException.log SEVERE Error while trying to recover. core=collection1:java.lang.RuntimeException: No registered leader was found, collection:collection1 slice:shard1
		at org.apache.solr.common.cloud.ZkStateReader.getLeaderProps(ZkStateReader.java:413)
		at org.apache.solr.common.cloud.ZkStateReader.getLeaderProps(ZkStateReader.java:399)
		at org.apache.solr.cloud.RecoveryStrategy.doRecovery(RecoveryStrategy.java:296)
		at org.apache.solr.cloud.RecoveryStrategy.run(RecoveryStrategy.java:212)
	
90283 T2249 C7 P41518 oasc.RecoveryStrategy.doRecovery SEVERE Recovery failed - trying again... core=collection1
95289 T2250 C8 P41510 oasc.SolrException.log SEVERE Error while trying to recover. core=collection1:java.lang.RuntimeException: No registered leader was found, collection:collection1 slice:shard1
		at org.apache.solr.common.cloud.ZkStateReader.getLeaderProps(ZkStateReader.java:413)
		at org.apache.solr.common.cloud.ZkStateReader.getLeaderProps(ZkStateReader.java:399)
		at org.apache.solr.cloud.RecoveryStrategy.doRecovery(RecoveryStrategy.java:296)
		at org.apache.solr.cloud.RecoveryStrategy.run(RecoveryStrategy.java:212)
	
95289 T2250 C8 P41510 oasc.RecoveryStrategy.doRecovery SEVERE Recovery failed - trying again... core=collection1
95308 T2249 C7 P41518 oasc.SolrException.log SEVERE Error while trying to recover. core=collection1:java.lang.RuntimeException: No registered leader was found, collection:collection1 slice:shard1
		at org.apache.solr.common.cloud.ZkStateReader.getLeaderProps(ZkStateReader.java:413)
		at org.apache.solr.common.cloud.ZkStateReader.getLeaderProps(ZkStateReader.java:399)
		at org.apache.solr.cloud.RecoveryStrategy.doRecovery(RecoveryStrategy.java:296)
		at org.apache.solr.cloud.RecoveryStrategy.run(RecoveryStrategy.java:212)
	
95308 T2249 C7 P41518 oasc.RecoveryStrategy.doRecovery SEVERE Recovery failed - trying again... core=collection1
104318 T2250 C8 P41510 oasc.SolrException.log SEVERE Error while trying to recover. core=collection1:java.lang.RuntimeException: No registered leader was found, collection:collection1 slice:shard1
		at org.apache.solr.common.cloud.ZkStateReader.getLeaderProps(ZkStateReader.java:413)
		at org.apache.solr.common.cloud.ZkStateReader.getLeaderProps(ZkStateReader.java:399)
		at org.apache.solr.cloud.RecoveryStrategy.doRecovery(RecoveryStrategy.java:296)
		at org.apache.solr.cloud.RecoveryStrategy.run(RecoveryStrategy.java:212)
	
104318 T2250 C8 P41510 oasc.RecoveryStrategy.doRecovery SEVERE Recovery failed - trying again... core=collection1
104336 T2249 C7 P41518 oasc.SolrException.log SEVERE Error while trying to recover. core=collection1:java.lang.RuntimeException: No registered leader was found, collection:collection1 slice:shard1
		at org.apache.solr.common.cloud.ZkStateReader.getLeaderProps(ZkStateReader.java:413)
		at org.apache.solr.common.cloud.ZkStateReader.getLeaderProps(ZkStateReader.java:399)
		at org.apache.solr.cloud.RecoveryStrategy.doRecovery(RecoveryStrategy.java:296)
		at org.apache.solr.cloud.RecoveryStrategy.run(RecoveryStrategy.java:212)
	
104338 T2249 C7 P41518 oasc.RecoveryStrategy.doRecovery SEVERE Recovery failed - trying again... core=collection1
117211 T2179 oasc.SolrException.log SEVERE http://127.0.0.1:41515/solr/collection1/: Could not tell a replica to recover:org.apache.solr.client.solrj.SolrServerException: IOException occured when talking to server at: http://127.0.0.1:41512/solr
		at org.apache.solr.client.solrj.impl.HttpSolrServer.request(HttpSolrServer.java:414)
		at org.apache.solr.client.solrj.impl.HttpSolrServer.request(HttpSolrServer.java:182)
		at org.apache.solr.cloud.SyncStrategy.requestRecovery(SyncStrategy.java:282)
		at org.apache.solr.cloud.SyncStrategy.syncToMe(SyncStrategy.java:226)
		at org.apache.solr.cloud.SyncStrategy.syncReplicas(SyncStrategy.java:119)
		at org.apache.solr.cloud.SyncStrategy.sync(SyncStrategy.java:85)
		at org.apache.solr.cloud.ShardLeaderElectionContext.runLeaderProcess(ElectionContext.java:180)
		at org.apache.solr.cloud.LeaderElector.runIamLeaderProcess(LeaderElector.java:159)
		at org.apache.solr.cloud.LeaderElector.checkIfIamLeader(LeaderElector.java:103)
		at org.apache.solr.cloud.LeaderElector.access$000(LeaderElector.java:57)
		at org.apache.solr.cloud.LeaderElector$1.process(LeaderElector.java:132)
		at org.apache.zookeeper.ClientCnxn$EventThread.processEvent(ClientCnxn.java:526)
		at org.apache.zookeeper.ClientCnxn$EventThread.run(ClientCnxn.java:502)
	Caused by: org.apache.http.conn.ConnectTimeoutException: Connect to 127.0.0.1:41512 timed out
		at org.apache.http.conn.scheme.PlainSocketFactory.connectSocket(PlainSocketFactory.java:125)
		at org.apache.http.impl.conn.DefaultClientConnectionOperator.openConnection(DefaultClientConnectionOperator.java:148)
		at org.apache.http.impl.conn.AbstractPoolEntry.open(AbstractPoolEntry.java:150)
		at org.apache.http.impl.conn.AbstractPooledConnAdapter.open(AbstractPooledConnAdapter.java:121)
		at org.apache.http.impl.client.DefaultRequestDirector.tryConnect(DefaultRequestDirector.java:575)
		at org.apache.http.impl.client.DefaultRequestDirector.execute(DefaultRequestDirector.java:425)
		at org.apache.http.impl.client.AbstractHttpClient.execute(AbstractHttpClient.java:820)
		at org.apache.http.impl.client.AbstractHttpClient.execute(AbstractHttpClient.java:754)
		at org.apache.http.impl.client.AbstractHttpClient.execute(AbstractHttpClient.java:732)
		at org.apache.solr.client.solrj.impl.HttpSolrServer.request(HttpSolrServer.java:353)
		... 12 more
	
Control Docs:305
check const of shard1
client0
PROPS:shard=shard1
roles=null
state=active
core=collection1
collection=collection1
node_name=127.0.0.1:41510_solr
base_url=http://127.0.0.1:41510/solr

 live:true
 num:305

client1
PROPS:shard=shard1
roles=null
state=active
core=collection1
collection=collection1
node_name=127.0.0.1:41512_solr
base_url=http://127.0.0.1:41512/solr

error contacting client: IOException occured when talking to server at: http://localhost:41512/solr/collection1

client2
PROPS:shard=shard1
roles=null
leader=true
state=active
core=collection1
collection=collection1
node_name=127.0.0.1:41515_solr
base_url=http://127.0.0.1:41515/solr

 live:true
 num:305

client3
PROPS:shard=shard1
roles=null
state=active
core=collection1
collection=collection1
node_name=127.0.0.1:41518_solr
base_url=http://127.0.0.1:41518/solr

 live:true
 num:305

http://127.0.0.1:41510/solr/collection1/ : 305
shard:shard1
Tests run: 1, Failures: 0, Errors: 0, Skipped: 0, Time elapsed: 130.668 sec
Running org.apache.solr.client.solrj.response.DocumentAnalysisResponseTest
Tests run: 1, Failures: 0, Errors: 0, Skipped: 0, Time elapsed: 0.017 sec
Running org.apache.solr.common.util.TestNamedListCodec
Tests run: 4, Failures: 0, Errors: 0, Skipped: 0, Time elapsed: 0.37 sec
Running org.apache.solr.handler.BinaryUpdateRequestHandlerTest
Creating dataDir: /usr/home/hudson/hudson-slave/workspace/Lucene-Solr-Maven-trunk/maven-build/solr/core/target/test/./solrtest-BinaryUpdateRequestHandlerTest-1346521687091
null
Tests run: 1, Failures: 0, Errors: 0, Skipped: 0, Time elapsed: 0.498 sec
Running org.apache.solr.common.params.SolrParamTest
Tests run: 1, Failures: 0, Errors: 0, Skipped: 0, Time elapsed: 0.017 sec
Running org.apache.solr.OutputWriterTest
Creating dataDir: /usr/home/hudson/hudson-slave/workspace/Lucene-Solr-Maven-trunk/maven-build/solr/core/target/test/./solrtest-OutputWriterTest-1346521687606
Tests run: 5, Failures: 0, Errors: 0, Skipped: 0, Time elapsed: 0.235 sec
Running org.apache.solr.search.TestStressReorder
Creating dataDir: /usr/home/hudson/hudson-slave/workspace/Lucene-Solr-Maven-trunk/maven-build/solr/core/target/test/./solrtest-TestStressReorder-1346521687843
Tests run: 1, Failures: 0, Errors: 0, Skipped: 0, Time elapsed: 2.41 sec
Running org.apache.solr.search.function.distance.DistanceFunctionTest
Creating dataDir: /usr/home/hudson/hudson-slave/workspace/Lucene-Solr-Maven-trunk/maven-build/solr/core/target/test/./solrtest-DistanceFunctionTest-1346521690257
Tests run: 3, Failures: 0, Errors: 0, Skipped: 0, Time elapsed: 0.623 sec
Running org.apache.solr.client.solrj.response.TestSpellCheckResponse
Creating dataDir: /usr/home/hudson/hudson-slave/workspace/Lucene-Solr-Maven-trunk/maven-build/solr/core/target/test/./solrtest-TestSpellCheckResponse-1346521690877
Tests run: 3, Failures: 0, Errors: 0, Skipped: 0, Time elapsed: 0.714 sec
Running org.apache.solr.spelling.WordBreakSolrSpellCheckerTest
Creating dataDir: /usr/home/hudson/hudson-slave/workspace/Lucene-Solr-Maven-trunk/maven-build/solr/core/target/test/./solrtest-WordBreakSolrSpellCheckerTest-1346521691593
Tests run: 3, Failures: 0, Errors: 0, Skipped: 0, Time elapsed: 1.117 sec
Running org.apache.solr.analysis.TestLuceneMatchVersion
Creating dataDir: /usr/home/hudson/hudson-slave/workspace/Lucene-Solr-Maven-trunk/maven-build/solr/core/target/test/./solrtest-TestLuceneMatchVersion-1346521692709
Tests run: 1, Failures: 0, Errors: 0, Skipped: 0, Time elapsed: 0.193 sec
Running org.apache.solr.schema.TestCollationField
Creating dataDir: /usr/home/hudson/hudson-slave/workspace/Lucene-Solr-Maven-trunk/maven-build/solr/core/target/test/./solrtest-TestCollationField-1346521692946
Tests run: 8, Failures: 0, Errors: 0, Skipped: 0, Time elapsed: 0.366 sec
Running org.apache.solr.client.solrj.embedded.LargeVolumeEmbeddedTest
Creating dataDir: /usr/home/hudson/hudson-slave/workspace/Lucene-Solr-Maven-trunk/maven-build/solr/core/target/test/./solrtest-LargeVolumeEmbeddedTest-1346521693273
Tests run: 1, Failures: 0, Errors: 0, Skipped: 0, Time elapsed: 0.545 sec
Running org.apache.solr.internal.csv.CSVParserTest
Tests run: 23, Failures: 0, Errors: 0, Skipped: 0, Time elapsed: 0.008 sec
Running org.apache.solr.core.TestQuerySenderListener
Creating dataDir: /usr/home/hudson/hudson-slave/workspace/Lucene-Solr-Maven-trunk/maven-build/solr/core/target/test/./solrtest-TestQuerySenderListener-1346521693823
Tests run: 3, Failures: 0, Errors: 0, Skipped: 0, Time elapsed: 0.282 sec
Running org.apache.solr.servlet.NoCacheHeaderTest
Creating dataDir: /usr/home/hudson/hudson-slave/workspace/Lucene-Solr-Maven-trunk/maven-build/solr/core/target/test/./solrtest-NoCacheHeaderTest-1346521694106
Tests run: 3, Failures: 0, Errors: 0, Skipped: 0, Time elapsed: 0.41 sec
Running org.apache.solr.search.TestFastLRUCache
Tests run: 7, Failures: 0, Errors: 0, Skipped: 0, Time elapsed: 0.033 sec
Running org.apache.solr.core.SOLR749Test
Creating dataDir: /usr/home/hudson/hudson-slave/workspace/Lucene-Solr-Maven-trunk/maven-build/solr/core/target/test/./solrtest-SOLR749Test-1346521694548
12 T3 oasu.ConcurrentLRUCache.finalize SEVERE ConcurrentLRUCache was not destroyed prior to finalize(), indicates a bug -- POSSIBLE RESOURCE LEAK!!!
Tests run: 1, Failures: 0, Errors: 0, Skipped: 0, Time elapsed: 0.266 sec
Running org.apache.solr.handler.admin.LukeRequestHandlerTest
Tests run: 3, Failures: 0, Errors: 0, Skipped: 0, Time elapsed: 1.172 sec
Running org.apache.solr.search.TestQueryUtils
Tests run: 1, Failures: 0, Errors: 0, Skipped: 0, Time elapsed: 0.398 sec
Running org.apache.solr.search.similarities.TestBM25SimilarityFactory
Creating dataDir: /usr/home/hudson/hudson-slave/workspace/Lucene-Solr-Maven-trunk/maven-build/solr/core/target/test/./solrtest-TestBM25SimilarityFactory-1346521696388
Tests run: 2, Failures: 0, Errors: 0, Skipped: 0, Time elapsed: 0.065 sec
Running org.apache.solr.common.SolrDocumentTest
Tests run: 5, Failures: 0, Errors: 0, Skipped: 0, Time elapsed: 0.014 sec
Running org.apache.solr.request.SimpleFacetsTest
Creating dataDir: /usr/home/hudson/hudson-slave/workspace/Lucene-Solr-Maven-trunk/maven-build/solr/core/target/test/./solrtest-SimpleFacetsTest-1346521696476
ASYNC  NEW_CORE C9 name=collection1 org.apache.solr.core.SolrCore@4ab0295c
2362 T2386 C9 oasc.SolrException.log SEVERE org.apache.solr.common.SolrException: Specify the group.field as parameter or local parameter
		at org.apache.solr.request.SimpleFacets.getGroupedCounts(SimpleFacets.java:360)
		at org.apache.solr.request.SimpleFacets.getTermCounts(SimpleFacets.java:319)
		at org.apache.solr.request.SimpleFacets.getFacetFieldCounts(SimpleFacets.java:423)
		at org.apache.solr.request.SimpleFacets.getFacetCounts(SimpleFacets.java:206)
		at org.apache.solr.handler.component.FacetComponent.process(FacetComponent.java:87)
		at org.apache.solr.handler.component.SearchHandler.handleRequestBody(SearchHandler.java:206)
		at org.apache.solr.handler.RequestHandlerBase.handleRequest(RequestHandlerBase.java:129)
		at org.apache.solr.core.SolrCore.execute(SolrCore.java:1692)
		at org.apache.solr.util.TestHarness.query(TestHarness.java:351)
		at org.apache.solr.util.TestHarness.query(TestHarness.java:333)
		at org.apache.solr.request.SimpleFacetsTest.testSimpleGroupedFacets(SimpleFacetsTest.java:211)
		at sun.reflect.NativeMethodAccessorImpl.invoke0(Native Method)
		at sun.reflect.NativeMethodAccessorImpl.invoke(NativeMethodAccessorImpl.java:57)
		at sun.reflect.DelegatingMethodAccessorImpl.invoke(DelegatingMethodAccessorImpl.java:43)
		at java.lang.reflect.Method.invoke(Method.java:616)
		at com.carrotsearch.randomizedtesting.RandomizedRunner.invoke(RandomizedRunner.java:1559)
		at com.carrotsearch.randomizedtesting.RandomizedRunner.access$600(RandomizedRunner.java:79)
		at com.carrotsearch.randomizedtesting.RandomizedRunner$6.evaluate(RandomizedRunner.java:737)
		at com.carrotsearch.randomizedtesting.RandomizedRunner$7.evaluate(RandomizedRunner.java:773)
		at com.carrotsearch.randomizedtesting.RandomizedRunner$8.evaluate(RandomizedRunner.java:787)
		at com.carrotsearch.randomizedtesting.rules.SystemPropertiesRestoreRule$1.evaluate(SystemPropertiesRestoreRule.java:53)
		at org.apache.lucene.util.TestRuleSetupTeardownChained$1.evaluate(TestRuleSetupTeardownChained.java:50)
		at org.apache.lucene.util.TestRuleFieldCacheSanity$1.evaluate(TestRuleFieldCacheSanity.java:51)
		at org.apache.lucene.util.AbstractBeforeAfterRule$1.evaluate(AbstractBeforeAfterRule.java:45)
		at com.carrotsearch.randomizedtesting.rules.SystemPropertiesInvariantRule$1.evaluate(SystemPropertiesInvariantRule.java:55)
		at org.apache.lucene.util.TestRuleThreadAndTestName$1.evaluate(TestRuleThreadAndTestName.java:48)
		at org.apache.lucene.util.TestRuleIgnoreAfterMaxFailures$1.evaluate(TestRuleIgnoreAfterMaxFailures.java:70)
		at org.apache.lucene.util.TestRuleMarkFailure$1.evaluate(TestRuleMarkFailure.java:48)
		at com.carrotsearch.randomizedtesting.rules.StatementAdapter.evaluate(StatementAdapter.java:36)
		at com.carrotsearch.randomizedtesting.ThreadLeakControl$StatementRunner.run(ThreadLeakControl.java:345)
		at com.carrotsearch.randomizedtesting.ThreadLeakControl.forkTimeoutingTask(ThreadLeakControl.java:769)
		at com.carrotsearch.randomizedtesting.ThreadLeakControl$3.evaluate(ThreadLeakControl.java:429)
		at com.carrotsearch.randomizedtesting.RandomizedRunner.runSingleTest(RandomizedRunner.java:746)
		at com.carrotsearch.randomizedtesting.RandomizedRunner$3.evaluate(RandomizedRunner.java:648)
		at com.carrotsearch.randomizedtesting.RandomizedRunner$4.evaluate(RandomizedRunner.java:682)
		at com.carrotsearch.randomizedtesting.RandomizedRunner$5.evaluate(RandomizedRunner.java:693)
		at com.carrotsearch.randomizedtesting.rules.StatementAdapter.evaluate(StatementAdapter.java:36)
		at com.carrotsearch.randomizedtesting.rules.SystemPropertiesRestoreRule$1.evaluate(SystemPropertiesRestoreRule.java:53)
		at org.apache.lucene.util.AbstractBeforeAfterRule$1.evaluate(AbstractBeforeAfterRule.java:45)
		at org.apache.lucene.util.TestRuleStoreClassName$1.evaluate(TestRuleStoreClassName.java:42)
		at com.carrotsearch.randomizedtesting.rules.SystemPropertiesInvariantRule$1.evaluate(SystemPropertiesInvariantRule.java:55)
		at com.carrotsearch.randomizedtesting.rules.NoShadowingOrOverridesOnMethodsRule$1.evaluate(NoShadowingOrOverridesOnMethodsRule.java:39)
		at com.carrotsearch.randomizedtesting.rules.NoShadowingOrOverridesOnMethodsRule$1.evaluate(NoShadowingOrOverridesOnMethodsRule.java:39)
		at org.apache.lucene.util.TestRuleAssertionsRequired$1.evaluate(TestRuleAssertionsRequired.java:40)
		at org.apache.lucene.util.TestRuleMarkFailure$1.evaluate(TestRuleMarkFailure.java:48)
		at org.apache.lucene.util.TestRuleIgnoreAfterMaxFailures$1.evaluate(TestRuleIgnoreAfterMaxFailures.java:70)
		at org.apache.lucene.util.TestRuleIgnoreTestSuites$1.evaluate(TestRuleIgnoreTestSuites.java:55)
		at com.carrotsearch.randomizedtesting.rules.StatementAdapter.evaluate(StatementAdapter.java:36)
		at com.carrotsearch.randomizedtesting.ThreadLeakControl$StatementRunner.run(ThreadLeakControl.java:345)
		at java.lang.Thread.run(Thread.java:679)
	
2690 T2386 C9 oasc.SolrException.log SEVERE org.apache.solr.common.SolrException: range facet infinite loop: gap is either zero, or too small relative start/end and caused underflow: 23.0 + 0 = 23.0
		at org.apache.solr.request.SimpleFacets.getFacetRangeCounts(SimpleFacets.java:1122)
		at org.apache.solr.request.SimpleFacets.getFacetRangeCounts(SimpleFacets.java:1074)
		at org.apache.solr.request.SimpleFacets.getFacetRangeCounts(SimpleFacets.java:1018)
		at org.apache.solr.request.SimpleFacets.getFacetCounts(SimpleFacets.java:208)
		at org.apache.solr.handler.component.FacetComponent.process(FacetComponent.java:87)
		at org.apache.solr.handler.component.SearchHandler.handleRequestBody(SearchHandler.java:206)
		at org.apache.solr.handler.RequestHandlerBase.handleRequest(RequestHandlerBase.java:129)
		at org.apache.solr.core.SolrCore.execute(SolrCore.java:1692)
		at org.apache.solr.util.TestHarness.query(TestHarness.java:351)
		at org.apache.solr.util.TestHarness.query(TestHarness.java:333)
		at org.apache.solr.SolrTestCaseJ4.assertQEx(SolrTestCaseJ4.java:601)
		at org.apache.solr.request.SimpleFacetsTest.testRangeFacetInfiniteLoopDetection(SimpleFacetsTest.java:2018)
		at sun.reflect.NativeMethodAccessorImpl.invoke0(Native Method)
		at sun.reflect.NativeMethodAccessorImpl.invoke(NativeMethodAccessorImpl.java:57)
		at sun.reflect.DelegatingMethodAccessorImpl.invoke(DelegatingMethodAccessorImpl.java:43)
		at java.lang.reflect.Method.invoke(Method.java:616)
		at com.carrotsearch.randomizedtesting.RandomizedRunner.invoke(RandomizedRunner.java:1559)
		at com.carrotsearch.randomizedtesting.RandomizedRunner.access$600(RandomizedRunner.java:79)
		at com.carrotsearch.randomizedtesting.RandomizedRunner$6.evaluate(RandomizedRunner.java:737)
		at com.carrotsearch.randomizedtesting.RandomizedRunner$7.evaluate(RandomizedRunner.java:773)
		at com.carrotsearch.randomizedtesting.RandomizedRunner$8.evaluate(RandomizedRunner.java:787)
		at com.carrotsearch.randomizedtesting.rules.SystemPropertiesRestoreRule$1.evaluate(SystemPropertiesRestoreRule.java:53)
		at org.apache.lucene.util.TestRuleSetupTeardownChained$1.evaluate(TestRuleSetupTeardownChained.java:50)
		at org.apache.lucene.util.TestRuleFieldCacheSanity$1.evaluate(TestRuleFieldCacheSanity.java:51)
		at org.apache.lucene.util.AbstractBeforeAfterRule$1.evaluate(AbstractBeforeAfterRule.java:45)
		at com.carrotsearch.randomizedtesting.rules.SystemPropertiesInvariantRule$1.evaluate(SystemPropertiesInvariantRule.java:55)
		at org.apache.lucene.util.TestRuleThreadAndTestName$1.evaluate(TestRuleThreadAndTestName.java:48)
		at org.apache.lucene.util.TestRuleIgnoreAfterMaxFailures$1.evaluate(TestRuleIgnoreAfterMaxFailures.java:70)
		at org.apache.lucene.util.TestRuleMarkFailure$1.evaluate(TestRuleMarkFailure.java:48)
		at com.carrotsearch.randomizedtesting.rules.StatementAdapter.evaluate(StatementAdapter.java:36)
		at com.carrotsearch.randomizedtesting.ThreadLeakControl$StatementRunner.run(ThreadLeakControl.java:345)
		at com.carrotsearch.randomizedtesting.ThreadLeakControl.forkTimeoutingTask(ThreadLeakControl.java:769)
		at com.carrotsearch.randomizedtesting.ThreadLeakControl$3.evaluate(ThreadLeakControl.java:429)
		at com.carrotsearch.randomizedtesting.RandomizedRunner.runSingleTest(RandomizedRunner.java:746)
		at com.carrotsearch.randomizedtesting.RandomizedRunner$3.evaluate(RandomizedRunner.java:648)
		at com.carrotsearch.randomizedtesting.RandomizedRunner$4.evaluate(RandomizedRunner.java:682)
		at com.carrotsearch.randomizedtesting.RandomizedRunner$5.evaluate(RandomizedRunner.java:693)
		at com.carrotsearch.randomizedtesting.rules.StatementAdapter.evaluate(StatementAdapter.java:36)
		at com.carrotsearch.randomizedtesting.rules.SystemPropertiesRestoreRule$1.evaluate(SystemPropertiesRestoreRule.java:53)
		at org.apache.lucene.util.AbstractBeforeAfterRule$1.evaluate(AbstractBeforeAfterRule.java:45)
		at org.apache.lucene.util.TestRuleStoreClassName$1.evaluate(TestRuleStoreClassName.java:42)
		at com.carrotsearch.randomizedtesting.rules.SystemPropertiesInvariantRule$1.evaluate(SystemPropertiesInvariantRule.java:55)
		at com.carrotsearch.randomizedtesting.rules.NoShadowingOrOverridesOnMethodsRule$1.evaluate(NoShadowingOrOverridesOnMethodsRule.java:39)
		at com.carrotsearch.randomizedtesting.rules.NoShadowingOrOverridesOnMethodsRule$1.evaluate(NoShadowingOrOverridesOnMethodsRule.java:39)
		at org.apache.lucene.util.TestRuleAssertionsRequired$1.evaluate(TestRuleAssertionsRequired.java:40)
		at org.apache.lucene.util.TestRuleMarkFailure$1.evaluate(TestRuleMarkFailure.java:48)
		at org.apache.lucene.util.TestRuleIgnoreAfterMaxFailures$1.evaluate(TestRuleIgnoreAfterMaxFailures.java:70)
		at org.apache.lucene.util.TestRuleIgnoreTestSuites$1.evaluate(TestRuleIgnoreTestSuites.java:55)
		at com.carrotsearch.randomizedtesting.rules.StatementAdapter.evaluate(StatementAdapter.java:36)
		at com.carrotsearch.randomizedtesting.ThreadLeakControl$StatementRunner.run(ThreadLeakControl.java:345)
		at java.lang.Thread.run(Thread.java:679)
	
2690 T2386 C9 oasc.SolrException.log SEVERE org.apache.solr.common.SolrException: range facet infinite loop: gap is either zero, or too small relative start/end and caused underflow: 23.0 + 0 = 23.0
		at org.apache.solr.request.SimpleFacets.getFacetRangeCounts(SimpleFacets.java:1122)
		at org.apache.solr.request.SimpleFacets.getFacetRangeCounts(SimpleFacets.java:1074)
		at org.apache.solr.request.SimpleFacets.getFacetRangeCounts(SimpleFacets.java:1018)
		at org.apache.solr.request.SimpleFacets.getFacetCounts(SimpleFacets.java:208)
		at org.apache.solr.handler.component.FacetComponent.process(FacetComponent.java:87)
		at org.apache.solr.handler.component.SearchHandler.handleRequestBody(SearchHandler.java:206)
		at org.apache.solr.handler.RequestHandlerBase.handleRequest(RequestHandlerBase.java:129)
		at org.apache.solr.core.SolrCore.execute(SolrCore.java:1692)
		at org.apache.solr.util.TestHarness.query(TestHarness.java:351)
		at org.apache.solr.util.TestHarness.query(TestHarness.java:333)
		at org.apache.solr.SolrTestCaseJ4.assertQEx(SolrTestCaseJ4.java:601)
		at org.apache.solr.request.SimpleFacetsTest.testRangeFacetInfiniteLoopDetection(SimpleFacetsTest.java:2018)
		at sun.reflect.NativeMethodAccessorImpl.invoke0(Native Method)
		at sun.reflect.NativeMethodAccessorImpl.invoke(NativeMethodAccessorImpl.java:57)
		at sun.reflect.DelegatingMethodAccessorImpl.invoke(DelegatingMethodAccessorImpl.java:43)
		at java.lang.reflect.Method.invoke(Method.java:616)
		at com.carrotsearch.randomizedtesting.RandomizedRunner.invoke(RandomizedRunner.java:1559)
		at com.carrotsearch.randomizedtesting.RandomizedRunner.access$600(RandomizedRunner.java:79)
		at com.carrotsearch.randomizedtesting.RandomizedRunner$6.evaluate(RandomizedRunner.java:737)
		at com.carrotsearch.randomizedtesting.RandomizedRunner$7.evaluate(RandomizedRunner.java:773)
		at com.carrotsearch.randomizedtesting.RandomizedRunner$8.evaluate(RandomizedRunner.java:787)
		at com.carrotsearch.randomizedtesting.rules.SystemPropertiesRestoreRule$1.evaluate(SystemPropertiesRestoreRule.java:53)
		at org.apache.lucene.util.TestRuleSetupTeardownChained$1.evaluate(TestRuleSetupTeardownChained.java:50)
		at org.apache.lucene.util.TestRuleFieldCacheSanity$1.evaluate(TestRuleFieldCacheSanity.java:51)
		at org.apache.lucene.util.AbstractBeforeAfterRule$1.evaluate(AbstractBeforeAfterRule.java:45)
		at com.carrotsearch.randomizedtesting.rules.SystemPropertiesInvariantRule$1.evaluate(SystemPropertiesInvariantRule.java:55)
		at org.apache.lucene.util.TestRuleThreadAndTestName$1.evaluate(TestRuleThreadAndTestName.java:48)
		at org.apache.lucene.util.TestRuleIgnoreAfterMaxFailures$1.evaluate(TestRuleIgnoreAfterMaxFailures.java:70)
		at org.apache.lucene.util.TestRuleMarkFailure$1.evaluate(TestRuleMarkFailure.java:48)
		at com.carrotsearch.randomizedtesting.rules.StatementAdapter.evaluate(StatementAdapter.java:36)
		at com.carrotsearch.randomizedtesting.ThreadLeakControl$StatementRunner.run(ThreadLeakControl.java:345)
		at com.carrotsearch.randomizedtesting.ThreadLeakControl.forkTimeoutingTask(ThreadLeakControl.java:769)
		at com.carrotsearch.randomizedtesting.ThreadLeakControl$3.evaluate(ThreadLeakControl.java:429)
		at com.carrotsearch.randomizedtesting.RandomizedRunner.runSingleTest(RandomizedRunner.java:746)
		at com.carrotsearch.randomizedtesting.RandomizedRunner$3.evaluate(RandomizedRunner.java:648)
		at com.carrotsearch.randomizedtesting.RandomizedRunner$4.evaluate(RandomizedRunner.java:682)
		at com.carrotsearch.randomizedtesting.RandomizedRunner$5.evaluate(RandomizedRunner.java:693)
		at com.carrotsearch.randomizedtesting.rules.StatementAdapter.evaluate(StatementAdapter.java:36)
		at com.carrotsearch.randomizedtesting.rules.SystemPropertiesRestoreRule$1.evaluate(SystemPropertiesRestoreRule.java:53)
		at org.apache.lucene.util.AbstractBeforeAfterRule$1.evaluate(AbstractBeforeAfterRule.java:45)
		at org.apache.lucene.util.TestRuleStoreClassName$1.evaluate(TestRuleStoreClassName.java:42)
		at com.carrotsearch.randomizedtesting.rules.SystemPropertiesInvariantRule$1.evaluate(SystemPropertiesInvariantRule.java:55)
		at com.carrotsearch.randomizedtesting.rules.NoShadowingOrOverridesOnMethodsRule$1.evaluate(NoShadowingOrOverridesOnMethodsRule.java:39)
		at com.carrotsearch.randomizedtesting.rules.NoShadowingOrOverridesOnMethodsRule$1.evaluate(NoShadowingOrOverridesOnMethodsRule.java:39)
		at org.apache.lucene.util.TestRuleAssertionsRequired$1.evaluate(TestRuleAssertionsRequired.java:40)
		at org.apache.lucene.util.TestRuleMarkFailure$1.evaluate(TestRuleMarkFailure.java:48)
		at org.apache.lucene.util.TestRuleIgnoreAfterMaxFailures$1.evaluate(TestRuleIgnoreAfterMaxFailures.java:70)
		at org.apache.lucene.util.TestRuleIgnoreTestSuites$1.evaluate(TestRuleIgnoreTestSuites.java:55)
		at com.carrotsearch.randomizedtesting.rules.StatementAdapter.evaluate(StatementAdapter.java:36)
		at com.carrotsearch.randomizedtesting.ThreadLeakControl$StatementRunner.run(ThreadLeakControl.java:345)
		at java.lang.Thread.run(Thread.java:679)
	
2691 T2386 C9 oasc.SolrException.log SEVERE org.apache.solr.common.SolrException: range facet infinite loop: gap is either zero, or too small relative start/end and caused underflow: 23.0 + 0 = 23.0
		at org.apache.solr.request.SimpleFacets.getFacetRangeCounts(SimpleFacets.java:1122)
		at org.apache.solr.request.SimpleFacets.getFacetRangeCounts(SimpleFacets.java:1074)
		at org.apache.solr.request.SimpleFacets.getFacetRangeCounts(SimpleFacets.java:1018)
		at org.apache.solr.request.SimpleFacets.getFacetCounts(SimpleFacets.java:208)
		at org.apache.solr.handler.component.FacetComponent.process(FacetComponent.java:87)
		at org.apache.solr.handler.component.SearchHandler.handleRequestBody(SearchHandler.java:206)
		at org.apache.solr.handler.RequestHandlerBase.handleRequest(RequestHandlerBase.java:129)
		at org.apache.solr.core.SolrCore.execute(SolrCore.java:1692)
		at org.apache.solr.util.TestHarness.query(TestHarness.java:351)
		at org.apache.solr.util.TestHarness.query(TestHarness.java:333)
		at org.apache.solr.SolrTestCaseJ4.assertQEx(SolrTestCaseJ4.java:601)
		at org.apache.solr.request.SimpleFacetsTest.testRangeFacetInfiniteLoopDetection(SimpleFacetsTest.java:2018)
		at sun.reflect.NativeMethodAccessorImpl.invoke0(Native Method)
		at sun.reflect.NativeMethodAccessorImpl.invoke(NativeMethodAccessorImpl.java:57)
		at sun.reflect.DelegatingMethodAccessorImpl.invoke(DelegatingMethodAccessorImpl.java:43)
		at java.lang.reflect.Method.invoke(Method.java:616)
		at com.carrotsearch.randomizedtesting.RandomizedRunner.invoke(RandomizedRunner.java:1559)
		at com.carrotsearch.randomizedtesting.RandomizedRunner.access$600(RandomizedRunner.java:79)
		at com.carrotsearch.randomizedtesting.RandomizedRunner$6.evaluate(RandomizedRunner.java:737)
		at com.carrotsearch.randomizedtesting.RandomizedRunner$7.evaluate(RandomizedRunner.java:773)
		at com.carrotsearch.randomizedtesting.RandomizedRunner$8.evaluate(RandomizedRunner.java:787)
		at com.carrotsearch.randomizedtesting.rules.SystemPropertiesRestoreRule$1.evaluate(SystemPropertiesRestoreRule.java:53)
		at org.apache.lucene.util.TestRuleSetupTeardownChained$1.evaluate(TestRuleSetupTeardownChained.java:50)
		at org.apache.lucene.util.TestRuleFieldCacheSanity$1.evaluate(TestRuleFieldCacheSanity.java:51)
		at org.apache.lucene.util.AbstractBeforeAfterRule$1.evaluate(AbstractBeforeAfterRule.java:45)
		at com.carrotsearch.randomizedtesting.rules.SystemPropertiesInvariantRule$1.evaluate(SystemPropertiesInvariantRule.java:55)
		at org.apache.lucene.util.TestRuleThreadAndTestName$1.evaluate(TestRuleThreadAndTestName.java:48)
		at org.apache.lucene.util.TestRuleIgnoreAfterMaxFailures$1.evaluate(TestRuleIgnoreAfterMaxFailures.java:70)
		at org.apache.lucene.util.TestRuleMarkFailure$1.evaluate(TestRuleMarkFailure.java:48)
		at com.carrotsearch.randomizedtesting.rules.StatementAdapter.evaluate(StatementAdapter.java:36)
		at com.carrotsearch.randomizedtesting.ThreadLeakControl$StatementRunner.run(ThreadLeakControl.java:345)
		at com.carrotsearch.randomizedtesting.ThreadLeakControl.forkTimeoutingTask(ThreadLeakControl.java:769)
		at com.carrotsearch.randomizedtesting.ThreadLeakControl$3.evaluate(ThreadLeakControl.java:429)
		at com.carrotsearch.randomizedtesting.RandomizedRunner.runSingleTest(RandomizedRunner.java:746)
		at com.carrotsearch.randomizedtesting.RandomizedRunner$3.evaluate(RandomizedRunner.java:648)
		at com.carrotsearch.randomizedtesting.RandomizedRunner$4.evaluate(RandomizedRunner.java:682)
		at com.carrotsearch.randomizedtesting.RandomizedRunner$5.evaluate(RandomizedRunner.java:693)
		at com.carrotsearch.randomizedtesting.rules.StatementAdapter.evaluate(StatementAdapter.java:36)
		at com.carrotsearch.randomizedtesting.rules.SystemPropertiesRestoreRule$1.evaluate(SystemPropertiesRestoreRule.java:53)
		at org.apache.lucene.util.AbstractBeforeAfterRule$1.evaluate(AbstractBeforeAfterRule.java:45)
		at org.apache.lucene.util.TestRuleStoreClassName$1.evaluate(TestRuleStoreClassName.java:42)
		at com.carrotsearch.randomizedtesting.rules.SystemPropertiesInvariantRule$1.evaluate(SystemPropertiesInvariantRule.java:55)
		at com.carrotsearch.randomizedtesting.rules.NoShadowingOrOverridesOnMethodsRule$1.evaluate(NoShadowingOrOverridesOnMethodsRule.java:39)
		at com.carrotsearch.randomizedtesting.rules.NoShadowingOrOverridesOnMethodsRule$1.evaluate(NoShadowingOrOverridesOnMethodsRule.java:39)
		at org.apache.lucene.util.TestRuleAssertionsRequired$1.evaluate(TestRuleAssertionsRequired.java:40)
		at org.apache.lucene.util.TestRuleMarkFailure$1.evaluate(TestRuleMarkFailure.java:48)
		at org.apache.lucene.util.TestRuleIgnoreAfterMaxFailures$1.evaluate(TestRuleIgnoreAfterMaxFailures.java:70)
		at org.apache.lucene.util.TestRuleIgnoreTestSuites$1.evaluate(TestRuleIgnoreTestSuites.java:55)
		at com.carrotsearch.randomizedtesting.rules.StatementAdapter.evaluate(StatementAdapter.java:36)
		at com.carrotsearch.randomizedtesting.ThreadLeakControl$StatementRunner.run(ThreadLeakControl.java:345)
		at java.lang.Thread.run(Thread.java:679)
	
2691 T2386 C9 oasc.SolrException.log SEVERE org.apache.solr.common.SolrException: range facet infinite loop: gap is either zero, or too small relative start/end and caused underflow: 23.0 + 0 = 23.0
		at org.apache.solr.request.SimpleFacets.getFacetRangeCounts(SimpleFacets.java:1122)
		at org.apache.solr.request.SimpleFacets.getFacetRangeCounts(SimpleFacets.java:1074)
		at org.apache.solr.request.SimpleFacets.getFacetRangeCounts(SimpleFacets.java:1018)
		at org.apache.solr.request.SimpleFacets.getFacetCounts(SimpleFacets.java:208)
		at org.apache.solr.handler.component.FacetComponent.process(FacetComponent.java:87)
		at org.apache.solr.handler.component.SearchHandler.handleRequestBody(SearchHandler.java:206)
		at org.apache.solr.handler.RequestHandlerBase.handleRequest(RequestHandlerBase.java:129)
		at org.apache.solr.core.SolrCore.execute(SolrCore.java:1692)
		at org.apache.solr.util.TestHarness.query(TestHarness.java:351)
		at org.apache.solr.util.TestHarness.query(TestHarness.java:333)
		at org.apache.solr.SolrTestCaseJ4.assertQEx(SolrTestCaseJ4.java:601)
		at org.apache.solr.request.SimpleFacetsTest.testRangeFacetInfiniteLoopDetection(SimpleFacetsTest.java:2018)
		at sun.reflect.NativeMethodAccessorImpl.invoke0(Native Method)
		at sun.reflect.NativeMethodAccessorImpl.invoke(NativeMethodAccessorImpl.java:57)
		at sun.reflect.DelegatingMethodAccessorImpl.invoke(DelegatingMethodAccessorImpl.java:43)
		at java.lang.reflect.Method.invoke(Method.java:616)
		at com.carrotsearch.randomizedtesting.RandomizedRunner.invoke(RandomizedRunner.java:1559)
		at com.carrotsearch.randomizedtesting.RandomizedRunner.access$600(RandomizedRunner.java:79)
		at com.carrotsearch.randomizedtesting.RandomizedRunner$6.evaluate(RandomizedRunner.java:737)
		at com.carrotsearch.randomizedtesting.RandomizedRunner$7.evaluate(RandomizedRunner.java:773)
		at com.carrotsearch.randomizedtesting.RandomizedRunner$8.evaluate(RandomizedRunner.java:787)
		at com.carrotsearch.randomizedtesting.rules.SystemPropertiesRestoreRule$1.evaluate(SystemPropertiesRestoreRule.java:53)
		at org.apache.lucene.util.TestRuleSetupTeardownChained$1.evaluate(TestRuleSetupTeardownChained.java:50)
		at org.apache.lucene.util.TestRuleFieldCacheSanity$1.evaluate(TestRuleFieldCacheSanity.java:51)
		at org.apache.lucene.util.AbstractBeforeAfterRule$1.evaluate(AbstractBeforeAfterRule.java:45)
		at com.carrotsearch.randomizedtesting.rules.SystemPropertiesInvariantRule$1.evaluate(SystemPropertiesInvariantRule.java:55)
		at org.apache.lucene.util.TestRuleThreadAndTestName$1.evaluate(TestRuleThreadAndTestName.java:48)
		at org.apache.lucene.util.TestRuleIgnoreAfterMaxFailures$1.evaluate(TestRuleIgnoreAfterMaxFailures.java:70)
		at org.apache.lucene.util.TestRuleMarkFailure$1.evaluate(TestRuleMarkFailure.java:48)
		at com.carrotsearch.randomizedtesting.rules.StatementAdapter.evaluate(StatementAdapter.java:36)
		at com.carrotsearch.randomizedtesting.ThreadLeakControl$StatementRunner.run(ThreadLeakControl.java:345)
		at com.carrotsearch.randomizedtesting.ThreadLeakControl.forkTimeoutingTask(ThreadLeakControl.java:769)
		at com.carrotsearch.randomizedtesting.ThreadLeakControl$3.evaluate(ThreadLeakControl.java:429)
		at com.carrotsearch.randomizedtesting.RandomizedRunner.runSingleTest(RandomizedRunner.java:746)
		at com.carrotsearch.randomizedtesting.RandomizedRunner$3.evaluate(RandomizedRunner.java:648)
		at com.carrotsearch.randomizedtesting.RandomizedRunner$4.evaluate(RandomizedRunner.java:682)
		at com.carrotsearch.randomizedtesting.RandomizedRunner$5.evaluate(RandomizedRunner.java:693)
		at com.carrotsearch.randomizedtesting.rules.StatementAdapter.evaluate(StatementAdapter.java:36)
		at com.carrotsearch.randomizedtesting.rules.SystemPropertiesRestoreRule$1.evaluate(SystemPropertiesRestoreRule.java:53)
		at org.apache.lucene.util.AbstractBeforeAfterRule$1.evaluate(AbstractBeforeAfterRule.java:45)
		at org.apache.lucene.util.TestRuleStoreClassName$1.evaluate(TestRuleStoreClassName.java:42)
		at com.carrotsearch.randomizedtesting.rules.SystemPropertiesInvariantRule$1.evaluate(SystemPropertiesInvariantRule.java:55)
		at com.carrotsearch.randomizedtesting.rules.NoShadowingOrOverridesOnMethodsRule$1.evaluate(NoShadowingOrOverridesOnMethodsRule.java:39)
		at com.carrotsearch.randomizedtesting.rules.NoShadowingOrOverridesOnMethodsRule$1.evaluate(NoShadowingOrOverridesOnMethodsRule.java:39)
		at org.apache.lucene.util.TestRuleAssertionsRequired$1.evaluate(TestRuleAssertionsRequired.java:40)
		at org.apache.lucene.util.TestRuleMarkFailure$1.evaluate(TestRuleMarkFailure.java:48)
		at org.apache.lucene.util.TestRuleIgnoreAfterMaxFailures$1.evaluate(TestRuleIgnoreAfterMaxFailures.java:70)
		at org.apache.lucene.util.TestRuleIgnoreTestSuites$1.evaluate(TestRuleIgnoreTestSuites.java:55)
		at com.carrotsearch.randomizedtesting.rules.StatementAdapter.evaluate(StatementAdapter.java:36)
		at com.carrotsearch.randomizedtesting.ThreadLeakControl$StatementRunner.run(ThreadLeakControl.java:345)
		at java.lang.Thread.run(Thread.java:679)
	
2692 T2386 C9 oasc.SolrException.log SEVERE org.apache.solr.common.SolrException: range facet infinite loop: gap is either zero, or too small relative start/end and caused underflow: 23 + 0 = 23
		at org.apache.solr.request.SimpleFacets.getFacetRangeCounts(SimpleFacets.java:1122)
		at org.apache.solr.request.SimpleFacets.getFacetRangeCounts(SimpleFacets.java:1074)
		at org.apache.solr.request.SimpleFacets.getFacetRangeCounts(SimpleFacets.java:1018)
		at org.apache.solr.request.SimpleFacets.getFacetCounts(SimpleFacets.java:208)
		at org.apache.solr.handler.component.FacetComponent.process(FacetComponent.java:87)
		at org.apache.solr.handler.component.SearchHandler.handleRequestBody(SearchHandler.java:206)
		at org.apache.solr.handler.RequestHandlerBase.handleRequest(RequestHandlerBase.java:129)
		at org.apache.solr.core.SolrCore.execute(SolrCore.java:1692)
		at org.apache.solr.util.TestHarness.query(TestHarness.java:351)
		at org.apache.solr.util.TestHarness.query(TestHarness.java:333)
		at org.apache.solr.SolrTestCaseJ4.assertQEx(SolrTestCaseJ4.java:601)
		at org.apache.solr.request.SimpleFacetsTest.testRangeFacetInfiniteLoopDetection(SimpleFacetsTest.java:2018)
		at sun.reflect.NativeMethodAccessorImpl.invoke0(Native Method)
		at sun.reflect.NativeMethodAccessorImpl.invoke(NativeMethodAccessorImpl.java:57)
		at sun.reflect.DelegatingMethodAccessorImpl.invoke(DelegatingMethodAccessorImpl.java:43)
		at java.lang.reflect.Method.invoke(Method.java:616)
		at com.carrotsearch.randomizedtesting.RandomizedRunner.invoke(RandomizedRunner.java:1559)
		at com.carrotsearch.randomizedtesting.RandomizedRunner.access$600(RandomizedRunner.java:79)
		at com.carrotsearch.randomizedtesting.RandomizedRunner$6.evaluate(RandomizedRunner.java:737)
		at com.carrotsearch.randomizedtesting.RandomizedRunner$7.evaluate(RandomizedRunner.java:773)
		at com.carrotsearch.randomizedtesting.RandomizedRunner$8.evaluate(RandomizedRunner.java:787)
		at com.carrotsearch.randomizedtesting.rules.SystemPropertiesRestoreRule$1.evaluate(SystemPropertiesRestoreRule.java:53)
		at org.apache.lucene.util.TestRuleSetupTeardownChained$1.evaluate(TestRuleSetupTeardownChained.java:50)
		at org.apache.lucene.util.TestRuleFieldCacheSanity$1.evaluate(TestRuleFieldCacheSanity.java:51)
		at org.apache.lucene.util.AbstractBeforeAfterRule$1.evaluate(AbstractBeforeAfterRule.java:45)
		at com.carrotsearch.randomizedtesting.rules.SystemPropertiesInvariantRule$1.evaluate(SystemPropertiesInvariantRule.java:55)
		at org.apache.lucene.util.TestRuleThreadAndTestName$1.evaluate(TestRuleThreadAndTestName.java:48)
		at org.apache.lucene.util.TestRuleIgnoreAfterMaxFailures$1.evaluate(TestRuleIgnoreAfterMaxFailures.java:70)
		at org.apache.lucene.util.TestRuleMarkFailure$1.evaluate(TestRuleMarkFailure.java:48)
		at com.carrotsearch.randomizedtesting.rules.StatementAdapter.evaluate(StatementAdapter.java:36)
		at com.carrotsearch.randomizedtesting.ThreadLeakControl$StatementRunner.run(ThreadLeakControl.java:345)
		at com.carrotsearch.randomizedtesting.ThreadLeakControl.forkTimeoutingTask(ThreadLeakControl.java:769)
		at com.carrotsearch.randomizedtesting.ThreadLeakControl$3.evaluate(ThreadLeakControl.java:429)
		at com.carrotsearch.randomizedtesting.RandomizedRunner.runSingleTest(RandomizedRunner.java:746)
		at com.carrotsearch.randomizedtesting.RandomizedRunner$3.evaluate(RandomizedRunner.java:648)
		at com.carrotsearch.randomizedtesting.RandomizedRunner$4.evaluate(RandomizedRunner.java:682)
		at com.carrotsearch.randomizedtesting.RandomizedRunner$5.evaluate(RandomizedRunner.java:693)
		at com.carrotsearch.randomizedtesting.rules.StatementAdapter.evaluate(StatementAdapter.java:36)
		at com.carrotsearch.randomizedtesting.rules.SystemPropertiesRestoreRule$1.evaluate(SystemPropertiesRestoreRule.java:53)
		at org.apache.lucene.util.AbstractBeforeAfterRule$1.evaluate(AbstractBeforeAfterRule.java:45)
		at org.apache.lucene.util.TestRuleStoreClassName$1.evaluate(TestRuleStoreClassName.java:42)
		at com.carrotsearch.randomizedtesting.rules.SystemPropertiesInvariantRule$1.evaluate(SystemPropertiesInvariantRule.java:55)
		at com.carrotsearch.randomizedtesting.rules.NoShadowingOrOverridesOnMethodsRule$1.evaluate(NoShadowingOrOverridesOnMethodsRule.java:39)
		at com.carrotsearch.randomizedtesting.rules.NoShadowingOrOverridesOnMethodsRule$1.evaluate(NoShadowingOrOverridesOnMethodsRule.java:39)
		at org.apache.lucene.util.TestRuleAssertionsRequired$1.evaluate(TestRuleAssertionsRequired.java:40)
		at org.apache.lucene.util.TestRuleMarkFailure$1.evaluate(TestRuleMarkFailure.java:48)
		at org.apache.lucene.util.TestRuleIgnoreAfterMaxFailures$1.evaluate(TestRuleIgnoreAfterMaxFailures.java:70)
		at org.apache.lucene.util.TestRuleIgnoreTestSuites$1.evaluate(TestRuleIgnoreTestSuites.java:55)
		at com.carrotsearch.randomizedtesting.rules.StatementAdapter.evaluate(StatementAdapter.java:36)
		at com.carrotsearch.randomizedtesting.ThreadLeakControl$StatementRunner.run(ThreadLeakControl.java:345)
		at java.lang.Thread.run(Thread.java:679)
	
2693 T2386 C9 oasc.SolrException.log SEVERE org.apache.solr.common.SolrException: range facet infinite loop: gap is either zero, or too small relative start/end and caused underflow: 23 + 0 = 23
		at org.apache.solr.request.SimpleFacets.getFacetRangeCounts(SimpleFacets.java:1122)
		at org.apache.solr.request.SimpleFacets.getFacetRangeCounts(SimpleFacets.java:1074)
		at org.apache.solr.request.SimpleFacets.getFacetRangeCounts(SimpleFacets.java:1018)
		at org.apache.solr.request.SimpleFacets.getFacetCounts(SimpleFacets.java:208)
		at org.apache.solr.handler.component.FacetComponent.process(FacetComponent.java:87)
		at org.apache.solr.handler.component.SearchHandler.handleRequestBody(SearchHandler.java:206)
		at org.apache.solr.handler.RequestHandlerBase.handleRequest(RequestHandlerBase.java:129)
		at org.apache.solr.core.SolrCore.execute(SolrCore.java:1692)
		at org.apache.solr.util.TestHarness.query(TestHarness.java:351)
		at org.apache.solr.util.TestHarness.query(TestHarness.java:333)
		at org.apache.solr.SolrTestCaseJ4.assertQEx(SolrTestCaseJ4.java:601)
		at org.apache.solr.request.SimpleFacetsTest.testRangeFacetInfiniteLoopDetection(SimpleFacetsTest.java:2018)
		at sun.reflect.NativeMethodAccessorImpl.invoke0(Native Method)
		at sun.reflect.NativeMethodAccessorImpl.invoke(NativeMethodAccessorImpl.java:57)
		at sun.reflect.DelegatingMethodAccessorImpl.invoke(DelegatingMethodAccessorImpl.java:43)
		at java.lang.reflect.Method.invoke(Method.java:616)
		at com.carrotsearch.randomizedtesting.RandomizedRunner.invoke(RandomizedRunner.java:1559)
		at com.carrotsearch.randomizedtesting.RandomizedRunner.access$600(RandomizedRunner.java:79)
		at com.carrotsearch.randomizedtesting.RandomizedRunner$6.evaluate(RandomizedRunner.java:737)
		at com.carrotsearch.randomizedtesting.RandomizedRunner$7.evaluate(RandomizedRunner.java:773)
		at com.carrotsearch.randomizedtesting.RandomizedRunner$8.evaluate(RandomizedRunner.java:787)
		at com.carrotsearch.randomizedtesting.rules.SystemPropertiesRestoreRule$1.evaluate(SystemPropertiesRestoreRule.java:53)
		at org.apache.lucene.util.TestRuleSetupTeardownChained$1.evaluate(TestRuleSetupTeardownChained.java:50)
		at org.apache.lucene.util.TestRuleFieldCacheSanity$1.evaluate(TestRuleFieldCacheSanity.java:51)
		at org.apache.lucene.util.AbstractBeforeAfterRule$1.evaluate(AbstractBeforeAfterRule.java:45)
		at com.carrotsearch.randomizedtesting.rules.SystemPropertiesInvariantRule$1.evaluate(SystemPropertiesInvariantRule.java:55)
		at org.apache.lucene.util.TestRuleThreadAndTestName$1.evaluate(TestRuleThreadAndTestName.java:48)
		at org.apache.lucene.util.TestRuleIgnoreAfterMaxFailures$1.evaluate(TestRuleIgnoreAfterMaxFailures.java:70)
		at org.apache.lucene.util.TestRuleMarkFailure$1.evaluate(TestRuleMarkFailure.java:48)
		at com.carrotsearch.randomizedtesting.rules.StatementAdapter.evaluate(StatementAdapter.java:36)
		at com.carrotsearch.randomizedtesting.ThreadLeakControl$StatementRunner.run(ThreadLeakControl.java:345)
		at com.carrotsearch.randomizedtesting.ThreadLeakControl.forkTimeoutingTask(ThreadLeakControl.java:769)
		at com.carrotsearch.randomizedtesting.ThreadLeakControl$3.evaluate(ThreadLeakControl.java:429)
		at com.carrotsearch.randomizedtesting.RandomizedRunner.runSingleTest(RandomizedRunner.java:746)
		at com.carrotsearch.randomizedtesting.RandomizedRunner$3.evaluate(RandomizedRunner.java:648)
		at com.carrotsearch.randomizedtesting.RandomizedRunner$4.evaluate(RandomizedRunner.java:682)
		at com.carrotsearch.randomizedtesting.RandomizedRunner$5.evaluate(RandomizedRunner.java:693)
		at com.carrotsearch.randomizedtesting.rules.StatementAdapter.evaluate(StatementAdapter.java:36)
		at com.carrotsearch.randomizedtesting.rules.SystemPropertiesRestoreRule$1.evaluate(SystemPropertiesRestoreRule.java:53)
		at org.apache.lucene.util.AbstractBeforeAfterRule$1.evaluate(AbstractBeforeAfterRule.java:45)
		at org.apache.lucene.util.TestRuleStoreClassName$1.evaluate(TestRuleStoreClassName.java:42)
		at com.carrotsearch.randomizedtesting.rules.SystemPropertiesInvariantRule$1.evaluate(SystemPropertiesInvariantRule.java:55)
		at com.carrotsearch.randomizedtesting.rules.NoShadowingOrOverridesOnMethodsRule$1.evaluate(NoShadowingOrOverridesOnMethodsRule.java:39)
		at com.carrotsearch.randomizedtesting.rules.NoShadowingOrOverridesOnMethodsRule$1.evaluate(NoShadowingOrOverridesOnMethodsRule.java:39)
		at org.apache.lucene.util.TestRuleAssertionsRequired$1.evaluate(TestRuleAssertionsRequired.java:40)
		at org.apache.lucene.util.TestRuleMarkFailure$1.evaluate(TestRuleMarkFailure.java:48)
		at org.apache.lucene.util.TestRuleIgnoreAfterMaxFailures$1.evaluate(TestRuleIgnoreAfterMaxFailures.java:70)
		at org.apache.lucene.util.TestRuleIgnoreTestSuites$1.evaluate(TestRuleIgnoreTestSuites.java:55)
		at com.carrotsearch.randomizedtesting.rules.StatementAdapter.evaluate(StatementAdapter.java:36)
		at com.carrotsearch.randomizedtesting.ThreadLeakControl$StatementRunner.run(ThreadLeakControl.java:345)
		at java.lang.Thread.run(Thread.java:679)
	
2693 T2386 C9 oasc.SolrException.log SEVERE org.apache.solr.common.SolrException: date facet infinite loop: gap is effectively zero
		at org.apache.solr.request.SimpleFacets.getFacetDateCounts(SimpleFacets.java:928)
		at org.apache.solr.request.SimpleFacets.getFacetDateCounts(SimpleFacets.java:837)
		at org.apache.solr.request.SimpleFacets.getFacetCounts(SimpleFacets.java:207)
		at org.apache.solr.handler.component.FacetComponent.process(FacetComponent.java:87)
		at org.apache.solr.handler.component.SearchHandler.handleRequestBody(SearchHandler.java:206)
		at org.apache.solr.handler.RequestHandlerBase.handleRequest(RequestHandlerBase.java:129)
		at org.apache.solr.core.SolrCore.execute(SolrCore.java:1692)
		at org.apache.solr.util.TestHarness.query(TestHarness.java:351)
		at org.apache.solr.util.TestHarness.query(TestHarness.java:333)
		at org.apache.solr.SolrTestCaseJ4.assertQEx(SolrTestCaseJ4.java:601)
		at org.apache.solr.request.SimpleFacetsTest.testRangeFacetInfiniteLoopDetection(SimpleFacetsTest.java:2029)
		at sun.reflect.NativeMethodAccessorImpl.invoke0(Native Method)
		at sun.reflect.NativeMethodAccessorImpl.invoke(NativeMethodAccessorImpl.java:57)
		at sun.reflect.DelegatingMethodAccessorImpl.invoke(DelegatingMethodAccessorImpl.java:43)
		at java.lang.reflect.Method.invoke(Method.java:616)
		at com.carrotsearch.randomizedtesting.RandomizedRunner.invoke(RandomizedRunner.java:1559)
		at com.carrotsearch.randomizedtesting.RandomizedRunner.access$600(RandomizedRunner.java:79)
		at com.carrotsearch.randomizedtesting.RandomizedRunner$6.evaluate(RandomizedRunner.java:737)
		at com.carrotsearch.randomizedtesting.RandomizedRunner$7.evaluate(RandomizedRunner.java:773)
		at com.carrotsearch.randomizedtesting.RandomizedRunner$8.evaluate(RandomizedRunner.java:787)
		at com.carrotsearch.randomizedtesting.rules.SystemPropertiesRestoreRule$1.evaluate(SystemPropertiesRestoreRule.java:53)
		at org.apache.lucene.util.TestRuleSetupTeardownChained$1.evaluate(TestRuleSetupTeardownChained.java:50)
		at org.apache.lucene.util.TestRuleFieldCacheSanity$1.evaluate(TestRuleFieldCacheSanity.java:51)
		at org.apache.lucene.util.AbstractBeforeAfterRule$1.evaluate(AbstractBeforeAfterRule.java:45)
		at com.carrotsearch.randomizedtesting.rules.SystemPropertiesInvariantRule$1.evaluate(SystemPropertiesInvariantRule.java:55)
		at org.apache.lucene.util.TestRuleThreadAndTestName$1.evaluate(TestRuleThreadAndTestName.java:48)
		at org.apache.lucene.util.TestRuleIgnoreAfterMaxFailures$1.evaluate(TestRuleIgnoreAfterMaxFailures.java:70)
		at org.apache.lucene.util.TestRuleMarkFailure$1.evaluate(TestRuleMarkFailure.java:48)
		at com.carrotsearch.randomizedtesting.rules.StatementAdapter.evaluate(StatementAdapter.java:36)
		at com.carrotsearch.randomizedtesting.ThreadLeakControl$StatementRunner.run(ThreadLeakControl.java:345)
		at com.carrotsearch.randomizedtesting.ThreadLeakControl.forkTimeoutingTask(ThreadLeakControl.java:769)
		at com.carrotsearch.randomizedtesting.ThreadLeakControl$3.evaluate(ThreadLeakControl.java:429)
		at com.carrotsearch.randomizedtesting.RandomizedRunner.runSingleTest(RandomizedRunner.java:746)
		at com.carrotsearch.randomizedtesting.RandomizedRunner$3.evaluate(RandomizedRunner.java:648)
		at com.carrotsearch.randomizedtesting.RandomizedRunner$4.evaluate(RandomizedRunner.java:682)
		at com.carrotsearch.randomizedtesting.RandomizedRunner$5.evaluate(RandomizedRunner.java:693)
		at com.carrotsearch.randomizedtesting.rules.StatementAdapter.evaluate(StatementAdapter.java:36)
		at com.carrotsearch.randomizedtesting.rules.SystemPropertiesRestoreRule$1.evaluate(SystemPropertiesRestoreRule.java:53)
		at org.apache.lucene.util.AbstractBeforeAfterRule$1.evaluate(AbstractBeforeAfterRule.java:45)
		at org.apache.lucene.util.TestRuleStoreClassName$1.evaluate(TestRuleStoreClassName.java:42)
		at com.carrotsearch.randomizedtesting.rules.SystemPropertiesInvariantRule$1.evaluate(SystemPropertiesInvariantRule.java:55)
		at com.carrotsearch.randomizedtesting.rules.NoShadowingOrOverridesOnMethodsRule$1.evaluate(NoShadowingOrOverridesOnMethodsRule.java:39)
		at com.carrotsearch.randomizedtesting.rules.NoShadowingOrOverridesOnMethodsRule$1.evaluate(NoShadowingOrOverridesOnMethodsRule.java:39)
		at org.apache.lucene.util.TestRuleAssertionsRequired$1.evaluate(TestRuleAssertionsRequired.java:40)
		at org.apache.lucene.util.TestRuleMarkFailure$1.evaluate(TestRuleMarkFailure.java:48)
		at org.apache.lucene.util.TestRuleIgnoreAfterMaxFailures$1.evaluate(TestRuleIgnoreAfterMaxFailures.java:70)
		at org.apache.lucene.util.TestRuleIgnoreTestSuites$1.evaluate(TestRuleIgnoreTestSuites.java:55)
		at com.carrotsearch.randomizedtesting.rules.StatementAdapter.evaluate(StatementAdapter.java:36)
		at com.carrotsearch.randomizedtesting.ThreadLeakControl$StatementRunner.run(ThreadLeakControl.java:345)
		at java.lang.Thread.run(Thread.java:679)
	
2694 T2386 C9 oasc.SolrException.log SEVERE org.apache.solr.common.SolrException: range facet infinite loop: gap is either zero, or too small relative start/end and caused underflow: Sat Sep 01 18:48:19 WAT 2012 + +0DAYS = Sat Sep 01 18:48:19 WAT 2012
		at org.apache.solr.request.SimpleFacets.getFacetRangeCounts(SimpleFacets.java:1122)
		at org.apache.solr.request.SimpleFacets.getFacetRangeCounts(SimpleFacets.java:1074)
		at org.apache.solr.request.SimpleFacets.getFacetRangeCounts(SimpleFacets.java:1018)
		at org.apache.solr.request.SimpleFacets.getFacetCounts(SimpleFacets.java:208)
		at org.apache.solr.handler.component.FacetComponent.process(FacetComponent.java:87)
		at org.apache.solr.handler.component.SearchHandler.handleRequestBody(SearchHandler.java:206)
		at org.apache.solr.handler.RequestHandlerBase.handleRequest(RequestHandlerBase.java:129)
		at org.apache.solr.core.SolrCore.execute(SolrCore.java:1692)
		at org.apache.solr.util.TestHarness.query(TestHarness.java:351)
		at org.apache.solr.util.TestHarness.query(TestHarness.java:333)
		at org.apache.solr.SolrTestCaseJ4.assertQEx(SolrTestCaseJ4.java:601)
		at org.apache.solr.request.SimpleFacetsTest.testRangeFacetInfiniteLoopDetection(SimpleFacetsTest.java:2029)
		at sun.reflect.NativeMethodAccessorImpl.invoke0(Native Method)
		at sun.reflect.NativeMethodAccessorImpl.invoke(NativeMethodAccessorImpl.java:57)
		at sun.reflect.DelegatingMethodAccessorImpl.invoke(DelegatingMethodAccessorImpl.java:43)
		at java.lang.reflect.Method.invoke(Method.java:616)
		at com.carrotsearch.randomizedtesting.RandomizedRunner.invoke(RandomizedRunner.java:1559)
		at com.carrotsearch.randomizedtesting.RandomizedRunner.access$600(RandomizedRunner.java:79)
		at com.carrotsearch.randomizedtesting.RandomizedRunner$6.evaluate(RandomizedRunner.java:737)
		at com.carrotsearch.randomizedtesting.RandomizedRunner$7.evaluate(RandomizedRunner.java:773)
		at com.carrotsearch.randomizedtesting.RandomizedRunner$8.evaluate(RandomizedRunner.java:787)
		at com.carrotsearch.randomizedtesting.rules.SystemPropertiesRestoreRule$1.evaluate(SystemPropertiesRestoreRule.java:53)
		at org.apache.lucene.util.TestRuleSetupTeardownChained$1.evaluate(TestRuleSetupTeardownChained.java:50)
		at org.apache.lucene.util.TestRuleFieldCacheSanity$1.evaluate(TestRuleFieldCacheSanity.java:51)
		at org.apache.lucene.util.AbstractBeforeAfterRule$1.evaluate(AbstractBeforeAfterRule.java:45)
		at com.carrotsearch.randomizedtesting.rules.SystemPropertiesInvariantRule$1.evaluate(SystemPropertiesInvariantRule.java:55)
		at org.apache.lucene.util.TestRuleThreadAndTestName$1.evaluate(TestRuleThreadAndTestName.java:48)
		at org.apache.lucene.util.TestRuleIgn

[...truncated too long message...]

maven-build/solr/core/target/test/./solrtest-QueryParsingTest-1346522227317
Tests run: 4, Failures: 0, Errors: 0, Skipped: 0, Time elapsed: 0.512 sec
Running org.apache.solr.core.PluginInfoTest
Tests run: 9, Failures: 0, Errors: 0, Skipped: 0, Time elapsed: 0.084 sec
Running org.apache.solr.common.util.TestJavaBinCodec
Tests run: 1, Failures: 0, Errors: 0, Skipped: 0, Time elapsed: 0.145 sec
Running org.apache.solr.handler.MoreLikeThisHandlerTest
Creating dataDir: /usr/home/hudson/hudson-slave/workspace/Lucene-Solr-Maven-trunk/maven-build/solr/core/target/test/./solrtest-MoreLikeThisHandlerTest-1346522228063
Tests run: 1, Failures: 0, Errors: 0, Skipped: 0, Time elapsed: 0.584 sec

Results :

Tests in error: 
  testDistribSearch(org.apache.solr.cloud.BasicDistributedZkTest): ERROR: [doc=1000] multiple values encountered for non multiValued field val_i: [10, 20]

Tests run: 1150, Failures: 0, Errors: 1, Skipped: 8

[INFO] ------------------------------------------------------------------------
[INFO] SKIPPING Apache Solr Search Server
[INFO]    task-segment: [install]
[INFO] This project has been banned from further executions due to previous failures.
[INFO] ------------------------------------------------------------------------
[INFO] ------------------------------------------------------------------------
[INFO] SKIPPING Apache Solr Test Framework
[INFO]    task-segment: [install]
[INFO] This project has been banned from further executions due to previous failures.
[INFO] ------------------------------------------------------------------------
[INFO] ------------------------------------------------------------------------
[INFO] SKIPPING Apache Solr Analysis Extras
[INFO]    task-segment: [install]
[INFO] This project has been banned from further executions due to previous failures.
[INFO] ------------------------------------------------------------------------
[INFO] ------------------------------------------------------------------------
[INFO] SKIPPING Apache Solr Clustering
[INFO]    task-segment: [install]
[INFO] This project has been banned from further executions due to previous failures.
[INFO] ------------------------------------------------------------------------
[INFO] ------------------------------------------------------------------------
[INFO] SKIPPING Apache Solr DataImportHandler
[INFO]    task-segment: [install]
[INFO] This project has been banned from further executions due to previous failures.
[INFO] ------------------------------------------------------------------------
[INFO] ------------------------------------------------------------------------
[INFO] SKIPPING Apache Solr DataImportHandler Extras
[INFO]    task-segment: [install]
[INFO] This project has been banned from further executions due to previous failures.
[INFO] ------------------------------------------------------------------------
[INFO] ------------------------------------------------------------------------
[INFO] SKIPPING Apache Solr Content Extraction Library
[INFO]    task-segment: [install]
[INFO] This project has been banned from further executions due to previous failures.
[INFO] ------------------------------------------------------------------------
[INFO] ------------------------------------------------------------------------
[INFO] SKIPPING Apache Solr Language Identifier
[INFO]    task-segment: [install]
[INFO] This project has been banned from further executions due to previous failures.
[INFO] ------------------------------------------------------------------------
[INFO] ------------------------------------------------------------------------
[INFO] SKIPPING Apache Solr UIMA integration
[INFO]    task-segment: [install]
[INFO] This project has been banned from further executions due to previous failures.
[INFO] ------------------------------------------------------------------------
[INFO] ------------------------------------------------------------------------
[INFO] SKIPPING Apache Solr Velocity
[INFO]    task-segment: [install]
[INFO] This project has been banned from further executions due to previous failures.
[INFO] ------------------------------------------------------------------------
[INFO] ------------------------------------------------------------------------
[INFO] Building Apache Solr Contrib aggregator POM
[INFO]    task-segment: [install]
[INFO] ------------------------------------------------------------------------
[INFO] [groovy:execute {execution: generate-timestamps}]
[INFO] [buildnumber:create {execution: default}]
[INFO] [enforcer:enforce {execution: enforce-java-compat-version-and-maven-2.2.1}]
[INFO] [remote-resources:process {execution: default}]
[INFO] [bundle:manifest {execution: bundle-manifest}]
[WARNING] Ignoring project type pom - supportedProjectTypes = [jar, bundle]
[INFO] [site:attach-descriptor {execution: default-attach-descriptor}]
[INFO] [install:install {execution: default-install}]
[INFO] Installing /usr/home/hudson/hudson-slave/workspace/Lucene-Solr-Maven-trunk/maven-build/solr/contrib/pom.xml to /home/hudson/.m2/repository/org/apache/solr/solr-contrib-aggregator/5.0-SNAPSHOT/solr-contrib-aggregator-5.0-SNAPSHOT.pom
[INFO] 
[INFO] 
[INFO] ------------------------------------------------------------------------
[INFO] Reactor Summary:
[INFO] ------------------------------------------------------------------------
[INFO] Grandparent POM for Apache Lucene Core and Apache Solr  SUCCESS [7.402s]
[INFO] Lucene parent POM ..................................... SUCCESS [0.058s]
[INFO] Lucene Core ........................................... SUCCESS [4:17.747s]
[INFO] Lucene Test Framework ................................. SUCCESS [4.946s]
[INFO] Lucene Common Analyzers ............................... SUCCESS [1:46.550s]
[INFO] Lucene ICU Analysis Components ........................ SUCCESS [11.704s]
[INFO] Lucene Kuromoji Japanese Morphological Analyzer ....... SUCCESS [25.203s]
[INFO] Lucene Morfologik Polish Lemmatizer ................... SUCCESS [4.116s]
[INFO] Lucene Phonetic Filters ............................... SUCCESS [23.339s]
[INFO] Lucene Smart Chinese Analyzer ......................... SUCCESS [9.475s]
[INFO] Lucene Stempel Analyzer ............................... SUCCESS [4.590s]
[INFO] Lucene UIMA Analysis Components ....................... SUCCESS [21.957s]
[INFO] Lucene Analysis Modules aggregator POM ................ SUCCESS [0.258s]
[INFO] Lucene Queries ........................................ SUCCESS [12.552s]
[INFO] Lucene Sandbox ........................................ SUCCESS [8.192s]
[INFO] Lucene QueryParsers ................................... SUCCESS [13.397s]
[INFO] Lucene Memory ......................................... SUCCESS [8.475s]
[INFO] Lucene Highlighter .................................... SUCCESS [8.345s]
[INFO] Lucene Facets ......................................... SUCCESS [1:19.059s]
[INFO] Lucene Benchmark ...................................... SUCCESS [23.771s]
[INFO] Lucene Demo ........................................... SUCCESS [3.824s]
[INFO] Lucene Grouping ....................................... SUCCESS [17.966s]
[INFO] Lucene Join ........................................... SUCCESS [14.671s]
[INFO] Lucene Miscellaneous .................................. SUCCESS [6.850s]
[INFO] Lucene Spatial ........................................ SUCCESS [13.600s]
[INFO] Lucene Suggest ........................................ SUCCESS [16.178s]
[INFO] Apache Solr parent POM ................................ SUCCESS [0.119s]
[INFO] Apache Solr Solrj ..................................... SUCCESS [6.679s]
[INFO] Apache Solr Core ...................................... FAILED [18:45.114s]
[INFO] Apache Solr Search Server ............................. SKIPPED (dependency build failed or was skipped)
[INFO] Apache Solr Test Framework ............................ SKIPPED (dependency build failed or was skipped)
[INFO] Apache Solr Analysis Extras ........................... SKIPPED (dependency build failed or was skipped)
[INFO] Apache Solr Clustering ................................ SKIPPED (dependency build failed or was skipped)
[INFO] Apache Solr DataImportHandler ......................... SKIPPED (dependency build failed or was skipped)
[INFO] Apache Solr DataImportHandler Extras .................. SKIPPED (dependency build failed or was skipped)
[INFO] Apache Solr Content Extraction Library ................ SKIPPED (dependency build failed or was skipped)
[INFO] Apache Solr Language Identifier ....................... SKIPPED (dependency build failed or was skipped)
[INFO] Apache Solr UIMA integration .......................... SKIPPED (dependency build failed or was skipped)
[INFO] Apache Solr Velocity .................................. SKIPPED (dependency build failed or was skipped)
[INFO] Apache Solr Contrib aggregator POM .................... SUCCESS [0.096s]
[INFO] ------------------------------------------------------------------------
[INFO] Error for project: Apache Solr Core (during install)
[INFO] ------------------------------------------------------------------------
[INFO] There are test failures.

Please refer to /usr/home/hudson/hudson-slave/workspace/Lucene-Solr-Maven-trunk/maven-build/solr/core/target/surefire-reports for the individual test results.
[INFO] ------------------------------------------------------------------------
[INFO] For more information, run Maven with the -e switch
[INFO] ------------------------------------------------------------------------
[INFO] BUILD ERRORS
[INFO] ------------------------------------------------------------------------
[INFO] Total time: 30 minutes 37 seconds
[INFO] Finished at: Sat Sep 01 17:57:09 UTC 2012
[INFO] Final Memory: 170M/1985M
[INFO] ------------------------------------------------------------------------
Build step 'Invoke top-level Maven targets' marked build as failure
Recording test results
Email was triggered for: Failure
Sending email for trigger: Failure




Mime
View raw message