lucene-dev mailing list archives

Site index · List index
Message view « Date » · « Thread »
Top « Date » · « Thread »
From Apache Jenkins Server <jenk...@builds.apache.org>
Subject [JENKINS] Lucene-Solr-Tests-trunk-java7 - Build # 3151 - Failure
Date Sun, 02 Sep 2012 16:03:56 GMT
Build: https://builds.apache.org/job/Lucene-Solr-Tests-trunk-java7/3151/

1 tests failed.
REGRESSION:  org.apache.solr.cloud.BasicDistributedZkTest.testDistribSearch

Error Message:
some core start times did not change on reload

Stack Trace:
java.lang.AssertionError: some core start times did not change on reload
	at __randomizedtesting.SeedInfo.seed([B833DB5BE53E4056:39D555439261206A]:0)
	at org.junit.Assert.fail(Assert.java:93)
	at org.junit.Assert.assertTrue(Assert.java:43)
	at org.apache.solr.cloud.BasicDistributedZkTest.testCollectionsAPI(BasicDistributedZkTest.java:410)
	at org.apache.solr.cloud.BasicDistributedZkTest.doTest(BasicDistributedZkTest.java:314)
	at org.apache.solr.BaseDistributedSearchTestCase.testDistribSearch(BaseDistributedSearchTestCase.java:691)
	at sun.reflect.NativeMethodAccessorImpl.invoke0(Native Method)
	at sun.reflect.NativeMethodAccessorImpl.invoke(NativeMethodAccessorImpl.java:57)
	at sun.reflect.DelegatingMethodAccessorImpl.invoke(DelegatingMethodAccessorImpl.java:43)
	at java.lang.reflect.Method.invoke(Method.java:601)
	at com.carrotsearch.randomizedtesting.RandomizedRunner.invoke(RandomizedRunner.java:1559)
	at com.carrotsearch.randomizedtesting.RandomizedRunner.access$600(RandomizedRunner.java:79)
	at com.carrotsearch.randomizedtesting.RandomizedRunner$6.evaluate(RandomizedRunner.java:737)
	at com.carrotsearch.randomizedtesting.RandomizedRunner$7.evaluate(RandomizedRunner.java:773)
	at com.carrotsearch.randomizedtesting.RandomizedRunner$8.evaluate(RandomizedRunner.java:787)
	at com.carrotsearch.randomizedtesting.rules.SystemPropertiesRestoreRule$1.evaluate(SystemPropertiesRestoreRule.java:53)
	at org.apache.lucene.util.TestRuleSetupTeardownChained$1.evaluate(TestRuleSetupTeardownChained.java:50)
	at org.apache.lucene.util.TestRuleFieldCacheSanity$1.evaluate(TestRuleFieldCacheSanity.java:51)
	at org.apache.lucene.util.AbstractBeforeAfterRule$1.evaluate(AbstractBeforeAfterRule.java:45)
	at com.carrotsearch.randomizedtesting.rules.SystemPropertiesInvariantRule$1.evaluate(SystemPropertiesInvariantRule.java:55)
	at org.apache.lucene.util.TestRuleThreadAndTestName$1.evaluate(TestRuleThreadAndTestName.java:48)
	at org.apache.lucene.util.TestRuleIgnoreAfterMaxFailures$1.evaluate(TestRuleIgnoreAfterMaxFailures.java:70)
	at org.apache.lucene.util.TestRuleMarkFailure$1.evaluate(TestRuleMarkFailure.java:48)
	at com.carrotsearch.randomizedtesting.rules.StatementAdapter.evaluate(StatementAdapter.java:36)
	at com.carrotsearch.randomizedtesting.ThreadLeakControl$StatementRunner.run(ThreadLeakControl.java:345)
	at com.carrotsearch.randomizedtesting.ThreadLeakControl.forkTimeoutingTask(ThreadLeakControl.java:769)
	at com.carrotsearch.randomizedtesting.ThreadLeakControl$3.evaluate(ThreadLeakControl.java:429)
	at com.carrotsearch.randomizedtesting.RandomizedRunner.runSingleTest(RandomizedRunner.java:746)
	at com.carrotsearch.randomizedtesting.RandomizedRunner$3.evaluate(RandomizedRunner.java:648)
	at com.carrotsearch.randomizedtesting.RandomizedRunner$4.evaluate(RandomizedRunner.java:682)
	at com.carrotsearch.randomizedtesting.RandomizedRunner$5.evaluate(RandomizedRunner.java:693)
	at com.carrotsearch.randomizedtesting.rules.StatementAdapter.evaluate(StatementAdapter.java:36)
	at com.carrotsearch.randomizedtesting.rules.SystemPropertiesRestoreRule$1.evaluate(SystemPropertiesRestoreRule.java:53)
	at org.apache.lucene.util.AbstractBeforeAfterRule$1.evaluate(AbstractBeforeAfterRule.java:45)
	at org.apache.lucene.util.TestRuleStoreClassName$1.evaluate(TestRuleStoreClassName.java:42)
	at com.carrotsearch.randomizedtesting.rules.SystemPropertiesInvariantRule$1.evaluate(SystemPropertiesInvariantRule.java:55)
	at com.carrotsearch.randomizedtesting.rules.NoShadowingOrOverridesOnMethodsRule$1.evaluate(NoShadowingOrOverridesOnMethodsRule.java:39)
	at com.carrotsearch.randomizedtesting.rules.NoShadowingOrOverridesOnMethodsRule$1.evaluate(NoShadowingOrOverridesOnMethodsRule.java:39)
	at org.apache.lucene.util.TestRuleAssertionsRequired$1.evaluate(TestRuleAssertionsRequired.java:40)
	at org.apache.lucene.util.TestRuleMarkFailure$1.evaluate(TestRuleMarkFailure.java:48)
	at org.apache.lucene.util.TestRuleIgnoreAfterMaxFailures$1.evaluate(TestRuleIgnoreAfterMaxFailures.java:70)
	at org.apache.lucene.util.TestRuleIgnoreTestSuites$1.evaluate(TestRuleIgnoreTestSuites.java:55)
	at com.carrotsearch.randomizedtesting.rules.StatementAdapter.evaluate(StatementAdapter.java:36)
	at com.carrotsearch.randomizedtesting.ThreadLeakControl$StatementRunner.run(ThreadLeakControl.java:345)
	at java.lang.Thread.run(Thread.java:722)




Build Log:
[...truncated 7268 lines...]
[junit4:junit4] Suite: org.apache.solr.cloud.BasicDistributedZkTest
[junit4:junit4]   2> 4 T601 oas.SolrTestCaseJ4.setUp ###Starting testDistribSearch
[junit4:junit4]   2> Creating dataDir: /usr/home/hudson/hudson-slave/workspace/Lucene-Solr-Tests-trunk-java7/solr/build/solr-core/test/J0/./solrtest-BasicDistributedZkTest-1346601197284
[junit4:junit4]   2> 5 T601 oasc.ZkTestServer.run STARTING ZK TEST SERVER
[junit4:junit4]   2> 7 T602 oazs.ZooKeeperServer.setTickTime tickTime set to 3000
[junit4:junit4]   2> 8 T602 oazs.NIOServerCnxn$Factory.<init> binding to port 0.0.0.0/0.0.0.0:0
[junit4:junit4]   2> 9 T602 oazsp.FileTxnSnapLog.save Snapshotting: 0
[junit4:junit4]   2> 106 T601 oasc.ZkTestServer.run start zk server on port:38809
[junit4:junit4]   2> 106 T601 oaz.ZooKeeper.<init> Initiating client connection, connectString=127.0.0.1:38809 sessionTimeout=10000 watcher=org.apache.solr.common.cloud.ConnectionManager@2dfec8bc
[junit4:junit4]   2> 107 T607 oaz.ClientCnxn$SendThread.startConnect Opening socket connection to server /127.0.0.1:38809
[junit4:junit4]   2> 107 T601 oascc.ConnectionManager.waitForConnected Waiting for client to connect to ZooKeeper
[junit4:junit4]   2> 108 T607 oaz.ClientCnxn$SendThread.primeConnection Socket connection established to localhost/127.0.0.1:38809, initiating session
[junit4:junit4]   2> 109 T603 oazs.NIOServerCnxn$Factory.run Accepted socket connection from /140.211.11.196:41079
[junit4:junit4]   2> 109 T603 oazs.NIOServerCnxn.readConnectRequest Client attempting to establish new session at /140.211.11.196:41079
[junit4:junit4]   2> 109 T605 oazsp.FileTxnLog.append Creating new log file: log.1
[junit4:junit4]   2> 112 T605 oazs.NIOServerCnxn.finishSessionInit Established session 0x13987af9ee90000 with negotiated timeout 10000 for client /140.211.11.196:41079
[junit4:junit4]   2> 112 T607 oaz.ClientCnxn$SendThread.readConnectResult Session establishment complete on server localhost/127.0.0.1:38809, sessionid = 0x13987af9ee90000, negotiated timeout = 10000
[junit4:junit4]   2> 113 T608 oascc.ConnectionManager.process Watcher org.apache.solr.common.cloud.ConnectionManager@2dfec8bc name:ZooKeeperConnection Watcher:127.0.0.1:38809 got event WatchedEvent state:SyncConnected type:None path:null path:null type:None
[junit4:junit4]   2> 113 T601 oascc.ConnectionManager.waitForConnected Client is connected to ZooKeeper
[junit4:junit4]   2> 113 T601 oascc.SolrZkClient.makePath makePath: /solr
[junit4:junit4]   2> 116 T606 oazs.PrepRequestProcessor.pRequest Processed session termination for sessionid: 0x13987af9ee90000
[junit4:junit4]   2> 117 T608 oaz.ClientCnxn$EventThread.run EventThread shut down
[junit4:junit4]   2> 117 T601 oaz.ZooKeeper.close Session: 0x13987af9ee90000 closed
[junit4:junit4]   2> 117 T603 oazs.NIOServerCnxn.closeSock Closed socket connection for client /140.211.11.196:41079 which had sessionid 0x13987af9ee90000
[junit4:junit4]   2> 117 T601 oaz.ZooKeeper.<init> Initiating client connection, connectString=127.0.0.1:38809/solr sessionTimeout=10000 watcher=org.apache.solr.common.cloud.ConnectionManager@2d8b8076
[junit4:junit4]   2> 118 T609 oaz.ClientCnxn$SendThread.startConnect Opening socket connection to server /127.0.0.1:38809
[junit4:junit4]   2> 118 T601 oascc.ConnectionManager.waitForConnected Waiting for client to connect to ZooKeeper
[junit4:junit4]   2> 119 T609 oaz.ClientCnxn$SendThread.primeConnection Socket connection established to localhost/127.0.0.1:38809, initiating session
[junit4:junit4]   2> 119 T603 oazs.NIOServerCnxn$Factory.run Accepted socket connection from /140.211.11.196:13670
[junit4:junit4]   2> 119 T603 oazs.NIOServerCnxn.readConnectRequest Client attempting to establish new session at /140.211.11.196:13670
[junit4:junit4]   2> 120 T605 oazs.NIOServerCnxn.finishSessionInit Established session 0x13987af9ee90001 with negotiated timeout 10000 for client /140.211.11.196:13670
[junit4:junit4]   2> 120 T609 oaz.ClientCnxn$SendThread.readConnectResult Session establishment complete on server localhost/127.0.0.1:38809, sessionid = 0x13987af9ee90001, negotiated timeout = 10000
[junit4:junit4]   2> 121 T610 oascc.ConnectionManager.process Watcher org.apache.solr.common.cloud.ConnectionManager@2d8b8076 name:ZooKeeperConnection Watcher:127.0.0.1:38809/solr got event WatchedEvent state:SyncConnected type:None path:null path:null type:None
[junit4:junit4]   2> 121 T601 oascc.ConnectionManager.waitForConnected Client is connected to ZooKeeper
[junit4:junit4]   2> 121 T601 oascc.SolrZkClient.makePath makePath: /collections/collection1
[junit4:junit4]   2> 125 T601 oascc.SolrZkClient.makePath makePath: /collections/collection1/shards
[junit4:junit4]   2> 135 T601 oascc.SolrZkClient.makePath makePath: /collections/control_collection
[junit4:junit4]   2> 137 T601 oascc.SolrZkClient.makePath makePath: /collections/control_collection/shards
[junit4:junit4]   2> 139 T601 oasc.AbstractZkTestCase.putConfig put /usr/home/hudson/hudson-slave/workspace/Lucene-Solr-Tests-trunk-java7/solr/build/solr-core/test-files/solr/collection1/conf/solrconfig.xml to /configs/conf1/solrconfig.xml
[junit4:junit4]   2> 140 T601 oascc.SolrZkClient.makePath makePath: /configs/conf1/solrconfig.xml
[junit4:junit4]   2> 145 T601 oasc.AbstractZkTestCase.putConfig put /usr/home/hudson/hudson-slave/workspace/Lucene-Solr-Tests-trunk-java7/solr/build/solr-core/test-files/solr/collection1/conf/schema.xml to /configs/conf1/schema.xml
[junit4:junit4]   2> 146 T601 oascc.SolrZkClient.makePath makePath: /configs/conf1/schema.xml
[junit4:junit4]   2> 285 T601 oasc.AbstractZkTestCase.putConfig put /usr/home/hudson/hudson-slave/workspace/Lucene-Solr-Tests-trunk-java7/solr/build/solr-core/test-files/solr/collection1/conf/solrconfig.xml to /configs/conf1/solrconfig.xml
[junit4:junit4]   2> 286 T601 oascc.SolrZkClient.makePath makePath: /configs/conf1/solrconfig.xml
[junit4:junit4]   2> 294 T601 oasc.AbstractZkTestCase.putConfig put /usr/home/hudson/hudson-slave/workspace/Lucene-Solr-Tests-trunk-java7/solr/build/solr-core/test-files/solr/collection1/conf/stopwords.txt to /configs/conf1/stopwords.txt
[junit4:junit4]   2> 295 T601 oascc.SolrZkClient.makePath makePath: /configs/conf1/stopwords.txt
[junit4:junit4]   2> 346 T601 oasc.AbstractZkTestCase.putConfig put /usr/home/hudson/hudson-slave/workspace/Lucene-Solr-Tests-trunk-java7/solr/build/solr-core/test-files/solr/collection1/conf/protwords.txt to /configs/conf1/protwords.txt
[junit4:junit4]   2> 347 T601 oascc.SolrZkClient.makePath makePath: /configs/conf1/protwords.txt
[junit4:junit4]   2> 355 T601 oasc.AbstractZkTestCase.putConfig put /usr/home/hudson/hudson-slave/workspace/Lucene-Solr-Tests-trunk-java7/solr/build/solr-core/test-files/solr/collection1/conf/currency.xml to /configs/conf1/currency.xml
[junit4:junit4]   2> 356 T601 oascc.SolrZkClient.makePath makePath: /configs/conf1/currency.xml
[junit4:junit4]   2> 358 T601 oasc.AbstractZkTestCase.putConfig put /usr/home/hudson/hudson-slave/workspace/Lucene-Solr-Tests-trunk-java7/solr/build/solr-core/test-files/solr/collection1/conf/open-exchange-rates.json to /configs/conf1/open-exchange-rates.json
[junit4:junit4]   2> 359 T601 oascc.SolrZkClient.makePath makePath: /configs/conf1/open-exchange-rates.json
[junit4:junit4]   2> 376 T601 oasc.AbstractZkTestCase.putConfig put /usr/home/hudson/hudson-slave/workspace/Lucene-Solr-Tests-trunk-java7/solr/build/solr-core/test-files/solr/collection1/conf/mapping-ISOLatin1Accent.txt to /configs/conf1/mapping-ISOLatin1Accent.txt
[junit4:junit4]   2> 377 T601 oascc.SolrZkClient.makePath makePath: /configs/conf1/mapping-ISOLatin1Accent.txt
[junit4:junit4]   2> 380 T601 oasc.AbstractZkTestCase.putConfig put /usr/home/hudson/hudson-slave/workspace/Lucene-Solr-Tests-trunk-java7/solr/build/solr-core/test-files/solr/collection1/conf/old_synonyms.txt to /configs/conf1/old_synonyms.txt
[junit4:junit4]   2> 380 T601 oascc.SolrZkClient.makePath makePath: /configs/conf1/old_synonyms.txt
[junit4:junit4]   2> 424 T601 oasc.AbstractZkTestCase.putConfig put /usr/home/hudson/hudson-slave/workspace/Lucene-Solr-Tests-trunk-java7/solr/build/solr-core/test-files/solr/collection1/conf/synonyms.txt to /configs/conf1/synonyms.txt
[junit4:junit4]   2> 425 T601 oascc.SolrZkClient.makePath makePath: /configs/conf1/synonyms.txt
[junit4:junit4]   2> 428 T606 oazs.PrepRequestProcessor.pRequest Processed session termination for sessionid: 0x13987af9ee90001
[junit4:junit4]   2> 451 T610 oaz.ClientCnxn$EventThread.run EventThread shut down
[junit4:junit4]   2> 451 T603 oazs.NIOServerCnxn.closeSock Closed socket connection for client /140.211.11.196:13670 which had sessionid 0x13987af9ee90001
[junit4:junit4]   2> 451 T601 oaz.ZooKeeper.close Session: 0x13987af9ee90001 closed
[junit4:junit4]   2> 577 T601 oejs.Server.doStart jetty-8.1.2.v20120308
[junit4:junit4]   2> 580 T601 oejs.AbstractConnector.doStart Started SocketConnector@0.0.0.0:45643
[junit4:junit4]   2> 581 T601 oasc.SolrResourceLoader.locateSolrHome JNDI not configured for solr (NoInitialContextEx)
[junit4:junit4]   2> 581 T601 oasc.SolrResourceLoader.locateSolrHome using system property solr.solr.home: /usr/home/hudson/hudson-slave/workspace/Lucene-Solr-Tests-trunk-java7/solr/build/solr-core/test-files/control1
[junit4:junit4]   2> 582 T601 oasc.SolrResourceLoader.<init> new SolrResourceLoader for deduced Solr Home: '/usr/home/hudson/hudson-slave/workspace/Lucene-Solr-Tests-trunk-java7/solr/build/solr-core/test-files/control1/'
[junit4:junit4]   2> 612 T601 oass.SolrDispatchFilter.init SolrDispatchFilter.init()
[junit4:junit4]   2> 612 T601 oasc.SolrResourceLoader.locateSolrHome JNDI not configured for solr (NoInitialContextEx)
[junit4:junit4]   2> 613 T601 oasc.SolrResourceLoader.locateSolrHome using system property solr.solr.home: /usr/home/hudson/hudson-slave/workspace/Lucene-Solr-Tests-trunk-java7/solr/build/solr-core/test-files/control1
[junit4:junit4]   2> 613 T601 oasc.CoreContainer$Initializer.initialize looking for solr.xml: /usr/home/hudson/hudson-slave/workspace/Lucene-Solr-Tests-trunk-java7/solr/build/solr-core/test-files/control1/solr.xml
[junit4:junit4]   2> 613 T601 oasc.CoreContainer.<init> New CoreContainer 1443256008
[junit4:junit4]   2> 614 T601 oasc.CoreContainer.load Loading CoreContainer using Solr Home: '/usr/home/hudson/hudson-slave/workspace/Lucene-Solr-Tests-trunk-java7/solr/build/solr-core/test-files/control1/'
[junit4:junit4]   2> 614 T601 oasc.SolrResourceLoader.<init> new SolrResourceLoader for directory: '/usr/home/hudson/hudson-slave/workspace/Lucene-Solr-Tests-trunk-java7/solr/build/solr-core/test-files/control1/'
[junit4:junit4]   2> 636 T601 oasc.CoreContainer.load Registering Log Listener
[junit4:junit4]   2> 646 T601 oasc.CoreContainer.initZooKeeper Zookeeper client=127.0.0.1:38809/solr
[junit4:junit4]   2> 647 T601 oaz.ZooKeeper.<init> Initiating client connection, connectString=127.0.0.1:38809/solr sessionTimeout=8000 watcher=org.apache.solr.common.cloud.ConnectionManager@3c204632
[junit4:junit4]   2> 648 T620 oaz.ClientCnxn$SendThread.startConnect Opening socket connection to server /127.0.0.1:38809
[junit4:junit4]   2> 648 T601 oascc.ConnectionManager.waitForConnected Waiting for client to connect to ZooKeeper
[junit4:junit4]   2> 649 T620 oaz.ClientCnxn$SendThread.primeConnection Socket connection established to localhost/127.0.0.1:38809, initiating session
[junit4:junit4]   2> 649 T603 oazs.NIOServerCnxn$Factory.run Accepted socket connection from /140.211.11.196:34443
[junit4:junit4]   2> 649 T603 oazs.NIOServerCnxn.readConnectRequest Client attempting to establish new session at /140.211.11.196:34443
[junit4:junit4]   2> 654 T605 oazs.NIOServerCnxn.finishSessionInit Established session 0x13987af9ee90002 with negotiated timeout 8000 for client /140.211.11.196:34443
[junit4:junit4]   2> 655 T620 oaz.ClientCnxn$SendThread.readConnectResult Session establishment complete on server localhost/127.0.0.1:38809, sessionid = 0x13987af9ee90002, negotiated timeout = 8000
[junit4:junit4]   2> 655 T621 oascc.ConnectionManager.process Watcher org.apache.solr.common.cloud.ConnectionManager@3c204632 name:ZooKeeperConnection Watcher:127.0.0.1:38809/solr got event WatchedEvent state:SyncConnected type:None path:null path:null type:None
[junit4:junit4]   2> 655 T601 oascc.ConnectionManager.waitForConnected Client is connected to ZooKeeper
[junit4:junit4]   2> 657 T606 oazs.PrepRequestProcessor.pRequest Got user-level KeeperException when processing sessionid:0x13987af9ee90002 type:create cxid:0x2 zxid:0xfffffffffffffffe txntype:unknown reqpath:n/a Error Path:/solr/overseer Error:KeeperErrorCode = NodeExists for /solr/overseer
[junit4:junit4]   2> 666 T601 oascc.SolrZkClient.makePath makePath: /live_nodes
[junit4:junit4]   2> 668 T601 oasc.ZkController.createEphemeralLiveNode Register node as live in ZooKeeper:/live_nodes/127.0.0.1:45643_solr
[junit4:junit4]   2> 669 T606 oazs.PrepRequestProcessor.pRequest Got user-level KeeperException when processing sessionid:0x13987af9ee90002 type:delete cxid:0x7 zxid:0xfffffffffffffffe txntype:unknown reqpath:n/a Error Path:/solr/live_nodes/127.0.0.1:45643_solr Error:KeeperErrorCode = NoNode for /solr/live_nodes/127.0.0.1:45643_solr
[junit4:junit4]   2> 670 T601 oascc.SolrZkClient.makePath makePath: /live_nodes/127.0.0.1:45643_solr
[junit4:junit4]   2> 679 T601 oashc.HttpShardHandlerFactory.getParameter Setting socketTimeout to: 0
[junit4:junit4]   2> 679 T601 oashc.HttpShardHandlerFactory.getParameter Setting urlScheme to: http://
[junit4:junit4]   2> 679 T601 oashc.HttpShardHandlerFactory.getParameter Setting connTimeout to: 0
[junit4:junit4]   2> 680 T601 oashc.HttpShardHandlerFactory.getParameter Setting maxConnectionsPerHost to: 20
[junit4:junit4]   2> 680 T601 oashc.HttpShardHandlerFactory.getParameter Setting corePoolSize to: 0
[junit4:junit4]   2> 681 T601 oashc.HttpShardHandlerFactory.getParameter Setting maximumPoolSize to: 2147483647
[junit4:junit4]   2> 681 T601 oashc.HttpShardHandlerFactory.getParameter Setting maxThreadIdleTime to: 5
[junit4:junit4]   2> 681 T601 oashc.HttpShardHandlerFactory.getParameter Setting sizeOfQueue to: -1
[junit4:junit4]   2> 682 T601 oashc.HttpShardHandlerFactory.getParameter Setting fairnessPolicy to: false
[junit4:junit4]   2> 682 T601 oascsi.HttpClientUtil.createClient Creating new http client, config:maxConnectionsPerHost=20&maxConnections=10000&socketTimeout=0&connTimeout=0&retry=false
[junit4:junit4]   2> 694 T601 oascc.SolrZkClient.makePath makePath: /overseer_elect/election
[junit4:junit4]   2> 704 T606 oazs.PrepRequestProcessor.pRequest Got user-level KeeperException when processing sessionid:0x13987af9ee90002 type:delete cxid:0x15 zxid:0xfffffffffffffffe txntype:unknown reqpath:n/a Error Path:/solr/overseer_elect/leader Error:KeeperErrorCode = NoNode for /solr/overseer_elect/leader
[junit4:junit4]   2> 706 T601 oascc.SolrZkClient.makePath makePath: /overseer_elect/leader
[junit4:junit4]   2> 715 T601 oasc.Overseer.start Overseer (id=88250856065531906-127.0.0.1:45643_solr-n_0000000000) starting
[junit4:junit4]   2> 715 T606 oazs.PrepRequestProcessor.pRequest Got user-level KeeperException when processing sessionid:0x13987af9ee90002 type:create cxid:0x1a zxid:0xfffffffffffffffe txntype:unknown reqpath:n/a Error Path:/solr/overseer Error:KeeperErrorCode = NodeExists for /solr/overseer
[junit4:junit4]   2> 717 T606 oazs.PrepRequestProcessor.pRequest Got user-level KeeperException when processing sessionid:0x13987af9ee90002 type:create cxid:0x1b zxid:0xfffffffffffffffe txntype:unknown reqpath:n/a Error Path:/solr/overseer Error:KeeperErrorCode = NodeExists for /solr/overseer
[junit4:junit4]   2> 723 T606 oazs.PrepRequestProcessor.pRequest Got user-level KeeperException when processing sessionid:0x13987af9ee90002 type:create cxid:0x1c zxid:0xfffffffffffffffe txntype:unknown reqpath:n/a Error Path:/solr/overseer Error:KeeperErrorCode = NodeExists for /solr/overseer
[junit4:junit4]   2> 730 T606 oazs.PrepRequestProcessor.pRequest Got user-level KeeperException when processing sessionid:0x13987af9ee90002 type:create cxid:0x1d zxid:0xfffffffffffffffe txntype:unknown reqpath:n/a Error Path:/solr/overseer Error:KeeperErrorCode = NodeExists for /solr/overseer
[junit4:junit4]   2> 732 T623 oasc.OverseerCollectionProcessor.run Process current queue of collection creations
[junit4:junit4]   2> 732 T601 oascc.SolrZkClient.makePath makePath: /clusterstate.json
[junit4:junit4]   2> 734 T601 oascc.ZkStateReader.createClusterStateWatchersAndUpdate Updating cluster state from ZooKeeper... 
[junit4:junit4]   2> 739 T601 oasc.CoreContainer.create Creating SolrCore 'collection1' using instanceDir: /usr/home/hudson/hudson-slave/workspace/Lucene-Solr-Tests-trunk-java7/solr/build/solr-core/test-files/control1/collection1
[junit4:junit4]   2> 739 T601 oasc.ZkController.createCollectionZkNode Check for collection zkNode:control_collection
[junit4:junit4]   2> 740 T622 oasc.Overseer$ClusterStateUpdater.run Starting to work on the main queue
[junit4:junit4]   2> 740 T601 oasc.ZkController.createCollectionZkNode Collection zkNode exists
[junit4:junit4]   2> 740 T601 oasc.ZkController.readConfigName Load collection config from:/collections/control_collection
[junit4:junit4]   2> 742 T601 oasc.SolrResourceLoader.<init> new SolrResourceLoader for directory: '/usr/home/hudson/hudson-slave/workspace/Lucene-Solr-Tests-trunk-java7/solr/build/solr-core/test-files/control1/collection1/'
[junit4:junit4]   2> 743 T601 oasc.SolrResourceLoader.replaceClassLoader Adding 'file:/usr/home/hudson/hudson-slave/workspace/Lucene-Solr-Tests-trunk-java7/solr/build/solr-core/test-files/control1/collection1/lib/README' to classloader
[junit4:junit4]   2> 743 T601 oasc.SolrResourceLoader.replaceClassLoader Adding 'file:/usr/home/hudson/hudson-slave/workspace/Lucene-Solr-Tests-trunk-java7/solr/build/solr-core/test-files/control1/collection1/lib/classes/' to classloader
[junit4:junit4]   2> 780 T601 oasc.SolrConfig.<init> Using Lucene MatchVersion: LUCENE_50
[junit4:junit4]   2> 829 T601 oasc.SolrConfig.<init> Loaded SolrConfig: solrconfig.xml
[junit4:junit4]   2> 930 T601 oass.IndexSchema.readSchema Reading Solr Schema
[junit4:junit4]   2> 936 T601 oass.IndexSchema.readSchema Schema name=test
[junit4:junit4]   2> 1559 T601 oass.OpenExchangeRatesOrgProvider.init Initialized with rates=open-exchange-rates.json, refreshInterval=1440.
[junit4:junit4]   2> 1572 T601 oass.IndexSchema.readSchema default search field in schema is text
[junit4:junit4]   2> 1576 T601 oass.IndexSchema.readSchema unique key field: id
[junit4:junit4]   2> 1592 T601 oass.FileExchangeRateProvider.reload Reloading exchange rates from file currency.xml
[junit4:junit4]   2> 1597 T601 oass.FileExchangeRateProvider.reload Reloading exchange rates from file currency.xml
[junit4:junit4]   2> 1602 T601 oass.OpenExchangeRatesOrgProvider.reload Reloading exchange rates from open-exchange-rates.json
[junit4:junit4]   2> 1604 T601 oass.OpenExchangeRatesOrgProvider.reload Reloading exchange rates from open-exchange-rates.json
[junit4:junit4]   2> 1605 T601 oasc.SolrCore.<init> [collection1] Opening new SolrCore at /usr/home/hudson/hudson-slave/workspace/Lucene-Solr-Tests-trunk-java7/solr/build/solr-core/test-files/control1/collection1/, dataDir=/usr/home/hudson/hudson-slave/workspace/Lucene-Solr-Tests-trunk-java7/solr/build/solr-core/test-files/control1/collection1/data/
[junit4:junit4]   2> 1605 T601 oasc.JmxMonitoredMap.<init> JMX monitoring is enabled. Adding Solr mbeans to JMX Server: com.sun.jmx.mbeanserver.JmxMBeanServer@54dc2b4c
[junit4:junit4]   2> 1638 T601 oasc.SolrCore.getNewIndexDir WARNING New index directory detected: old=null new=/usr/home/hudson/hudson-slave/workspace/Lucene-Solr-Tests-trunk-java7/solr/build/solr-core/test-files/control1/collection1/data/index/
[junit4:junit4]   2> 1639 T601 oasc.SolrCore.initIndex WARNING [collection1] Solr index directory '/usr/home/hudson/hudson-slave/workspace/Lucene-Solr-Tests-trunk-java7/solr/build/solr-core/test-files/control1/collection1/data/index' doesn't exist. Creating new index...
[junit4:junit4]   2> 1640 T601 oasc.CachingDirectoryFactory.get return new directory for /usr/home/hudson/hudson-slave/workspace/Lucene-Solr-Tests-trunk-java7/solr/build/solr-core/test-files/control1/collection1/data/index forceNew:false
[junit4:junit4]   2> 1671 T601 oasc.SolrDeletionPolicy.onCommit SolrDeletionPolicy.onCommit: commits:num=1
[junit4:junit4]   2> 		commit{dir=/usr/home/hudson/hudson-slave/workspace/Lucene-Solr-Tests-trunk-java7/solr/build/solr-core/test-files/control1/collection1/data/index,segFN=segments_1,generation=1,filenames=[segments_1]
[junit4:junit4]   2> 1672 T601 oasc.SolrDeletionPolicy.updateCommits newest commit = 1
[junit4:junit4]   2> 1673 T601 oasc.SolrCore.initWriters created xml: solr.XMLResponseWriter
[junit4:junit4]   2> 1676 T601 oasup.UpdateRequestProcessorChain.init inserting DistributedUpdateProcessorFactory into updateRequestProcessorChain "dedupe"
[junit4:junit4]   2> 1676 T601 oasup.UpdateRequestProcessorChain.init inserting DistributedUpdateProcessorFactory into updateRequestProcessorChain "dedupe-allfields"
[junit4:junit4]   2> 1677 T601 oasup.UpdateRequestProcessorChain.init inserting DistributedUpdateProcessorFactory into updateRequestProcessorChain "stored_sig"
[junit4:junit4]   2> 1678 T601 oasup.UpdateRequestProcessorChain.init inserting DistributedUpdateProcessorFactory into updateRequestProcessorChain "uniq-fields"
[junit4:junit4]   2> 1679 T601 oasup.UpdateRequestProcessorChain.init inserting DistributedUpdateProcessorFactory into updateRequestProcessorChain "distrib-dup-test-chain-implicit"
[junit4:junit4]   2> 1679 T601 oasc.RequestHandlers.initHandlersFromConfig adding lazy requestHandler: solr.ReplicationHandler
[junit4:junit4]   2> 1680 T601 oasc.RequestHandlers.initHandlersFromConfig created /replication: solr.ReplicationHandler
[junit4:junit4]   2> 1680 T601 oasc.RequestHandlers.initHandlersFromConfig created standard: solr.StandardRequestHandler
[junit4:junit4]   2> 1681 T601 oasc.RequestHandlers.initHandlersFromConfig created /get: solr.RealTimeGetHandler
[junit4:junit4]   2> 1682 T601 oasc.RequestHandlers.initHandlersFromConfig created dismax: solr.SearchHandler
[junit4:junit4]   2> 1683 T601 oasc.RequestHandlers.initHandlersFromConfig created mock: org.apache.solr.core.MockQuerySenderListenerReqHandler
[junit4:junit4]   2> 1683 T601 oasc.RequestHandlers.initHandlersFromConfig created /admin/: org.apache.solr.handler.admin.AdminHandlers
[junit4:junit4]   2> 1684 T601 oasc.RequestHandlers.initHandlersFromConfig created defaults: solr.StandardRequestHandler
[junit4:junit4]   2> 1684 T601 oasc.RequestHandlers.initHandlersFromConfig adding lazy requestHandler: solr.StandardRequestHandler
[junit4:junit4]   2> 1685 T601 oasc.RequestHandlers.initHandlersFromConfig created lazy: solr.StandardRequestHandler
[junit4:junit4]   2> 1686 T601 oasc.RequestHandlers.initHandlersFromConfig created /update: solr.UpdateRequestHandler
[junit4:junit4]   2> 1686 T601 oasc.RequestHandlers.initHandlersFromConfig created /terms: org.apache.solr.handler.component.SearchHandler
[junit4:junit4]   2> 1687 T601 oasc.RequestHandlers.initHandlersFromConfig created spellCheckCompRH: org.apache.solr.handler.component.SearchHandler
[junit4:junit4]   2> 1688 T601 oasc.RequestHandlers.initHandlersFromConfig created spellCheckCompRH_Direct: org.apache.solr.handler.component.SearchHandler
[junit4:junit4]   2> 1688 T601 oasc.RequestHandlers.initHandlersFromConfig created spellCheckWithWordbreak: org.apache.solr.handler.component.SearchHandler
[junit4:junit4]   2> 1689 T601 oasc.RequestHandlers.initHandlersFromConfig created spellCheckWithWordbreak_Direct: org.apache.solr.handler.component.SearchHandler
[junit4:junit4]   2> 1690 T601 oasc.RequestHandlers.initHandlersFromConfig created spellCheckCompRH1: org.apache.solr.handler.component.SearchHandler
[junit4:junit4]   2> 1690 T601 oasc.RequestHandlers.initHandlersFromConfig created tvrh: org.apache.solr.handler.component.SearchHandler
[junit4:junit4]   2> 1691 T601 oasc.RequestHandlers.initHandlersFromConfig created /mlt: solr.MoreLikeThisHandler
[junit4:junit4]   2> 1692 T601 oasc.RequestHandlers.initHandlersFromConfig created /debug/dump: solr.DumpRequestHandler
[junit4:junit4]   2> 1696 T601 oashl.XMLLoader.init xsltCacheLifetimeSeconds=60
[junit4:junit4]   2> 1700 T601 oasc.SolrCore.initDeprecatedSupport WARNING solrconfig.xml uses deprecated <admin/gettableFiles>, Please update your config to use the ShowFileRequestHandler.
[junit4:junit4]   2> 1702 T601 oasc.SolrCore.initDeprecatedSupport WARNING adding ShowFileRequestHandler with hidden files: [SCHEMA.XML, OLD_SYNONYMS.TXT, STOPWORDS.TXT, PROTWORDS.TXT, OPEN-EXCHANGE-RATES.JSON, SYNONYMS.TXT, CURRENCY.XML, MAPPING-ISOLATIN1ACCENT.TXT]
[junit4:junit4]   2> 1706 T601 oass.SolrIndexSearcher.<init> Opening Searcher@5c67b3b1 main
[junit4:junit4]   2> 1729 T601 oasu.CommitTracker.<init> Hard AutoCommit: disabled
[junit4:junit4]   2> 1730 T601 oasu.CommitTracker.<init> Soft AutoCommit: disabled
[junit4:junit4]   2> 1730 T601 oashc.SpellCheckComponent.inform Initializing spell checkers
[junit4:junit4]   2> 1733 T601 oass.DirectSolrSpellChecker.init init: {name=direct,classname=DirectSolrSpellChecker,field=lowerfilt,minQueryLength=3}
[junit4:junit4]   2> 1749 T624 oasc.SolrCore.registerSearcher [collection1] Registered new searcher Searcher@5c67b3b1 main{StandardDirectoryReader(segments_1:1)}
[junit4:junit4]   2> 1754 T606 oazs.PrepRequestProcessor.pRequest Got user-level KeeperException when processing sessionid:0x13987af9ee90002 type:create cxid:0x53 zxid:0xfffffffffffffffe txntype:unknown reqpath:n/a Error Path:/solr/overseer/queue Error:KeeperErrorCode = NoNode for /solr/overseer/queue
[junit4:junit4]   2> 1767 T601 oasc.CoreContainer.register registering core: collection1
[junit4:junit4]   2> 1768 T622 oascc.ZkStateReader.updateClusterState Updating cloud state from ZooKeeper... 
[junit4:junit4]   2> 1768 T601 oasc.ZkController.register Register shard - core:collection1 address:http://127.0.0.1:45643/solr shardId:control_shard
[junit4:junit4]   2> 1769 T606 oazs.PrepRequestProcessor.pRequest Got user-level KeeperException when processing sessionid:0x13987af9ee90002 type:create cxid:0x5c zxid:0xfffffffffffffffe txntype:unknown reqpath:n/a Error Path:/solr/overseer/queue-work Error:KeeperErrorCode = NoNode for /solr/overseer/queue-work
[junit4:junit4]   2> 1769 T601 oascc.SolrZkClient.makePath makePath: /collections/control_collection/leader_elect/control_shard/election
[junit4:junit4]   2> 1792 T621 oascc.ZkStateReader$2.process A cluster state change has occurred - updating...
[junit4:junit4]   2> 1802 T606 oazs.PrepRequestProcessor.pRequest Got user-level KeeperException when processing sessionid:0x13987af9ee90002 type:delete cxid:0x73 zxid:0xfffffffffffffffe txntype:unknown reqpath:n/a Error Path:/solr/collections/control_collection/leaders Error:KeeperErrorCode = NoNode for /solr/collections/control_collection/leaders
[junit4:junit4]   2> 1803 T606 oazs.PrepRequestProcessor.pRequest Got user-level KeeperException when processing sessionid:0x13987af9ee90002 type:create cxid:0x75 zxid:0xfffffffffffffffe txntype:unknown reqpath:n/a Error Path:/solr/overseer Error:KeeperErrorCode = NodeExists for /solr/overseer
[junit4:junit4]   2> 1813 T601 oasc.ShardLeaderElectionContext.waitForReplicasToComeUp Running the leader process. afterExperiation=false
[junit4:junit4]   2> 1814 T601 oasc.ShardLeaderElectionContext.waitForReplicasToComeUp Enough replicas found to continue.
[junit4:junit4]   2> 1814 T601 oasc.ShardLeaderElectionContext.runLeaderProcess I am the new leader: http://127.0.0.1:45643/solr/collection1/
[junit4:junit4]   2> 2303 T622 oascc.ZkStateReader.updateClusterState Updating cloud state from ZooKeeper... 
[junit4:junit4]   2> 2316 T601 oascc.SolrZkClient.makePath makePath: /collections/control_collection/leaders/control_shard
[junit4:junit4]   2> 2319 T621 oascc.ZkStateReader$2.process A cluster state change has occurred - updating...
[junit4:junit4]   2> 2331 T606 oazs.PrepRequestProcessor.pRequest Got user-level KeeperException when processing sessionid:0x13987af9ee90002 type:create cxid:0x8e zxid:0xfffffffffffffffe txntype:unknown reqpath:n/a Error Path:/solr/overseer Error:KeeperErrorCode = NodeExists for /solr/overseer
[junit4:junit4]   2> 2823 T622 oascc.ZkStateReader.updateClusterState Updating cloud state from ZooKeeper... 
[junit4:junit4]   2> 2838 T621 oascc.ZkStateReader$2.process A cluster state change has occurred - updating...
[junit4:junit4]   2> 2844 T601 oasc.ZkController.register We are http://127.0.0.1:45643/solr/collection1/ and leader is http://127.0.0.1:45643/solr/collection1/
[junit4:junit4]   2> 2847 T601 oasc.ZkController.register No LogReplay needed for core=collection1 baseURL=http://127.0.0.1:45643/solr
[junit4:junit4]   2> 2847 T601 oasc.ZkController.checkRecovery I am the leader, no recovery necessary
[junit4:junit4]   2> 2849 T601 oascc.ZkStateReader.updateClusterState Updating cloud state from ZooKeeper... 
[junit4:junit4]   2> 2850 T601 oass.SolrDispatchFilter.init user.dir=/usr/home/hudson/hudson-slave/workspace/Lucene-Solr-Tests-trunk-java7/solr/build/solr-core/test/J0
[junit4:junit4]   2> 2850 T601 oass.SolrDispatchFilter.init SolrDispatchFilter.init() done
[junit4:junit4]   2> 2851 T601 oascsi.HttpClientUtil.createClient Creating new http client, config:maxConnections=128&maxConnectionsPerHost=32&followRedirects=false
[junit4:junit4]   2> 2977 T601 oejs.Server.doStart jetty-8.1.2.v20120308
[junit4:junit4]   2> 2979 T601 oejs.AbstractConnector.doStart Started SocketConnector@0.0.0.0:54546
[junit4:junit4]   2> 2980 T601 oasc.SolrResourceLoader.locateSolrHome JNDI not configured for solr (NoInitialContextEx)
[junit4:junit4]   2> 2980 T601 oasc.SolrResourceLoader.locateSolrHome using system property solr.solr.home: /usr/home/hudson/hudson-slave/workspace/Lucene-Solr-Tests-trunk-java7/solr/build/solr-core/test-files/jetty2
[junit4:junit4]   2> 2981 T601 oasc.SolrResourceLoader.<init> new SolrResourceLoader for deduced Solr Home: '/usr/home/hudson/hudson-slave/workspace/Lucene-Solr-Tests-trunk-java7/solr/build/solr-core/test-files/jetty2/'
[junit4:junit4]   2> 3009 T601 oass.SolrDispatchFilter.init SolrDispatchFilter.init()
[junit4:junit4]   2> 3009 T601 oasc.SolrResourceLoader.locateSolrHome JNDI not configured for solr (NoInitialContextEx)
[junit4:junit4]   2> 3010 T601 oasc.SolrResourceLoader.locateSolrHome using system property solr.solr.home: /usr/home/hudson/hudson-slave/workspace/Lucene-Solr-Tests-trunk-java7/solr/build/solr-core/test-files/jetty2
[junit4:junit4]   2> 3010 T601 oasc.CoreContainer$Initializer.initialize looking for solr.xml: /usr/home/hudson/hudson-slave/workspace/Lucene-Solr-Tests-trunk-java7/solr/build/solr-core/test-files/jetty2/solr.xml
[junit4:junit4]   2> 3010 T601 oasc.CoreContainer.<init> New CoreContainer 1222687343
[junit4:junit4]   2> 3011 T601 oasc.CoreContainer.load Loading CoreContainer using Solr Home: '/usr/home/hudson/hudson-slave/workspace/Lucene-Solr-Tests-trunk-java7/solr/build/solr-core/test-files/jetty2/'
[junit4:junit4]   2> 3011 T601 oasc.SolrResourceLoader.<init> new SolrResourceLoader for directory: '/usr/home/hudson/hudson-slave/workspace/Lucene-Solr-Tests-trunk-java7/solr/build/solr-core/test-files/jetty2/'
[junit4:junit4]   2> 3033 T601 oasc.CoreContainer.load Registering Log Listener
[junit4:junit4]   2> 3042 T601 oasc.CoreContainer.initZooKeeper Zookeeper client=127.0.0.1:38809/solr
[junit4:junit4]   2> 3043 T601 oaz.ZooKeeper.<init> Initiating client connection, connectString=127.0.0.1:38809/solr sessionTimeout=8000 watcher=org.apache.solr.common.cloud.ConnectionManager@7cdf06c2
[junit4:junit4]   2> 3044 T634 oaz.ClientCnxn$SendThread.startConnect Opening socket connection to server /127.0.0.1:38809
[junit4:junit4]   2> 3044 T601 oascc.ConnectionManager.waitForConnected Waiting for client to connect to ZooKeeper
[junit4:junit4]   2> 3045 T634 oaz.ClientCnxn$SendThread.primeConnection Socket connection established to localhost/127.0.0.1:38809, initiating session
[junit4:junit4]   2> 3045 T603 oazs.NIOServerCnxn$Factory.run Accepted socket connection from /140.211.11.196:64504
[junit4:junit4]   2> 3046 T603 oazs.NIOServerCnxn.readConnectRequest Client attempting to establish new session at /140.211.11.196:64504
[junit4:junit4]   2> 3048 T605 oazs.NIOServerCnxn.finishSessionInit Established session 0x13987af9ee90003 with negotiated timeout 8000 for client /140.211.11.196:64504
[junit4:junit4]   2> 3048 T634 oaz.ClientCnxn$SendThread.readConnectResult Session establishment complete on server localhost/127.0.0.1:38809, sessionid = 0x13987af9ee90003, negotiated timeout = 8000
[junit4:junit4]   2> 3048 T635 oascc.ConnectionManager.process Watcher org.apache.solr.common.cloud.ConnectionManager@7cdf06c2 name:ZooKeeperConnection Watcher:127.0.0.1:38809/solr got event WatchedEvent state:SyncConnected type:None path:null path:null type:None
[junit4:junit4]   2> 3048 T601 oascc.ConnectionManager.waitForConnected Client is connected to ZooKeeper
[junit4:junit4]   2> 3049 T606 oazs.PrepRequestProcessor.pRequest Got user-level KeeperException when processing sessionid:0x13987af9ee90003 type:create cxid:0x1 zxid:0xfffffffffffffffe txntype:unknown reqpath:n/a Error Path:/solr/overseer Error:KeeperErrorCode = NodeExists for /solr/overseer
[junit4:junit4]   2> 3060 T606 oazs.PrepRequestProcessor.pRequest Got user-level KeeperException when processing sessionid:0x13987af9ee90003 type:create cxid:0x2 zxid:0xfffffffffffffffe txntype:unknown reqpath:n/a Error Path:/solr/overseer Error:KeeperErrorCode = NodeExists for /solr/overseer
[junit4:junit4]   2> 3061 T601 oasc.ZkController.createEphemeralLiveNode Register node as live in ZooKeeper:/live_nodes/127.0.0.1:54546_solr
[junit4:junit4]   2> 3062 T606 oazs.PrepRequestProcessor.pRequest Got user-level KeeperException when processing sessionid:0x13987af9ee90003 type:delete cxid:0x4 zxid:0xfffffffffffffffe txntype:unknown reqpath:n/a Error Path:/solr/live_nodes/127.0.0.1:54546_solr Error:KeeperErrorCode = NoNode for /solr/live_nodes/127.0.0.1:54546_solr
[junit4:junit4]   2> 3063 T601 oascc.SolrZkClient.makePath makePath: /live_nodes/127.0.0.1:54546_solr
[junit4:junit4]   2> 3071 T621 oascc.ZkStateReader$3.process Updating live nodes
[junit4:junit4]   2> 3072 T601 oashc.HttpShardHandlerFactory.getParameter Setting socketTimeout to: 0
[junit4:junit4]   2> 3073 T601 oashc.HttpShardHandlerFactory.getParameter Setting urlScheme to: http://
[junit4:junit4]   2> 3073 T601 oashc.HttpShardHandlerFactory.getParameter Setting connTimeout to: 0
[junit4:junit4]   2> 3074 T601 oashc.HttpShardHandlerFactory.getParameter Setting maxConnectionsPerHost to: 20
[junit4:junit4]   2> 3074 T601 oashc.HttpShardHandlerFactory.getParameter Setting corePoolSize to: 0
[junit4:junit4]   2> 3075 T601 oashc.HttpShardHandlerFactory.getParameter Setting maximumPoolSize to: 2147483647
[junit4:junit4]   2> 3075 T601 oashc.HttpShardHandlerFactory.getParameter Setting maxThreadIdleTime to: 5
[junit4:junit4]   2> 3076 T601 oashc.HttpShardHandlerFactory.getParameter Setting sizeOfQueue to: -1
[junit4:junit4]   2> 3076 T601 oashc.HttpShardHandlerFactory.getParameter Setting fairnessPolicy to: false
[junit4:junit4]   2> 3077 T601 oascsi.HttpClientUtil.createClient Creating new http client, config:maxConnectionsPerHost=20&maxConnections=10000&socketTimeout=0&connTimeout=0&retry=false
[junit4:junit4]   2> 3094 T601 oascc.ZkStateReader.createClusterStateWatchersAndUpdate Updating cluster state from ZooKeeper... 
[junit4:junit4]   2> 3101 T601 oasc.CoreContainer.create Creating SolrCore 'collection1' using instanceDir: /usr/home/hudson/hudson-slave/workspace/Lucene-Solr-Tests-trunk-java7/solr/build/solr-core/test-files/jetty2/collection1
[junit4:junit4]   2> 3101 T601 oasc.ZkController.createCollectionZkNode Check for collection zkNode:collection1
[junit4:junit4]   2> 3102 T601 oasc.ZkController.createCollectionZkNode Collection zkNode exists
[junit4:junit4]   2> 3102 T601 oasc.ZkController.readConfigName Load collection config from:/collections/collection1
[junit4:junit4]   2> 3104 T601 oasc.SolrResourceLoader.<init> new SolrResourceLoader for directory: '/usr/home/hudson/hudson-slave/workspace/Lucene-Solr-Tests-trunk-java7/solr/build/solr-core/test-files/jetty2/collection1/'
[junit4:junit4]   2> 3105 T601 oasc.SolrResourceLoader.replaceClassLoader Adding 'file:/usr/home/hudson/hudson-slave/workspace/Lucene-Solr-Tests-trunk-java7/solr/build/solr-core/test-files/jetty2/collection1/lib/classes/' to classloader
[junit4:junit4]   2> 3106 T601 oasc.SolrResourceLoader.replaceClassLoader Adding 'file:/usr/home/hudson/hudson-slave/workspace/Lucene-Solr-Tests-trunk-java7/solr/build/solr-core/test-files/jetty2/collection1/lib/README' to classloader
[junit4:junit4]   2> 3166 T601 oasc.SolrConfig.<init> Using Lucene MatchVersion: LUCENE_50
[junit4:junit4]   2> 3232 T601 oasc.SolrConfig.<init> Loaded SolrConfig: solrconfig.xml
[junit4:junit4]   2> 3333 T601 oass.IndexSchema.readSchema Reading Solr Schema
[junit4:junit4]   2> 3340 T601 oass.IndexSchema.readSchema Schema name=test
[junit4:junit4]   2> 3342 T622 oascc.ZkStateReader.updateClusterState Updating cloud state from ZooKeeper... 
[junit4:junit4]   2> 3358 T635 oascc.ZkStateReader$2.process A cluster state change has occurred - updating...
[junit4:junit4]   2> 3358 T621 oascc.ZkStateReader$2.process A cluster state change has occurred - updating...
[junit4:junit4]   2> 3922 T601 oass.OpenExchangeRatesOrgProvider.init Initialized with rates=open-exchange-rates.json, refreshInterval=1440.
[junit4:junit4]   2> 3930 T601 oass.IndexSchema.readSchema default search field in schema is text
[junit4:junit4]   2> 3933 T601 oass.IndexSchema.readSchema unique key field: id
[junit4:junit4]   2> 3944 T601 oass.FileExchangeRateProvider.reload Reloading exchange rates from file currency.xml
[junit4:junit4]   2> 3947 T601 oass.FileExchangeRateProvider.reload Reloading exchange rates from file currency.xml
[junit4:junit4]   2> 3951 T601 oass.OpenExchangeRatesOrgProvider.reload Reloading exchange rates from open-exchange-rates.json
[junit4:junit4]   2> 3952 T601 oass.OpenExchangeRatesOrgProvider.reload Reloading exchange rates from open-exchange-rates.json
[junit4:junit4]   2> 3953 T601 oasc.SolrCore.<init> [collection1] Opening new SolrCore at /usr/home/hudson/hudson-slave/workspace/Lucene-Solr-Tests-trunk-java7/solr/build/solr-core/test-files/jetty2/collection1/, dataDir=/usr/home/hudson/hudson-slave/workspace/Lucene-Solr-Tests-trunk-java7/solr/build/solr-core/test-files/jetty2/collection1/data/
[junit4:junit4]   2> 3953 T601 oasc.JmxMonitoredMap.<init> JMX monitoring is enabled. Adding Solr mbeans to JMX Server: com.sun.jmx.mbeanserver.JmxMBeanServer@54dc2b4c
[junit4:junit4]   2> 3954 T601 oasc.SolrCore.getNewIndexDir WARNING New index directory detected: old=null new=/usr/home/hudson/hudson-slave/workspace/Lucene-Solr-Tests-trunk-java7/solr/build/solr-core/test-files/jetty2/collection1/data/index/
[junit4:junit4]   2> 3955 T601 oasc.SolrCore.initIndex WARNING [collection1] Solr index directory '/usr/home/hudson/hudson-slave/workspace/Lucene-Solr-Tests-trunk-java7/solr/build/solr-core/test-files/jetty2/collection1/data/index' doesn't exist. Creating new index...
[junit4:junit4]   2> 3955 T601 oasc.CachingDirectoryFactory.get return new directory for /usr/home/hudson/hudson-slave/workspace/Lucene-Solr-Tests-trunk-java7/solr/build/solr-core/test-files/jetty2/collection1/data/index forceNew:false
[junit4:junit4]   2> 3984 T601 oasc.SolrDeletionPolicy.onCommit SolrDeletionPolicy.onCommit: commits:num=1
[junit4:junit4]   2> 		commit{dir=/usr/home/hudson/hudson-slave/workspace/Lucene-Solr-Tests-trunk-java7/solr/build/solr-core/test-files/jetty2/collection1/data/index,segFN=segments_1,generation=1,filenames=[segments_1]
[junit4:junit4]   2> 3985 T601 oasc.SolrDeletionPolicy.updateCommits newest commit = 1
[junit4:junit4]   2> 3985 T601 oasc.SolrCore.initWriters created xml: solr.XMLResponseWriter
[junit4:junit4]   2> 3987 T601 oasup.UpdateRequestProcessorChain.init inserting DistributedUpdateProcessorFactory into updateRequestProcessorChain "dedupe"
[junit4:junit4]   2> 3988 T601 oasup.UpdateRequestProcessorChain.init inserting DistributedUpdateProcessorFactory into updateRequestProcessorChain "dedupe-allfields"
[junit4:junit4]   2> 3988 T601 oasup.UpdateRequestProcessorChain.init inserting DistributedUpdateProcessorFactory into updateRequestProcessorChain "stored_sig"
[junit4:junit4]   2> 3989 T601 oasup.UpdateRequestProcessorChain.init inserting DistributedUpdateProcessorFactory into updateRequestProcessorChain "uniq-fields"
[junit4:junit4]   2> 3989 T601 oasup.UpdateRequestProcessorChain.init inserting DistributedUpdateProcessorFactory into updateRequestProcessorChain "distrib-dup-test-chain-implicit"
[junit4:junit4]   2> 3990 T601 oasc.RequestHandlers.initHandlersFromConfig adding lazy requestHandler: solr.ReplicationHandler
[junit4:junit4]   2> 3990 T601 oasc.RequestHandlers.initHandlersFromConfig created /replication: solr.ReplicationHandler
[junit4:junit4]   2> 3991 T601 oasc.RequestHandlers.initHandlersFromConfig created standard: solr.StandardRequestHandler
[junit4:junit4]   2> 3991 T601 oasc.RequestHandlers.initHandlersFromConfig created /get: solr.RealTimeGetHandler
[junit4:junit4]   2> 3992 T601 oasc.RequestHandlers.initHandlersFromConfig created dismax: solr.SearchHandler
[junit4:junit4]   2> 3992 T601 oasc.RequestHandlers.initHandlersFromConfig created mock: org.apache.solr.core.MockQuerySenderListenerReqHandler
[junit4:junit4]   2> 3993 T601 oasc.RequestHandlers.initHandlersFromConfig created /admin/: org.apache.solr.handler.admin.AdminHandlers
[junit4:junit4]   2> 3993 T601 oasc.RequestHandlers.initHandlersFromConfig created defaults: solr.StandardRequestHandler
[junit4:junit4]   2> 3994 T601 oasc.RequestHandlers.initHandlersFromConfig adding lazy requestHandler: solr.StandardRequestHandler
[junit4:junit4]   2> 3994 T601 oasc.RequestHandlers.initHandlersFromConfig created lazy: solr.StandardRequestHandler
[junit4:junit4]   2> 3995 T601 oasc.RequestHandlers.initHandlersFromConfig created /update: solr.UpdateRequestHandler
[junit4:junit4]   2> 3995 T601 oasc.RequestHandlers.initHandlersFromConfig created /terms: org.apache.solr.handler.component.SearchHandler
[junit4:junit4]   2> 3996 T601 oasc.RequestHandlers.initHandlersFromConfig created spellCheckCompRH: org.apache.solr.handler.component.SearchHandler
[junit4:junit4]   2> 3996 T601 oasc.RequestHandlers.initHandlersFromConfig created spellCheckCompRH_Direct: org.apache.solr.handler.component.SearchHandler
[junit4:junit4]   2> 3997 T601 oasc.RequestHandlers.initHandlersFromConfig created spellCheckWithWordbreak: org.apache.solr.handler.component.SearchHandler
[junit4:junit4]   2> 3997 T601 oasc.RequestHandlers.initHandlersFromConfig created spellCheckWithWordbreak_Direct: org.apache.solr.handler.component.SearchHandler
[junit4:junit4]   2> 3998 T601 oasc.RequestHandlers.initHandlersFromConfig created spellCheckCompRH1: org.apache.solr.handler.component.SearchHandler
[junit4:junit4]   2> 3998 T601 oasc.RequestHandlers.initHandlersFromConfig created tvrh: org.apache.solr.handler.component.SearchHandler
[junit4:junit4]   2> 3999 T601 oasc.RequestHandlers.initHandlersFromConfig created /mlt: solr.MoreLikeThisHandler
[junit4:junit4]   2> 3999 T601 oasc.RequestHandlers.initHandlersFromConfig created /debug/dump: solr.DumpRequestHandler
[junit4:junit4]   2> 4002 T601 oashl.XMLLoader.init xsltCacheLifetimeSeconds=60
[junit4:junit4]   2> 4005 T601 oasc.SolrCore.initDeprecatedSupport WARNING solrconfig.xml uses deprecated <admin/gettableFiles>, Please update your config to use the ShowFileRequestHandler.
[junit4:junit4]   2> 4006 T601 oasc.SolrCore.initDeprecatedSupport WARNING adding ShowFileRequestHandler with hidden files: [SCHEMA.XML, OLD_SYNONYMS.TXT, STOPWORDS.TXT, PROTWORDS.TXT, OPEN-EXCHANGE-RATES.JSON, SYNONYMS.TXT, CURRENCY.XML, MAPPING-ISOLATIN1ACCENT.TXT]
[junit4:junit4]   2> 4009 T601 oass.SolrIndexSearcher.<init> Opening Searcher@5cdbc420 main
[junit4:junit4]   2> 4010 T601 oasu.CommitTracker.<init> Hard AutoCommit: disabled
[junit4:junit4]   2> 4010 T601 oasu.CommitTracker.<init> Soft AutoCommit: disabled
[junit4:junit4]   2> 4011 T601 oashc.SpellCheckComponent.inform Initializing spell checkers
[junit4:junit4]   2> 4013 T601 oass.DirectSolrSpellChecker.init init: {name=direct,classname=DirectSolrSpellChecker,field=lowerfilt,minQueryLength=3}
[junit4:junit4]   2> 4024 T636 oasc.SolrCore.registerSearcher [collection1] Registered new searcher Searcher@5cdbc420 main{StandardDirectoryReader(segments_1:1)}
[junit4:junit4]   2> 4029 T601 oasc.CoreContainer.register registering core: collection1
[junit4:junit4]   2> 4030 T601 oasc.ZkController.register Register shard - core:collection1 address:http://127.0.0.1:54546/solr shardId:shard3
[junit4:junit4]   2> 4030 T601 oascc.SolrZkClient.makePath makePath: /collections/collection1/leader_elect/shard3/election
[junit4:junit4]   2> 4049 T606 oazs.PrepRequestProcessor.pRequest Got user-level KeeperException when processing sessionid:0x13987af9ee90003 type:delete cxid:0x42 zxid:0xfffffffffffffffe txntype:unknown reqpath:n/a Error Path:/solr/collections/collection1/leaders Error:KeeperErrorCode = NoNode for /solr/collections/collection1/leaders
[junit4:junit4]   2> 4051 T606 oazs.PrepRequestProcessor.pRequest Got user-level KeeperException when processing sessionid:0x13987af9ee90003 type:create cxid:0x43 zxid:0xfffffffffffffffe txntype:unknown reqpath:n/a Error Path:/solr/overseer Error:KeeperErrorCode = NodeExists for /solr/overseer
[junit4:junit4]   2> 4063 T601 oasc.ShardLeaderElectionContext.waitForReplicasToComeUp Running the leader process. afterExperiation=false
[junit4:junit4]   2> 4365 T622 oascc.ZkStateReader.updateClusterState Updating cloud state from ZooKeeper... 
[junit4:junit4]   2> 4384 T635 oascc.ZkStateReader$2.process A cluster state change has occurred - updating...
[junit4:junit4]   2> 4384 T621 oascc.ZkStateReader$2.process A cluster state change has occurred - updating...
[junit4:junit4]   2> 5064 T601 oasc.ShardLeaderElectionContext.waitForReplicasToComeUp Enough replicas found to continue.
[junit4:junit4]   2> 5064 T601 oasc.ShardLeaderElectionContext.runLeaderProcess I am the new leader: http://127.0.0.1:54546/solr/collection1/
[junit4:junit4]   2> 5566 T601 oascc.SolrZkClient.makePath makePath: /collections/collection1/leaders/shard3
[junit4:junit4]   2> 5571 T606 oazs.PrepRequestProcessor.pRequest Got user-level KeeperException when processing sessionid:0x13987af9ee90003 type:create cxid:0x4d zxid:0xfffffffffffffffe txntype:unknown reqpath:n/a Error Path:/solr/overseer Error:KeeperErrorCode = NodeExists for /solr/overseer
[junit4:junit4]   2> 5901 T622 oascc.ZkStateReader.updateClusterState Updating cloud state from ZooKeeper... 
[junit4:junit4]   2> 5916 T621 oascc.ZkStateReader$2.process A cluster state change has occurred - updating...
[junit4:junit4]   2> 5916 T635 oascc.ZkStateReader$2.process A cluster state change has occurred - updating...
[junit4:junit4]   2> 5926 T601 oasc.ZkController.register We are http://127.0.0.1:54546/solr/collection1/ and leader is http://127.0.0.1:54546/solr/collection1/
[junit4:junit4]   2> 5926 T601 oasc.ZkController.register No LogReplay needed for core=collection1 baseURL=http://127.0.0.1:54546/solr
[junit4:junit4]   2> 5927 T601 oasc.ZkController.checkRecovery I am the leader, no recovery necessary
[junit4:junit4]   2> 5929 T601 oascc.ZkStateReader.updateClusterState Updating cloud state from ZooKeeper... 
[junit4:junit4]   2> 5930 T601 oass.SolrDispatchFilter.init user.dir=/usr/home/hudson/hudson-slave/workspace/Lucene-Solr-Tests-trunk-java7/solr/build/solr-core/test/J0
[junit4:junit4]   2> 5930 T601 oass.SolrDispatchFilter.init SolrDispatchFilter.init() done
[junit4:junit4]   2> 5931 T601 oascsi.HttpClientUtil.createClient Creating new http client, config:maxConnections=128&maxConnectionsPerHost=32&followRedirects=false
[junit4:junit4]   2> 6114 T601 oejs.Server.doStart jetty-8.1.2.v20120308
[junit4:junit4]   2> 6118 T601 oejs.AbstractConnector.doStart Started SocketConnector@0.0.0.0:10401
[junit4:junit4]   2> 6118 T601 oasc.SolrResourceLoader.locateSolrHome JNDI not configured for solr (NoInitialContextEx)
[junit4:junit4]   2> 6119 T601 oasc.SolrResourceLoader.locateSolrHome using system property solr.solr.home: /usr/home/hudson/hudson-slave/workspace/Lucene-Solr-Tests-trunk-java7/solr/build/solr-core/test-files/jetty3
[junit4:junit4]   2> 6119 T601 oasc.SolrResourceLoader.<init> new SolrResourceLoader for deduced Solr Home: '/usr/home/hudson/hudson-slave/workspace/Lucene-Solr-Tests-trunk-java7/solr/build/solr-core/test-files/jetty3/'
[junit4:junit4]   2> 6161 T601 oass.SolrDispatchFilter.init SolrDispatchFilter.init()
[junit4:junit4]   2> 6161 T601 oasc.SolrResourceLoader.locateSolrHome JNDI not configured for solr (NoInitialContextEx)
[junit4:junit4]   2> 6162 T601 oasc.SolrResourceLoader.locateSolrHome using system property solr.solr.home: /usr/home/hudson/hudson-slave/workspace/Lucene-Solr-Tests-trunk-java7/solr/build/solr-core/test-files/jetty3
[junit4:junit4]   2> 6162 T601 oasc.CoreContainer$Initializer.initialize looking for solr.xml: /usr/home/hudson/hudson-slave/workspace/Lucene-Solr-Tests-trunk-java7/solr/build/solr-core/test-files/jetty3/solr.xml
[junit4:junit4]   2> 6163 T601 oasc.CoreContainer.<init> New CoreContainer 29135429
[junit4:junit4]   2> 6163 T601 oasc.CoreContainer.load Loading CoreContainer using Solr Home: '/usr/home/hudson/hudson-slave/workspace/Lucene-Solr-Tests-trunk-java7/solr/build/solr-core/test-files/jetty3/'
[junit4:junit4]   2> 6164 T601 oasc.SolrResourceLoader.<init> new SolrResourceLoader for directory: '/usr/home/hudson/hudson-slave/workspace/Lucene-Solr-Tests-trunk-java7/solr/build/solr-core/test-files/jetty3/'
[junit4:junit4]   2> 6194 T601 oasc.CoreContainer.load Registering Log Listener
[junit4:junit4]   2> 6207 T601 oasc.CoreContainer.initZooKeeper Zookeeper client=127.0.0.1:38809/solr
[junit4:junit4]   2> 6208 T601 oaz.ZooKeeper.<init> Initiating client connection, connectString=127.0.0.1:38809/solr sessionTimeout=8000 watcher=org.apache.solr.common.cloud.ConnectionManager@2fe5e175
[junit4:junit4]   2> 6209 T646 oaz.ClientCnxn$SendThread.startConnect Opening socket connection to server /127.0.0.1:38809
[junit4:junit4]   2> 6209 T601 oascc.ConnectionManager.waitForConnected Waiting for client to connect to ZooKeeper
[junit4:junit4]   2> 6210 T646 oaz.ClientCnxn$SendThread.primeConnection Socket connection established to localhost/127.0.0.1:38809, initiating session
[junit4:junit4]   2> 6210 T603 oazs.NIOServerCnxn$Factory.run Accepted socket connection from /140.211.11.196:49717
[junit4:junit4]   2> 6211 T603 oazs.NIOServerCnxn.readConnectRequest Client attempting to establish new session at /140.211.11.196:49717
[junit4:junit4]   2> 6213 T605 oazs.NIOServerCnxn.finishSessionInit Established session 0x13987af9ee90004 with negotiated timeout 8000 for client /140.211.11.196:49717
[junit4:junit4]   2> 6214 T646 oaz.ClientCnxn$SendThread.readConnectResult Session establishment complete on server localhost/127.0.0.1:38809, sessionid = 0x13987af9ee90004, negotiated timeout = 8000
[junit4:junit4]   2> 6214 T647 oascc.ConnectionManager.process Watcher org.apache.solr.common.cloud.ConnectionManager@2fe5e175 name:ZooKeeperConnection Watcher:127.0.0.1:38809/solr got event WatchedEvent state:SyncConnected type:None path:null path:null type:None
[junit4:junit4]   2> 6214 T601 oascc.ConnectionManager.waitForConnected Client is connected to ZooKeeper
[junit4:junit4]   2> 6215 T606 oazs.PrepRequestProcessor.pRequest Got user-level KeeperException when processing sessionid:0x13987af9ee90004 type:create cxid:0x1 zxid:0xfffffffffffffffe txntype:unknown reqpath:n/a Error Path:/solr/overseer Error:KeeperErrorCode = NodeExists for /solr/overseer
[junit4:junit4]   2> 6227 T606 oazs.PrepRequestProcessor.pRequest Got user-level KeeperException when processing sessionid:0x13987af9ee90004 type:create cxid:0x2 zxid:0xfffffffffffffffe txntype:unknown reqpath:n/a Error Path:/solr/overseer Error:KeeperErrorCode = NodeExists for /solr/overseer
[junit4:junit4]   2> 6229 T601 oasc.ZkController.createEphemeralLiveNode Register node as live in ZooKeeper:/live_nodes/127.0.0.1:10401_solr
[junit4:junit4]   2> 6229 T606 oazs.PrepRequestProcessor.pRequest Got user-level KeeperException when processing sessionid:0x13987af9ee90004 type:delete cxid:0x4 zxid:0xfffffffffffffffe txntype:unknown reqpath:n/a Error Path:/solr/live_nodes/127.0.0.1:10401_solr Error:KeeperErrorCode = NoNode for /solr/live_nodes/127.0.0.1:10401_solr
[junit4:junit4]   2> 6231 T601 oascc.SolrZkClient.makePath makePath: /live_nodes/127.0.0.1:10401_solr
[junit4:junit4]   2> 6233 T635 oascc.ZkStateReader$3.process Updating live nodes
[junit4:junit4]   2> 6233 T621 oascc.ZkStateReader$3.process Updating live nodes
[junit4:junit4]   2> 6234 T601 oashc.HttpShardHandlerFactory.getParameter Setting socketTimeout to: 0
[junit4:junit4]   2> 6234 T601 oashc.HttpShardHandlerFactory.getParameter Setting urlScheme to: http://
[junit4:junit4]   2> 6235 T601 oashc.HttpShardHandlerFactory.getParameter Setting connTimeout to: 0
[junit4:junit4]   2> 6235 T601 oashc.HttpShardHandlerFactory.getParameter Setting maxConnectionsPerHost to: 20
[junit4:junit4]   2> 6236 T601 oashc.HttpShardHandlerFactory.getParameter Setting corePoolSize to: 0
[junit4:junit4]   2> 6236 T601 oashc.HttpShardHandlerFactory.getParameter Setting maximumPoolSize to: 2147483647
[junit4:junit4]   2> 6237 T601 oashc.HttpShardHandlerFactory.getParameter Setting maxThreadIdleTime to: 5
[junit4:junit4]   2> 6237 T601 oashc.HttpShardHandlerFactory.getParameter Setting sizeOfQueue to: -1
[junit4:junit4]   2> 6238 T601 oashc.HttpShardHandlerFactory.getParameter Setting fairnessPolicy to: false
[junit4:junit4]   2> 6238 T601 oascsi.HttpClientUtil.createClient Creating new http client, config:maxConnectionsPerHost=20&maxConnections=10000&socketTimeout=0&connTimeout=0&retry=false
[junit4:junit4]   2> 6257 T601 oascc.ZkStateReader.createClusterStateWatchersAndUpdate Updating cluster state from ZooKeeper... 
[junit4:junit4]   2> 6263 T601 oasc.CoreContainer.create Creating SolrCore 'collection1' using instanceDir: /usr/home/hudson/hudson-slave/workspace/Lucene-Solr-Tests-trunk-java7/solr/build/solr-core/test-files/jetty3/collection1
[junit4:junit4]   2> 6264 T601 oasc.ZkController.createCollectionZkNode Check for collection zkNode:collection1
[junit4:junit4]   2> 6265 T601 oasc.ZkController.createCollectionZkNode Collection zkNode exists
[junit4:junit4]   2> 6265 T601 oasc.ZkController.readConfigName Load collection config from:/collections/collection1
[junit4:junit4]   2> 6267 T601 oasc.SolrResourceLoader.<init> new SolrResourceLoader for directory: '/usr/home/hudson/hudson-slave/workspace/Lucene-Solr-Tests-trunk-java7/solr/build/solr-core/test-files/jetty3/collection1/'
[junit4:junit4]   2> 6268 T601 oasc.SolrResourceLoader.replaceClassLoader Adding 'file:/usr/home/hudson/hudson-slave/workspace/Lucene-Solr-Tests-trunk-java7/solr/build/solr-core/test-files/jetty3/collection1/lib/classes/' to classloader
[junit4:junit4]   2> 6269 T601 oasc.SolrResourceLoader.replaceClassLoader Adding 'file:/usr/home/hudson/hudson-slave/workspace/Lucene-Solr-Tests-trunk-java7/solr/build/solr-core/test-files/jetty3/collection1/lib/README' to classloader
[junit4:junit4]   2> 6317 T601 oasc.SolrConfig.<init> Using Lucene MatchVersion: LUCENE_50
[junit4:junit4]   2> 6382 T601 oasc.SolrConfig.<init> Loaded SolrConfig: solrconfig.xml
[junit4:junit4]   2> 6420 T622 oascc.ZkStateReader.updateClusterState Updating cloud state from ZooKeeper... 
[junit4:junit4]   2> 6434 T635 oascc.ZkStateReader$2.process A cluster state change has occurred - updating...
[junit4:junit4]   2> 6434 T621 oascc.ZkStateReader$2.process A cluster state change has occurred - updating...
[junit4:junit4]   2> 6483 T647 oascc.ZkStateReader$2.process A cluster state change has occurred - updating...
[junit4:junit4]   2> 6483 T601 oass.IndexSchema.readSchema Reading Solr Schema
[junit4:junit4]   2> 6489 T601 oass.IndexSchema.readSchema Schema name=test
[junit4:junit4]   2> 7685 T601 oass.OpenExchangeRatesOrgProvider.init Initialized with rates=open-exchange-rates.json, refreshInterval=1440.
[junit4:junit4]   2> 7692 T601 oass.IndexSchema.readSchema default search field in schema is text
[junit4:junit4]   2> 7695 T601 oass.IndexSchema.readSchema unique key field: id
[junit4:junit4]   2> 7707 T601 oass.FileExchangeRateProvider.reload Reloading exchange rates from file currency.xml
[junit4:junit4]   2> 7711 T601 oass.FileExchangeRateProvider.reload Reloading exchange rates from file currency.xml
[junit4:junit4]   2> 7714 T601 oass.OpenExchangeRatesOrgProvider.reload Reloading exchange rates from open-exchange-rates.json
[junit4:junit4]   2> 7715 T601 oass.OpenExchangeRatesOrgProvider.reload Reloading exchange rates from open-exchange-rates.json
[junit4:junit4]   2> 7716 T601 oasc.SolrCore.<init> [collection1] Opening new SolrCore at /usr/home/hudson/hudson-slave/workspace/Lucene-Solr-Tests-trunk-java7/solr/build/solr-core/test-files/jetty3/collection1/, dataDir=/usr/home/hudson/hudson-slave/workspace/Lucene-Solr-Tests-trunk-java7/solr/build/solr-core/test-files/jetty3/collection1/data/
[junit4:junit4]   2> 7717 T601 oasc.JmxMonitoredMap.<init> JMX monitoring is enabled. Adding Solr mbeans to JMX Server: com.sun.jmx.mbeanserver.JmxMBeanServer@54dc2b4c
[junit4:junit4]   2> 7718 T601 oasc.SolrCore.getNewIndexDir WARNING New index directory detected: old=null new=/usr/home/hudson/hudson-slave/workspace/Lucene-Solr-Tests-trunk-java7/solr/build/solr-core/test-files/jetty3/collection1/data/index/
[junit4:junit4]   2> 7718 T601 oasc.SolrCore.initIndex WARNING [collection1] Solr index directory '/usr/home/hudson/hudson-slave/workspace/Lucene-Solr-Tests-trunk-java7/solr/build/solr-core/test-files/jetty3/collection1/data/index' doesn't exist. Creating new index...
[junit4:junit4]   2> 7719 T601 oasc.CachingDirectoryFactory.get return new directory for /usr/home/hudson/hudson-slave/workspace/Lucene-Solr-Tests-trunk-java7/solr/build/solr-core/test-files/jetty3/collection1/data/index forceNew:false
[junit4:junit4]   2> 7723 T601 oasc.SolrDeletionPolicy.onCommit SolrDeletionPolicy.onCommit: commits:num=1
[junit4:junit4]   2> 		commit{dir=/usr/home/hudson/hudson-slave/workspace/Lucene-Solr-Tests-trunk-java7/solr/build/solr-core/test-files/jetty3/collection1/data/index,segFN=segments_1,generation=1,filenames=[segments_1]
[junit4:junit4]   2> 7723 T601 oasc.SolrDeletionPolicy.updateCommits newest commit = 1
[junit4:junit4]   2> 7724 T601 oasc.SolrCore.initWriters created xml: solr.XMLResponseWriter
[junit4:junit4]   2> 7726 T601 oasup.UpdateRequestProcessorChain.init inserting DistributedUpdateProcessorFactory into updateRequestProcessorChain "dedupe"
[junit4:junit4]   2> 7726 T601 oasup.UpdateRequestProcessorChain.init inserting DistributedUpdateProcessorFactory into updateRequestProcessorChain "dedupe-allfields"
[junit4:junit4]   2> 7727 T601 oasup.UpdateRequestProcessorChain.init inserting DistributedUpdateProcessorFactory into updateRequestProcessorChain "stored_sig"
[junit4:junit4]   2> 7727 T601 oasup.UpdateRequestProcessorChain.init inserting DistributedUpdateProcessorFactory into updateRequestProcessorChain "uniq-fields"
[junit4:junit4]   2> 7728 T601 oasup.UpdateRequestProcessorChain.init inserting DistributedUpdateProcessorFactory into updateRequestProcessorChain "distrib-dup-test-chain-implicit"
[junit4:junit4]   2> 7728 T601 oasc.RequestHandlers.initHandlersFromConfig adding lazy requestHandler: solr.ReplicationHandler
[junit4:junit4]   2> 7729 T601 oasc.RequestHandlers.initHandlersFromConfig created /replication: solr.ReplicationHandler
[junit4:junit4]   2> 7729 T601 oasc.RequestHandlers.initHandlersFromConfig created standard: solr.StandardRequestHandler
[junit4:junit4]   2> 7730 T601 oasc.RequestHandlers.initHandlersFromConfig created /get: solr.RealTimeGetHandler
[junit4:junit4]   2> 7730 T601 oasc.RequestHandlers.initHandlersFromConfig created dismax: solr.SearchHandler
[junit4:junit4]   2> 7731 T601 oasc.RequestHandlers.initHandlersFromConfig created mock: org.apache.solr.core.MockQuerySenderListenerReqHandler
[junit4:junit4]   2> 7731 T601 oasc.RequestHandlers.initHandlersFromConfig created /admin/: org.apache.solr.handler.admin.AdminHandlers
[junit4:junit4]   2> 7732 T601 oasc.RequestHandlers.initHandlersFromConfig created defaults: solr.StandardRequestHandler
[junit4:junit4]   2> 7732 T601 oasc.RequestHandlers.initHandlersFromConfig adding lazy requestHandler: solr.StandardRequestHandler
[junit4:junit4]   2> 7732 T601 oasc.RequestHandlers.initHandlersFromConfig created lazy: solr.StandardRequestHandler
[junit4:junit4]   2> 7733 T601 oasc.RequestHandlers.initHandlersFromConfig created /update: solr.UpdateRequestHandler
[junit4:junit4]   2> 7733 T601 oasc.RequestHandlers.initHandlersFromConfig created /terms: org.apache.solr.handler.component.SearchHandler
[junit4:junit4]   2> 7734 T601 oasc.RequestHandlers.initHandlersFromConfig created spellCheckCompRH: org.apache.solr.handler.component.SearchHandler
[junit4:junit4]   2> 7734 T601 oasc.RequestHandlers.initHandlersFromConfig created spellCheckCompRH_Direct: org.apache.solr.handler.component.SearchHandler
[junit4:junit4]   2> 7735 T601 oasc.RequestHandlers.initHandlersFromConfig created spellCheckWithWordbreak: org.apache.solr.handler.component.SearchHandler
[junit4:junit4]   2> 7736 T601 oasc.RequestHandlers.initHandlersFromConfig created spellCheckWithWordbreak_Direct: org.apache.solr.handler.component.SearchHandler
[junit4:junit4]   2> 7736 T601 oasc.RequestHandlers.initHandlersFromConfig created spellCheckCompRH1: org.apache.solr.handler.component.SearchHandler
[junit4:junit4]   2> 7737 T601 oasc.RequestHandlers.initHandlersFromConfig created tvrh: org.apache.solr.handler.component.SearchHandler
[junit4:junit4]   2> 7737 T601 oasc.RequestHandlers.initHandlersFromConfig created /mlt: solr.MoreLikeThisHandler
[junit4:junit4]   2> 7738 T601 oasc.RequestHandlers.initHandlersFromConfig created /debug/dump: solr.DumpRequestHandler
[junit4:junit4]   2> 7740 T601 oashl.XMLLoader.init xsltCacheLifetimeSeconds=60
[junit4:junit4]   2> 7743 T601 oasc.SolrCore.initDeprecatedSupport WARNING solrconfig.xml uses deprecated <admin/gettableFiles>, Please update your config to use the ShowFileRequestHandler.
[junit4:junit4]   2> 7744 T601 oasc.SolrCore.initDeprecatedSupport WARNING adding ShowFileRequestHandler with hidden files: [SCHEMA.XML, OLD_SYNONYMS.TXT, STOPWORDS.TXT, PROTWORDS.TXT, OPEN-EXCHANGE-RATES.JSON, SYNONYMS.TXT, CURRENCY.XML, MAPPING-ISOLATIN1ACCENT.TXT]
[junit4:junit4]   2> 7747 T601 oass.SolrIndexSearcher.<init> Opening Searcher@67a97d1f main
[junit4:junit4]   2> 7748 T601 oasu.CommitTracker.<init> Hard AutoCommit: disabled
[junit4:junit4]   2> 7748 T601 oasu.CommitTracker.<init> Soft AutoCommit: disabled
[junit4:junit4]   2> 7749 T601 oashc.SpellCheckComponent.inform Initializing spell checkers
[junit4:junit4]   2> 7751 T601 oass.DirectSolrSpellChecker.init init: {name=direct,classname=DirectSolrSpellChecker,field=lowerfilt,minQueryLength=3}
[junit4:junit4]   2> 7762 T648 oasc.SolrCore.registerSearcher [collection1] Registered new searcher Searcher@67a97d1f main{StandardDirectoryReader(segments_1:1)}
[junit4:junit4]   2> 7767 T601 oasc.CoreContainer.register registering core: collection1
[junit4:junit4]   2> 7768 T601 oasc.ZkController.register Register shard - core:collection1 address:http://127.0.0.1:10401/solr shardId:shard4
[junit4:junit4]   2> 7768 T601 oascc.SolrZkClient.makePath makePath: /collections/collection1/leader_elect/shard4/election
[junit4:junit4]   2> 7780 T606 oazs.PrepRequestProcessor.pRequest Got user-level KeeperException when processing sessionid:0x13987af9ee90004 type:delete cxid:0x41 zxid:0xfffffffffffffffe txntype:unknown reqpath:n/a Error Path:/solr/collections/collection1/leaders/shard4 Error:KeeperErrorCode = NoNode for /solr/collections/collection1/leaders/shard4
[junit4:junit4]   2> 7786 T606 oazs.PrepRequestProcessor.pRequest Got user-level KeeperException when processing sessionid:0x13987af9ee90004 type:create cxid:0x42 zxid:0xfffffffffffffffe txntype:unknown reqpath:n/a Error Path:/solr/overseer Error:KeeperErrorCode = NodeExists for /solr/overseer
[junit4:junit4]   2> 7788 T601 oasc.ShardLeaderElectionContext.waitForReplicasToComeUp Running the leader process. afterExperiation=false
[junit4:junit4]   2> 7938 T622 oascc.ZkStateReader.updateClusterState Updating cloud state from ZooKeeper... 
[junit4:junit4]   2> 7984 T647 oascc.ZkStateReader$2.process A cluster state change has occurred - updating...
[junit4:junit4]   2> 7984 T621 oascc.ZkStateReader$2.process A cluster state change has occurred - updating...
[junit4:junit4]   2> 7984 T635 oascc.ZkStateReader$2.process A cluster state change has occurred - updating...
[junit4:junit4]   2> 8789 T601 oasc.ShardLeaderElectionContext.waitForReplicasToComeUp Enough replicas found to continue.
[junit4:junit4]   2> 8789 T601 oasc.ShardLeaderElectionContext.runLeaderProcess I am the new leader: http://127.0.0.1:10401/solr/collection1/
[junit4:junit4]   2> 9291 T601 oascc.SolrZkClient.makePath makePath: /collections/collection1/leaders/shard4
[junit4:junit4]   2> 9295 T606 oazs.PrepRequestProcessor.pRequest Got user-level KeeperException when processing sessionid:0x13987af9ee90004 type:create cxid:0x4b zxid:0xfffffffffffffffe txntype:unknown reqpath:n/a Error Path:/solr/overseer Error:KeeperErrorCode = NodeExists for /solr/overseer
[junit4:junit4]   2> 9501 T622 oascc.ZkStateReader.updateClusterState Updating cloud state from ZooKeeper... 
[junit4:junit4]   2> 9517 T635 oascc.ZkStateReader$2.process A cluster state change has occurred - updating...
[junit4:junit4]   2> 9517 T621 oascc.ZkStateReader$2.process A cluster state change has occurred - updating...
[junit4:junit4]   2> 9517 T647 oascc.ZkStateReader$2.process A cluster state change has occurred - updating...
[junit4:junit4]   2> 9562 T601 oasc.ZkController.register We are http://127.0.0.1:10401/solr/collection1/ and leader is http://127.0.0.1:10401/solr/collection1/
[junit4:junit4]   2> 9562 T601 oasc.ZkController.register No LogReplay needed for core=collection1 baseURL=http://127.0.0.1:10401/solr
[junit4:junit4]   2> 9563 T601 oasc.ZkController.checkRecovery I am the leader, no recovery necessary
[junit4:junit4]   2> 9565 T601 oascc.ZkStateReader.updateClusterState Updating cloud state from ZooKeeper... 
[junit4:junit4]   2> 9566 T601 oass.SolrDispatchFilter.init user.dir=/usr/home/hudson/hudson-slave/workspace/Lucene-Solr-Tests-trunk-java7/solr/build/solr-core/test/J0
[junit4:junit4]   2> 9566 T601 oass.SolrDispatchFilter.init SolrDispatchFilter.init() done
[junit4:junit4]   2> 9567 T601 oascsi.HttpClientUtil.createClient Creating new http client, config:maxConnections=128&maxConnectionsPerHost=32&followRedirects=false
[junit4:junit4]   2> 9753 T601 oejs.Server.doStart jetty-8.1.2.v20120308
[junit4:junit4]   2> 9756 T601 oejs.AbstractConnector.doStart Started SocketConnector@0.0.0.0:48701
[junit4:junit4]   2> 9757 T601 oasc.SolrResourceLoader.locateSolrHome JNDI not configured for solr (NoInitialContextEx)
[junit4:junit4]   2> 9758 T601 oasc.SolrResourceLoader.locateSolrHome using system property solr.solr.home: /usr/home/hudson/hudson-slave/workspace/Lucene-Solr-Tests-trunk-java7/solr/build/solr-core/test-files/jetty4
[junit4:junit4]   2> 9758 T601 oasc.SolrResourceLoader.<init> new SolrResourceLoader for deduced Solr Home: '/usr/home/hudson/hudson-slave/workspace/Lucene-Solr-Tests-trunk-java7/solr/build/solr-core/test-files/jetty4/'
[junit4:junit4]   2> 9800 T601 oass.SolrDispatchFilter.init SolrDispatchFilter.init()
[junit4:junit4]   2> 9801 T601 oasc.SolrResourceLoader.locateSolrHome JNDI not configured for solr (NoInitialContextEx)
[junit4:junit4]   2> 9801 T601 oasc.SolrResourceLoader.locateSolrHome using system property solr.solr.home: /usr/home/hudson/hudson-slave/workspace/Lucene-Solr-Tests-trunk-java7/solr/build/solr-core/test-files/jetty4
[junit4:junit4]   2> 9801 T601 oasc.CoreContainer$Initializer.initialize looking for solr.xml: /usr/home/hudson/hudson-slave/workspace/Lucene-Solr-Tests-trunk-java7/solr/build/solr-core/test-files/jetty4/solr.xml
[junit4:junit4]   2> 9802 T601 oasc.CoreContainer.<init> New CoreContainer 577166317
[junit4:junit4]   2> 9803 T601 oasc.CoreContainer.load Loading CoreContainer using Solr Home: '/usr/home/hudson/hudson-slave/workspace/Lucene-Solr-Tests-trunk-java7/solr/build/solr-core/test-files/jetty4/'
[junit4:junit4]   2> 9803 T601 oasc.SolrResourceLoader.<init> new SolrResourceLoader for directory: '/usr/home/hudson/hudson-slave/workspace/Lucene-Solr-Tests-trunk-java7/solr/build/solr-core/test-files/jetty4/'
[junit4:junit4]   2> 9833 T601 oasc.CoreContainer.load Registering Log Listener
[junit4:junit4]   2> 9846 T601 oasc.CoreContainer.initZooKeeper Zookeeper client=127.0.0.1:38809/solr
[junit4:junit4]   2> 9847 T601 oaz.ZooKeeper.<init> Initiating client connection, connectString=127.0.0.1:38809/solr sessionTimeout=8000 watcher=org.apache.solr.common.cloud.ConnectionManager@59c8e870
[junit4:junit4]   2> 9848 T658 oaz.ClientCnxn$SendThread.startConnect Opening socket connection to server /127.0.0.1:38809
[junit4:junit4]   2> 9848 T601 oascc.ConnectionManager.waitForConnected Waiting for client to connect to ZooKeeper
[junit4:junit4]   2> 9849 T658 oaz.ClientCnxn$SendThread.primeConnection Socket connection established to localhost/127.0.0.1:38809, initiating session
[junit4:junit4]   2> 9850 T603 oazs.NIOServerCnxn$Factory.run Accepted socket connection from /140.211.11.196:15952
[junit4:junit4]   2> 9850 T603 oazs.NIOServerCnxn.readConnectRequest Client attempting to establish new session at /140.211.11.196:15952
[junit4:junit4]   2> 9853 T605 oazs.NIOServerCnxn.finishSessionInit Established session 0x13987af9ee90005 with negotiated timeout 8000 for client /140.211.11.196:15952
[junit4:junit4]   2> 9853 T658 oaz.ClientCnxn$SendThread.readConnectResult Session establishment complete on server localhost/127.0.0.1:38809, sessionid = 0x13987af9ee90005, negotiated timeout = 8000
[junit4:junit4]   2> 9853 T659 oascc.ConnectionManager.process Watcher org.apache.solr.common.cloud.ConnectionManager@59c8e870 name:ZooKeeperConnection Watcher:127.0.0.1:38809/solr got event WatchedEvent state:SyncConnected type:None path:null path:null type:None
[junit4:junit4]   2> 9853 T601 oascc.ConnectionManager.waitForConnected Client is connected to ZooKeeper
[junit4:junit4]   2> 9854 T606 oazs.PrepRequestProcessor.pRequest Got user-level KeeperException when processing sessionid:0x13987af9ee90005 type:create cxid:0x1 zxid:0xfffffffffffffffe txntype:unknown reqpath:n/a Error Path:/solr/overseer Error:KeeperErrorCode = NodeExists for /solr/overseer
[junit4:junit4]   2> 9869 T606 oazs.PrepRequestProcessor.pRequest Got user-level KeeperException when processing sessionid:0x13987af9ee90005 type:create cxid:0x2 zxid:0xfffffffffffffffe txntype:unknown reqpath:n/a Error Path:/solr/overseer Error:KeeperErrorCode = NodeExists for /solr/overseer
[junit4:junit4]   2> 9871 T601 oasc.ZkController.createEphemeralLiveNode Register node as live in ZooKeeper:/live_nodes/127.0.0.1:48701_solr
[junit4:junit4]   2> 9871 T606 oazs.PrepRequestProcessor.pRequest Got user-level KeeperException when processing sessionid:0x13987af9ee90005 type:delete cxid:0x4 zxid:0xfffffffffffffffe txntype:unknown reqpath:n/a Error Path:/solr/live_nodes/127.0.0.1:48701_solr Error:KeeperErrorCode = NoNode for /solr/live_nodes/127.0.0.1:48701_solr
[junit4:junit4]   2> 9878 T601 oascc.SolrZkClient.makePath makePath: /live_nodes/127.0.0.1:48701_solr
[junit4:junit4]   2> 9880 T647 oascc.ZkStateReader$3.process Updating live nodes
[junit4:junit4]   2> 9880 T621 oascc.ZkStateReader$3.process Updating live nodes
[junit4:junit4]   2> 9880 T635 oascc.ZkStateReader$3.process Updating live nodes
[junit4:junit4]   2> 9881 T601 oashc.HttpShardHandlerFactory.getParameter Setting socketTimeout to: 0
[junit4:junit4]   2> 9881 T601 oashc.HttpShardHandlerFactory.getParameter Setting urlScheme to: http://
[junit4:junit4]   2> 9882 T601 oashc.HttpShardHandlerFactory.getParameter Setting connTimeout to: 0
[junit4:junit4]   2> 9882 T601 oashc.HttpShardHandlerFactory.getParameter Setting maxConnectionsPerHost to: 20
[junit4:junit4]   2> 9883 T601 oashc.HttpShardHandlerFactory.getParameter Setting corePoolSize to: 0
[junit4:junit4]   2> 9883 T601 oashc.HttpShardHandlerFactory.getParameter Setting maximumPoolSize to: 2147483647
[junit4:junit4]   2> 9884 T601 oashc.HttpShardHandlerFactory.getParameter Setting maxThreadIdleTime to: 5
[junit4:junit4]   2> 9884 T601 oashc.HttpShardHandlerFactory.getParameter Setting sizeOfQueue to: -1
[junit4:junit4]   2> 9885 T601 oashc.HttpShardHandlerFactory.getParameter Setting fairnessPolicy to: false
[junit4:junit4]   2> 9885 T601 oascsi.HttpClientUtil.createClient Creating new http client, config:maxConnectionsPerHost=20&maxConnections=10000&socketTimeout=0&connTimeout=0&retry=false
[junit4:junit4]   2> 9914 T601 oascc.ZkStateReader.createClusterStateWatchersAndUpdate Updating cluster state from ZooKeeper... 
[junit4:junit4]   2> 9921 T601 oasc.CoreContainer.create Creating SolrCore 'collection1' using instanceDir: /usr/home/hudson/hudson-slave/workspace/Lucene-Solr-Tests-trunk-java7/solr/build/solr-core/test-files/jetty4/collection1
[junit4:junit4]   2> 9922 T601 oasc.ZkController.createCollectionZkNode Check for collection zkNode:collection1
[junit4:junit4]   2> 9922 T601 oasc.ZkController.createCollectionZkNode Collection zkNode exists
[junit4:junit4]   2> 9923 T601 oasc.ZkController.readConfigName Load collection config from:/collections/collection1
[junit4:junit4]   2> 9924 T601 oasc.SolrResourceLoader.<init> new SolrResourceLoader for directory: '/usr/home/hudson/hudson-slave/workspace/Lucene-Solr-Tests-trunk-java7/solr/build/solr-core/test-files/jetty4/collection1/'
[junit4:junit4]   2> 9926 T601 oasc.SolrResourceLoader.replaceClassLoader Adding 'file:/usr/home/hudson/hudson-slave/workspace/Lucene-Solr-Tests-trunk-java7/solr/build/solr-core/test-files/jetty4/collection1/lib/classes/' to classloader
[junit4:junit4]   2> 9926 T601 oasc.SolrResourceLoader.replaceClassLoader Adding 'file:/usr/home/hudson/hudson-slave/workspace/Lucene-Solr-Tests-trunk-java7/solr/build/solr-core/test-files/jetty4/collection1/lib/README' to classloader
[junit4:junit4]   2> 9974 T601 oasc.SolrConfig.<init> Using Lucene MatchVersion: LUCENE_50
[junit4:junit4]   2> 10021 T622 oascc.ZkStateReader.updateClusterState Updating cloud state from ZooKeeper... 
[junit4:junit4]   2> 10035 T647 oascc.ZkStateReader$2.process A cluster state change has occurred - updating...
[junit4:junit4]   2> 10035 T659 oascc.ZkStateReader$2.process A cluster state change has occurred - updating...
[junit4:junit4]   2> 10035 T621 oascc.ZkStateReader$2.process A cluster state change has occurred - updating...
[junit4:junit4]   2> 10035 T635 oascc.ZkStateReader$2.process A cluster state change has occurred - updating...
[junit4:junit4]   2> 10041 T601 oasc.SolrConfig.<init> Loaded SolrConfig: solrconfig.xml
[junit4:junit4]   2> 10141 T601 oass.IndexSchema.readSchema Reading Solr Schema
[junit4:junit4]   2> 10147 T601 oass.IndexSchema.readSchema Schema name=test
[junit4:junit4]   2> 10749 T601 oass.OpenExchangeRatesOrgProvider.init Initialized with rates=open-exchange-rates.json, refreshInterval=1440.
[junit4:junit4]   2> 10760 T601 oass.IndexSchema.readSchema default search field in schema is text
[junit4:junit4]   2> 10764 T601 oass.IndexSchema.readSchema unique key field: id
[junit4:junit4]   2> 10778 T601 oass.FileExchangeRateProvider.reload Reloading exchange rates from file currency.xml
[junit4:junit4]   2> 10783 T601 oass.FileExchangeRateProvider.reload Reloading exchange rates from file currency.xml
[junit4:junit4]   2> 10787 T601 oass.OpenExchangeRatesOrgProvider.reload Reloading exchange rates from open-exchange-rates.json
[junit4:junit4]   2> 10789 T601 oass.OpenExchangeRatesOrgProvider.reload Reloading exchange rates from open-exchange-rates.json
[junit4:junit4]   2> 10790 T601 oasc.SolrCore.<init> [collection1] Opening new SolrCore at /usr/home/hudson/hudson-slave/workspace/Lucene-Solr-Tests-trunk-java7/solr/build/solr-core/test-files/jetty4/collection1/, dataDir=/usr/home/hudson/hudson-slave/workspace/Lucene-Solr-Tests-trunk-java7/solr/build/solr-core/test-files/jetty4/collection1/data/
[junit4:junit4]   2> 10791 T601 oasc.JmxMonitoredMap.<init> JMX monitoring is enabled. Adding Solr mbeans to JMX Server: com.sun.jmx.mbeanserver.JmxMBeanServer@54dc2b4c
[junit4:junit4]   2> 10792 T601 oasc.SolrCore.getNewIndexDir WARNING New index directory detected: old=null new=/usr/home/hudson/hudson-slave/workspace/Lucene-Solr-Tests-trunk-java7/solr/build/solr-core/test-files/jetty4/collection1/data/index/
[junit4:junit4]   2> 10793 T601 oasc.SolrCore.initIndex WARNING [collection1] Solr index directory '/usr/home/hudson/hudson-slave/workspace/Lucene-Solr-Tests-trunk-java7/solr/build/solr-core/test-files/jetty4/collection1/data/index' doesn't exist. Creating new index...
[junit4:junit4]   2> 10794 T601 oasc.CachingDirectoryFactory.get return new directory for /usr/home/hudson/hudson-slave/workspace/Lucene-Solr-Tests-trunk-java7/solr/build/solr-core/test-files/jetty4/collection1/data/index forceNew:false
[junit4:junit4]   2> 10800 T601 oasc.SolrDeletionPolicy.onCommit SolrDeletionPolicy.onCommit: commits:num=1
[junit4:junit4]   2> 		commit{dir=/usr/home/hudson/hudson-slave/workspace/Lucene-Solr-Tests-trunk-java7/solr/build/solr-core/test-files/jetty4/collection1/data/index,segFN=segments_1,generation=1,filenames=[segments_1]
[junit4:junit4]   2> 10801 T601 oasc.SolrDeletionPolicy.updateCommits newest commit = 1
[junit4:junit4]   2> 10801 T601 oasc.SolrCore.initWriters created xml: solr.XMLResponseWriter
[junit4:junit4]   2> 10804 T601 oasup.UpdateRequestProcessorChain.init inserting DistributedUpdateProcessorFactory into updateRequestProcessorChain "dedupe"
[junit4:junit4]   2> 10805 T601 oasup.UpdateRequestProcessorChain.init inserting DistributedUpdateProcessorFactory into updateRequestProcessorChain "dedupe-allfields"
[junit4:junit4]   2> 10805 T601 oasup.UpdateRequestProcessorChain.init inserting DistributedUpdateProcessorFactory into updateRequestProcessorChain "stored_sig"
[junit4:junit4]   2> 10806 T601 oasup.UpdateRequestProcessorChain.init inserting DistributedUpdateProcessorFactory into updateRequestProcessorChain "uniq-fields"
[junit4:junit4]   2> 10807 T601 oasup.UpdateRequestProcessorChain.init inserting DistributedUpdateProcessorFactory into updateRequestProcessorChain "distrib-dup-test-chain-implicit"
[junit4:junit4]   2> 10807 T601 oasc.RequestHandlers.initHandlersFromConfig adding lazy requestHandler: solr.ReplicationHandler
[junit4:junit4]   2> 10808 T601 oasc.RequestHandlers.initHandlersFromConfig created /replication: solr.ReplicationHandler
[junit4:junit4]   2> 10809 T601 oasc.RequestHandlers.initHandlersFromConfig created standard: solr.StandardRequestHandler
[junit4:junit4]   2> 10810 T601 oasc.RequestHandlers.initHandlersFromConfig created /get: solr.RealTimeGetHandler
[junit4:junit4]   2> 10811 T601 oasc.RequestHandlers.initHandlersFromConfig created dismax: solr.SearchHandler
[junit4:junit4]   2> 10811 T601 oasc.RequestHandlers.initHandlersFromConfig created mock: org.apache.solr.core.MockQuerySenderListenerReqHandler
[junit4:junit4]   2> 10812 T601 oasc.RequestHandlers.initHandlersFromConfig created /admin/: org.apache.solr.handler.admin.AdminHandlers
[junit4:junit4]   2> 10813 T601 oasc.RequestHandlers.initHandlersFromConfig created defaults: solr.StandardRequestHandler
[junit4:junit4]   2> 10813 T601 oasc.RequestHandlers.initHandlersFromConfig adding lazy requestHandler: solr.StandardRequestHandler
[junit4:junit4]   2> 10814 T601 oasc.RequestHandlers.initHandlersFromConfig created lazy: solr.StandardRequestHandler
[junit4:junit4]   2> 10815 T601 oasc.RequestHandlers.initHandlersFromConfig created /update: solr.UpdateRequestHandler
[junit4:junit4]   2> 10815 T601 oasc.RequestHandlers.initHandlersFromConfig created /terms: org.apache.solr.handler.component.SearchHandler
[junit4:junit4]   2> 10816 T601 oasc.RequestHandlers.initHandlersFromConfig created spellCheckCompRH: org.apache.solr.handler.component.SearchHandler
[junit4:junit4]   2> 10817 T601 oasc.RequestHandlers.initHandlersFromConfig created spellCheckCompRH_Direct: org.apache.solr.handler.component.SearchHandler
[junit4:junit4]   2> 10818 T601 oasc.RequestHandlers.initHandlersFromConfig created spellCheckWithWordbreak: org.apache.solr.handler.component.SearchHandler
[junit4:junit4]   2> 10819 T601 oasc.RequestHandlers.initHandlersFromConfig created spellCheckWithWordbreak_Direct: org.apache.solr.handler.component.SearchHandler
[junit4:junit4]   2> 10819 T601 oasc.RequestHandlers.initHandlersFromConfig created spellCheckCompRH1: org.apache.solr.handler.component.SearchHandler
[junit4:junit4]   2> 10820 T601 oasc.RequestHandlers.initHandlersFromConfig created tvrh: org.apache.solr.handler.component.SearchHandler
[junit4:junit4]   2> 10821 T601 oasc.RequestHandlers.initHandlersFromConfig created /mlt: solr.MoreLikeThisHandler
[junit4:junit4]   2> 10822 T601 oasc.RequestHandlers.initHandlersFromConfig created /debug/dump: solr.DumpRequestHandler
[junit4:junit4]   2> 10825 T601 oashl.XMLLoader.init xsltCacheLifetimeSeconds=60
[junit4:junit4]   2> 10830 T601 oasc.SolrCore.initDeprecatedSupport WARNING solrconfig.xml uses deprecated <admin/gettableFiles>, Please update your config to use the ShowFileRequestHandler.
[junit4:junit4]   2> 10831 T601 oasc.SolrCore.initDeprecatedSupport WARNING adding ShowFileRequestHandler with hidden files: [SCHEMA.XML, OLD_SYNONYMS.TXT, STOPWORDS.TXT, PROTWORDS.TXT, OPEN-EXCHANGE-RATES.JSON, SYNONYMS.TXT, CURRENCY.XML, MAPPING-ISOLATIN1ACCENT.TXT]
[junit4:junit4]   2> 10838 T601 oass.SolrIndexSearcher.<init> Opening Searcher@3a4123b1 main
[junit4:junit4]   2> 10840 T601 oasu.CommitTracker.<init> Hard AutoCommit: disabled
[junit4:junit4]   2> 10841 T601 oasu.CommitTracker.<init> Soft AutoCommit: disabled
[junit4:junit4]   2> 10842 T601 oashc.SpellCheckComponent.inform Initializing spell checkers
[junit4:junit4]   2> 10846 T601 oass.DirectSolrSpellChecker.init init: {name=direct,classname=DirectSolrSpellChecker,field=lowerfilt,minQueryLength=3}
[junit4:junit4]   2> 10870 T660 oasc.SolrCore.registerSearcher [collection1] Registered new searcher Searcher@3a4123b1 main{StandardDirectoryReader(segments_1:1)}
[junit4:junit4]   2> 10883 T601 oasc.CoreContainer.register registering core: collection1
[junit4:junit4]   2> 10884 T601 oasc.ZkController.register Register shard - core:collection1 address:http://127.0.0.1:48701/solr shardId:shard5
[junit4:junit4]   2> 10885 T601 oascc.SolrZkClient.makePath makePath: /collections/collection1/leader_elect/shard5/election
[junit4:junit4]   2> 10899 T606 oazs.PrepRequestProcessor.pRequest Got user-level KeeperException when processing sessionid:0x13987af9ee90005 type:delete cxid:0x41 zxid:0xfffffffffffffffe txntype:unknown reqpath:n/a Error Path:/solr/collections/collection1/leaders/shard5 Error:KeeperErrorCode = NoNode for /solr/collections/collection1/leaders/shard5
[junit4:junit4]   2> 10901 T606 oazs.PrepRequestProcessor.pRequest Got user-level KeeperException when processing sessionid:0x13987af9ee90005 type:create cxid:0x42 zxid:0xfffffffffffffffe txntype:unknown reqpath:n/a Error Path:/solr/overseer Error:KeeperErrorCode = NodeExists for /solr/overseer
[junit4:junit4]   2> 10912 T601 oasc.ShardLeaderElectionContext.waitForReplicasToComeUp Running the leader process. afterExperiation=false
[junit4:junit4]   2> 11042 T622 oascc.ZkStateReader.updateClusterState Updating cloud state from ZooKeeper... 
[junit4:junit4]   2> 11067 T635 oascc.ZkStateReader$2.process A cluster state change has occurred - updating...
[junit4:junit4]   2> 11067 T621 oascc.ZkStateReader$2.process A cluster state change has occurred - updating...
[junit4:junit4]   2> 11067 T659 oascc.ZkStateReader$2.process A cluster state change has occurred - updating...
[junit4:junit4]   2> 11067 T647 oascc.ZkStateReader$2.process A cluster state change has occurred - updating...
[junit4:junit4]   2> 11914 T601 oasc.ShardLeaderElectionContext.waitForReplicasToComeUp Enough replicas found to continue.
[junit4:junit4]   2> 11914 T601 oasc.ShardLeaderElectionContext.runLeaderProcess I am the new leader: http://127.0.0.1:48701/solr/collection1/
[junit4:junit4]   2> 12416 T601 oascc.SolrZkClient.makePath makePath: /collections/collection1/leaders/shard5
[junit4:junit4]   2> 12420 T606 oazs.PrepRequestProcessor.pRequest Got user-level KeeperException when processing sessionid:0x13987af9ee90005 type:create cxid:0x4b zxid:0xfffffffffffffffe txntype:unknown reqpath:n/a Error Path:/solr/overseer Error:KeeperErrorCode = NodeExists for /solr/overseer
[junit4:junit4]   2> 12579 T622 oascc.ZkStateReader.updateClusterState Updating cloud state from ZooKeeper... 
[junit4:junit4]   2> 12618 T647 oascc.ZkStateReader$2.process A cluster state change has occurred - updating...
[junit4:junit4]   2> 12618 T621 oascc.ZkStateReader$2.process A cluster state change has occurred - updating...
[junit4:junit4]   2> 12618 T659 oascc.ZkStateReader$2.process A cluster state change has occurred - updating...
[junit4:junit4]   2> 12618 T635 oascc.ZkStateReader$2.process A cluster state change has occurred - updating...
[junit4:junit4]   2> 12632 T601 oasc.ZkController.register We are http://127.0.0.1:48701/solr/collection1/ and leader is http://127.0.0.1:48701/solr/collection1/
[junit4:junit4]   2> 12632 T601 oasc.ZkController.register No LogReplay needed for core=collection1 baseURL=http://127.0.0.1:48701/solr
[junit4:junit4]   2> 12633 T601 oasc.ZkController.checkRecovery I am the leader, no recovery necessary
[junit4:junit4]   2> 12635 T601 oascc.ZkStateReader.updateClusterState Updating cloud state from ZooKeeper... 
[junit4:junit4]   2> 12636 T601 oass.SolrDispatchFilter.init user.dir=/usr/home/hudson/hudson-slave/workspace/Lucene-Solr-Tests-trunk-java7/solr/build/solr-core/test/J0
[junit4:junit4]   2> 12636 T601 oass.SolrDispatchFilter.init SolrDispatchFilter.init() done
[junit4:junit4]   2> 12637 T601 oascsi.HttpClientUtil.createClient Creating new http client, config:maxConnections=128&maxConnectionsPerHost=32&followRedirects=false
[junit4:junit4]   2> ASYNC  NEW_CORE C50 name=collection1 org.apache.solr.core.SolrCore@4530e9b8 url=http://127.0.0.1:45643/solr/collection1 node=127.0.0.1:45643_solr
[junit4:junit4]   2> 12673 T613 C50 P45643 oasc.SolrDeletionPolicy.onInit SolrDeletionPolicy.onInit: commits:num=1
[junit4:junit4]   2> 		commit{dir=/usr/home/hudson/hudson-slave/workspace/Lucene-Solr-Tests-trunk-java7/solr/build/solr-core/test-files/control1/collection1/data/index,segFN=segments_1,generation=1,filenames=[segments_1]
[junit4:junit4]   2> 12674 T613 C50 P45643 oasc.SolrDeletionPolicy.updateCommits newest commit = 1
[junit4:junit4]   2> 12706 T613 C50 P45643 oass.SolrIndexSearcher.<init> Opening Searcher@4142cdfc realtime
[junit4:junit4]   2> 12712 T613 C50 P45643 UPDATE [collection1] webapp=/solr path=/update params={wt=javabin&version=2} {deleteByQuery=*:* (-1412013710322434048)} 0 51
[junit4:junit4]   2> ASYNC  NEW_CORE C51 name=collection1 org.apache.solr.core.SolrCore@69216aa7 url=http://127.0.0.1:54546/solr/collection1 node=127.0.0.1:54546_solr
[junit4:junit4]   2> 12730 T627 C51 P54546 oasc.SolrDeletionPolicy.onInit SolrDeletionPolicy.onInit: commits:num=1
[junit4:junit4]   2> 		commit{dir=/usr/home/hudson/hudson-slave/workspace/Lucene-Solr-Tests-trunk-java7/solr/build/solr-core/test-files/jetty2/collection1/data/index,segFN=segments_1,generation=1,filenames=[segments_1]
[junit4:junit4]   2> 12731 T627 C51 P54546 oasc.SolrDeletionPolicy.updateCommits newest commit = 1
[junit4:junit4]   2> 12733 T627 C51 P54546 oass.SolrIndexSearcher.<init> Opening Searcher@336b3e5c realtime
[junit4:junit4]   2> ASYNC  NEW_CORE C52 name=collection1 org.apache.solr.core.SolrCore@4144acf1 url=http://127.0.0.1:10401/solr/collection1 node=127.0.0.1:10401_solr
[junit4:junit4]   2> 12760 T639 C52 P10401 oasc.SolrDeletionPolicy.onInit SolrDeletionPolicy.onInit: commits:num=1
[junit4:junit4]   2> 		commit{dir=/usr/home/hudson/hudson-slave/workspace/Lucene-Solr-Tests-trunk-java7/solr/build/solr-core/test-files/jetty3/collection1/data/index,segFN=segments_1,generation=1,filenames=[segments_1]
[junit4:junit4]   2> 12761 T639 C52 P10401 oasc.SolrDeletionPolicy.updateCommits newest commit = 1
[junit4:junit4]   2> 12763 T639 C52 P10401 oass.SolrIndexSearcher.<init> Opening Searcher@76bed2aa realtime
[junit4:junit4]   2> 12763 T639 C52 P10401 REQ [collection1] webapp=/solr path=/update params={update.distrib=TOLEADER&wt=javabin&version=2} status=0 QTime=8 
[junit4:junit4]   2> ASYNC  NEW_CORE C53 name=collection1 org.apache.solr.core.SolrCore@22ee3985 url=http://127.0.0.1:48701/solr/collection1 node=127.0.0.1:48701_solr
[junit4:junit4]   2> 12764 T651 C53 P48701 oasc.SolrDeletionPolicy.onInit SolrDeletionPolicy.onInit: commits:num=1
[junit4:junit4]   2> 		commit{dir=/usr/home/hudson/hudson-slave/workspace/Lucene-Solr-Tests-trunk-java7/solr/build/solr-core/test-files/jetty4/collection1/data/index,segFN=segments_1,generation=1,filenames=[segments_1]
[junit4:junit4]   2> 12765 T651 C53 P48701 oasc.SolrDeletionPolicy.updateCommits newest commit = 1
[junit4:junit4]   2> 12767 T651 C53 P48701 oass.SolrIndexSearcher.<init> Opening Searcher@19d6f478 realtime
[junit4:junit4]   2> 12768 T651 C53 P48701 REQ [collection1] webapp=/solr path=/update params={update.distrib=TOLEADER&wt=javabin&version=2} status=0 QTime=9 
[junit4:junit4]   2> 12769 T627 C51 P54546 UPDATE [collection1] webapp=/solr path=/update params={wt=javabin&version=2} {deleteByQuery=*:* (-1412013710384300032)} 0 49
[junit4:junit4]   2> 12776 T628 C51 P54546 REQ [collection1] webapp=/solr path=/update params={update.distrib=TOLEADER&wt=javabin&version=2} status=0 QTime=1 
[junit4:junit4]   2> 12777 T651 C53 P48701 REQ [collection1] webapp=/solr path=/update params={update.distrib=TOLEADER&wt=javabin&version=2} status=0 QTime=1 
[junit4:junit4]   2> 12778 T640 C52 P10401 UPDATE [collection1] webapp=/solr path=/update params={wt=javabin&version=2} {deleteByQuery=*:* (-1412013710431485952)} 0 7
[junit4:junit4]   2> 12785 T628 C51 P54546 REQ [collection1] webapp=/solr path=/update params={update.distrib=TOLEADER&wt=javabin&version=2} status=0 QTime=1 
[junit4:junit4]   2> 12785 T639 C52 P10401 REQ [collection1] webapp=/solr path=/update params={update.distrib=TOLEADER&wt=javabin&version=2} status=0 QTime=1 
[junit4:junit4]   2> 12786 T652 C53 P48701 UPDATE [collection1] webapp=/solr path=/update params={wt=javabin&version=2} {deleteByQuery=*:* (-1412013710440923136)} 0 6
[junit4:junit4]   2> 12804 T613 C50 P45643 UPDATE [collection1] webapp=/solr path=/update params={wt=javabin&version=2} {add=[1 (1412013710458748928)]} 0 14
[junit4:junit4]   2> 12814 T627 C51 P54546 UPDATE [collection1] webapp=/solr path=/update params={wt=javabin&version=2} {add=[1 (1412013710470283264)]} 0 6
[junit4:junit4]   2> 12820 T613 C50 P45643 UPDATE [collection1] webapp=/solr path=/update params={wt=javabin&version=2} {add=[2 (1412013710480769024)]} 0 2
[junit4:junit4]   2> 12828 T640 C52 P10401 UPDATE [collection1] webapp=/solr path=/update params={wt=javabin&version=2} {add=[2 (1412013710486011904)]} 0 5
[junit4:junit4]   2> 12834 T613 C50 P45643 UPDATE [collection1] webapp=/solr path=/update params={wt=javabin&version=2} {add=[3 (1412013710494400512)]} 0 3
[junit4:junit4]   2> 12855 T639 C52 P10401 REQ [collection1] webapp=/solr path=/update params={distrib.from=http://127.0.0.1:48701/solr/collection1/&update.distrib=TOLEADER&wt=javabin&version=2} status=0 QTime=2 
[junit4:junit4]   2> 12856 T652 C53 P48701 UPDATE [collection1] webapp=/solr path=/update params={wt=javabin&version=2} {add=[3]} 0 19
[junit4:junit4]   2> 12863 T613 C50 P45643 UPDATE [collection1] webapp=/solr path=/update params={wt=javabin&version=2} {add=[4 (1412013710524809216)]} 0 3
[junit4:junit4]   2> 12871 T639 C52 P10401 REQ [collection1] webapp=/solr path=/update params={distrib.from=http://127.0.0.1:54546/solr/collection1/&update.distrib=TOLEADER&wt=javabin&version=2} status=0 QTime=2 
[junit4:junit4]   2> 12872 T627 C51 P54546 UPDATE [collection1] webapp=/solr path=/update params={wt=javabin&version=2} {add=[4]} 0 6
[junit4:junit4]   2> 12879 T613 C50 P45643 UPDATE [collection1] webapp=/solr path=/update params={wt=javabin&version=2} {add=[5 (1412013710540537856)]} 0 4
[junit4:junit4]   2> 12891 T651 C53 P48701 REQ [collection1] webapp=/solr path=/update params={distrib.from=http://127.0.0.1:10401/solr/collection1/&update.distrib=TOLEADER&wt=javabin&version=2} status=0 QTime=6 
[junit4:junit4]   2> 12893 T640 C52 P10401 UPDATE [collection1] webapp=/solr path=/update params={wt=javabin&version=2} {add=[5]} 0 11
[junit4:junit4]   2> 12898 T613 C50 P45643 UPDATE [collection1] webapp=/solr path=/update params={wt=javabin&version=2} {add=[6 (1412013710562557952)]} 0 2
[junit4:junit4]   2> 12906 T639 C52 P10401 REQ [collection1] webapp=/solr path=/update params={distrib.from=http://127.0.0.1:48701/solr/collection1/&update.distrib=TOLEADER&wt=javabin&version=2} status=0 QTime=2 
[junit4:junit4]   2> 12907 T652 C53 P48701 UPDATE [collection1] webapp=/solr path=/update params={wt=javabin&version=2} {add=[6]} 0 6
[junit4:junit4]   2> 12913 T613 C50 P45643 UPDATE [collection1] webapp=/solr path=/update params={wt=javabin&version=2} {add=[7 (1412013710577238016)]} 0 3
[junit4:junit4]   2> 12921 T639 C52 P10401 REQ [collection1] webapp=/solr path=/update params={distrib.from=http://127.0.0.1:54546/solr/collection1/&update.distrib=TOLEADER&wt=javabin&version=2} status=0 QTime=2 
[junit4:junit4]   2> 12922 T627 C51 P54546 UPDATE [collection1] webapp=/solr path=/update params={wt=javabin&version=2} {add=[7]} 0 6
[junit4:junit4]   2> 12927 T613 C50 P45643 UPDATE [collection1] webapp=/solr path=/update params={wt=javabin&version=2} {add=[8 (1412013710592966656)]} 0 2
[junit4:junit4]   2> 12936 T628 C51 P54546 REQ [collection1] webapp=/solr path=/update params={distrib.from=http://127.0.0.1:10401/solr/collection1/&update.distrib=TOLEADER&wt=javabin&version=2} status=0 QTime=3 
[junit4:junit4]   2> 12937 T640 C52 P10401 UPDATE [collection1] webapp=/solr path=/update params={wt=javabin&version=2} {add=[8]} 0 7
[junit4:junit4]   2> 12944 T613 C50 P45643 UPDATE [collection1] webapp=/solr path=/update params={wt=javabin&version=2} {add=[9 (1412013710608695296)]} 0 4
[junit4:junit4]   2> 12952 T639 C52 P10401 REQ [collection1] webapp=/solr path=/update params={distrib.from=http://127.0.0.1:48701/solr/collection1/&update.distrib=TOLEADER&wt=javabin&version=2} status=0 QTime=2 
[junit4:junit4]   2> 12953 T652 C53 P48701 UPDATE [collection1] webapp=/solr path=/update params={wt=javabin&version=2} {add=[9]} 0 6
[junit4:junit4]   2> 13000 T613 C50 P45643 UPDATE [collection1] webapp=/solr path=/update params={wt=javabin&version=2} {add=[10 (1412013710625472512)]} 0 44
[junit4:junit4]   2> 13008 T627 C51 P54546 UPDATE [collection1] webapp=/solr path=/update params={wt=javabin&version=2} {add=[10 (1412013710675804160)]} 0 4
[junit4:junit4]   2> 13017 T613 C50 P45643 UPDATE [collection1] webapp=/solr path=/update params={wt=javabin&version=2} {add=[11 (1412013710683144192)]} 0 6
[junit4:junit4]   2> 13027 T628 C51 P54546 REQ [collection1] webapp=/solr path=/update params={distrib.from=http://127.0.0.1:10401/solr/collection1/&update.distrib=TOLEADER&wt=javabin&version=2} status=0 QTime=3 
[junit4:junit4]   2> 13028 T640 C52 P10401 UPDATE [collection1] webapp=/solr path=/update params={wt=javabin&version=2} {add=[11]} 0 8
[junit4:junit4]   2> 13035 T613 C50 P45643 UPDATE [collection1] webapp=/solr path=/update params={wt=javabin&version=2} {add=[12 (1412013710704115712)]} 0 4
[junit4:junit4]   2> 13043 T639 C52 P10401 REQ [collection1] webapp=/solr path=/update params={distrib.from=http://127.0.0.1:48701/solr/collection1/&update.distrib=TOLEADER&wt=javabin&version=2} status=0 QTime=2 
[junit4:junit4]   2> 13044 T652 C53 P48701 UPDATE [collection1] webapp=/solr path=/update params={wt=javabin&version=2} {add=[12]} 0 6
[junit4:junit4]   2> 13050 T613 C50 P45643 UPDATE [collection1] webapp=/solr path=/update params={wt=javabin&version=2} {add=[13 (1412013710720892928)]} 0 3
[junit4:junit4]   2> 13055 T627 C51 P54546 UPDATE [collection1] webapp=/solr path=/update params={wt=javabin&version=2} {add=[13 (1412013710727184384)]} 0 2
[junit4:junit4]   2> 13062 T613 C50 P45643 UPDATE [collection1] webapp=/solr path=/update params={wt=javabin&version=2} {add=[14 (1412013710733475840)]} 0 3
[junit4:junit4]   2> 13070 T628 C51 P54546 REQ [collection1] webapp=/solr path=/update params={distrib.from=http://127.0.0.1:10401/solr/collection1/&update.distrib=TOLEADER&wt=javabin&version=2} status=0 QTime=2 
[junit4:junit4]   2> 13071 T640 C52 P10401 UPDATE [collection1] webapp=/solr path=/update params={wt=javabin&version=2} {add=[14]} 0 6
[junit4:junit4]   2> 13077 T613 C50 P45643 UPDATE [collection1] webapp=/solr path=/update params={wt=javabin&version=2} {add=[15 (1412013710749204480)]} 0 3
[junit4:junit4]   2> 13085 T639 C52 P10401 REQ [collection1] webapp=/solr path=/update params={distrib.from=http://127.0.0.1:48701/solr/collection1/&update.distrib=TOLEADER&wt=javabin&version=2} status=0 QTime=2 
[junit4:junit4]   2> 13086 T652 C53 P48701 UPDATE [collection1] webapp=/solr path=/update params={wt=javabin&version=2} {add=[15]} 0 6
[junit4:junit4]   2> 13092 T613 C50 P45643 UPDATE [collection1] webapp=/solr path=/update params={wt=javabin&version=2} {add=[16 (1412013710764933120)]} 0 3
[junit4:junit4]   2> 13097 T627 C51 P54546 UPDATE [collection1] webapp=/solr path=/update params={wt=javabin&version=2} {add=[16 (1412013710771224576)]} 0 2
[junit4:junit4]   2> 13109 T613 C50 P45643 UPDATE [collection1] webapp=/solr path=/update params={wt=javabin&version=2} {add=[17 (1412013710780661760)]} 0 8
[junit4:junit4]   2> 13125 T651 C53 P48701 REQ [collection1] webapp=/solr path=/update params={distrib.from=http://127.0.0.1:10401/solr/collection1/&update.distrib=TOLEADER&wt=javabin&version=2} status=0 QTime=6 
[junit4:junit4]   2> 13126 T640 C52 P10401 UPDATE [collection1] webapp=/solr path=/update params={wt=javabin&version=2} {add=[17]} 0 13
[junit4:junit4]   2> 13128 T622 oascc.ZkStateReader.updateClusterState Updating cloud state from ZooKeeper... 
[junit4:junit4]   2> 13133 T613 C50 P45643 UPDATE [collection1] webapp=/solr path=/update params={wt=javabin&version=2} {add=[100 (1412013710807924736)]} 0 3
[junit4:junit4]   2> 13143 T628 C51 P54546 REQ [collection1] webapp=/solr path=/update params={distrib.from=http://127.0.0.1:10401/solr/collection1/&update.distrib=TOLEADER&wt=javabin&version=2} status=0 QTime=2 
[junit4:junit4]   2> 13144 T635 oascc.ZkStateReader$2.process A cluster state change has occurred - updating...
[junit4:junit4]   2> 13145 T621 oascc.ZkStateReader$2.process A cluster state change has occurred - updating...
[junit4:junit4]   2> 13144 T640 C52 P10401 UPDATE [collection1] webapp=/solr path=/update params={wt=javabin&version=2} {add=[100]} 0 7
[junit4:junit4]   2> 13144 T659 oascc.ZkStateReader$2.process A cluster state change has occurred - updating...
[junit4:junit4]   2> 13144 T647 oascc.ZkStateReader$2.process A cluster state change has occurred - updating...
[junit4:junit4]   2> 13151 T613 C50 P45643 UPDATE [collection1] webapp=/solr path=/update params={wt=javabin&version=2} {add=[101 (1412013710826799104)]} 0 3
[junit4:junit4]   2> 13159 T639 C52 P10401 REQ [collection1] webapp=/solr path=/update params={distrib.from=http://127.0.0.1:48701/solr/collection1/&update.distrib=TOLEADER&wt=javabin&version=2} status=0 QTime=2 
[junit4:junit4]   2>  C53_STATE=coll:collection1 core:collection1 props:{shard=shard5, leader=true, roles=null, state=active, core=collection1, collection=collection1, node_name=127.0.0.1:48701_solr, base_url=http://127.0.0.1:48701/solr}
[junit4:junit4]   2> 13160 T652 C53 P48701 UPDATE [collection1] webapp=/solr path=/update params={wt=javabin&version=2} {add=[101]} 0 6
[junit4:junit4]   2> 13201 T613 C50 P45643 UPDATE [collection1] webapp=/solr path=/update params={wt=javabin&version=2} {add=[102 (1412013710842527744)]} 0 38
[junit4:junit4]   2> 13235 T639 C52 P10401 REQ [collection1] webapp=/solr path=/update params={distrib.from=http://127.0.0.1:54546/solr/collection1/&update.distrib=TOLEADER&wt=javabin&version=2} status=0 QTime=28 
[junit4:junit4]   2> 13236 T627 C51 P54546 UPDATE [collection1] webapp=/solr path=/update params={wt=javabin&version=2} {add=[102]} 0 32
[junit4:junit4]   2> 13244 T613 C50 P45643 UPDATE [collection1] webapp=/solr path=/update params={wt=javabin&version=2} {add=[103 (1412013710922219520)]} 0 5
[junit4:junit4]   2> 13253 T651 C53 P48701 REQ [collection1] webapp=/solr path=/update params={distrib.from=http://127.0.0.1:10401/solr/collection1/&update.distrib=TOLEADER&wt=javabin&version=2} status=0 QTime=2 
[junit4:junit4]   2> 13254 T640 C52 P10401 UPDATE [collection1] webapp=/solr path=/update params={wt=javabin&version=2} {add=[103]} 0 6
[junit4:junit4]   2> 13260 T613 C50 P45643 UPDATE [collection1] webapp=/solr path=/update params={wt=javabin&version=2} {add=[104 (1412013710941093888)]} 0 3
[junit4:junit4]   2> 13265 T652 C53 P48701 UPDATE [collection1] webapp=/solr path=/update params={wt=javabin&version=2} {add=[104 (1412013710947385344)]} 0 2
[junit4:junit4]   2> 13272 T613 C50 P45643 UPDATE [collection1] webapp=/solr path=/update params={wt=javabin&version=2} {add=[105 (1412013710953676800)]} 0 3
[junit4:junit4]   2> 13282 T639 C52 P10401 REQ [collection1] webapp=/solr path=/update params={distrib.from=http://127.0.0.1:54546/solr/collection1/&update.distrib=TOLEADER&wt=javabin&version=2} status=0 QTime=4 
[junit4:junit4]   2> 13283 T627 C51 P54546 UPDATE [collection1] webapp=/solr path=/update params={wt=javabin&version=2} {add=[105]} 0 8
[junit4:junit4]   2> 13289 T613 C50 P45643 UPDATE [collection1] webapp=/solr path=/update params={wt=javabin&version=2} {add=[106 (1412013710971502592)]} 0 3
[junit4:junit4]   2> 13297 T651 C53 P48701 REQ [collection1] webapp=/solr path=/update params={distrib.from=http://127.0.0.1:10401/solr/collection1/&update.distrib=TOLEADER&wt=javabin&version=2} status=0 QTime=2 
[junit4:junit4]   2> 13298 T640 C52 P10401 UPDATE [collection1] webapp=/solr path=/update params={wt=javabin&version=2} {add=[106]} 0 6
[junit4:junit4]   2> 13304 T613 C50 P45643 UPDATE [collection1] webapp=/solr path=/update params={wt=javabin&version=2} {add=[107 (1412013710987231232)]} 0 3
[junit4:junit4]   2> 13312 T639 C52 P10401 REQ [collection1] webapp=/solr path=/update params={distrib.from=http://127.0.0.1:48701/solr/collection1/&update.distrib=TOLEADER&wt=javabin&version=2} status=0 QTime=2 
[junit4:junit4]   2> 13313 T652 C53 P48701 UPDATE [collection1] webapp=/solr path=/update params={wt=javabin&version=2} {add=[107]} 0 6
[junit4:junit4]   2> 13318 T613 C50 P45643 UPDATE [collection1] webapp=/solr path=/update params={wt=javabin&version=2} {add=[108 (1412013711002959872)]} 0 2
[junit4:junit4]   2> 13324 T627 C51 P54546 UPDATE [collection1] webapp=/solr path=/update params={wt=javabin&version=2} {add=[108 (1412013711009251328)]} 0 2
[junit4:junit4]   2> 13330 T613 C50 P45643 UPDATE [collection1] webapp=/solr path=/update params={wt=javabin&version=2} {add=[109 (1412013711014494208)]} 0 3
[junit4:junit4]   2> 13362 T628 C51 P54546 REQ [collection1] webapp=/solr path=/update params={distrib.from=http://127.0.0.1:10401/solr/collection1/&update.distrib=TOLEADER&wt=javabin&version=2} status=0 QTime=26 
[junit4:junit4]   2> 13364 T640 C52 P10401 UPDATE [collection1] webapp=/solr path=/update params={wt=javabin&version=2} {add=[109]} 0 31
[junit4:junit4]   2> 13370 T613 C50 P45643 UPDATE [collection1] webapp=/solr path=/update params={wt=javabin&version=2} {add=[110 (1412013711056437248)]} 0 2
[junit4:junit4]   2> 13379 T628 C51 P54546 REQ [collection1] webapp=/solr path=/update params={distrib.from=http://127.0.0.1:48701/solr/collection1/&update.distrib=TOLEADER&wt=javabin&version=2} status=0 QTime=3 
[junit4:junit4]   2> 13380 T652 C53 P48701 UPDATE [collection1] webapp=/solr path=/update params={wt=javabin&version=2} {add=[110]} 0 7
[junit4:junit4]   2> 13386 T613 C50 P45643 UPDATE [collection1] webapp=/solr path=/update params={wt=javabin&version=2} {add=[111 (1412013711073214464)]} 0 2
[junit4:junit4]   2> 13394 T639 C52 P10401 REQ [collection1] webapp=/solr path=/update params={distrib.from=http://127.0.0.1:54546/solr/collection1/&update.distrib=TOLEADER&wt=javabin&version=2} status=0 QTime=2 
[junit4:junit4]   2> 13395 T627 C51 P54546 UPDATE [collection1] webapp=/solr path=/update params={wt=javabin&version=2} {add=[111]} 0 6
[junit4:junit4]   2> 13430 T613 C50 P45643 UPDATE [collection1] webapp=/solr path=/update params={wt=javabin&version=2} {add=[112 (1412013711088943104)]} 0 32
[junit4:junit4]   2> 13440 T651 C53 P48701 REQ [collection1] webapp=/solr path=/update params={distrib.from=http://127.0.0.1:10401/solr/collection1/&update.distrib=TOLEADER&wt=javabin&version=2} status=0 QTime=2 
[junit4:junit4]   2> 13441 T640 C52 P10401 UPDATE [collection1] webapp=/solr path=/update params={wt=javabin&version=2} {add=[112]} 0 6
[junit4:junit4]   2> 13455 T613 C50 P45643 UPDATE [collection1] webapp=/solr path=/update params={wt=javabin&version=2} {add=[113 (1412013711144517632)]} 0 4
[junit4:junit4]   2> 13463 T639 C52 P10401 REQ [collection1] webapp=/solr path=/update params={distrib.from=http://127.0.0.1:48701/solr/collection1/&update.distrib=TOLEADER&wt=javabin&version=2} status=0 QTime=2 
[junit4:junit4]   2> 13464 T652 C53 P48701 UPDATE [collection1] webapp=/solr path=/update params={wt=javabin&version=2} {add=[113]} 0 6
[junit4:junit4]   2> 13469 T613 C50 P45643 UPDATE [collection1] webapp=/solr path=/update params={wt=javabin&version=2} {add=[114 (1412013711161294848)]} 0 2
[junit4:junit4]   2> 13477 T639 C52 P10401 REQ [collection1] webapp=/solr path=/update params={distrib.from=http://127.0.0.1:54546/solr/collection1/&update.distrib=TOLEADER&wt=javabin&version=2} status=0 QTime=2 
[junit4:junit4]   2> 13478 T627 C51 P54546 UPDATE [collection1] webapp=/solr path=/update params={wt=javabin&version=2} {add=[114]} 0 6
[junit4:junit4]   2> 13483 T613 C50 P45643 UPDATE [collection1] webapp=/solr path=/update params={wt=javabin&version=2} {add=[115 (1412013711175974912)]} 0 2
[junit4:junit4]   2> 13488 T640 C52 P10401 UPDATE [collection1] webapp=/solr path=/update params={wt=javabin&version=2} {add=[115 (1412013711181217792)]} 0 2
[junit4:junit4]   2> 13493 T613 C50 P45643 UPDATE [collection1] webapp=/solr path=/update params={wt=javabin&version=2} {add=[116 (1412013711186460672)]} 0 2
[junit4:junit4]   2> 13499 T652 C53 P48701 UPDATE [collection1] webapp=/solr path=/update params={wt=javabin&version=2} {add=[116 (1412013711192752128)]} 0 2
[junit4:junit4]   2> 13505 T613 C50 P45643 UPDATE [collection1] webapp=/solr path=/update params={wt=javabin&version=2} {add=[117 (1412013711199043584)]} 0 2
[junit4:junit4]   2> 13513 T639 C52 P10401 REQ [collection1] webapp=/solr path=/update params={distrib.from=http://127.0.0.1:54546/solr/collection1/&update.distrib=TOLEADER&wt=javabin&version=2} status=0 QTime=2 
[junit4:junit4]   2> 13514 T627 C51 P54546 UPDATE [collection1] webapp=/solr path=/update params={wt=javabin&version=2} {add=[117]} 0 6
[junit4:junit4]   2> 13519 T613 C50 P45643 UPDATE [collection1] webapp=/solr path=/update params={wt=javabin&version=2} {add=[118 (1412013711213723648)]} 0 2
[junit4:junit4]   2> 13527 T628 C51 P54546 REQ [collection1] webapp=/solr path=/update params={distrib.from=http://127.0.0.1:10401/solr/collection1/&update.distrib=TOLEADER&wt=javabin&version=2} status=0 QTime=2 
[junit4:junit4]   2> 13528 T640 C52 P10401 UPDATE [collection1] webapp=/solr path=/update params={wt=javabin&version=2} {add=[118]} 0 6
[junit4:junit4]   2> 13533 T613 C50 P45643 UPDATE [collection1] webapp=/solr path=/update params={wt=javabin&version=2} {add=[119 (1412013711228403712)]} 0 2
[junit4:junit4]   2> 13541 T639 C52 P10401 REQ [collection1] webapp=/solr path=/update params={distrib.from=http://127.0.0.1:48701/solr/collection1/&update.distrib=TOLEADER&wt=javabin&version=2} status=0 QTime=2 
[junit4:junit4]   2> 13542 T652 C53 P48701 UPDATE [collection1] webapp=/solr path=/update params={wt=javabin&version=2} {add=[119]} 0 6
[junit4:junit4]   2> 13547 T613 C50 P45643 UPDATE [collection1] webapp=/solr path=/update params={wt=javabin&version=2} {add=[120 (1412013711243083776)]} 0 2
[junit4:junit4]   2> 13555 T639 C52 P10401 REQ [collection1] webapp=/solr path=/update params={distrib.from=http://127.0.0.1:54546/solr/collection1/&update.distrib=TOLEADER&wt=javabin&version=2} status=0 QTime=2 
[junit4:junit4]   2> 13556 T627 C51 P54546 UPDATE [collection1] webapp=/solr path=/update params={wt=javabin&version=2} {add=[120]} 0 6
[junit4:junit4]   2> 13561 T613 C50 P45643 UPDATE [collection1] webapp=/solr path=/update params={wt=javabin&version=2} {add=[121 (1412013711257763840)]} 0 2
[junit4:junit4]   2> 13569 T651 C53 P48701 REQ [collection1] webapp=/solr path=/update params={distrib.from=http://127.0.0.1:10401/solr/collection1/&update.distrib=TOLEADER&wt=javabin&version=2} status=0 QTime=2 
[junit4:junit4]   2> 13570 T640 C52 P10401 UPDATE [collection1] webapp=/solr path=/update params={wt=javabin&version=2} {add=[121]} 0 6
[junit4:junit4]   2> 13595 T613 C50 P45643 UPDATE [collection1] webapp=/solr path=/update params={wt=javabin&version=2} {add=[122 (1412013711272443904)]} 0 22
[junit4:junit4]   2> 13623 T639 C52 P10401 REQ [collection1] webapp=/solr path=/update params={distrib.from=http://127.0.0.1:48701/solr/collection1/&update.distrib=TOLEADER&wt=javabin&version=2} status=0 QTime=22 
[junit4:junit4]   2> 13624 T652 C53 P48701 UPDATE [collection1] webapp=/solr path=/update params={wt=javabin&version=2} {add=[122]} 0 26
[junit4:junit4]   2> 13631 T613 C50 P45643 UPDATE [collection1] webapp=/solr path=/update params={wt=javabin&version=2} {add=[123 (1412013711329067008)]} 0 4
[junit4:junit4]   2> 13637 T627 C51 P54546 UPDATE [collection1] webapp=/solr path=/update params={wt=javabin&version=2} {add=[123 (1412013711336407040)]} 0 3
[junit4:junit4]   2> 13642 T613 C50 P45643 UPDATE [collection1] webapp=/solr path=/update params={wt=javabin&version=2} {add=[124 (1412013711342698496)]} 0 2
[junit4:junit4]   2> 13650 T628 C51 P54546 REQ [collection1] webapp=/solr path=/update params={distrib.from=http://127.0.0.1:10401/solr/collection1/&update.distrib=TOLEADER&wt=javabin&version=2} status=0 QTime=2 
[junit4:junit4]   2> 13651 T640 C52 P10401 UPDATE [collection1] webapp=/solr path=/update params={wt=javabin&version=2} {add=[124]} 0 6
[junit4:junit4]   2> 13656 T613 C50 P45643 UPDATE [collection1] webapp=/solr path=/update params={wt=javabin&version=2} {add=[125 (1412013711357378560)]} 0 2
[junit4:junit4]   2> 13666 T639 C52 P10401 REQ [collection1] webapp=/solr path=/update params={distrib.from=http://127.0.0.1:48701/solr/collection1/&update.distrib=TOLEADER&wt=javabin&version=2} status=0 QTime=4 
[junit4:junit4]   2> 13667 T652 C53 P48701 UPDATE [collection1] webapp=/solr path=/update params={wt=javabin&version=2} {add=[125]} 0 8
[junit4:junit4]   2> 13672 T613 C50 P45643 UPDATE [collection1] webapp=/solr path=/update params={wt=javabin&version=2} {add=[126 (1412013711374155776)]} 0 2
[junit4:junit4]   2> 13680 T651 C53 P48701 REQ [collection1] webapp=/solr path=/update params={distrib.from=http://127.0.0.1:54546/solr/collection1/&update.distrib=TOLEADER&wt=javabin&version=2} status=0 QTime=2 
[junit4:junit4]   2> 13681 T627 C51 P54546 UPDATE [collection1] webapp=/solr path=/update params={wt=javabin&version=2} {add=[126]} 0 6
[junit4:junit4]   2> 13686 T613 C50 P45643 UPDATE [collection1] webapp=/solr path=/update params={wt=javabin&version=2} {add=[127 (1412013711388835840)]} 0 2
[junit4:junit4]   2> 13715 T651 C53 P48701 REQ [collection1] webapp=/solr path=/update params={distrib.from=http://127.0.0.1:10401/solr/collection1/&update.distrib=TOLEADER&wt=javabin&version=2} status=0 QTime=23 
[junit4:junit4]   2> 13716 T640 C52 P10401 UPDATE [collection1] webapp=/solr path=/update params={wt=javabin&version=2} {add=[127]} 0 27
[junit4:junit4]   2> 13721 T613 C50 P45643 UPDATE [collection1] webapp=/solr path=/update params={wt=javabin&version=2} {add=[128 (1412013711425536000)]} 0 2
[junit4:junit4]   2> 13728 T652 C53 P48701 UPDATE [collection1] webapp=/solr path=/update params={wt=javabin&version=2} {add=[128 (1412013711430778880)]} 0 4
[junit4:junit4]   2> 13747 T613 C50 P45643 UPDATE [collection1] webapp=/solr path=/update params={wt=javabin&version=2} {add=[129 (1412013711438118912)]} 0 15
[junit4:junit4]   2> 13755 T639 C52 P10401 REQ [collection1] webapp=/solr path=/update params={distrib.from=http://127.0.0.1:54546/solr/collection1/&update.distrib=TOLEADER&wt=javabin&version=2} status=0 QTime=2 
[junit4:junit4]   2> 13756 T627 C51 P54546 UPDATE [collection1] webapp=/solr path=/update params={wt=javabin&version=2} {add=[129]} 0 6
[junit4:junit4]   2> 13762 T613 C50 P45643 UPDATE [collection1] webapp=/solr path=/update params={wt=javabin&version=2} {add=[130 (1412013711468527616)]} 0 2
[junit4:junit4]   2> 13767 T640 C52 P10401 UPDATE [collection1] webapp=/solr path=/update params={wt=javabin&version=2} {add=[130 (1412013711473770496)]} 0 2
[junit4:junit4]   2> 13773 T613 C50 P45643 UPDATE [collection1] webapp=/solr path=/update params={wt=javabin&version=2} {add=[131 (1412013711480061952)]} 0 2
[junit4:junit4]   2> 13778 T652 C53 P48701 UPDATE [collection1] webapp=/solr path=/update params={wt=javabin&version=2} {add=[131 (1412013711485304832)]} 0 2
[junit4:junit4]   2> 13801 T613 C50 P45643 UPDATE [collection1] webapp=/solr path=/update params={wt=javabin&version=2} {add=[132 (1412013711490547712)]} 0 20
[junit4:junit4]   2> 13807 T627 C51 P54546 UPDATE [collection1] webapp=/solr path=/update params={wt=javabin&version=2} {add=[132 (1412013711515713536)]} 0 2
[junit4:junit4]   2> 13813 T613 C50 P45643 UPDATE [collection1] webapp=/solr path=/update params={wt=javabin&version=2} {add=[133 (1412013711520956416)]} 0 3
[junit4:junit4]   2> 13818 T640 C52 P10401 UPDATE [collection1] webapp=/solr path=/update params={wt=javabin&version=2} {add=[133 (1412013711527247872)]} 0 2
[junit4:junit4]   2> 13823 T613 C50 P45643 UPDATE [collection1] webapp=/solr path=/update params={wt=javabin&version=2} {add=[134 (1412013711532490752)]} 0 2
[junit4:junit4]   2> 13831 T639 C52 P10401 REQ [collection1] webapp=/solr path=/update params={distrib.from=http://127.0.0.1:48701/solr/collection1/&update.distrib=TOLEADER&wt=javabin&version=2} status=0 QTime=2 
[junit4:junit4]   2> 13831 T652 C53 P48701 UPDATE [collection1] webapp=/solr path=/update params={wt=javabin&version=2} {add=[134]} 0 5
[junit4:junit4]   2> 13837 T613 C50 P45643 UPDATE [collection1] webapp=/solr path=/update params={wt=javabin&version=2} {add=[135 (1412013711547170816)]} 0 2
[junit4:junit4]   2> 13841 T627 C51 P54546 UPDATE [collection1] webapp=/solr path=/update params={wt=javabin&version=2} {add=[135 (1412013711551365120)]} 0 2
[junit4:junit4]   2> 13846 T613 C50 P45643 UPDATE [collection1] webapp=/solr path=/update params={wt=javabin&version=2} {add=[136 (1412013711556608000)]} 0 2
[junit4:junit4]   2> 13853 T651 C53 P48701 REQ [collection1] webapp=/solr path=/update params={distrib.from=http://127.0.0.1:10401/solr/collection1/&update.distrib=TOLEADER&wt=javabin&version=2} status=0 QTime=2 
[junit4:junit4]   2> 13854 T640 C52 P10401 UPDATE [collection1] webapp=/solr path=/update params={wt=javabin&version=2} {add=[136]} 0 6
[junit4:junit4]   2> 13859 T613 C50 P45643 UPDATE [collection1] webapp=/solr path=/update params={wt=javabin&version=2} {add=[137 (1412013711570239488)]} 0 2
[junit4:junit4]   2> 13864 T652 C53 P48701 UPDATE [collection1] webapp=/solr path=/update params={wt=javabin&version=2} {add=[137 (1412013711575482368)]} 0 2
[junit4:junit4]   2> 13869 T613 C50 P45643 UPDATE [collection1] webapp=/solr path=/update params={wt=javabin&version=2} {add=[138 (1412013711580725248)]} 0 2
[junit4:junit4]   2> 13873 T627 C51 P54546 UPDATE [collection1] webapp=/solr path=/update params={wt=javabin&version=2} {add=[138 (1412013711584919552)]} 0 2
[junit4:junit4]   2> 13878 T613 C50 P45643 UPDATE [collection1] webapp=/solr path=/update params={wt=javabin&version=2} {add=[139 (1412013711589113856)]} 0 2
[junit4:junit4]   2> 13885 T651 C53 P48701 REQ [collection1] webapp=/solr path=/update params={distrib.from=http://127.0.0.1:10401/solr/collection1/&update.distrib=TOLEADER&wt=javabin&version=2} status=0 QTime=2 
[junit4:junit4]   2> 13886 T640 C52 P10401 UPDATE [collection1] webapp=/solr path=/update params={wt=javabin&version=2} {add=[139]} 0 6
[junit4:junit4]   2> 13891 T613 C50 P45643 UPDATE [collection1] webapp=/solr path=/update params={wt=javabin&version=2} {add=[140 (1412013711603793920)]} 0 2
[junit4:junit4]   2> 13899 T639 C52 P10401 REQ [collection1] webapp=/solr path=/update params={distrib.from=http://127.0.0.1:48701/solr/collection1/&update.distrib=TOLEADER&wt=javabin&version=2} status=0 QTime=2 
[junit4:junit4]   2> 13899 T652 C53 P48701 UPDATE [collection1] webapp=/solr path=/update params={wt=javabin&version=2} {add=[140]} 0 5
[junit4:junit4]   2> 13905 T613 C50 P45643 UPDATE [collection1] webapp=/solr path=/update params={wt=javabin&version=2} {add=[141 (1412013711618473984)]} 0 2
[junit4:junit4]   2> 13912 T639 C52 P10401 REQ [collection1] webapp=/solr path=/update params={distrib.from=http://127.0.0.1:54546/solr/collection1/&update.distrib=TOLEADER&wt=javabin&version=2} status=0 QTime=2 
[junit4:junit4]   2> 13912 T627 C51 P54546 UPDATE [collection1] webapp=/solr path=/update params={wt=javabin&version=2} {add=[141]} 0 5
[junit4:junit4]   2> 13938 T613 C50 P45643 UPDATE [collection1] webapp=/solr path=/update params={wt=javabin&version=2} {add=[142 (1412013711631056896)]} 0 23
[junit4:junit4]   2> 13946 T651 C53 P48701 REQ [collection1] webapp=/solr path=/update params={distrib.from=http://127.0.0.1:10401/solr/collection1/&update.distrib=TOLEADER&wt=javabin&version=2} status=0 QTime=2 
[junit4:junit4]   2> 13947 T640 C52 P10401 UPDATE [collection1] webapp=/solr path=/update params={wt=javabin&version=2} {add=[142]} 0 6
[junit4:junit4]   2> 13954 T613 C50 P45643 UPDATE [collection1] webapp=/solr path=/update params={wt=javabin&version=2} {add=[143 (1412013711667757056)]} 0 4
[junit4:junit4]   2> 13962 T639 C52 P10401 REQ [collection1] webapp=/solr path=/update params={distrib.from=http://127.0.0.1:48701/solr/collection1/&update.distrib=TOLEADER&wt=javabin&version=2} status=0 QTime=2 
[junit4:junit4]   2> 13963 T652 C53 P48701 UPDATE [collection1] webapp=/solr path=/update params={wt=javabin&version=2} {add=[143]} 0 6
[junit4:junit4]   2> 13968 T613 C50 P45643 UPDATE [collection1] webapp=/solr path=/update params={wt=javabin&version=2} {add=[144 (1412013711684534272)]} 0 2
[junit4:junit4]   2> 13976 T639 C52 P10401 REQ [collection1] webapp=/solr path=/update params={distrib.from=http://127.0.0.1:54546/solr/collection1/&update.distrib=TOLEADER&wt=javabin&version=2} status=0 QTime=2 
[junit4:junit4]   2> 13977 T627 C51 P54546 UPDATE [collection1] webapp=/solr path=/update params={wt=javabin&version=2} {add=[144]} 0 6
[junit4:junit4]   2> 13982 T613 C50 P45643 UPDATE [collection1] webapp=/solr path=/update params={wt=javabin&version=2} {add=[145 (1412013711699214336)]} 0 2
[junit4:junit4]   2> 13990 T651 C53 P48701 REQ [collection1] webapp=/solr path=/update params={distrib.from=http://127.0.0.1:10401/solr/collection1/&update.distrib=TOLEADER&wt=javabin&version=2} status=0 QTime=2 
[junit4:junit4]   2> 13991 T640 C52 P10401 UPDATE [collection1] webapp=/solr path=/update params={wt=javabin&version=2} {add=[145]} 0 6
[junit4:junit4]   2> 13996 T613 C50 P45643 UPDATE [collection1] webapp=/solr path=/update params={wt=javabin&version=2} {add=[146 (1412013711713894400)]} 0 2
[junit4:junit4]   2> 14023 T639 C52 P10401 REQ [collection1] webapp=/solr path=/update params={distrib.from=http://127.0.0.1:48701/solr/collection1/&update.distrib=TOLEADER&wt=javabin&version=2} status=0 QTime=21 
[junit4:junit4]   2> 14025 T652 C53 P48701 UPDATE [collection1] webapp=/solr path=/update params={wt=javabin&version=2} {add=[146]} 0 26
[junit4:junit4]   2> 14031 T613 C50 P45643 UPDATE [collection1] webapp=/solr path=/update params={wt=javabin&version=2} {add=[147 (1412013711749545984)]} 0 3
[junit4:junit4]   2> 14039 T651 C53 P48701 REQ [collection1] webapp=/solr path=/update params={distrib.from=http://127.0.0.1:54546/solr/collection1/&update.distrib=TOLEADER&wt=javabin&version=2} status=0 QTime=2 
[junit4:junit4]   2> 14040 T627 C51 P54546 UPDATE [collection1] webapp=/solr path=/update params={wt=javabin&version=2} {add=[147]} 0 6
[junit4:junit4]   2> 14044 T613 C50 P45643 UPDATE [collection1] webapp=/solr path=/update params={wt=javabin&version=2} {add=[148 (1412013711764226048)]} 0 2
[junit4:junit4]   2> 14051 T628 C51 P54546 REQ [collection1] webapp=/solr path=/update params={distrib.from=http://127.0.0.1:10401/solr/collection1/&update.distrib=TOLEADER&wt=javabin&version=2} status=0 QTime=2 
[junit4:junit4]   2> 14052 T640 C52 P10401 UPDATE [collection1] webapp=/solr path=/update params={wt=javabin&version=2} {add=[148]} 0 6
[junit4:junit4]   2> 14056 T613 C50 P45643 UPDATE [collection1] webapp=/solr path=/update params={wt=javabin&version=2} {add=[149 (1412013711776808960)]} 0 1
[junit4:junit4]   2> 14060 T652 C53 P48701 UPDATE [collection1] webapp=/solr path=/update params={wt=javabin&version=2} {add=[149 (1412013711782051840)]} 0 1
[junit4:junit4]   2> 14063 T613 C50 P45643 oasu.DirectUpdateHandler2.commit start commit{flags=0,_version_=0,optimize=false,openSearcher=true,waitSearcher=true,expungeDeletes=false,softCommit=false}
[junit4:junit4]   2> 14419 T613 C50 P45643 oasc.SolrDeletionPolicy.onCommit SolrDeletionPolicy.onCommit: commits:num=2
[junit4:junit4]   2> 		commit{dir=/usr/home/hudson/hudson-slave/workspace/Lucene-Solr-Tests-trunk-java7/solr/build/solr-core/test-files/control1/collection1/data/index,segFN=segments_1,generation=1,filenames=[segments_1]
[junit4:junit4]   2> 		commit{dir=/usr/home/hudson/hudson-slave/workspace/Lucene-Solr-Tests-trunk-java7/solr/build/solr-core/test-files/control1/collection1/data/index,segFN=segments_2,generation=2,filenames=[_5_nrm.cfe, _2_NestedPulsing_0.tim, _1_NestedPulsing_0.tip, _5_NestedPulsing_0.tip, _5_NestedPulsing_0.tim, _0_MockSep_0.pos, _4_MockSep_0.tib, _4_MockSep_0.skp, _3.fdt, _3_NestedPulsing_0.prx, _3_MockSep_0.frq, _0_Pulsing40_0.frq, _2_MockSep_0.doc, _6_NestedPulsing_0.prx, _6_MockSep_0.doc, _5_MockSep_0.skp, _4_MockSep_0.doc, _5_Pulsing40_0.tip, _1_NestedPulsing_0.tim, _6_MockSep_0.frq, _2_NestedPulsing_0.tip, _5_Pulsing40_0.tim, _1_MockSep_0.pyl, _1_MockSep_0.skp, _0_Pulsing40_0.tim, _1_MockSep_0.tib, _0_Memory_0.ram, _2.fdt, _3_Pulsing40_0.tip, _3_NestedPulsing_0.tim, _5_MockSep_0.doc, _2.fdx, _3_Pulsing40_0.tim, _1_MockSep_0.tii, _1.fdx, _5_nrm.cfs, _4_MockSep_0.pyl, _1.fdt, _3_NestedPulsing_0.tip, _3_MockSep_0.pos, _3.si, _4_NestedPulsing_0.frq, _6.fdt, _4_MockSep_0.tii, _2.si, _3_Pulsing40_0.frq, _6_NestedPulsing_0.frq, _2_Pulsing40_0.tim, _6_MockSep_0.pyl, _6.fdx, _2_Pulsing40_0.tip, _2_MockSep_0.skp, _3.fnm, _0_NestedPulsing_0.tip, _5_MockSep_0.tii, _3_MockSep_0.pyl, _0_NestedPulsing_0.tim, _4_Pulsing40_0.prx, _1_Memory_0.ram, _2_nrm.cfe, _5_Pulsing40_0.frq, _6_MockSep_0.pos, _4_NestedPulsing_0.tip, _0_Pulsing40_0.tip, _4_NestedPulsing_0.tim, _2_nrm.cfs, _1_MockSep_0.pos, _2_NestedPulsing_0.prx, _0_NestedPulsing_0.frq, _6_MockSep_0.skp, _0_NestedPulsing_0.prx, _2.fnm, _3.fdx, _4_Pulsing40_0.tip, _2_MockSep_0.pyl, _4_Pulsing40_0.tim, _1_NestedPulsing_0.frq, _5_NestedPulsing_0.frq, _5_Pulsing40_0.prx, _5_MockSep_0.tib, _1.si, _2_NestedPulsing_0.frq, _6_NestedPulsing_0.tip, _6.si, _6.fnm, _3_MockSep_0.skp, _6_NestedPulsing_0.tim, _3_nrm.cfe, _3_MockSep_0.doc, _5_MockSep_0.pos, _5.fdt, _1_Pulsing40_0.tip, _6_Pulsing40_0.frq, _1_Pulsing40_0.tim, _4.fnm, _4_nrm.cfe, _0_Pulsing40_0.prx, _1.fnm, _1_Pulsing40_0.frq, _4.fdx, _0_MockSep_0.skp, _3_MockSep_0.tib, _6_Pulsing40_0.tim, _1_Pulsing40_0.prx, _6_Pulsing40_0.tip, _4_NestedPulsing_0.prx, _2_Pulsing40_0.prx, _6_MockSep_0.tii, _1_MockSep_0.doc, _6_MockSep_0.tib, _0.fnm, _4_MockSep_0.pos, _5_MockSep_0.frq, _2_MockSep_0.tii, _2_MockSep_0.tib, _3_MockSep_0.tii, _2_Pulsing40_0.frq, _5.si, _3_nrm.cfs, _3_NestedPulsing_0.frq, _6_Pulsing40_0.prx, _4_nrm.cfs, _2_MockSep_0.pos, _5_MockSep_0.pyl, _1_MockSep_0.frq, _1_NestedPulsing_0.prx, _6_nrm.cfs, _0_MockSep_0.doc, _0.si, _1_nrm.cfs, _5.fnm, _6_nrm.cfe, _2_MockSep_0.frq, _0_nrm.cfs, _4.fdt, _4.si, _1_nrm.cfe, _0_MockSep_0.tib, _5_NestedPulsing_0.prx, _4_Pulsing40_0.frq, _3_Pulsing40_0.prx, _0_nrm.cfe, _5.fdx, _4_MockSep_0.frq, segments_2, _0_MockSep_0.frq, _0.fdx, _0_MockSep_0.tii, _0_MockSep_0.pyl, _0.fdt]
[junit4:junit4]   2> 14420 T613 C50 P45643 oasc.SolrDeletionPolicy.updateCommits newest commit = 2
[junit4:junit4]   2> 14430 T613 C50 P45643 oass.SolrIndexSearcher.<init> Opening Searcher@652d9fcd main
[junit4:junit4]   2> 14431 T613 C50 P45643 oasu.DirectUpdateHandler2.commit end_commit_flush
[junit4:junit4]   2> 14432 T624 oasc.SolrCore.registerSearcher [collection1] Registered new searcher Searcher@652d9fcd main{StandardDirectoryReader(segments_2:15:nrt _0(5.0):C10 _1(5.0):C10 _2(5.0):C10 _3(5.0):C10 _4(5.0):C10 _5(5.0):C10 _6(5.0):C7)}
[junit4:junit4]   2> 14432 T613 C50 P45643 UPDATE [collection1] webapp=/solr path=/update params={waitSearcher=true&wt=javabin&commit=true&softCommit=false&version=2} {commit=} 0 369
[junit4:junit4]   2> 14435 T627 C51 P54546 oasu.DirectUpdateHandler2.commit start commit{flags=0,_version_=0,optimize=false,openSearcher=true,waitSearcher=true,expungeDeletes=false,softCommit=false}
[junit4:junit4]   2> 14593 T627 C51 P54546 oasc.SolrDeletionPolicy.onCommit SolrDeletionPolicy.onCommit: commits:num=2
[junit4:junit4]   2> 		commit{dir=/usr/home/hudson/hudson-slave/workspace/Lucene-Solr-Tests-trunk-java7/solr/build/solr-core/test-files/jetty2/collection1/data/index,segFN=segments_1,generation=1,filenames=[segments_1]
[junit4:junit4]   2> 		commit{dir=/usr/home/hudson/hudson-slave/workspace/Lucene-Solr-Tests-trunk-java7/solr/build/solr-core/test-files/jetty2/collection1/data/index,segFN=segments_2,generation=2,filenames=[_1_MockSep_0.frq, _1_NestedPulsing_0.tip, _1_NestedPulsing_0.prx, _1_Pulsing40_0.tip, _0_MockSep_0.pos, _1_Pulsing40_0.tim, _0_Pulsing40_0.prx, _0_NestedPulsing_0.tip, _1.fnm, _0_Pulsing40_0.frq, _0_NestedPulsing_0.tim, _1_Pulsing40_0.frq, _0_MockSep_0.skp, _1_Pulsing40_0.prx, _0_Pulsing40_0.tip, _1_NestedPulsing_0.tim, _0_MockSep_0.doc, _0.si, _1_MockSep_0.pyl, _1_MockSep_0.doc, _1_nrm.cfs, _1_MockSep_0.skp, _0_Pulsing40_0.tim, _0.fnm, _1_MockSep_0.pos, _1_MockSep_0.tib, _0_Memory_0.ram, _0_NestedPulsing_0.frq, _0_nrm.cfs, _0_NestedPulsing_0.prx, _1_MockSep_0.tii, _1_nrm.cfe, _0_MockSep_0.tib, _1.fdx, _1_NestedPulsing_0.frq, _1.fdt, _1.si, _0_nrm.cfe, segments_2, _0_MockSep_0.frq, _0.fdx, _0_MockSep_0.tii, _0_MockSep_0.pyl, _0.fdt]
[junit4:junit4]   2> 14594 T627 C51 P54546 oasc.SolrDeletionPolicy.updateCommits newest commit = 2
[junit4:junit4]   2> 14603 T627 C51 P54546 oass.SolrIndexSearcher.<init> Opening Searcher@b8c79de main
[junit4:junit4]   2> 14604 T627 C51 P54546 oasu.DirectUpdateHandler2.commit end_commit_flush
[junit4:junit4]   2> 14605 T636 oasc.SolrCore.registerSearcher [collection1] Registered new searcher Searcher@b8c79de main{StandardDirectoryReader(segments_2:5:nrt _0(5.0):C10 _1(5.0):C8)}
[junit4:junit4]   2> 14606 T627 C51 P54546 oasu.SolrCmdDistributor.distribCommit Distrib commit to:[StdNode: http://127.0.0.1:10401/solr/collection1/, StdNode: http://127.0.0.1:48701/solr/collection1/]
[junit4:junit4]   2> 14609 T639 C52 P10401 oasu.DirectUpdateHandler2.commit start commit{flags=0,_version_=0,optimize=false,openSearcher=true,waitSearcher=true,expungeDeletes=false,softCommit=false}
[junit4:junit4]   2> 14609 T651 C53 P48701 oasu.DirectUpdateHandler2.commit start commit{flags=0,_version_=0,optimize=false,openSearcher=true,waitSearcher=true,expungeDeletes=false,softCommit=false}
[junit4:junit4]   2> 15035 T651 C53 P48701 oasc.SolrDeletionPolicy.onCommit SolrDeletionPolicy.onCommit: commits:num=2
[junit4:junit4]   2> 		commit{dir=/usr/home/hudson/hudson-slave/workspace/Lucene-Solr-Tests-trunk-java7/solr/build/solr-core/test-files/jetty4/collection1/data/index,segFN=segments_1,generation=1,filenames=[segments_1]
[junit4:junit4]   2> 		commit{dir=/usr/home/hudson/hudson-slave/workspace/Lucene-Solr-Tests-trunk-java7/solr/build/solr-core/test-files/jetty4/collection1/data/index,segFN=segments_2,generation=2,filenames=[_1_MockSep_0.frq, _1_NestedPulsing_0.tip, _1_NestedPulsing_0.prx, _1_Pulsing40_0.tip, _0_MockSep_0.pos, _1_Pulsing40_0.tim, _0_Pulsing40_0.prx, _0_NestedPulsing_0.tip, _1.fnm, _0_Pulsing40_0.frq, _0_NestedPulsing_0.tim, _1_Pulsing40_0.frq, _0_MockSep_0.skp, _1_Pulsing40_0.prx, _0_Pulsing40_0.tip, _1_NestedPulsing_0.tim, _0_MockSep_0.doc, _0.si, _1_MockSep_0.pyl, _1_MockSep_0.doc, _1_nrm.cfs, _1_MockSep_0.skp, _0_Pulsing40_0.tim, _0.fnm, _1_MockSep_0.pos, _1_MockSep_0.tib, _0_Memory_0.ram, _0_NestedPulsing_0.frq, _0_nrm.cfs, _0_NestedPulsing_0.prx, _1_MockSep_0.tii, _1_nrm.cfe, _0_MockSep_0.tib, _1.fdx, _1_NestedPulsing_0.frq, _1.fdt, _1.si, _0_nrm.cfe, segments_2, _0_MockSep_0.frq, _0.fdx, _0_MockSep_0.tii, _0_MockSep_0.pyl, _0.fdt]
[junit4:junit4]   2> 15036 T651 C53 P48701 oasc.SolrDeletionPolicy.updateCommits newest commit = 2
[junit4:junit4]   2> 15045 T651 C53 P48701 oass.SolrIndexSearcher.<init> Opening Searcher@7b0ea6b4 main
[junit4:junit4]   2> 15046 T651 C53 P48701 oasu.DirectUpdateHandler2.commit end_commit_flush
[junit4:junit4]   2> 15047 T660 oasc.SolrCore.registerSearcher [collection1] Registered new searcher Searcher@7b0ea6b4 main{StandardDirectoryReader(segments_2:5:nrt _0(5.0):C10 _1(5.0):C9)}
[junit4:junit4]   2> 15048 T651 C53 P48701 UPDATE [collection1] webapp=/solr path=/update params={waitSearcher=true&commit=true&wt=javabin&commit_end_point=true&softCommit=false&version=2} {commit=} 0 439
[junit4:junit4]   2> 15073 T639 C52 P10401 oasc.SolrDeletionPolicy.onCommit SolrDeletionPolicy.onCommit: commits:num=2
[junit4:junit4]   2> 		commit{dir=/usr/home/hudson/hudson-slave/workspace/Lucene-Solr-Tests-trunk-java7/solr/build/solr-core/test-files/jetty3/collection1/data/index,segFN=segments_1,generation=1,filenames=[segments_1]
[junit4:junit4]   2> 		commit{dir=/usr/home/hudson/hudson-slave/workspace/Lucene-Solr-Tests-trunk-java7/solr/build/solr-core/test-files/jetty3/collection1/data/index,segFN=segments_2,generation=2,filenames=[_1_NestedPulsing_0.tip, _2_NestedPulsing_0.tim, _1_Pulsing40_0.tip, _0_MockSep_0.pos, _1_Pulsing40_0.tim, _0_Pulsing40_0.prx, _2_MockSep_0.doc, _0_Pulsing40_0.frq, _1.fnm, _1_Pulsing40_0.frq, _0_MockSep_0.skp, _1_Pulsing40_0.prx, _1_NestedPulsing_0.tim, _2_NestedPulsing_0.tip, _2_Pulsing40_0.prx, _1_MockSep_0.doc, _1_MockSep_0.pyl, _1_MockSep_0.skp, _0.fnm, _0_Pulsing40_0.tim, _0_Memory_0.ram, _1_MockSep_0.tib, _2.fdt, _2_MockSep_0.tii, _2_MockSep_0.tib, _2.fdx, _2_Pulsing40_0.frq, _1_MockSep_0.tii, _1.fdx, _1.fdt, _2_MockSep_0.pos, _1_MockSep_0.frq, _2.si, _2_Pulsing40_0.tim, _1_NestedPulsing_0.prx, _2_MockSep_0.skp, _2_Pulsing40_0.tip, _0_NestedPulsing_0.tip, _0_NestedPulsing_0.tim, _2_nrm.cfe, _0_Pulsing40_0.tip, _2_nrm.cfs, _0.si, _0_MockSep_0.doc, _1_nrm.cfs, _1_MockSep_0.pos, _2_NestedPulsing_0.prx, _2_MockSep_0.frq, _0_NestedPulsing_0.frq, _0_nrm.cfs, _0_NestedPulsing_0.prx, _2.fnm, _1_nrm.cfe, _0_MockSep_0.tib, _2_MockSep_0.pyl, _1_NestedPulsing_0.frq, _1.si, _2_NestedPulsing_0.frq, _0_nrm.cfe, _0_MockSep_0.frq, segments_2, _0.fdx, _0_MockSep_0.tii, _0_MockSep_0.pyl, _0.fdt]
[junit4:junit4]   2> 15074 T639 C52 P10401 oasc.SolrDeletionPolicy.updateCommits newest commit = 2
[junit4:junit4]   2> 15083 T639 C52 P10401 oass.SolrIndexSearcher.<init> Opening Searcher@74228796 main
[junit4:junit4]   2> 15084 T639 C52 P10401 oasu.DirectUpdateHandler2.commit end_commit_flush
[junit4:junit4]   2> 15085 T648 oasc.SolrCore.registerSearcher [collection1] Registered new searcher Searcher@74228796 main{StandardDirectoryReader(segments_2:7:nrt _0(5.0):C10 _1(5.0):C10 _2(5.0):C10)}
[junit4:junit4]   2> 15086 T639 C52 P10401 UPDATE [collection1] webapp=/solr path=/update params={waitSearcher=true&commit=true&wt=javabin&commit_end_point=true&softCommit=false&version=2} {commit=} 0 477
[junit4:junit4]   2> 15087 T627 C51 P54546 UPDATE [collection1] webapp=/solr path=/update params={waitSearcher=true&wt=javabin&commit=true&softCommit=false&version=2} {commit=} 0 652
[junit4:junit4]   2> 15090 T640 C52 P10401 oasu.DirectUpdateHandler2.commit start commit{flags=0,_version_=0,optimize=false,openSearcher=true,waitSearcher=true,expungeDeletes=false,softCommit=false}
[junit4:junit4]   2> 15092 T640 C52 P10401 oass.SolrIndexSearcher.<init> Opening Searcher@3a572fe9 main
[junit4:junit4]   2> 15092 T640 C52 P10401 oasu.DirectUpdateHandler2.commit end_commit_flush
[junit4:junit4]   2> 15094 T648 oasc.SolrCore.registerSearcher [collection1] Registered new searcher Searcher@3a572fe9 main{StandardDirectoryReader(segments_2:7:nrt _0(5.0):C10 _1(5.0):C10 _2(5.0):C10)}
[junit4:junit4]   2> 15094 T640 C52 P10401 oasu.SolrCmdDistributor.distribCommit Distrib commit to:[StdNode: http://127.0.0.1:54546/solr/collection1/, StdNode: http://127.0.0.1:48701/solr/collection1/]
[junit4:junit4]   2> 15097 T651 C53 P48701 oasu.DirectUpdateHandler2.commit start commit{flags=0,_version_=0,optimize=false,openSearcher=true,waitSearcher=true,expungeDeletes=false,softCommit=false}
[junit4:junit4]   2> 15098 T628 C51 P54546 oasu.DirectUpdateHandler2.commit start commit{flags=0,_version_=0,optimize=false,openSearcher=true,waitSearcher=true,expungeDeletes=false,softCommit=false}
[junit4:junit4]   2> 15098 T651 C53 P48701 oass.SolrIndexSearcher.<init> Opening Searcher@2233ddca main
[junit4:junit4]   2> 15099 T651 C53 P48701 oasu.DirectUpdateHandler2.commit end_commit_flush
[junit4:junit4]   2> 15099 T628 C51 P54546 oass.SolrIndexSearcher.<init> Opening Searcher@7e6f4959 main
[junit4:junit4]   2> 15099 T628 C51 P54546 oasu.DirectUpdateHandler2.commit end_commit_flush
[junit4:junit4]   2> 15101 T660 oasc.SolrCore.registerSearcher [collection1] Registered new searcher Searcher@2233ddca main{StandardDirectoryReader(segments_2:5:nrt _0(5.0):C10 _1(5.0):C9)}
[junit4:junit4]   2> 15101 T651 C53 P48701 UPDATE [collection1] webapp=/solr path=/update params={waitSearcher=true&commit=true&wt=javabin&commit_end_point=true&softCommit=false&version=2} {commit=} 0 4
[junit4:junit4]   2> 15101 T636 oasc.SolrCore.registerSearcher [collection1] Registered new searcher Searcher@7e6f4959 main{StandardDirectoryReader(segments_2:5:nrt _0(5.0):C10 _1(5.0):C8)}
[junit4:junit4]   2> 15102 T628 C51 P54546 UPDATE [collection1] webapp=/solr path=/update params={waitSearcher=true&commit=true&wt=javabin&commit_end_point=true&softCommit=false&version=2} {commit=} 0 5
[junit4:junit4]   2> 15103 T640 C52 P10401 UPDATE [collection1] webapp=/solr path=/update params={waitSearcher=true&wt=javabin&commit=true&softCommit=false&version=2} {commit=} 0 13
[junit4:junit4]   2> 15106 T652 C53 P48701 oasu.DirectUpdateHandler2.commit start commit{flags=0,_version_=0,optimize=false,openSearcher=true,waitSearcher=true,expungeDeletes=false,softCommit=false}
[junit4:junit4]   2> 15107 T652 C53 P48701 oass.SolrIndexSearcher.<init> Opening Searcher@359c7738 main
[junit4:junit4]   2> 15108 T652 C53 P48701 oasu.DirectUpdateHandler2.commit end_commit_flush
[junit4:junit4]   2> 15109 T660 oasc.SolrCore.registerSearcher [collection1] Registered new searcher Searcher@359c7738 main{StandardDirectoryReader(segments_2:5:nrt _0(5.0):C10 _1(5.0):C9)}
[junit4:junit4]   2> 15110 T652 C53 P48701 oasu.SolrCmdDistributor.distribCommit Distrib commit to:[StdNode: http://127.0.0.1:54546/solr/collection1/, StdNode: http://127.0.0.1:10401/solr/collection1/]
[junit4:junit4]   2> 15112 T639 C52 P10401 oasu.DirectUpdateHandler2.commit start commit{flags=0,_version_=0,optimize=false,openSearcher=true,waitSearcher=true,expungeDeletes=false,softCommit=false}
[junit4:junit4]   2> 15112 T628 C51 P54546 oasu.DirectUpdateHandler2.commit start commit{flags=0,_version_=0,optimize=false,openSearcher=true,waitSearcher=true,expungeDeletes=false,softCommit=false}
[junit4:junit4]   2> 15113 T639 C52 P10401 oass.SolrIndexSearcher.<init> Opening Searcher@3470e98e main
[junit4:junit4]   2> 15113 T628 C51 P54546 oass.SolrIndexSearcher.<init> Opening Searcher@16cfeccc main
[junit4:junit4]   2> 15113 T639 C52 P10401 oasu.DirectUpdateHandler2.commit end_commit_flush
[junit4:junit4]   2> 15114 T628 C51 P54546 oasu.DirectUpdateHandler2.commit end_commit_flush
[junit4:junit4]   2> 15114 T636 oasc.JmxMonitoredMap.put WARNING Failed to register info bean: searcher javax.management.InstanceAlreadyExistsException: solr/collection1:type=searcher,id=org.apache.solr.search.SolrIndexSearcher
[junit4:junit4]   2> 	at com.sun.jmx.mbeanserver.Repository.addMBean(Repository.java:437)
[junit4:junit4]   2> 	at com.sun.jmx.interceptor.DefaultMBeanServerInterceptor.registerWithRepository(DefaultMBeanServerInterceptor.java:1898)
[junit4:junit4]   2> 	at com.sun.jmx.interceptor.DefaultMBeanServerInterceptor.registerDynamicMBean(DefaultMBeanServerInterceptor.java:966)
[junit4:junit4]   2> 	at com.sun.jmx.interceptor.DefaultMBeanServerInterceptor.registerObject(DefaultMBeanServerInterceptor.java:900)
[junit4:junit4]   2> 	at com.sun.jmx.interceptor.DefaultMBeanServerInterceptor.registerMBean(DefaultMBeanServerInterceptor.java:324)
[junit4:junit4]   2> 	at com.sun.jmx.mbeanserver.JmxMBeanServer.registerMBean(JmxMBeanServer.java:512)
[junit4:junit4]   2> 	at org.apache.solr.core.JmxMonitoredMap.put(JmxMonitoredMap.java:140)
[junit4:junit4]   2> 	at org.apache.solr.core.JmxMonitoredMap.put(JmxMonitoredMap.java:51)
[junit4:junit4]   2> 	at org.apache.solr.search.SolrIndexSearcher.register(SolrIndexSearcher.java:242)
[junit4:junit4]   2> 	at org.apache.solr.core.SolrCore.registerSearcher(SolrCore.java:1633)
[junit4:junit4]   2> 	at org.apache.solr.core.SolrCore.access$000(SolrCore.java:121)
[junit4:junit4]   2> 	at org.apache.solr.core.SolrCore$7.call(SolrCore.java:1510)
[junit4:junit4]   2> 	at java.util.concurrent.FutureTask$Sync.innerRun(FutureTask.java:334)
[junit4:junit4]   2> 	at java.util.concurrent.FutureTask.run(FutureTask.java:166)
[junit4:junit4]   2> 	at java.util.concurrent.ThreadPoolExecutor.runWorker(ThreadPoolExecutor.java:1110)
[junit4:junit4]   2> 	at java.util.concurrent.ThreadPoolExecutor$Worker.run(ThreadPoolExecutor.java:603)
[junit4:junit4]   2> 	at java.lang.Thread.run(Thread.java:722)
[junit4:junit4]   2> 
[junit4:junit4]   2> 15116 T648 oasc.SolrCore.registerSearcher [collection1] Registered new searcher Searcher@3470e98e main{StandardDirectoryReader(segments_2:7:nrt _0(5.0):C10 _1(5.0):C10 _2(5.0):C10)}
[junit4:junit4]   2> 15116 T639 C52 P10401 UPDATE [collection1] webapp=/solr path=/update params={waitSearcher=true&commit=true&wt=javabin&commit_end_point=true&softCommit=false&version=2} {commit=} 0 4
[junit4:junit4]   2> 15117 T636 oasc.SolrCore.registerSearcher [collection1] Registered new searcher Searcher@16cfeccc main{StandardDirectoryReader(segments_2:5:nrt _0(5.0):C10 _1(5.0):C8)}
[junit4:junit4]   2> 15117 T628 C51 P54546 UPDATE [collection1] webapp=/solr path=/update params={waitSearcher=true&commit=true&wt=javabin&commit_end_point=true&softCommit=false&version=2} {commit=} 0 5
[junit4:junit4]   2> 15118 T652 C53 P48701 UPDATE [collection1] webapp=/solr path=/update params={waitSearcher=true&wt=javabin&commit=true&softCommit=false&version=2} {commit=} 0 12
[junit4:junit4]   2> 15123 T613 C50 P45643 REQ [collection1] webapp=/solr path=/select params={distrib=false&sort=n_ti1+desc&wt=javabin&q=*:*&version=2} hits=67 status=0 QTime=2 
[junit4:junit4]   2> 15158 T629 C51 P54546 REQ [collection1] webapp=/solr path=/select params={sort=n_ti1+desc&distrib=false&wt=javabin&rows=10&version=2&fl=id&shard.url=127.0.0.1:54546/solr/collection1/&NOW=1346601212409&start=0&q=*:*&isShard=true&fsv=true} hits=18 status=0 QTime=1 
[junit4:junit4]   2> 15158 T653 C53 P48701 REQ [collection1] webapp=/solr path=/select params={sort=n_ti1+desc&distrib=false&wt=javabin&rows=10&version=2&fl=id&shard.url=127.0.0.1:48701/solr/collection1/&NOW=1346601212409&start=0&q=*:*&isShard=true&fsv=true} hits=19 status=0 QTime=1 
[junit4:junit4]   2> 15159 T641 C52 P10401 REQ [collection1] webapp=/solr path=/select params={sort=n_ti1+desc&distrib=false&wt=javabin&rows=10&version=2&fl=id&shard.url=127.0.0.1:10401/solr/collection1/&NOW=1346601212409&start=0&q=*:*&isShard=true&fsv=true} hits=30 status=0 QTime=2 
[junit4:junit4]   2> 15165 T629 C51 P54546 REQ [collection1] webapp=/solr path=/select params={shard.url=127.0.0.1:54546/solr/collection1/&NOW=1346601212409&q=*:*&ids=118&distrib=false&isShard=true&wt=javabin&version=2} status=0 QTime=1 
[junit4:junit4]   2> 15165 T653 C53 P48701 REQ [collection1] webapp=/solr path=/select params={shard.url=127.0.0.1:48701/solr/collection1/&NOW=1346601212409&q=*:*&ids=112,137,17&distrib=false&isShard=true&wt=javabin&version=2} status=0 QTime=1 
[junit4:junit4]   2> 15166 T641 C52 P10401 REQ [collection1] webapp=/solr path=/select params={shard.url=127.0.0.1:10401/solr/collection1/&NOW=1346601212409&q=*:*&ids=143,133,6,107,101,141&distrib=false&isShard=true&wt=javabin&version=2} status=0 QTime=1 
[junit4:junit4]   2> 15168 T652 C53 P48701 REQ [collection1] webapp=/solr path=/select params={sort=n_ti1+desc&wt=javabin&q=*:*&version=2} status=0 QTime=39 
[junit4:junit4]   2> 15173 T613 C50 P45643 REQ [collection1] webapp=/solr path=/select params={distrib=false&sort=n_ti1+asc&wt=javabin&q=*:*&version=2} hits=67 status=0 QTime=0 
[junit4:junit4]   2> 15183 T642 C52 P10401 REQ [collection1] webapp=/solr path=/select params={sort=n_ti1+asc&distrib=false&wt=javabin&rows=10&version=2&fl=id&shard.url=127.0.0.1:10401/solr/collection1/&NOW=1346601212459&start=0&q=*:*&isShard=true&fsv=true} hits=30 status=0 QTime=0 
[junit4:junit4]   2> 15183 T654 C53 P48701 REQ [collection1] webapp=/solr path=/select params={sort=n_ti1+asc&distrib=false&wt=javabin&rows=10&version=2&fl=id&shard.url=127.0.0.1:48701/solr/collection1/&NOW=1346601212459&start=0&q=*:*&isShard=true&fsv=true} hits=19 status=0 QTime=0 
[junit4:junit4]   2> 15183 T630 C51 P54546 REQ [collection1] webapp=/solr path=/select params={sort=n_ti1+asc&distrib=false&wt=javabin&rows=10&version=2&fl=id&shard.url=127.0.0.1:54546/solr/collection1/&NOW=1346601212459&start=0&q=*:*&isShard=true&fsv=true} hits=18 status=0 QTime=0 
[junit4:junit4]   2> 15189 T642 C52 P10401 REQ [collection1] webapp=/solr path=/select params={shard.url=127.0.0.1:10401/solr/collection1/&NOW=1346601212459&q=*:*&ids=134,115,129&distrib=false&isShard=true&wt=javabin&version=2} status=0 QTime=1 
[junit4:junit4]   2> 15189 T630 C51 P54546 REQ [collection1] webapp=/solr path=/select params={shard.url=127.0.0.1:54546/solr/collection1/&NOW=1346601212459&q=*:*&ids=10,109,16&distrib=false&isShard=true&wt=javabin&version=2} status=0 QTime=0 
[junit4:junit4]   2> 15189 T654 C53 P48701 REQ [collection1] webapp=/solr path=/select params={shard.url=127.0.0.1:48701/solr/collection1/&NOW=1346601212459&q=*:*&ids=116,147,5,136&distrib=false&isShard=true&wt=javabin&version=2} status=0 QTime=1 
[junit4:junit4]   2> 15191 T627 C51 P54546 REQ [collection1] webapp=/solr path=/select params={sort=n_ti1+asc&shards=shard3,shard4,shard5&wt=javabin&q=*:*&version=2} status=0 QTime=12 
[junit4:junit4]   2> 15198 T613 C50 P45643 REQ [collection1] webapp=/solr path=/select params={distrib=false&sort=n_f1+desc&wt=javabin&q=*:*&version=2} hits=67 status=0 QTime=2 
[junit4:junit4]   2> 15206 T631 C51 P54546 REQ [collection1] webapp=/solr path=/select params={sort=n_f1+desc&distrib=false&wt=javabin&rows=10&version=2&fl=id&shard.url=127.0.0.1:54546/solr/collection1/&NOW=1346601212482&start=0&q=*:*&isShard=true&fsv=true} hits=18 status=0 QTime=1 
[junit4:junit4]   2> 15207 T655 C53 P48701 REQ [collection1] webapp=/solr path=/select params={sort=n_f1+desc&distrib=false&wt=javabin&rows=10&version=2&fl=id&shard.url=127.0.0.1:48701/solr/collection1/&NOW=1346601212482&start=0&q=*:*&isShard=true&fsv=true} hits=19 status=0 QTime=1 
[junit4:junit4]   2> 15207 T643 C52 P10401 REQ [collection1] webapp=/solr path=/select params={sort=n_f1+desc&distrib=false&wt=javabin&rows=10&version=2&fl=id&shard.url=127.0.0.1:10401/solr/collection1/&NOW=1346601212482&start=0&q=*:*&isShard=true&fsv=true} hits=30 status=0 QTime=2 
[junit4:junit4]   2> 15212 T631 C51 P54546 REQ [collection1] webapp=/solr path=/select params={shard.url=127.0.0.1:54546/solr/collection1/&NOW=1346601212482&q=*:*&ids=123&distrib=false&isShard=true&wt=javabin&version=2} status=0 QTime=1 
[junit4:junit4]   2> 15212 T655 C53 P48701 REQ [collection1] webapp=/solr path=/select params={shard.url=127.0.0.1:48701/solr/collection1/&NOW=1346601212482&q=*:*&ids=112,17&distrib=false&isShard=true&wt=javabin&version=2} status=0 QTime=1 
[junit4:junit4]   2> 15212 T643 C52 P10401 REQ [collection1] webapp=/solr path=/select params={shard.url=127.0.0.1:10401/solr/collection1/&NOW=1346601212482&q=*:*&ids=3,134,133,7,6,129,12&distrib=false&isShard=true&wt=javabin&version=2} status=0 QTime=1 
[junit4:junit4]   2> 15215 T640 C52 P10401 REQ [collection1] webapp=/solr path=/select params={sort=n_f1+desc&shards=shard3,shard4,shard5&wt=javabin&q=*:*&version=2} status=0 QTime=13 
[junit4:junit4]   2> 15219 T613 C50 P45643 REQ [collection1] webapp=/solr path=/select params={distrib=false&sort=n_f1+asc&wt=javabin&q=*:*&version=2} hits=67 status=0 QTime=0 
[junit4:junit4]   2> 15227 T629 C51 P54546 REQ [collection1] webapp=/solr path=/select params={sort=n_f1+asc&distrib=false&wt=javabin&rows=10&version=2&fl=id&shard.url=127.0.0.1:54546/solr/collection1/&NOW=1346601212504&start=0&q=*:*&isShard=true&fsv=true} hits=18 status=0 QTime=0 
[junit4:junit4]   2> 15228 T653 C53 P48701 REQ [collection1] webapp=/solr path=/select params={sort=n_f1+asc&distrib=false&wt=javabin&rows=10&version=2&fl=id&shard.url=127.0.0.1:48701/solr/collection1/&NOW=1346601212504&start=0&q=*:*&isShard=true&fsv=true} hits=19 status=0 QTime=1 
[junit4:junit4]   2> 15228 T641 C52 P10401 REQ [collection1] webapp=/solr path=/select params={sort=n_f1+asc&distrib=false&wt=javabin&rows=10&version=2&fl=id&shard.url=127.0.0.1:10401/solr/collection1/&NOW=1346601212504&start=0&q=*:*&isShard=true&fsv=true} hits=30 status=0 QTime=1 
[junit4:junit4]   2> 15233 T629 C51 P54546 REQ [collection1] webapp=/solr path=/select params={shard.url=127.0.0.1:54546/solr/collection1/&NOW=1346601212504&q=*:*&ids=11&distrib=false&isShard=true&wt=javabin&version=2} status=0 QTime=1 
[junit4:junit4]   2> 15233 T641 C52 P10401 REQ [collection1] webapp=/solr path=/select params={shard.url=127.0.0.1:10401/solr/collection1/&NOW=1346601212504&q=*:*&ids=125,117,114,105&distrib=false&isShard=true&wt=javabin&version=2} status=0 QTime=1 
[junit4:junit4]   2> 15233 T653 C53 P48701 REQ [collection1] webapp=/solr path=/select params={shard.url=127.0.0.1:48701/solr/collection1/&NOW=1346601212504&q=*:*&ids=116,127,128,121,106&distrib=false&isShard=true&wt=javabin&version=2} status=0 QTime=1 
[junit4:junit4]   2> 15235 T652 C53 P48701 REQ [collection1] webapp=/solr path=/select params={sort=n_f1+asc&wt=javabin&q=*:*&version=2} status=0 QTime=11 
[junit4:junit4]   2> 15241 T613 C50 P45643 REQ [collection1] webapp=/solr path=/select params={distrib=false&sort=n_tf1+desc&wt=javabin&q=*:*&version=2} hits=67 status=0 QTime=2 
[junit4:junit4]   2> 15249 T631 C51 P54546 REQ [collection1] webapp=/solr path=/select params={sort=n_tf1+desc&distrib=false&wt=javabin&rows=10&version=2&fl=id&shard.url=127.0.0.1:54546/solr/collection1/&NOW=1346601212525&start=0&q=*:*&isShard=true&fsv=true} hits=18 status=0 QTime=1 
[junit4:junit4]   2> 15249 T655 C53 P48701 REQ [collection1] webapp=/solr path=/select params={sort=n_tf1+desc&distrib=false&wt=javabin&rows=10&version=2&fl=id&shard.url=127.0.0.1:48701/solr/collection1/&NOW=1346601212525&start=0&q=*:*&isShard=true&fsv=true} hits=19 status=0 QTime=1 
[junit4:junit4]   2> 15249 T643 C52 P10401 REQ [collection1] webapp=/solr path=/select params={sort=n_tf1+desc&distrib=false&wt=javabin&rows=10&version=2&fl=id&shard.url=127.0.0.1:10401/solr/collection1/&NOW=1346601212525&start=0&q=*:*&isShard=true&fsv=true} hits=30 status=0 QTime=1 
[junit4:junit4]   2> 15254 T655 C53 P48701 REQ [collection1] webapp=/solr path=/select params={shard.url=127.0.0.1:48701/solr/collection1/&NOW=1346601212525&q=*:*&ids=139&distrib=false&isShard=true&wt=javabin&version=2} status=0 QTime=1 
[junit4:junit4]   2> 15254 T631 C51 P54546 REQ [collection1] webapp=/solr path=/select params={shard.url=127.0.0.1:54546/solr/collection1/&NOW=1346601212525&q=*:*&ids=108,123,8,14&distrib=false&isShard=true&wt=javabin&version=2} status=0 QTime=1 
[junit4:junit4]   2> 15254 T643 C52 P10401 REQ [collection1] webapp=/solr path=/select params={shard.url=127.0.0.1:10401/solr/collection1/&NOW=1346601212525&q=*:*&ids=2,114,146,115,15&distrib=false&isShard=true&wt=javabin&version=2} status=0 QTime=1 
[junit4:junit4]   2> 15256 T640 C52 P10401 REQ [collection1] webapp=/solr path=/select params={sort=n_tf1+desc&shards=shard3,shard4,shard5&wt=javabin&q=*:*&version=2} status=0 QTime=11 
[junit4:junit4]   2> 15261 T613 C50 P45643 REQ [collection1] webapp=/solr path=/select params={distrib=false&sort=n_tf1+asc&wt=javabin&q=*:*&version=2} hits=67 status=0 QTime=0 
[junit4:junit4]   2> 15265 T601 oascsi.HttpClientUtil.createClient Creating new http client, config:
[junit4:junit4]   2> 15284 T601 oaz.ZooKeeper.<init> Initiating client connection, connectString=127.0.0.1:38809/solr sessionTimeout=10000 watcher=org.apache.solr.common.cloud.ConnectionManager@3aced6cd
[junit4:junit4]   2> 15286 T672 oaz.ClientCnxn$SendThread.startConnect Opening socket connection to server /127.0.0.1:38809
[junit4:junit4]   2> 15286 T601 oascc.ConnectionManager.waitForConnected Waiting for client to connect to ZooKeeper
[junit4:junit4]   2> 15288 T672 oaz.ClientCnxn$SendThread.primeConnection Socket connection established to localhost/127.0.0.1:38809, initiating session
[junit4:junit4]   2> 15288 T603 oazs.NIOServerCnxn$Factory.run Accepted socket connection from /140.211.11.196:24028
[junit4:junit4]   2> 15289 T603 oazs.NIOServerCnxn.readConnectRequest Client attempting to establish new session at /140.211.11.196:24028
[junit4:junit4]   2> 15345 T605 oazs.NIOServerCnxn.finishSessionInit Established session 0x13987af9ee90006 with negotiated timeout 10000 for client /140.211.11.196:24028
[junit4:junit4]   2> 15345 T672 oaz.ClientCnxn$SendThread.readConnectResult Session establishment complete on server localhost/127.0.0.1:38809, sessionid = 0x13987af9ee90006, negotiated timeout = 10000
[junit4:junit4]   2> 15345 T673 oascc.ConnectionManager.process Watcher org.apache.solr.common.cloud.ConnectionManager@3aced6cd name:ZooKeeperConnection Watcher:127.0.0.1:38809/solr got event WatchedEvent state:SyncConnected type:None path:null path:null type:None
[junit4:junit4]   2> 15346 T601 oascc.ConnectionManager.waitForConnected Client is connected to ZooKeeper
[junit4:junit4]   2> 15347 T601 oascc.ZkStateReader.createClusterStateWatchersAndUpdate Updating cluster state from ZooKeeper... 
[junit4:junit4]   2> 15359 T654 C53 P48701 REQ [collection1] webapp=/solr path=/select params={sort=n_tf1+asc&distrib=false&collection=collection1&wt=javabin&rows=10&version=2&NOW=1346601212635&shard.url=127.0.0.1:48701/solr/collection1/&fl=id&start=0&q=*:*&isShard=true&fsv=true} hits=19 status=0 QTime=1 
[junit4:junit4]   2> 15359 T642 C52 P10401 REQ [collection1] webapp=/solr path=/select params={sort=n_tf1+asc&distrib=false&collection=collection1&wt=javabin&rows=10&version=2&NOW=1346601212635&shard.url=127.0.0.1:10401/solr/collection1/&fl=id&start=0&q=*:*&isShard=true&fsv=true} hits=30 status=0 QTime=1 
[junit4:junit4]   2> 15359 T630 C51 P54546 REQ [collection1] webapp=/solr path=/select params={sort=n_tf1+asc&distrib=false&collection=collection1&wt=javabin&rows=10&version=2&NOW=1346601212635&shard.url=127.0.0.1:54546/solr/collection1/&fl=id&start=0&q=*:*&isShard=true&fsv=true} hits=18 status=0 QTime=1 
[junit4:junit4]   2> 15364 T630 C51 P54546 REQ [collection1] webapp=/solr path=/select params={shard.url=127.0.0.1:54546/solr/collection1/&NOW=1346601212635&q=*:*&ids=148,11&distrib=false&collection=collection1&isShard=true&wt=javabin&version=2} status=0 QTime=1 
[junit4:junit4]   2> 15364 T654 C53 P48701 REQ [collection1] webapp=/solr path=/select params={shard.url=127.0.0.1:48701/solr/collection1/&NOW=1346601212635&q=*:*&ids=126,128,121,142&distrib=false&collection=collection1&isShard=true&wt=javabin&version=2} status=0 QTime=1 
[junit4:junit4]   2> 15364 T642 C52 P10401 REQ [collection1] webapp=/solr path=/select params={shard.url=127.0.0.1:10401/solr/collection1/&NOW=1346601212635&q=*:*&ids=134,125,4,120&distrib=false&collection=collection1&isShard=true&wt=javabin&version=2} status=0 QTime=1 
[junit4:junit4]   2> 15366 T632 C51 P54546 REQ [collection1] webapp=/solr path=/select params={collection=collection1&sort=n_tf1+asc&wt=javabin&q=*:*&version=2} status=0 QTime=11 
[junit4:junit4]   2> 15372 T613 C50 P45643 REQ [collection1] webapp=/solr path=/select params={distrib=false&sort=n_d1+desc&wt=javabin&q=*:*&version=2} hits=67 status=0 QTime=2 
[junit4:junit4]   2> 15380 T630 C51 P54546 REQ [collection1] webapp=/solr path=/select params={sort=n_d1+desc&distrib=false&wt=javabin&rows=10&version=2&fl=id&shard.url=127.0.0.1:54546/solr/collection1/&NOW=1346601212656&start=0&q=*:*&isShard=true&fsv=true} hits=18 status=0 QTime=1 
[junit4:junit4]   2> 15380 T654 C53 P48701 REQ [collection1] webapp=/solr path=/select params={sort=n_d1+desc&distrib=false&wt=javabin&rows=10&version=2&fl=id&shard.url=127.0.0.1:48701/solr/collection1/&NOW=1346601212656&start=0&q=*:*&isShard=true&fsv=true} hits=19 status=0 QTime=1 
[junit4:junit4]   2> 15380 T642 C52 P10401 REQ [collection1] webapp=/solr path=/select params={sort=n_d1+desc&distrib=false&wt=javabin&rows=10&version=2&fl=id&shard.url=127.0.0.1:10401/solr/collection1/&NOW=1346601212656&start=0&q=*:*&isShard=true&fsv=true} hits=30 status=0 QTime=1 
[junit4:junit4]   2> 15385 T654 C53 P48701 REQ [collection1] webapp=/solr path=/select params={shard.url=127.0.0.1:48701/solr/collection1/&NOW=1346601212656&q=*:*&ids=145,139,149&distrib=false&isShard=true&wt=javabin&version=2} status=0 QTime=1 
[junit4:junit4]   2> 15385 T642 C52 P10401 REQ [collection1] webapp=/solr path=/select params={shard.url=127.0.0.1:10401/solr/collection1/&NOW=1346601212656&q=*:*&ids=113,105,129,101&distrib=false&isShard=true&wt=javabin&version=2} status=0 QTime=1 
[junit4:junit4]   2> 15385 T630 C51 P54546 REQ [collection1] webapp=/solr path=/select params={shard.url=127.0.0.1:54546/solr/collection1/&NOW=1346601212656&q=*:*&ids=135,10,124&distrib=false&isShard=true&wt=javabin&version=2} status=0 QTime=1 
[junit4:junit4]   2> 15387 T632 C51 P54546 REQ [collection1] webapp=/solr path=/select params={sort=n_d1+desc&shards=shard3,shard4,shard5&wt=javabin&q=*:*&version=2} status=0 QTime=11 
[junit4:junit4]   2> 15391 T613 C50 P45643 REQ [collection1] webapp=/solr path=/select params={distrib=false&sort=n_d1+asc&wt=javabin&q=*:*&version=2} hits=67 status=0 QTime=0 
[junit4:junit4]   2> 15400 T655 C53 P48701 REQ [collection1] webapp=/solr path=/select params={sort=n_d1+asc&distrib=false&wt=javabin&rows=10&version=2&fl=id&shard.url=127.0.0.1:48701/solr/collection1/&NOW=1346601212676&start=0&q=*:*&isShard=true&fsv=true} hits=19 status=0 QTime=1 
[junit4:junit4]   2> 15400 T643 C52 P10401 REQ [collection1] webapp=/solr path=/select params={sort=n_d1+asc&distrib=false&wt=javabin&rows=10&version=2&fl=id&shard.url=127.0.0.1:10401/solr/collection1/&NOW=1346601212676&start=0&q=*:*&isShard=true&fsv=true} hits=30 status=0 QTime=1 
[junit4:junit4]   2> 15400 T631 C51 P54546 REQ [collection1] webapp=/solr path=/select params={sort=n_d1+asc&distrib=false&wt=javabin&rows=10&version=2&fl=id&shard.url=127.0.0.1:54546/solr/collection1/&NOW=1346601212676&start=0&q=*:*&isShard=true&fsv=true} hits=18 status=0 QTime=1 
[junit4:junit4]   2> 15405 T655 C53 P48701 REQ [collection1] webapp=/solr path=/select params={shard.url=127.0.0.1:48701/solr/collection1/&NOW=1346601212676&q=*:*&ids=128,147&distrib=false&isShard=true&wt=javabin&version=2} status=0 QTime=1 
[junit4:junit4]   2> 15405 T643 C52 P10401 REQ [collection1] webapp=/solr path=/select params={shard.url=127.0.0.1:10401/solr/collection1/&NOW=1346601212676&q=*:*&ids=3,15,102&distrib=false&isShard=true&wt=javabin&version=2} status=0 QTime=1 
[junit4:junit4]   2> 15405 T631 C51 P54546 REQ [collection1] webapp=/solr path=/select params={shard.url=127.0.0.1:54546/solr/collection1/&NOW=1346601212676&q=*:*&ids=1,108,110,8,118&distrib=false&isShard=true&wt=javabin&version=2} status=0 QTime=1 
[junit4:junit4]   2> 15407 T640 C52 P10401 REQ [collection1] webapp=/solr path=/select params={sort=n_d1+asc&shards=shard3,shard4,shard5&wt=javabin&q=*:*&version=2} status=0 QTime=11 
[junit4:junit4]   2> 15413 T613 C50 P45643 REQ [collection1] webapp=/solr path=/select params={distrib=false&sort=n_td1+desc&wt=javabin&q=*:*&version=2} hits=67 status=0 QTime=2 
[junit4:junit4]   2> 15421 T654 C53 P48701 REQ [collection1] webapp=/solr path=/select params={sort=n_td1+desc&distrib=false&wt=javabin&rows=10&version=2&fl=id&shard.url=127.0.0.1:48701/solr/collection1/&NOW=1346601212697&start=0&q=*:*&isShard=true&fsv=true} hits=19 status=0 QTime=1 
[junit4:junit4]   2> 15421 T630 C51 P54546 REQ [collection1] webapp=/solr path=/select params={sort=n_td1+desc&distrib=false&wt=javabin&rows=10&version=2&fl=id&shard.url=127.0.0.1:54546/solr/collection1/&NOW=1346601212697&start=0&q=*:*&isShard=true&fsv=true} hits=18 status=0 QTime=1 
[junit4:junit4]   2> 15421 T642 C52 P10401 REQ [collection1] webapp=/solr path=/select params={sort=n_td1+desc&distrib=false&wt=javabin&rows=10&version=2&fl=id&shard.url=127.0.0.1:10401/solr/collection1/&NOW=1346601212697&start=0&q=*:*&isShard=true&fsv=true} hits=30 status=0 QTime=1 
[junit4:junit4]   2> 15426 T654 C53 P48701 REQ [collection1] webapp=/solr path=/select params={shard.url=127.0.0.1:48701/solr/collection1/&NOW=1346601212697&q=*:*&ids=104,142&distrib=false&isShard=true&wt=javabin&version=2} status=0 QTime=1 
[junit4:junit4]   2> 15426 T642 C52 P10401 REQ [collection1] webapp=/solr path=/select params={shard.url=127.0.0.1:10401/solr/collection1/&NOW=1346601212697&q=*:*&ids=125,113,4&distrib=false&isShard=true&wt=javabin&version=2} status=0 QTime=1 
[junit4:junit4]   2> 15426 T630 C51 P54546 REQ [collection1] webapp=/solr path=/select params={shard.url=127.0.0.1:54546/solr/collection1/&NOW=1346601212697&q=*:*&ids=135,148,110,124,8&distrib=false&isShard=true&wt=javabin&version=2} status=0 QTime=1 
[junit4:junit4]   2> 15428 T632 C51 P54546 REQ [collection1] webapp=/solr path=/select params={sort=n_td1+desc&wt=javabin&q=*:*&version=2} status=0 QTime=11 
[junit4:junit4]   2> 15433 T613 C50 P45643 REQ [collection1] webapp=/solr path=/select params={distrib=false&sort=n_td1+asc&wt=javabin&q=*:*&version=2} hits=67 status=0 QTime=1 
[junit4:junit4]   2> 15441 T654 C53 P48701 REQ [collection1] webapp=/solr path=/select params={sort=n_td1+asc&distrib=false&wt=javabin&rows=10&version=2&fl=id&shard.url=127.0.0.1:48701/solr/collection1/&NOW=1346601212717&start=0&q=*:*&isShard=true&fsv=true} hits=19 status=0 QTime=1 
[junit4:junit4]   2> 15441 T642 C52 P10401 REQ [collection1] webapp=/solr path=/select params={sort=n_td1+asc&distrib=false&wt=javabin&rows=10&version=2&fl=id&shard.url=127.0.0.1:10401/solr/collection1/&NOW=1346601212717&start=0&q=*:*&isShard=true&fsv=true} hits=30 status=0 QTime=1 
[junit4:junit4]   2> 15441 T630 C51 P54546 REQ [collection1] webapp=/solr path=/select params={sort=n_td1+asc&distrib=false&wt=javabin&rows=10&version=2&fl=id&shard.url=127.0.0.1:54546/solr/collection1/&NOW=1346601212717&start=0&q=*:*&isShard=true&fsv=true} hits=18 status=0 QTime=1 
[junit4:junit4]   2> 15446 T654 C53 P48701 REQ [collection1] webapp=/solr path=/select params={shard.url=127.0.0.1:48701/solr/collection1/&NOW=1346601212717&q=*:*&ids=116,126,106,17&distrib=false&isShard=true&wt=javabin&version=2} status=0 QTime=1 
[junit4:junit4]   2> 15446 T642 C52 P10401 REQ [collection1] webapp=/solr path=/select params={shard.url=127.0.0.1:10401/solr/collection1/&NOW=1346601212717&q=*:*&ids=105,12,119&distrib=false&isShard=true&wt=javabin&version=2} status=0 QTime=0 
[junit4:junit4]   2> 15446 T630 C51 P54546 REQ [collection1] webapp=/solr path=/select params={shard.url=127.0.0.1:54546/solr/collection1/&NOW=1346601212717&q=*:*&ids=10,100,11&distrib=false&isShard=true&wt=javabin&version=2} status=0 QTime=1 
[junit4:junit4]   2> 15448 T627 C51 P54546 REQ [collection1] webapp=/solr path=/select params={sort=n_td1+asc&wt=javabin&q=*:*&version=2} status=0 QTime=11 
[junit4:junit4]   2> 15454 T613 C50 P45643 REQ [collection1] webapp=/solr path=/select params={distrib=false&sort=n_l1+desc&wt=javabin&q=*:*&version=2} hits=67 status=0 QTime=2 
[junit4:junit4]   2> 15462 T654 C53 P48701 REQ [collection1] webapp=/solr path=/select params={sort=n_l1+desc&distrib=false&wt=javabin&rows=10&version=2&fl=id&shard.url=127.0.0.1:48701/solr/collection1/&NOW=1346601212738&start=0&q=*:*&isShard=true&fsv=true} hits=19 status=0 QTime=1 
[junit4:junit4]   2> 15463 T642 C52 P10401 REQ [collection1] webapp=/solr path=/select params={sort=n_l1+desc&distrib=false&wt=javabin&rows=10&version=2&fl=id&shard.url=127.0.0.1:10401/solr/collection1/&NOW=1346601212738&start=0&q=*:*&isShard=true&fsv=true} hits=30 status=0 QTime=1 
[junit4:junit4]   2> 15463 T630 C51 P54546 REQ [collection1] webapp=/solr path=/select params={sort=n_l1+desc&distrib=false&wt=javabin&rows=10&version=2&fl=id&shard.url=127.0.0.1:54546/solr/collection1/&NOW=1346601212738&start=0&q=*:*&isShard=true&fsv=true} hits=18 status=0 QTime=2 
[junit4:junit4]   2> 15468 T654 C53 P48701 REQ [collection1] webapp=/solr path=/select params={shard.url=127.0.0.1:48701/solr/collection1/&NOW=1346601212738&q=*:*&ids=112,5,104&distrib=false&isShard=true&wt=javabin&version=2} status=0 QTime=1 
[junit4:junit4]   2> 15468 T630 C51 P54546 REQ [collection1] webapp=/solr path=/select params={shard.url=127.0.0.1:54546/solr/collection1/&NOW=1346601212738&q=*:*&ids=109,123&distrib=false&isShard=true&wt=javabin&version=2} status=0 QTime=1 
[junit4:junit4]   2> 15468 T642 C52 P10401 REQ [collection1] webapp=/solr path=/select params={shard.url=127.0.0.1:10401/solr/collection1/&NOW=1346601212738&q=*:*&ids=134,133,146,105,101&distrib=false&isShard=true&wt=javabin&version=2} status=0 QTime=1 
[junit4:junit4]   2> 15470 T627 C51 P54546 REQ [collection1] webapp=/solr path=/select params={sort=n_l1+desc&wt=javabin&q=*:*&version=2} status=0 QTime=12 
[junit4:junit4]   2> 15475 T613 C50 P45643 REQ [collection1] webapp=/solr path=/select params={distrib=false&sort=n_l1+asc&wt=javabin&q=*:*&version=2} hits=67 status=0 QTime=1 
[junit4:junit4]   2> 15482 T653 C53 P48701 REQ [collection1] webapp=/solr path=/select params={sort=n_l1+asc&distrib=false&wt=javabin&rows=10&version=2&fl=id&shard.url=127.0.0.1:48701/solr/collection1/&NOW=1346601212758&start=0&q=*:*&isShard=true&fsv=true} hits=19 status=0 QTime=1 
[junit4:junit4]   2> 15482 T641 C52 P10401 REQ [collection1] webapp=/solr path=/select params={sort=n_l1+asc&distrib=false&wt=javabin&rows=10&version=2&fl=id&shard.url=127.0.0.1:10401/solr/collection1/&NOW=1346601212758&start=0&q=*:*&isShard=true&fsv=true} hits=30 status=0 QTime=1 
[junit4:junit4]   2> 15482 T629 C51 P54546 REQ [collection1] webapp=/solr path=/select params={sort=n_l1+asc&distrib=false&wt=javabin&rows=10&version=2&fl=id&shard.url=127.0.0.1:54546/solr/collection1/&NOW=1346601212758&start=0&q=*:*&isShard=true&fsv=true} hits=18 status=0 QTime=1 
[junit4:junit4]   2> 15487 T629 C51 P54546 REQ [collection1] webapp=/solr path=/select params={shard.url=127.0.0.1:54546/solr/collection1/&NOW=1346601212758&q=*:*&ids=10,110,8,118&distrib=false&isShard=true&wt=javabin&version=2} status=0 QTime=1 
[junit4:junit4]   2> 15487 T653 C53 P48701 REQ [collection1] webapp=/solr path=/select params={shard.url=127.0.0.1:48701/solr/collection1/&NOW=1346601212758&q=*:*&ids=121,136,137,103&distrib=false&isShard=true&wt=javabin&version=2} status=0 QTime=1 
[junit4:junit4]   2> 15487 T641 C52 P10401 REQ [collection1] webapp=/solr path=/select params={shard.url=127.0.0.1:10401/solr/collection1/&NOW=1346601212758&q=*:*&ids=144,120&distrib=false&isShard=true&wt=javabin&version=2} status=0 QTime=0 
[junit4:junit4]   2> 15489 T652 C53 P48701 REQ [collection1] webapp=/solr path=/select params={sort=n_l1+asc&shards=shard3,shard4,shard5&wt=javabin&q=*:*&version=2} status=0 QTime=11 
[junit4:junit4]   2> 15495 T613 C50 P45643 REQ [collection1] webapp=/solr path=/select params={distrib=false&sort=n_tl1+desc&wt=javabin&q=*:*&version=2} hits=67 status=0 QTime=2 
[junit4:junit4]   2> 15502 T629 C51 P54546 REQ [collection1] webapp=/solr path=/select params={sort=n_tl1+desc&distrib=false&wt=javabin&rows=10&version=2&fl=id&shard.url=127.0.0.1:54546/solr/collection1/&NOW=1346601212778&start=0&q=*:*&isShard=true&fsv=true} hits=18 status=0 QTime=1 
[junit4:junit4]   2> 15502 T641 C52 P10401 REQ [collection1] webapp=/solr path=/select params={sort=n_tl1+desc&distrib=false&wt=javabin&rows=10&version=2&fl=id&shard.url=127.0.0.1:10401/solr/collection1/&NOW=1346601212778&start=0&q=*:*&isShard=true&fsv=true} hits=30 status=0 QTime=1 
[junit4:junit4]   2> 15502 T653 C53 P48701 REQ [collection1] webapp=/solr path=/select params={sort=n_tl1+desc&distrib=false&wt=javabin&rows=10&version=2&fl=id&shard.url=127.0.0.1:48701/solr/collection1/&NOW=1346601212778&start=0&q=*:*&isShard=true&fsv=true} hits=19 status=0 QTime=1 
[junit4:junit4]   2> 15507 T629 C51 P54546 REQ [collection1] webapp=/solr path=/select params={shard.url=127.0.0.1:54546/solr/collection1/&NOW=1346601212778&q=*:*&ids=135,1,109,123,118&distrib=false&isShard=true&wt=javabin&version=2} status=0 QTime=1 
[junit4:junit4]   2> 15508 T641 C52 P10401 REQ [collection1] webapp=/solr path=/select params={shard.url=127.0.0.1:10401/solr/collection1/&NOW=1346601212778&q=*:*&ids=117,107,120,140,119&distrib=false&isShard=true&wt=javabin&version=2} status=0 QTime=1 
[junit4:junit4]   2> 15509 T656 C53 P48701 REQ [collection1] webapp=/solr path=/select params={sort=n_tl1+desc&wt=javabin&q=*:*&version=2} status=0 QTime=11 
[junit4:junit4]   2> 15513 T613 C50 P45643 REQ [collection1] webapp=/solr path=/select params={distrib=false&sort=n_tl1+asc&wt=javabin&q=*:*&version=2} hits=67 status=0 QTime=1 
[junit4:junit4]   2> 15520 T643 C52 P10401 REQ [collection1] webapp=/solr path=/select params={sort=n_tl1+asc&distrib=false&wt=javabin&rows=10&version=2&fl=id&shard.url=127.0.0.1:10401/solr/collection1/&NOW=1346601212796&start=0&q=*:*&isShard=true&fsv=true} hits=30 status=0 QTime=1 
[junit4:junit4]   2> 15520 T631 C51 P54546 REQ [collection1] webapp=/solr path=/select params={sort=n_tl1+asc&distrib=false&wt=javabin&rows=10&version=2&fl=id&shard.url=127.0.0.1:54546/solr/collection1/&NOW=1346601212796&start=0&q=*:*&isShard=true&fsv=true} hits=18 status=0 QTime=1 
[junit4:junit4]   2> 15520 T655 C53 P48701 REQ [collection1] webapp=/solr path=/select params={sort=n_tl1+asc&distrib=false&wt=javabin&rows=10&version=2&fl=id&shard.url=127.0.0.1:48701/solr/collection1/&NOW=1346601212796&start=0&q=*:*&isShard=true&fsv=true} hits=19 status=0 QTime=1 
[junit4:junit4]   2> 15525 T631 C51 P54546 REQ [collection1] webapp=/solr path=/select params={shard.url=127.0.0.1:54546/solr/collection1/&NOW=1346601212796&q=*:*&ids=10,100&distrib=false&isShard=true&wt=javabin&version=2} status=0 QTime=1 
[junit4:junit4]   2> 15525 T655 C53 P48701 REQ [collection1] webapp=/solr path=/select params={shard.url=127.0.0.1:48701/solr/collection1/&NOW=1346601212796&q=*:*&ids=116,147,139,137&distrib=false&isShard=true&wt=javabin&version=2} status=0 QTime=0 
[junit4:junit4]   2> 15526 T643 C52 P10401 REQ [collection1] webapp=/solr path=/select params={shard.url=127.0.0.1:10401/solr/collection1/&NOW=1346601212796&q=*:*&ids=133,7,122,102&distrib=false&isShard=true&wt=javabin&version=2} status=0 QTime=2 
[junit4:junit4]   2> 15527 T644 C52 P10401 REQ [collection1] webapp=/solr path=/select params={sort=n_tl1+asc&shards=shard3,shard4,shard5&wt=javabin&q=*:*&version=2} status=0 QTime=11 
[junit4:junit4]   2> 15533 T613 C50 P45643 REQ [collection1] webapp=/solr path=/select params={distrib=false&sort=n_dt1+desc&wt=javabin&q=*:*&version=2} hits=67 status=0 QTime=2 
[junit4:junit4]   2> 15541 T654 C53 P48701 REQ [collection1] webapp=/solr path=/select params={sort=n_dt1+desc&distrib=false&collection=collection1&wt=javabin&rows=10&version=2&fl=id&shard.url=127.0.0.1:48701/solr/collection1/&NOW=1346601212817&start=0&q=*:*&isShard=true&fsv=true} hits=19 status=0 QTime=1 
[junit4:junit4]   2> 15541 T642 C52 P10401 REQ [collection1] webapp=/solr path=/select params={sort=n_dt1+desc&distrib=false&collection=collection1&wt=javabin&rows=10&version=2&fl=id&shard.url=127.0.0.1:10401/solr/collection1/&NOW=1346601212817&start=0&q=*:*&isShard=true&fsv=true} hits=30 status=0 QTime=1 
[junit4:junit4]   2> 15541 T630 C51 P54546 REQ [collection1] webapp=/solr path=/select params={sort=n_dt1+desc&distrib=false&collection=collection1&wt=javabin&rows=10&version=2&fl=id&shard.url=127.0.0.1:54546/solr/collection1/&NOW=1346601212817&start=0&q=*:*&isShard=true&fsv=true} hits=18 status=0 QTime=1 
[junit4:junit4]   2> 15546 T654 C53 P48701 REQ [collection1] webapp=/solr path=/select params={shard.url=127.0.0.1:48701/solr/collection1/&NOW=1346601212817&q=*:*&ids=126,112,149&distrib=false&collection=collection1&isShard=true&wt=javabin&version=2} status=0 QTime=1 
[junit4:junit4]   2> 15546 T630 C51 P54546 REQ [collection1] webapp=/solr path=/select params={shard.url=127.0.0.1:54546/solr/collection1/&NOW=1346601212817&q=*:*&ids=1,10,13&distrib=false&collection=collection1&isShard=true&wt=javabin&version=2} status=0 QTime=1 
[junit4:junit4]   2> 15546 T642 C52 P10401 REQ [collection1] webapp=/solr path=/select params={shard.url=127.0.0.1:10401/solr/collection1/&NOW=1346601212817&q=*:*&ids=133,122,4,130&distrib=false&collection=collection1&isShard=true&wt=javabin&version=2} status=0 QTime=1 
[junit4:junit4]   2> 15547 T632 C51 P54546 REQ [collection1] webapp=/solr path=/select params={collection=collection1&sort=n_dt1+desc&wt=javabin&q=*:*&version=2} status=0 QTime=10 
[junit4:junit4]   2> 15551 T613 C50 P45643 REQ [collection1] webapp=/solr path=/select params={distrib=false&sort=n_dt1+asc&wt=javabin&q=*:*&version=2} hits=67 status=0 QTime=0 
[junit4:junit4]   2> 15558 T655 C53 P48701 REQ [collection1] webapp=/solr path=/select params={sort=n_dt1+asc&distrib=false&collection=collection1&wt=javabin&rows=10&version=2&NOW=1346601212835&shard.url=127.0.0.1:48701/solr/collection1/&fl=id&start=0&q=*:*&isShard=true&fsv=true} hits=19 status=0 QTime=0 
[junit4:junit4]   2> 15559 T631 C51 P54546 REQ [collection1] webapp=/solr path=/select params={sort=n_dt1+asc&distrib=false&collection=collection1&wt=javabin&rows=10&version=2&NOW=1346601212835&shard.url=127.0.0.1:54546/solr/collection1/&fl=id&start=0&q=*:*&isShard=true&fsv=true} hits=18 status=0 QTime=0 
[junit4:junit4]   2> 15559 T643 C52 P10401 REQ [collection1] webapp=/solr path=/select params={sort=n_dt1+asc&distrib=false&collection=collection1&wt=javabin&rows=10&version=2&NOW=1346601212835&shard.url=127.0.0.1:10401/solr/collection1/&fl=id&start=0&q=*:*&isShard=true&fsv=true} hits=30 status=0 QTime=1 
[junit4:junit4]   2> 15563 T631 C51 P54546 REQ [collection1] webapp=/solr path=/select params={shard.url=127.0.0.1:54546/solr/collection1/&NOW=1346601212835&q=*:*&ids=124,118&distrib=false&collection=collection1&isShard=true&wt=javabin&version=2} status=0 QTime=1 
[junit4:junit4]   2> 15564 T643 C52 P10401 REQ [collection1] webapp=/solr path=/select params={shard.url=127.0.0.1:10401/solr/collection1/&NOW=1346601212835&q=*:*&ids=144,7,111,105,140,102,101,12&distrib=false&collection=collection1&isShard=true&wt=javabin&version=2} status=0 QTime=2 
[junit4:junit4]   2> 15565 T644 C52 P10401 REQ [collection1] webapp=/solr path=/select params={sort=n_dt1+asc&shards=shard3,shard4,shard5&q=*:*&collection=collection1&wt=javabin&version=2} status=0 QTime=10 
[junit4:junit4]   2> 15570 T613 C50 P45643 REQ [collection1] webapp=/solr path=/select params={distrib=false&sort=n_tdt1+desc&wt=javabin&q=*:*&version=2} hits=67 status=0 QTime=2 
[junit4:junit4]   2> 15577 T653 C53 P48701 REQ [collection1] webapp=/solr path=/select params={sort=n_tdt1+desc&distrib=false&wt=javabin&rows=10&version=2&fl=id&shard.url=127.0.0.1:48701/solr/collection1/&NOW=1346601212853&start=0&q=*:*&isShard=true&fsv=true} hits=19 status=0 QTime=1 
[junit4:junit4]   2> 15577 T629 C51 P54546 REQ [collection1] webapp=/solr path=/select params={sort=n_tdt1+desc&distrib=false&wt=javabin&rows=10&version=2&fl=id&shard.url=127.0.0.1:54546/solr/collection1/&NOW=1346601212853&start=0&q=*:*&isShard=true&fsv=true} hits=18 status=0 QTime=1 
[junit4:junit4]   2> 15577 T641 C52 P10401 REQ [collection1] webapp=/solr path=/select params={sort=n_tdt1+desc&distrib=false&wt=javabin&rows=10&version=2&fl=id&shard.url=127.0.0.1:10401/solr/collection1/&NOW=1346601212853&start=0&q=*:*&isShard=true&fsv=true} hits=30 status=0 QTime=1 
[junit4:junit4]   2> 15582 T629 C51 P54546 REQ [collection1] webapp=/solr path=/select params={shard.url=127.0.0.1:54546/solr/collection1/&NOW=1346601212853&q=*:*&ids=135,138,108&distrib=false&isShard=true&wt=javabin&version=2} status=0 QTime=1 
[junit4:junit4]   2> 15582 T653 C53 P48701 REQ [collection1] webapp=/solr path=/select params={shard.url=127.0.0.1:48701/solr/collection1/&NOW=1346601212853&q=*:*&ids=128,104,131,142&distrib=false&isShard=true&wt=javabin&version=2} status=0 QTime=1 
[junit4:junit4]   2> 15582 T641 C52 P10401 REQ [collection1] webapp=/solr path=/select params={shard.url=127.0.0.1:10401/solr/collection1/&NOW=1346601212853&q=*:*&ids=134,107,141&distrib=false&isShard=true&wt=javabin&version=2} status=0 QTime=1 
[junit4:junit4]   2> 15583 T652 C53 P48701 REQ [collection1] webapp=/solr path=/select params={sort=n_tdt1+desc&wt=javabin&q=*:*&version=2} status=0 QTime=10 
[junit4:junit4]   2> 15587 T613 C50 P45643 REQ [collection1] webapp=/solr path=/select params={distrib=false&sort=n_tdt1+asc&wt=javabin&q=*:*&version=2} hits=67 status=0 QTime=0 
[junit4:junit4]   2> 15595 T631 C51 P54546 REQ [collection1] webapp=/solr path=/select params={sort=n_tdt1+asc&distrib=false&wt=javabin&rows=10&version=2&fl=id&shard.url=127.0.0.1:54546/solr/collection1/&NOW=1346601212871&start=0&q=*:*&isShard=true&fsv=true} hits=18 status=0 QTime=1 
[junit4:junit4]   2> 15595 T655 C53 P48701 REQ [collection1] webapp=/solr path=/select params={sort=n_tdt1+asc&distrib=false&wt=javabin&rows=10&version=2&fl=id&shard.url=127.0.0.1:48701/solr/collection1/&NOW=1346601212871&start=0&q=*:*&isShard=true&fsv=true} hits=19 status=0 QTime=1 
[junit4:junit4]   2> 15595 T643 C52 P10401 REQ [collection1] webapp=/solr path=/select params={sort=n_tdt1+asc&distrib=false&wt=javabin&rows=10&version=2&fl=id&shard.url=127.0.0.1:10401/solr/collection1/&NOW=1346601212871&start=0&q=*:*&isShard=true&fsv=true} hits=30 status=0 QTime=1 
[junit4:junit4]   2> 15598 T631 C51 P54546 REQ [collection1] webapp=/solr path=/select params={shard.url=127.0.0.1:54546/solr/collection1/&NOW=1346601212871&q=*:*&ids=16&distrib=false&isShard=true&wt=javabin&version=2} status=0 QTime=0 
[junit4:junit4]   2> 15598 T655 C53 P48701 REQ [collection1] webapp=/solr path=/select params={shard.url=127.0.0.1:48701/solr/collection1/&NOW=1346601212871&q=*:*&ids=5&distrib=false&isShard=true&wt=javabin&version=2} status=0 QTime=0 
[junit4:junit4]   2> 15600 T643 C52 P10401 REQ [collection1] webapp=/solr path=/select params={shard.url=127.0.0.1:10401/solr/collection1/&NOW=1346601212871&q=*:*&ids=3,144,117,7,6,111,15,119&distrib=false&isShard=true&wt=javabin&version=2} status=0 QTime=2 
[junit4:junit4]   2> 15601 T640 C52 P10401 REQ [collection1] webapp=/solr path=/select params={sort=n_tdt1+asc&shards=shard3,shard4,shard5&wt=javabin&q=*:*&version=2} status=0 QTime=10 
[junit4:junit4]   2> 15606 T613 C50 P45643 REQ [collection1] webapp=/solr path=/select params={distrib=false&sort=a_si+desc&wt=javabin&q=*:*&version=2} hits=67 status=0 QTime=1 
[junit4:junit4]   2> 15614 T629 C51 P54546 REQ [collection1] webapp=/solr path=/select params={sort=a_si+desc&distrib=false&collection=collection1&wt=javabin&rows=10&version=2&NOW=1346601212890&shard.url=127.0.0.1:54546/solr/collection1/&fl=id&start=0&q=*:*&isShard=true&fsv=true} hits=18 status=0 QTime=1 
[junit4:junit4]   2> 15614 T641 C52 P10401 REQ [collection1] webapp=/solr path=/select params={sort=a_si+desc&distrib=false&collection=collection1&wt=javabin&rows=10&version=2&NOW=1346601212890&shard.url=127.0.0.1:10401/solr/collection1/&fl=id&start=0&q=*:*&isShard=true&fsv=true} hits=30 status=0 QTime=1 
[junit4:junit4]   2> 15614 T653 C53 P48701 REQ [collection1] webapp=/solr path=/select params={sort=a_si+desc&distrib=false&collection=collection1&wt=javabin&rows=10&version=2&NOW=1346601212890&shard.url=127.0.0.1:48701/solr/collection1/&fl=id&start=0&q=*:*&isShard=true&fsv=true} hits=19 status=0 QTime=1 
[junit4:junit4]   2> 15619 T653 C53 P48701 REQ [collection1] webapp=/solr path=/select params={shard.url=127.0.0.1:48701/solr/collection1/&NOW=1346601212890&q=*:*&ids=5&distrib=false&collection=collection1&isShard=true&wt=javabin&version=2} status=0 QTime=1 
[junit4:junit4]   2> 15619 T629 C51 P54546 REQ [collection1] webapp=/solr path=/select params={shard.url=127.0.0.1:54546/solr/collection1/&NOW=1346601212890&q=*:*&ids=10,1,8,13&distrib=false&collection=collection1&isShard=true&wt=javabin&version=2} status=0 QTime=1 
[junit4:junit4]   2> 15619 T641 C52 P10401 REQ [collection1] webapp=/solr path=/select params={shard.url=127.0.0.1:10401/solr/collection1/&NOW=1346601212890&q=*:*&ids=3,2,7,9,12&distrib=false&collection=collection1&isShard=true&wt=javabin&version=2} status=0 QTime=1 
[junit4:junit4]   2> 15620 T656 C53 P48701 REQ [collection1] webapp=/solr path=/select params={sort=a_si+desc&shards=shard3,shard4,shard5&q=*:*&collection=collection1&wt=javabin&version=2} status=0 QTime=10 
[junit4:junit4]   2> 15642 T613 C50 P45643 REQ [collection1] webapp=/solr path=/select params={distrib=false&sort=a_si+asc&wt=javabin&q=*:*&version=2} hits=67 status=0 QTime=18 
[junit4:junit4]   2> 15649 T654 C53 P48701 REQ [collection1] webapp=/solr path=/select params={sort=a_si+asc&distrib=false&wt=javabin&rows=10&version=2&fl=id&shard.url=127.0.0.1:48701/solr/collection1/&NOW=1346601212925&start=0&q=*:*&isShard=true&fsv=true} hits=19 status=0 QTime=1 
[junit4:junit4]   2> 15649 T642 C52 P10401 REQ [collection1] webapp=/solr path=/select params={sort=a_si+asc&distrib=false&wt=javabin&rows=10&version=2&fl=id&shard.url=127.0.0.1:10401/solr/collection1/&NOW=1346601212925&start=0&q=*:*&isShard=true&fsv=true} hits=30 status=0 QTime=1 
[junit4:junit4]   2> 15649 T630 C51 P54546 REQ [collection1] webapp=/solr path=/select params={sort=a_si+asc&distrib=false&wt=javabin&rows=10&version=2&fl=id&shard.url=127.0.0.1:54546/solr/collection1/&NOW=1346601212925&start=0&q=*:*&isShard=true&fsv=true} hits=18 status=0 QTime=1 
[junit4:junit4]   2> 15658 T630 C51 P54546 REQ [collection1] webapp=/solr path=/select params={shard.url=127.0.0.1:54546/solr/collection1/&NOW=1346601212925&q=*:*&ids=1,13,11&distrib=false&isShard=true&wt=javabin&version=2} status=0 QTime=1 
[junit4:junit4]   2> 15658 T642 C52 P10401 REQ [collection1] webapp=/solr path=/select params={shard.url=127.0.0.1:10401/solr/collection1/&NOW=1346601212925&q=*:*&ids=3,2,7,6,4,9,12&distrib=false&isShard=true&wt=javabin&version=2} status=0 QTime=1 
[junit4:junit4]   2> 15659 T627 C51 P54546 REQ [collection1] webapp=/solr path=/select params={sort=a_si+asc&wt=javabin&q=*:*&version=2} status=0 QTime=14 
[junit4:junit4]   2> 15664 T613 C50 P45643 REQ [collection1] webapp=/solr path=/select params={sort=a_si+desc&fl=*,score&q=*:*&distrib=false&wt=javabin&version=2} hits=67 status=0 QTime=1 
[junit4:junit4]   2> 15671 T629 C51 P54546 REQ [collection1] webapp=/solr path=/select params={sort=a_si+desc&distrib=false&wt=javabin&rows=10&version=2&fl=id,score&shard.url=127.0.0.1:54546/solr/collection1/&NOW=1346601212947&start=0&q=*:*&isShard=true&fsv=true} hits=18 status=0 QTime=1 
[junit4:junit4]   2> 15671 T641 C52 P10401 REQ [collection1] webapp=/solr path=/select params={sort=a_si+desc&distrib=false&wt=javabin&rows=10&version=2&fl=id,score&shard.url=127.0.0.1:10401/solr/collection1/&NOW=1346601212947&start=0&q=*:*&isShard=true&fsv=true} hits=30 status=0 QTime=1 
[junit4:junit4]   2> 15671 T653 C53 P48701 REQ [collection1] webapp=/solr path=/select params={sort=a_si+desc&distrib=false&wt=javabin&rows=10&version=2&fl=id,score&shard.url=127.0.0.1:48701/solr/collection1/&NOW=1346601212947&start=0&q=*:*&isShard=true&fsv=true} hits=19 status=0 QTime=1 
[junit4:junit4]   2> 15675 T653 C53 P48701 REQ [collection1] webapp=/solr path=/select params={fl=*,score&shard.url=127.0.0.1:48701/solr/collection1/&NOW=1346601212947&q=*:*&ids=5&distrib=false&isShard=true&wt=javabin&version=2} status=0 QTime=0 
[junit4:junit4]   2> 15675 T629 C51 P54546 REQ [collection1] webapp=/solr path=/select params={fl=*,score&shard.url=127.0.0.1:54546/solr/collection1/&NOW=1346601212947&q=*:*&ids=10,1,8,13&distrib=false&isShard=true&wt=javabin&version=2} status=0 QTime=1 
[junit4:junit4]   2> 15675 T641 C52 P10401 REQ [collection1] webapp=/solr path=/select params={fl=*,score&shard.url=127.0.0.1:10401/solr/collection1/&NOW=1346601212947&q=*:*&ids=3,2,7,9,12&distrib=false&isShard=true&wt=javabin&version=2} status=0 QTime=1 
[junit4:junit4]   2> 15676 T652 C53 P48701 REQ [collection1] webapp=/solr path=/select params={sort=a_si+desc&fl=*,score&wt=javabin&q=*:*&version=2} status=0 QTime=9 
[junit4:junit4]   2> 15681 T613 C50 P45643 REQ [collection1] webapp=/solr path=/select params={sort=n_tl1+asc&fl=*,score&q=*:*&distrib=false&wt=javabin&version=2} hits=67 status=0 QTime=1 
[junit4:junit4]   2> 15688 T630 C51 P54546 REQ [collection1] webapp=/solr path=/select params={sort=n_tl1+asc&distrib=false&wt=javabin&rows=10&version=2&fl=id,score&shard.url=127.0.0.1:54546/solr/collection1/&NOW=1346601212964&start=0&q=*:*&isShard=true&fsv=true} hits=18 status=0 QTime=0 
[junit4:junit4]   2> 15688 T654 C53 P48701 REQ [collection1] webapp=/solr path=/select params={sort=n_tl1+asc&distrib=false&wt=javabin&rows=10&version=2&fl=id,score&shard.url=127.0.0.1:48701/solr/collection1/&NOW=1346601212964&start=0&q=*:*&isShard=true&fsv=true} hits=19 status=0 QTime=1 
[junit4:junit4]   2> 15688 T642 C52 P10401 REQ [collection1] webapp=/solr path=/select params={sort=n_tl1+asc&distrib=false&wt=javabin&rows=10&version=2&fl=id,score&shard.url=127.0.0.1:10401/solr/collection1/&NOW=1346601212964&start=0&q=*:*&isShard=true&fsv=true} hits=30 status=0 QTime=1 
[junit4:junit4]   2> 15692 T642 C52 P10401 REQ [collection1] webapp=/solr path=/select params={fl=*,score&shard.url=127.0.0.1:10401/solr/collection1/&NOW=1346601212964&q=*:*&ids=133,7,122,102&distrib=false&isShard=true&wt=javabin&version=2} status=0 QTime=1 
[junit4:junit4]   2> 15693 T630 C51 P54546 REQ [collection1] webapp=/solr path=/select params={fl=*,score&shard.url=127.0.0.1:54546/solr/collection1/&NOW=1346601212964&q=*:*&ids=10,100&distrib=false&isShard=true&wt=javabin&version=2} status=0 QTime=1 
[junit4:junit4]   2> 15693 T654 C53 P48701 REQ [collection1] webapp=/solr path=/select params={fl=*,score&shard.url=127.0.0.1:48701/solr/collection1/&NOW=1346601212964&q=*:*&ids=116,147,139,137&distrib=false&isShard=true&wt=javabin&version=2} status=0 QTime=1 
[junit4:junit4]   2> 15694 T627 C51 P54546 REQ [collection1] webapp=/solr path=/select params={sort=n_tl1+asc&fl=*,score&shards=shard3,shard4,shard5&q=*:*&wt=javabin&version=2} status=0 QTime=10 
[junit4:junit4]   2> 15697 T613 C50 P

[...truncated too long message...]

nit4] FAILURE  382s J0 | BasicDistributedZkTest.testDistribSearch <<<
[junit4:junit4]    > Throwable #1: java.lang.AssertionError: some core start times did not change on reload
[junit4:junit4]    > 	at __randomizedtesting.SeedInfo.seed([B833DB5BE53E4056:39D555439261206A]:0)
[junit4:junit4]    > 	at org.junit.Assert.fail(Assert.java:93)
[junit4:junit4]    > 	at org.junit.Assert.assertTrue(Assert.java:43)
[junit4:junit4]    > 	at org.apache.solr.cloud.BasicDistributedZkTest.testCollectionsAPI(BasicDistributedZkTest.java:410)
[junit4:junit4]    > 	at org.apache.solr.cloud.BasicDistributedZkTest.doTest(BasicDistributedZkTest.java:314)
[junit4:junit4]    > 	at org.apache.solr.BaseDistributedSearchTestCase.testDistribSearch(BaseDistributedSearchTestCase.java:691)
[junit4:junit4]    > 	at sun.reflect.NativeMethodAccessorImpl.invoke0(Native Method)
[junit4:junit4]    > 	at sun.reflect.NativeMethodAccessorImpl.invoke(NativeMethodAccessorImpl.java:57)
[junit4:junit4]    > 	at sun.reflect.DelegatingMethodAccessorImpl.invoke(DelegatingMethodAccessorImpl.java:43)
[junit4:junit4]    > 	at java.lang.reflect.Method.invoke(Method.java:601)
[junit4:junit4]    > 	at com.carrotsearch.randomizedtesting.RandomizedRunner.invoke(RandomizedRunner.java:1559)
[junit4:junit4]    > 	at com.carrotsearch.randomizedtesting.RandomizedRunner.access$600(RandomizedRunner.java:79)
[junit4:junit4]    > 	at com.carrotsearch.randomizedtesting.RandomizedRunner$6.evaluate(RandomizedRunner.java:737)
[junit4:junit4]    > 	at com.carrotsearch.randomizedtesting.RandomizedRunner$7.evaluate(RandomizedRunner.java:773)
[junit4:junit4]    > 	at com.carrotsearch.randomizedtesting.RandomizedRunner$8.evaluate(RandomizedRunner.java:787)
[junit4:junit4]    > 	at com.carrotsearch.randomizedtesting.rules.SystemPropertiesRestoreRule$1.evaluate(SystemPropertiesRestoreRule.java:53)
[junit4:junit4]    > 	at org.apache.lucene.util.TestRuleSetupTeardownChained$1.evaluate(TestRuleSetupTeardownChained.java:50)
[junit4:junit4]    > 	at org.apache.lucene.util.TestRuleFieldCacheSanity$1.evaluate(TestRuleFieldCacheSanity.java:51)
[junit4:junit4]    > 	at org.apache.lucene.util.AbstractBeforeAfterRule$1.evaluate(AbstractBeforeAfterRule.java:45)
[junit4:junit4]    > 	at com.carrotsearch.randomizedtesting.rules.SystemPropertiesInvariantRule$1.evaluate(SystemPropertiesInvariantRule.java:55)
[junit4:junit4]    > 	at org.apache.lucene.util.TestRuleThreadAndTestName$1.evaluate(TestRuleThreadAndTestName.java:48)
[junit4:junit4]    > 	at org.apache.lucene.util.TestRuleIgnoreAfterMaxFailures$1.evaluate(TestRuleIgnoreAfterMaxFailures.java:70)
[junit4:junit4]    > 	at org.apache.lucene.util.TestRuleMarkFailure$1.evaluate(TestRuleMarkFailure.java:48)
[junit4:junit4]    > 	at com.carrotsearch.randomizedtesting.rules.StatementAdapter.evaluate(StatementAdapter.java:36)
[junit4:junit4]    > 	at com.carrotsearch.randomizedtesting.ThreadLeakControl$StatementRunner.run(ThreadLeakControl.java:345)
[junit4:junit4]    > 	at com.carrotsearch.randomizedtesting.ThreadLeakControl.forkTimeoutingTask(ThreadLeakControl.java:769)
[junit4:junit4]    > 	at com.carrotsearch.randomizedtesting.ThreadLeakControl$3.evaluate(ThreadLeakControl.java:429)
[junit4:junit4]    > 	at com.carrotsearch.randomizedtesting.RandomizedRunner.runSingleTest(RandomizedRunner.java:746)
[junit4:junit4]    > 	at com.carrotsearch.randomizedtesting.RandomizedRunner$3.evaluate(RandomizedRunner.java:648)
[junit4:junit4]    > 	at com.carrotsearch.randomizedtesting.RandomizedRunner$4.evaluate(RandomizedRunner.java:682)
[junit4:junit4]    > 	at com.carrotsearch.randomizedtesting.RandomizedRunner$5.evaluate(RandomizedRunner.java:693)
[junit4:junit4]    > 	at com.carrotsearch.randomizedtesting.rules.StatementAdapter.evaluate(StatementAdapter.java:36)
[junit4:junit4]    > 	at com.carrotsearch.randomizedtesting.rules.SystemPropertiesRestoreRule$1.evaluate(SystemPropertiesRestoreRule.java:53)
[junit4:junit4]    > 	at org.apache.lucene.util.AbstractBeforeAfterRule$1.evaluate(AbstractBeforeAfterRule.java:45)
[junit4:junit4]    > 	at org.apache.lucene.util.TestRuleStoreClassName$1.evaluate(TestRuleStoreClassName.java:42)
[junit4:junit4]    > 	at com.carrotsearch.randomizedtesting.rules.SystemPropertiesInvariantRule$1.evaluate(SystemPropertiesInvariantRule.java:55)
[junit4:junit4]    > 	at com.carrotsearch.randomizedtesting.rules.NoShadowingOrOverridesOnMethodsRule$1.evaluate(NoShadowingOrOverridesOnMethodsRule.java:39)
[junit4:junit4]    > 	at com.carrotsearch.randomizedtesting.rules.NoShadowingOrOverridesOnMethodsRule$1.evaluate(NoShadowingOrOverridesOnMethodsRule.java:39)
[junit4:junit4]    > 	at org.apache.lucene.util.TestRuleAssertionsRequired$1.evaluate(TestRuleAssertionsRequired.java:40)
[junit4:junit4]    > 	at org.apache.lucene.util.TestRuleMarkFailure$1.evaluate(TestRuleMarkFailure.java:48)
[junit4:junit4]    > 	at org.apache.lucene.util.TestRuleIgnoreAfterMaxFailures$1.evaluate(TestRuleIgnoreAfterMaxFailures.java:70)
[junit4:junit4]    > 	at org.apache.lucene.util.TestRuleIgnoreTestSuites$1.evaluate(TestRuleIgnoreTestSuites.java:55)
[junit4:junit4]    > 	at com.carrotsearch.randomizedtesting.rules.StatementAdapter.evaluate(StatementAdapter.java:36)
[junit4:junit4]    > 	at com.carrotsearch.randomizedtesting.ThreadLeakControl$StatementRunner.run(ThreadLeakControl.java:345)
[junit4:junit4]    > 	at java.lang.Thread.run(Thread.java:722)
[junit4:junit4]   2> 381610 T601 oas.SolrTestCaseJ4.deleteCore ###deleteCore
[junit4:junit4]   2> NOTE: test params are: codec=Lucene40: {n_f1=PostingsFormat(name=NestedPulsing), foo_b=PostingsFormat(name=Memory doPackFST= true), cat=Pulsing40(freqCutoff=17 minBlockSize=92 maxBlockSize=239), foo_d=PostingsFormat(name=MockSep), foo_f=PostingsFormat(name=Memory doPackFST= true), n_tl1=PostingsFormat(name=NestedPulsing), n_d1=Pulsing40(freqCutoff=17 minBlockSize=92 maxBlockSize=239), rnd_b=PostingsFormat(name=MockSep), intDefault=PostingsFormat(name=NestedPulsing), n_td1=PostingsFormat(name=NestedPulsing), timestamp=Pulsing40(freqCutoff=17 minBlockSize=92 maxBlockSize=239), id=PostingsFormat(name=MockSep), range_facet_sl=PostingsFormat(name=MockSep), range_facet_si=Pulsing40(freqCutoff=17 minBlockSize=92 maxBlockSize=239), oddField_s=PostingsFormat(name=MockSep), sequence_i=PostingsFormat(name=MockSep), name=PostingsFormat(name=MockSep), foo_i=PostingsFormat(name=NestedPulsing), regex_dup_B_s=Pulsing40(freqCutoff=17 minBlockSize=92 maxBlockSize=239), multiDefault=Pulsing40(freqCutoff=17 minBlockSize=92 maxBlockSize=239), n_tf1=Pulsing40(freqCutoff=17 minBlockSize=92 maxBlockSize=239), n_dt1=PostingsFormat(name=NestedPulsing), genre_s=PostingsFormat(name=MockSep), author_t=PostingsFormat(name=NestedPulsing), n_ti1=PostingsFormat(name=MockSep), range_facet_l=Pulsing40(freqCutoff=17 minBlockSize=92 maxBlockSize=239), text=PostingsFormat(name=Memory doPackFST= true), _version_=PostingsFormat(name=NestedPulsing), val_i=PostingsFormat(name=MockSep), SubjectTerms_mfacet=PostingsFormat(name=NestedPulsing), series_t=PostingsFormat(name=NestedPulsing), a_t=Pulsing40(freqCutoff=17 minBlockSize=92 maxBlockSize=239), n_tdt1=PostingsFormat(name=NestedPulsing), regex_dup_A_s=PostingsFormat(name=Memory doPackFST= true), price=PostingsFormat(name=Memory doPackFST= true), other_tl1=PostingsFormat(name=NestedPulsing), n_l1=Pulsing40(freqCutoff=17 minBlockSize=92 maxBlockSize=239), a_si=PostingsFormat(name=NestedPulsing), inStock=PostingsFormat(name=Memory doPackFST= true)}, sim=RandomSimilarityProvider(queryNorm=true,coord=no): {}, locale=es_SV, timezone=BET
[junit4:junit4]   2> NOTE: FreeBSD 9.0-RELEASE amd64/Oracle Corporation 1.7.0_06 (64-bit)/cpus=16,threads=1,free=217113832,total=411041792
[junit4:junit4]   2> NOTE: All tests run in this JVM: [CoreContainerCoreInitFailuresTest, WordBreakSolrSpellCheckerTest, SpellPossibilityIteratorTest, TestLMJelinekMercerSimilarityFactory, TestCoreContainer, JSONWriterTest, TestIndexSearcher, TestFiltering, CircularListTest, TestFastOutputStream, SearchHandlerTest, DistributedSpellCheckComponentTest, SampleTest, SortByFunctionTest, PluginInfoTest, AnalysisAfterCoreReloadTest, TestCollationField, TermVectorComponentDistributedTest, TestWordDelimiterFilterFactory, JsonLoaderTest, TestRangeQuery, LeaderElectionIntegrationTest, BadComponentTest, DirectUpdateHandlerOptimizeTest, TestLFUCache, SpatialFilterTest, RequestHandlersTest, TestConfig, ZkCLITest, TestSuggestSpellingConverter, NumericFieldsTest, SpellCheckComponentTest, TestSystemIdResolver, DirectSolrConnectionTest, TestQuerySenderNoQuery, TestCharFilters, SpellCheckCollatorTest, DateFieldTest, CacheHeaderTest, SystemInfoHandlerTest, FastVectorHighlighterTest, MoreLikeThisHandlerTest, AutoCommitTest, PreAnalyzedFieldTest, SOLR749Test, TestBinaryResponseWriter, SuggesterWFSTTest, CurrencyFieldTest, SolrCoreCheckLockOnStartupTest, AlternateDirectoryTest, TestJoin, BasicDistributedZkTest]
[junit4:junit4] Completed on J0 in 381.97s, 1 test, 1 failure <<< FAILURES!

[...truncated 333 lines...]
BUILD FAILED
/usr/home/hudson/hudson-slave/workspace/Lucene-Solr-Tests-trunk-java7/build.xml:29: The following error occurred while executing this line:
/usr/home/hudson/hudson-slave/workspace/Lucene-Solr-Tests-trunk-java7/solr/build.xml:144: The following error occurred while executing this line:
/usr/home/hudson/hudson-slave/workspace/Lucene-Solr-Tests-trunk-java7/lucene/module-build.xml:62: The following error occurred while executing this line:
/usr/home/hudson/hudson-slave/workspace/Lucene-Solr-Tests-trunk-java7/lucene/common-build.xml:1056: The following error occurred while executing this line:
/usr/home/hudson/hudson-slave/workspace/Lucene-Solr-Tests-trunk-java7/lucene/common-build.xml:741: There were test failures: 228 suites, 917 tests, 1 failure, 6 ignored (1 assumption)

Total time: 30 minutes 40 seconds
Build step 'Invoke Ant' marked build as failure
Recording test results
Email was triggered for: Failure
Sending email for trigger: Failure



Mime
View raw message