lucene-dev mailing list archives

Site index · List index
Message view « Date » · « Thread »
Top « Date » · « Thread »
From Apache Jenkins Server <jenk...@builds.apache.org>
Subject [JENKINS] Lucene-Solr-Tests-4.x-Java6 - Build # 647 - Failure
Date Sat, 15 Sep 2012 21:13:42 GMT
Build: https://builds.apache.org/job/Lucene-Solr-Tests-4.x-Java6/647/

1 tests failed.
REGRESSION:  org.apache.solr.cloud.BasicDistributedZk2Test.testDistribSearch

Error Message:
Shard still reported as live in zk

Stack Trace:
java.lang.AssertionError: Shard still reported as live in zk
	at __randomizedtesting.SeedInfo.seed([94ADA088D1E2CF9A:154B2E90A6BDAFA6]:0)
	at org.junit.Assert.fail(Assert.java:93)
	at org.apache.solr.cloud.AbstractFullDistribZkTestBase.waitToSeeNotLive(AbstractFullDistribZkTestBase.java:1220)
	at org.apache.solr.cloud.BasicDistributedZk2Test.brindDownShardIndexSomeDocsAndRecover(BasicDistributedZk2Test.java:190)
	at org.apache.solr.cloud.BasicDistributedZk2Test.doTest(BasicDistributedZk2Test.java:83)
	at org.apache.solr.BaseDistributedSearchTestCase.testDistribSearch(BaseDistributedSearchTestCase.java:695)
	at sun.reflect.NativeMethodAccessorImpl.invoke0(Native Method)
	at sun.reflect.NativeMethodAccessorImpl.invoke(NativeMethodAccessorImpl.java:57)
	at sun.reflect.DelegatingMethodAccessorImpl.invoke(DelegatingMethodAccessorImpl.java:43)
	at java.lang.reflect.Method.invoke(Method.java:616)
	at com.carrotsearch.randomizedtesting.RandomizedRunner.invoke(RandomizedRunner.java:1559)
	at com.carrotsearch.randomizedtesting.RandomizedRunner.access$600(RandomizedRunner.java:79)
	at com.carrotsearch.randomizedtesting.RandomizedRunner$6.evaluate(RandomizedRunner.java:737)
	at com.carrotsearch.randomizedtesting.RandomizedRunner$7.evaluate(RandomizedRunner.java:773)
	at com.carrotsearch.randomizedtesting.RandomizedRunner$8.evaluate(RandomizedRunner.java:787)
	at com.carrotsearch.randomizedtesting.rules.SystemPropertiesRestoreRule$1.evaluate(SystemPropertiesRestoreRule.java:53)
	at org.apache.lucene.util.TestRuleSetupTeardownChained$1.evaluate(TestRuleSetupTeardownChained.java:50)
	at org.apache.lucene.util.TestRuleFieldCacheSanity$1.evaluate(TestRuleFieldCacheSanity.java:51)
	at org.apache.lucene.util.AbstractBeforeAfterRule$1.evaluate(AbstractBeforeAfterRule.java:45)
	at com.carrotsearch.randomizedtesting.rules.SystemPropertiesInvariantRule$1.evaluate(SystemPropertiesInvariantRule.java:55)
	at org.apache.lucene.util.TestRuleThreadAndTestName$1.evaluate(TestRuleThreadAndTestName.java:48)
	at org.apache.lucene.util.TestRuleIgnoreAfterMaxFailures$1.evaluate(TestRuleIgnoreAfterMaxFailures.java:70)
	at org.apache.lucene.util.TestRuleMarkFailure$1.evaluate(TestRuleMarkFailure.java:48)
	at com.carrotsearch.randomizedtesting.rules.StatementAdapter.evaluate(StatementAdapter.java:36)
	at com.carrotsearch.randomizedtesting.ThreadLeakControl$StatementRunner.run(ThreadLeakControl.java:358)
	at com.carrotsearch.randomizedtesting.ThreadLeakControl.forkTimeoutingTask(ThreadLeakControl.java:782)
	at com.carrotsearch.randomizedtesting.ThreadLeakControl$3.evaluate(ThreadLeakControl.java:442)
	at com.carrotsearch.randomizedtesting.RandomizedRunner.runSingleTest(RandomizedRunner.java:746)
	at com.carrotsearch.randomizedtesting.RandomizedRunner$3.evaluate(RandomizedRunner.java:648)
	at com.carrotsearch.randomizedtesting.RandomizedRunner$4.evaluate(RandomizedRunner.java:682)
	at com.carrotsearch.randomizedtesting.RandomizedRunner$5.evaluate(RandomizedRunner.java:693)
	at com.carrotsearch.randomizedtesting.rules.StatementAdapter.evaluate(StatementAdapter.java:36)
	at com.carrotsearch.randomizedtesting.rules.SystemPropertiesRestoreRule$1.evaluate(SystemPropertiesRestoreRule.java:53)
	at org.apache.lucene.util.AbstractBeforeAfterRule$1.evaluate(AbstractBeforeAfterRule.java:45)
	at org.apache.lucene.util.TestRuleStoreClassName$1.evaluate(TestRuleStoreClassName.java:42)
	at com.carrotsearch.randomizedtesting.rules.SystemPropertiesInvariantRule$1.evaluate(SystemPropertiesInvariantRule.java:55)
	at com.carrotsearch.randomizedtesting.rules.NoShadowingOrOverridesOnMethodsRule$1.evaluate(NoShadowingOrOverridesOnMethodsRule.java:39)
	at com.carrotsearch.randomizedtesting.rules.NoShadowingOrOverridesOnMethodsRule$1.evaluate(NoShadowingOrOverridesOnMethodsRule.java:39)
	at com.carrotsearch.randomizedtesting.rules.StatementAdapter.evaluate(StatementAdapter.java:36)
	at org.apache.lucene.util.TestRuleAssertionsRequired$1.evaluate(TestRuleAssertionsRequired.java:43)
	at org.apache.lucene.util.TestRuleMarkFailure$1.evaluate(TestRuleMarkFailure.java:48)
	at org.apache.lucene.util.TestRuleIgnoreAfterMaxFailures$1.evaluate(TestRuleIgnoreAfterMaxFailures.java:70)
	at org.apache.lucene.util.TestRuleIgnoreTestSuites$1.evaluate(TestRuleIgnoreTestSuites.java:55)
	at com.carrotsearch.randomizedtesting.rules.StatementAdapter.evaluate(StatementAdapter.java:36)
	at com.carrotsearch.randomizedtesting.ThreadLeakControl$StatementRunner.run(ThreadLeakControl.java:358)
	at java.lang.Thread.run(Thread.java:679)




Build Log:
[...truncated 7095 lines...]
[junit4:junit4] Suite: org.apache.solr.cloud.BasicDistributedZk2Test
[junit4:junit4]   2> 4 T110 oas.SolrTestCaseJ4.setUp ###Starting testDistribSearch
[junit4:junit4]   2> Creating dataDir: /usr/home/hudson/hudson-slave/workspace/Lucene-Solr-Tests-4.x-Java6/solr/build/solr-core/test/J1/./solrtest-BasicDistributedZk2Test-1347742788278
[junit4:junit4]   2> 11 T110 oasc.ZkTestServer.run STARTING ZK TEST SERVER
[junit4:junit4]   2> 135 T111 oaz.Environment.logEnv Server environment:zookeeper.version=3.3.6-1366786, built on 07/29/2012 06:22 GMT
[junit4:junit4]   2> 136 T111 oaz.Environment.logEnv Server environment:host.name=lucene.zones.apache.org
[junit4:junit4]   2> 136 T111 oaz.Environment.logEnv Server environment:java.version=1.6.0_32
[junit4:junit4]   2> 136 T111 oaz.Environment.logEnv Server environment:java.vendor=Sun Microsystems Inc.
[junit4:junit4]   2> 136 T111 oaz.Environment.logEnv Server environment:java.home=/usr/local/openjdk6/jre
[junit4:junit4]   2> 137 T111 oaz.Environment.logEnv Server environment:java.class.path=/usr/home/hudson/hudson-slave/workspace/Lucene-Solr-Tests-4.x-Java6/solr/build/solr-core/classes/test:/usr/home/hudson/hudson-slave/workspace/Lucene-Solr-Tests-4.x-Java6/solr/build/solr-test-framework/classes/java:/usr/home/hudson/hudson-slave/workspace/Lucene-Solr-Tests-4.x-Java6/solr/build/solr-core/test-files:/usr/home/hudson/hudson-slave/workspace/Lucene-Solr-Tests-4.x-Java6/lucene/build/codecs/classes/java:/usr/home/hudson/hudson-slave/workspace/Lucene-Solr-Tests-4.x-Java6/lucene/build/test-framework/classes/java:/usr/home/hudson/hudson-slave/workspace/Lucene-Solr-Tests-4.x-Java6/solr/build/solr-solrj/classes/java:/usr/home/hudson/hudson-slave/workspace/Lucene-Solr-Tests-4.x-Java6/solr/build/solr-core/classes/java:/usr/home/hudson/hudson-slave/workspace/Lucene-Solr-Tests-4.x-Java6/lucene/build/analysis/common/lucene-analyzers-common-4.0-SNAPSHOT.jar:/usr/home/hudson/hudson-slave/workspace/Lucene-Solr-Tests-4.x-Java6/lucene/build/analysis/kuromoji/lucene-analyzers-kuromoji-4.0-SNAPSHOT.jar:/usr/home/hudson/hudson-slave/workspace/Lucene-Solr-Tests-4.x-Java6/lucene/build/analysis/phonetic/lucene-analyzers-phonetic-4.0-SNAPSHOT.jar:/usr/home/hudson/hudson-slave/workspace/Lucene-Solr-Tests-4.x-Java6/lucene/build/highlighter/lucene-highlighter-4.0-SNAPSHOT.jar:/usr/home/hudson/hudson-slave/workspace/Lucene-Solr-Tests-4.x-Java6/lucene/build/memory/lucene-memory-4.0-SNAPSHOT.jar:/usr/home/hudson/hudson-slave/workspace/Lucene-Solr-Tests-4.x-Java6/lucene/build/misc/lucene-misc-4.0-SNAPSHOT.jar:/usr/home/hudson/hudson-slave/workspace/Lucene-Solr-Tests-4.x-Java6/lucene/build/spatial/lucene-spatial-4.0-SNAPSHOT.jar:/usr/home/hudson/hudson-slave/workspace/Lucene-Solr-Tests-4.x-Java6/lucene/build/suggest/lucene-suggest-4.0-SNAPSHOT.jar:/usr/home/hudson/hudson-slave/workspace/Lucene-Solr-Tests-4.x-Java6/lucene/build/grouping/lucene-grouping-4.0-SNAPSHOT.jar:/usr/home/hudson/hudson-slave/workspace/Lucene-Solr-Tests-4.x-Java6/lucene/build/queries/lucene-queries-4.0-SNAPSHOT.jar:/usr/home/hudson/hudson-slave/workspace/Lucene-Solr-Tests-4.x-Java6/lucene/build/queryparser/lucene-queryparser-4.0-SNAPSHOT.jar:/usr/home/hudson/hudson-slave/workspace/Lucene-Solr-Tests-4.x-Java6/solr/core/lib/commons-cli-1.2.jar:/usr/home/hudson/hudson-slave/workspace/Lucene-Solr-Tests-4.x-Java6/solr/core/lib/commons-codec-1.6.jar:/usr/home/hudson/hudson-slave/workspace/Lucene-Solr-Tests-4.x-Java6/solr/core/lib/commons-fileupload-1.2.1.jar:/usr/home/hudson/hudson-slave/workspace/Lucene-Solr-Tests-4.x-Java6/solr/core/lib/commons-lang-2.6.jar:/usr/home/hudson/hudson-slave/workspace/Lucene-Solr-Tests-4.x-Java6/solr/core/lib/easymock-2.2.jar:/usr/home/hudson/hudson-slave/workspace/Lucene-Solr-Tests-4.x-Java6/solr/core/lib/guava-r05.jar:/usr/home/hudson/hudson-slave/workspace/Lucene-Solr-Tests-4.x-Java6/solr/core/lib/javax.servlet-api-3.0.1.jar:/usr/home/hudson/hudson-slave/workspace/Lucene-Solr-Tests-4.x-Java6/solr/core/lib/spatial4j-0.3.jar:/usr/home/hudson/hudson-slave/workspace/Lucene-Solr-Tests-4.x-Java6/solr/solrj/lib/commons-io-2.1.jar:/usr/home/hudson/hudson-slave/workspace/Lucene-Solr-Tests-4.x-Java6/solr/solrj/lib/httpclient-4.1.3.jar:/usr/home/hudson/hudson-slave/workspace/Lucene-Solr-Tests-4.x-Java6/solr/solrj/lib/httpcore-4.1.4.jar:/usr/home/hudson/hudson-slave/workspace/Lucene-Solr-Tests-4.x-Java6/solr/solrj/lib/httpmime-4.1.3.jar:/usr/home/hudson/hudson-slave/workspace/Lucene-Solr-Tests-4.x-Java6/solr/solrj/lib/jcl-over-slf4j-1.6.4.jar:/usr/home/hudson/hudson-slave/workspace/Lucene-Solr-Tests-4.x-Java6/solr/solrj/lib/log4j-over-slf4j-1.6.4.jar:/usr/home/hudson/hudson-slave/workspace/Lucene-Solr-Tests-4.x-Java6/solr/solrj/lib/slf4j-api-1.6.4.jar:/usr/home/hudson/hudson-slave/workspace/Lucene-Solr-Tests-4.x-Java6/solr/solrj/lib/slf4j-jdk14-1.6.4.jar:/usr/home/hudson/hudson-slave/workspace/Lucene-Solr-Tests-4.x-Java6/solr/solrj/lib/wstx-asl-3.2.7.jar:/usr/home/hudson/hudson-slave/workspace/Lucene-Solr-Tests-4.x-Java6/solr/solrj/lib/zookeeper-3.3.6.jar:/usr/home/hudson/hudson-slave/workspace/Lucene-Solr-Tests-4.x-Java6/solr/example/lib/jetty-continuation-8.1.2.v20120308.jar:/usr/home/hudson/hudson-slave/workspace/Lucene-Solr-Tests-4.x-Java6/solr/example/lib/jetty-deploy-8.1.2.v20120308.jar:/usr/home/hudson/hudson-slave/workspace/Lucene-Solr-Tests-4.x-Java6/solr/example/lib/jetty-http-8.1.2.v20120308.jar:/usr/home/hudson/hudson-slave/workspace/Lucene-Solr-Tests-4.x-Java6/solr/example/lib/jetty-io-8.1.2.v20120308.jar:/usr/home/hudson/hudson-slave/workspace/Lucene-Solr-Tests-4.x-Java6/solr/example/lib/jetty-jmx-8.1.2.v20120308.jar:/usr/home/hudson/hudson-slave/workspace/Lucene-Solr-Tests-4.x-Java6/solr/example/lib/jetty-security-8.1.2.v20120308.jar:/usr/home/hudson/hudson-slave/workspace/Lucene-Solr-Tests-4.x-Java6/solr/example/lib/jetty-server-8.1.2.v20120308.jar:/usr/home/hudson/hudson-slave/workspace/Lucene-Solr-Tests-4.x-Java6/solr/example/lib/jetty-servlet-8.1.2.v20120308.jar:/usr/home/hudson/hudson-slave/workspace/Lucene-Solr-Tests-4.x-Java6/solr/example/lib/jetty-util-8.1.2.v20120308.jar:/usr/home/hudson/hudson-slave/workspace/Lucene-Solr-Tests-4.x-Java6/solr/example/lib/jetty-webapp-8.1.2.v20120308.jar:/usr/home/hudson/hudson-slave/workspace/Lucene-Solr-Tests-4.x-Java6/solr/example/lib/jetty-xml-8.1.2.v20120308.jar:/usr/home/hudson/hudson-slave/workspace/Lucene-Solr-Tests-4.x-Java6/solr/example/lib/servlet-api-3.0.jar:/usr/home/hudson/hudson-slave/workspace/Lucene-Solr-Tests-4.x-Java6/solr/example/example-DIH/solr/db/lib/hsqldb-1.8.0.10.jar:/usr/home/hudson/hudson-slave/workspace/Lucene-Solr-Tests-4.x-Java6/lucene/build/core/classes/java:/usr/home/hudson/hudson-slave/workspace/Lucene-Solr-Tests-4.x-Java6/lucene/test-framework/lib/junit-4.10.jar:/usr/home/hudson/hudson-slave/workspace/Lucene-Solr-Tests-4.x-Java6/lucene/test-framework/lib/randomizedtesting-runner-2.0.0.jar:/home/hudson/hudson-slave/tools/Ant/ant-1.8.2/lib/ant-launcher.jar:/home/hudson/.ant/lib/ivy-2.2.0.jar:/home/hudson/hudson-slave/tools/Ant/ant-1.8.2/lib/ant-apache-regexp.jar:/home/hudson/hudson-slave/tools/Ant/ant-1.8.2/lib/ant-junit.jar:/home/hudson/hudson-slave/tools/Ant/ant-1.8.2/lib/ant-apache-bsf.jar:/home/hudson/hudson-slave/tools/Ant/ant-1.8.2/lib/ant-commons-net.jar:/home/hudson/hudson-slave/tools/Ant/ant-1.8.2/lib/ant-antlr.jar:/home/hudson/hudson-slave/tools/Ant/ant-1.8.2/lib/ant-apache-log4j.jar:/home/hudson/hudson-slave/tools/Ant/ant-1.8.2/lib/ant-commons-logging.jar:/home/hudson/hudson-slave/tools/Ant/ant-1.8.2/lib/ant-apache-xalan2.jar:/home/hudson/hudson-slave/tools/Ant/ant-1.8.2/lib/ant-apache-oro.jar:/home/hudson/hudson-slave/tools/Ant/ant-1.8.2/lib/ant-junit4.jar:/home/hudson/hudson-slave/tools/Ant/ant-1.8.2/lib/ant-netrexx.jar:/home/hudson/hudson-slave/tools/Ant/ant-1.8.2/lib/ant-swing.jar:/home/hudson/hudson-slave/tools/Ant/ant-1.8.2/lib/ant-javamail.jar:/home/hudson/hudson-slave/tools/Ant/ant-1.8.2/lib/ant-jsch.jar:/home/hudson/hudson-slave/tools/Ant/ant-1.8.2/lib/ant-jmf.jar:/home/hudson/hudson-slave/tools/Ant/ant-1.8.2/lib/ant.jar:/home/hudson/hudson-slave/tools/Ant/ant-1.8.2/lib/ant-apache-bcel.jar:/home/hudson/hudson-slave/tools/Ant/ant-1.8.2/lib/ant-jai.jar:/home/hudson/hudson-slave/tools/Ant/ant-1.8.2/lib/ant-testutil.jar:/home/hudson/hudson-slave/tools/Ant/ant-1.8.2/lib/ant-apache-resolver.jar:/home/hudson/hudson-slave/tools/Ant/ant-1.8.2/lib/ant-jdepend.jar:/usr/local/openjdk6/lib/tools.jar:/home/hudson/.ivy2/cache/com.carrotsearch.randomizedtesting/junit4-ant/jars/junit4-ant-2.0.0.jar
[junit4:junit4]   2> 138 T111 oaz.Environment.logEnv Server environment:java.library.path=/usr/local/openjdk6/jre/lib/amd64/server:/usr/local/openjdk6/jre/lib/amd64:/usr/local/openjdk6/jre/../lib/amd64:/usr/java/packages/lib/amd64:/lib:/usr/lib:/usr/local/lib
[junit4:junit4]   2> 138 T111 oaz.Environment.logEnv Server environment:java.io.tmpdir=.
[junit4:junit4]   2> 138 T111 oaz.Environment.logEnv Server environment:java.compiler=<NA>
[junit4:junit4]   2> 138 T111 oaz.Environment.logEnv Server environment:os.name=FreeBSD
[junit4:junit4]   2> 138 T111 oaz.Environment.logEnv Server environment:os.arch=amd64
[junit4:junit4]   2> 139 T111 oaz.Environment.logEnv Server environment:os.version=9.0-RELEASE
[junit4:junit4]   2> 139 T111 oaz.Environment.logEnv Server environment:user.name=hudson
[junit4:junit4]   2> 139 T111 oaz.Environment.logEnv Server environment:user.home=/home/hudson
[junit4:junit4]   2> 139 T111 oaz.Environment.logEnv Server environment:user.dir=/usr/home/hudson/hudson-slave/workspace/Lucene-Solr-Tests-4.x-Java6/solr/build/solr-core/test/J1
[junit4:junit4]   2> 191 T111 oazs.ZooKeeperServer.setTickTime tickTime set to 1000
[junit4:junit4]   2> 233 T111 oazs.NIOServerCnxn$Factory.<init> binding to port 0.0.0.0/0.0.0.0:0
[junit4:junit4]   2> 315 T111 oazsp.FileTxnSnapLog.save Snapshotting: 0
[junit4:junit4]   2> 318 T110 oasc.ZkTestServer.run start zk server on port:39260
[junit4:junit4]   2> 449 T110 oaz.Environment.logEnv Client environment:zookeeper.version=3.3.6-1366786, built on 07/29/2012 06:22 GMT
[junit4:junit4]   2> 449 T110 oaz.Environment.logEnv Client environment:host.name=lucene.zones.apache.org
[junit4:junit4]   2> 450 T110 oaz.Environment.logEnv Client environment:java.version=1.6.0_32
[junit4:junit4]   2> 450 T110 oaz.Environment.logEnv Client environment:java.vendor=Sun Microsystems Inc.
[junit4:junit4]   2> 450 T110 oaz.Environment.logEnv Client environment:java.home=/usr/local/openjdk6/jre
[junit4:junit4]   2> 451 T110 oaz.Environment.logEnv Client environment:java.class.path=/usr/home/hudson/hudson-slave/workspace/Lucene-Solr-Tests-4.x-Java6/solr/build/solr-core/classes/test:/usr/home/hudson/hudson-slave/workspace/Lucene-Solr-Tests-4.x-Java6/solr/build/solr-test-framework/classes/java:/usr/home/hudson/hudson-slave/workspace/Lucene-Solr-Tests-4.x-Java6/solr/build/solr-core/test-files:/usr/home/hudson/hudson-slave/workspace/Lucene-Solr-Tests-4.x-Java6/lucene/build/codecs/classes/java:/usr/home/hudson/hudson-slave/workspace/Lucene-Solr-Tests-4.x-Java6/lucene/build/test-framework/classes/java:/usr/home/hudson/hudson-slave/workspace/Lucene-Solr-Tests-4.x-Java6/solr/build/solr-solrj/classes/java:/usr/home/hudson/hudson-slave/workspace/Lucene-Solr-Tests-4.x-Java6/solr/build/solr-core/classes/java:/usr/home/hudson/hudson-slave/workspace/Lucene-Solr-Tests-4.x-Java6/lucene/build/analysis/common/lucene-analyzers-common-4.0-SNAPSHOT.jar:/usr/home/hudson/hudson-slave/workspace/Lucene-Solr-Tests-4.x-Java6/lucene/build/analysis/kuromoji/lucene-analyzers-kuromoji-4.0-SNAPSHOT.jar:/usr/home/hudson/hudson-slave/workspace/Lucene-Solr-Tests-4.x-Java6/lucene/build/analysis/phonetic/lucene-analyzers-phonetic-4.0-SNAPSHOT.jar:/usr/home/hudson/hudson-slave/workspace/Lucene-Solr-Tests-4.x-Java6/lucene/build/highlighter/lucene-highlighter-4.0-SNAPSHOT.jar:/usr/home/hudson/hudson-slave/workspace/Lucene-Solr-Tests-4.x-Java6/lucene/build/memory/lucene-memory-4.0-SNAPSHOT.jar:/usr/home/hudson/hudson-slave/workspace/Lucene-Solr-Tests-4.x-Java6/lucene/build/misc/lucene-misc-4.0-SNAPSHOT.jar:/usr/home/hudson/hudson-slave/workspace/Lucene-Solr-Tests-4.x-Java6/lucene/build/spatial/lucene-spatial-4.0-SNAPSHOT.jar:/usr/home/hudson/hudson-slave/workspace/Lucene-Solr-Tests-4.x-Java6/lucene/build/suggest/lucene-suggest-4.0-SNAPSHOT.jar:/usr/home/hudson/hudson-slave/workspace/Lucene-Solr-Tests-4.x-Java6/lucene/build/grouping/lucene-grouping-4.0-SNAPSHOT.jar:/usr/home/hudson/hudson-slave/workspace/Lucene-Solr-Tests-4.x-Java6/lucene/build/queries/lucene-queries-4.0-SNAPSHOT.jar:/usr/home/hudson/hudson-slave/workspace/Lucene-Solr-Tests-4.x-Java6/lucene/build/queryparser/lucene-queryparser-4.0-SNAPSHOT.jar:/usr/home/hudson/hudson-slave/workspace/Lucene-Solr-Tests-4.x-Java6/solr/core/lib/commons-cli-1.2.jar:/usr/home/hudson/hudson-slave/workspace/Lucene-Solr-Tests-4.x-Java6/solr/core/lib/commons-codec-1.6.jar:/usr/home/hudson/hudson-slave/workspace/Lucene-Solr-Tests-4.x-Java6/solr/core/lib/commons-fileupload-1.2.1.jar:/usr/home/hudson/hudson-slave/workspace/Lucene-Solr-Tests-4.x-Java6/solr/core/lib/commons-lang-2.6.jar:/usr/home/hudson/hudson-slave/workspace/Lucene-Solr-Tests-4.x-Java6/solr/core/lib/easymock-2.2.jar:/usr/home/hudson/hudson-slave/workspace/Lucene-Solr-Tests-4.x-Java6/solr/core/lib/guava-r05.jar:/usr/home/hudson/hudson-slave/workspace/Lucene-Solr-Tests-4.x-Java6/solr/core/lib/javax.servlet-api-3.0.1.jar:/usr/home/hudson/hudson-slave/workspace/Lucene-Solr-Tests-4.x-Java6/solr/core/lib/spatial4j-0.3.jar:/usr/home/hudson/hudson-slave/workspace/Lucene-Solr-Tests-4.x-Java6/solr/solrj/lib/commons-io-2.1.jar:/usr/home/hudson/hudson-slave/workspace/Lucene-Solr-Tests-4.x-Java6/solr/solrj/lib/httpclient-4.1.3.jar:/usr/home/hudson/hudson-slave/workspace/Lucene-Solr-Tests-4.x-Java6/solr/solrj/lib/httpcore-4.1.4.jar:/usr/home/hudson/hudson-slave/workspace/Lucene-Solr-Tests-4.x-Java6/solr/solrj/lib/httpmime-4.1.3.jar:/usr/home/hudson/hudson-slave/workspace/Lucene-Solr-Tests-4.x-Java6/solr/solrj/lib/jcl-over-slf4j-1.6.4.jar:/usr/home/hudson/hudson-slave/workspace/Lucene-Solr-Tests-4.x-Java6/solr/solrj/lib/log4j-over-slf4j-1.6.4.jar:/usr/home/hudson/hudson-slave/workspace/Lucene-Solr-Tests-4.x-Java6/solr/solrj/lib/slf4j-api-1.6.4.jar:/usr/home/hudson/hudson-slave/workspace/Lucene-Solr-Tests-4.x-Java6/solr/solrj/lib/slf4j-jdk14-1.6.4.jar:/usr/home/hudson/hudson-slave/workspace/Lucene-Solr-Tests-4.x-Java6/solr/solrj/lib/wstx-asl-3.2.7.jar:/usr/home/hudson/hudson-slave/workspace/Lucene-Solr-Tests-4.x-Java6/solr/solrj/lib/zookeeper-3.3.6.jar:/usr/home/hudson/hudson-slave/workspace/Lucene-Solr-Tests-4.x-Java6/solr/example/lib/jetty-continuation-8.1.2.v20120308.jar:/usr/home/hudson/hudson-slave/workspace/Lucene-Solr-Tests-4.x-Java6/solr/example/lib/jetty-deploy-8.1.2.v20120308.jar:/usr/home/hudson/hudson-slave/workspace/Lucene-Solr-Tests-4.x-Java6/solr/example/lib/jetty-http-8.1.2.v20120308.jar:/usr/home/hudson/hudson-slave/workspace/Lucene-Solr-Tests-4.x-Java6/solr/example/lib/jetty-io-8.1.2.v20120308.jar:/usr/home/hudson/hudson-slave/workspace/Lucene-Solr-Tests-4.x-Java6/solr/example/lib/jetty-jmx-8.1.2.v20120308.jar:/usr/home/hudson/hudson-slave/workspace/Lucene-Solr-Tests-4.x-Java6/solr/example/lib/jetty-security-8.1.2.v20120308.jar:/usr/home/hudson/hudson-slave/workspace/Lucene-Solr-Tests-4.x-Java6/solr/example/lib/jetty-server-8.1.2.v20120308.jar:/usr/home/hudson/hudson-slave/workspace/Lucene-Solr-Tests-4.x-Java6/solr/example/lib/jetty-servlet-8.1.2.v20120308.jar:/usr/home/hudson/hudson-slave/workspace/Lucene-Solr-Tests-4.x-Java6/solr/example/lib/jetty-util-8.1.2.v20120308.jar:/usr/home/hudson/hudson-slave/workspace/Lucene-Solr-Tests-4.x-Java6/solr/example/lib/jetty-webapp-8.1.2.v20120308.jar:/usr/home/hudson/hudson-slave/workspace/Lucene-Solr-Tests-4.x-Java6/solr/example/lib/jetty-xml-8.1.2.v20120308.jar:/usr/home/hudson/hudson-slave/workspace/Lucene-Solr-Tests-4.x-Java6/solr/example/lib/servlet-api-3.0.jar:/usr/home/hudson/hudson-slave/workspace/Lucene-Solr-Tests-4.x-Java6/solr/example/example-DIH/solr/db/lib/hsqldb-1.8.0.10.jar:/usr/home/hudson/hudson-slave/workspace/Lucene-Solr-Tests-4.x-Java6/lucene/build/core/classes/java:/usr/home/hudson/hudson-slave/workspace/Lucene-Solr-Tests-4.x-Java6/lucene/test-framework/lib/junit-4.10.jar:/usr/home/hudson/hudson-slave/workspace/Lucene-Solr-Tests-4.x-Java6/lucene/test-framework/lib/randomizedtesting-runner-2.0.0.jar:/home/hudson/hudson-slave/tools/Ant/ant-1.8.2/lib/ant-launcher.jar:/home/hudson/.ant/lib/ivy-2.2.0.jar:/home/hudson/hudson-slave/tools/Ant/ant-1.8.2/lib/ant-apache-regexp.jar:/home/hudson/hudson-slave/tools/Ant/ant-1.8.2/lib/ant-junit.jar:/home/hudson/hudson-slave/tools/Ant/ant-1.8.2/lib/ant-apache-bsf.jar:/home/hudson/hudson-slave/tools/Ant/ant-1.8.2/lib/ant-commons-net.jar:/home/hudson/hudson-slave/tools/Ant/ant-1.8.2/lib/ant-antlr.jar:/home/hudson/hudson-slave/tools/Ant/ant-1.8.2/lib/ant-apache-log4j.jar:/home/hudson/hudson-slave/tools/Ant/ant-1.8.2/lib/ant-commons-logging.jar:/home/hudson/hudson-slave/tools/Ant/ant-1.8.2/lib/ant-apache-xalan2.jar:/home/hudson/hudson-slave/tools/Ant/ant-1.8.2/lib/ant-apache-oro.jar:/home/hudson/hudson-slave/tools/Ant/ant-1.8.2/lib/ant-junit4.jar:/home/hudson/hudson-slave/tools/Ant/ant-1.8.2/lib/ant-netrexx.jar:/home/hudson/hudson-slave/tools/Ant/ant-1.8.2/lib/ant-swing.jar:/home/hudson/hudson-slave/tools/Ant/ant-1.8.2/lib/ant-javamail.jar:/home/hudson/hudson-slave/tools/Ant/ant-1.8.2/lib/ant-jsch.jar:/home/hudson/hudson-slave/tools/Ant/ant-1.8.2/lib/ant-jmf.jar:/home/hudson/hudson-slave/tools/Ant/ant-1.8.2/lib/ant.jar:/home/hudson/hudson-slave/tools/Ant/ant-1.8.2/lib/ant-apache-bcel.jar:/home/hudson/hudson-slave/tools/Ant/ant-1.8.2/lib/ant-jai.jar:/home/hudson/hudson-slave/tools/Ant/ant-1.8.2/lib/ant-testutil.jar:/home/hudson/hudson-slave/tools/Ant/ant-1.8.2/lib/ant-apache-resolver.jar:/home/hudson/hudson-slave/tools/Ant/ant-1.8.2/lib/ant-jdepend.jar:/usr/local/openjdk6/lib/tools.jar:/home/hudson/.ivy2/cache/com.carrotsearch.randomizedtesting/junit4-ant/jars/junit4-ant-2.0.0.jar
[junit4:junit4]   2> 451 T110 oaz.Environment.logEnv Client environment:java.library.path=/usr/local/openjdk6/jre/lib/amd64/server:/usr/local/openjdk6/jre/lib/amd64:/usr/local/openjdk6/jre/../lib/amd64:/usr/java/packages/lib/amd64:/lib:/usr/lib:/usr/local/lib
[junit4:junit4]   2> 452 T110 oaz.Environment.logEnv Client environment:java.io.tmpdir=.
[junit4:junit4]   2> 452 T110 oaz.Environment.logEnv Client environment:java.compiler=<NA>
[junit4:junit4]   2> 452 T110 oaz.Environment.logEnv Client environment:os.name=FreeBSD
[junit4:junit4]   2> 452 T110 oaz.Environment.logEnv Client environment:os.arch=amd64
[junit4:junit4]   2> 453 T110 oaz.Environment.logEnv Client environment:os.version=9.0-RELEASE
[junit4:junit4]   2> 453 T110 oaz.Environment.logEnv Client environment:user.name=hudson
[junit4:junit4]   2> 453 T110 oaz.Environment.logEnv Client environment:user.home=/home/hudson
[junit4:junit4]   2> 454 T110 oaz.Environment.logEnv Client environment:user.dir=/usr/home/hudson/hudson-slave/workspace/Lucene-Solr-Tests-4.x-Java6/solr/build/solr-core/test/J1
[junit4:junit4]   2> 460 T110 oaz.ZooKeeper.<init> Initiating client connection, connectString=127.0.0.1:39260 sessionTimeout=10000 watcher=org.apache.solr.common.cloud.ConnectionManager@2d48697e
[junit4:junit4]   2> 535 T116 oaz.ClientCnxn$SendThread.startConnect Opening socket connection to server /127.0.0.1:39260
[junit4:junit4]   2> 535 T110 oascc.ConnectionManager.waitForConnected Waiting for client to connect to ZooKeeper
[junit4:junit4]   2> 540 T112 oazs.NIOServerCnxn$Factory.run Accepted socket connection from /140.211.11.196:39261
[junit4:junit4]   2> 540 T116 oaz.ClientCnxn$SendThread.primeConnection Socket connection established to localhost/127.0.0.1:39260, initiating session
[junit4:junit4]   2> 561 T112 oazs.NIOServerCnxn.readConnectRequest Client attempting to establish new session at /140.211.11.196:39261
[junit4:junit4]   2> 584 T114 oazsp.FileTxnLog.append Creating new log file: log.1
[junit4:junit4]   2> 617 T114 oazs.NIOServerCnxn.finishSessionInit Established session 0x139cbbaec270000 with negotiated timeout 10000 for client /140.211.11.196:39261
[junit4:junit4]   2> 617 T116 oaz.ClientCnxn$SendThread.readConnectResult Session establishment complete on server localhost/127.0.0.1:39260, sessionid = 0x139cbbaec270000, negotiated timeout = 10000
[junit4:junit4]   2> 626 T117 oascc.ConnectionManager.process Watcher org.apache.solr.common.cloud.ConnectionManager@2d48697e name:ZooKeeperConnection Watcher:127.0.0.1:39260 got event WatchedEvent state:SyncConnected type:None path:null path:null type:None
[junit4:junit4]   2> 626 T110 oascc.ConnectionManager.waitForConnected Client is connected to ZooKeeper
[junit4:junit4]   2> 629 T110 oascc.SolrZkClient.makePath makePath: /solr
[junit4:junit4]   2> 684 T115 oazs.PrepRequestProcessor.pRequest Processed session termination for sessionid: 0x139cbbaec270000
[junit4:junit4]   2> 685 T117 oaz.ClientCnxn$EventThread.run EventThread shut down
[junit4:junit4]   2> 685 T110 oaz.ZooKeeper.close Session: 0x139cbbaec270000 closed
[junit4:junit4]   2> 686 T110 oaz.ZooKeeper.<init> Initiating client connection, connectString=127.0.0.1:39260/solr sessionTimeout=10000 watcher=org.apache.solr.common.cloud.ConnectionManager@78334b23
[junit4:junit4]   2> 686 T112 oazs.NIOServerCnxn.closeSock Closed socket connection for client /140.211.11.196:39261 which had sessionid 0x139cbbaec270000
[junit4:junit4]   2> 687 T118 oaz.ClientCnxn$SendThread.startConnect Opening socket connection to server /127.0.0.1:39260
[junit4:junit4]   2> 687 T110 oascc.ConnectionManager.waitForConnected Waiting for client to connect to ZooKeeper
[junit4:junit4]   2> 688 T118 oaz.ClientCnxn$SendThread.primeConnection Socket connection established to localhost/127.0.0.1:39260, initiating session
[junit4:junit4]   2> 688 T112 oazs.NIOServerCnxn$Factory.run Accepted socket connection from /140.211.11.196:39262
[junit4:junit4]   2> 688 T112 oazs.NIOServerCnxn.readConnectRequest Client attempting to establish new session at /140.211.11.196:39262
[junit4:junit4]   2> 689 T114 oazs.NIOServerCnxn.finishSessionInit Established session 0x139cbbaec270001 with negotiated timeout 10000 for client /140.211.11.196:39262
[junit4:junit4]   2> 689 T118 oaz.ClientCnxn$SendThread.readConnectResult Session establishment complete on server localhost/127.0.0.1:39260, sessionid = 0x139cbbaec270001, negotiated timeout = 10000
[junit4:junit4]   2> 690 T119 oascc.ConnectionManager.process Watcher org.apache.solr.common.cloud.ConnectionManager@78334b23 name:ZooKeeperConnection Watcher:127.0.0.1:39260/solr got event WatchedEvent state:SyncConnected type:None path:null path:null type:None
[junit4:junit4]   2> 690 T110 oascc.ConnectionManager.waitForConnected Client is connected to ZooKeeper
[junit4:junit4]   2> 696 T110 oascc.SolrZkClient.makePath makePath: /collections/collection1
[junit4:junit4]   2> 701 T110 oascc.SolrZkClient.makePath makePath: /collections/collection1/shards
[junit4:junit4]   2> 709 T110 oascc.SolrZkClient.makePath makePath: /collections/control_collection
[junit4:junit4]   2> 712 T110 oascc.SolrZkClient.makePath makePath: /collections/control_collection/shards
[junit4:junit4]   2> 715 T110 oasc.AbstractZkTestCase.putConfig put /usr/home/hudson/hudson-slave/workspace/Lucene-Solr-Tests-4.x-Java6/solr/build/solr-core/test-files/solr/collection1/conf/solrconfig.xml to /configs/conf1/solrconfig.xml
[junit4:junit4]   2> 745 T110 oascc.SolrZkClient.makePath makePath: /configs/conf1/solrconfig.xml
[junit4:junit4]   2> 756 T110 oasc.AbstractZkTestCase.putConfig put /usr/home/hudson/hudson-slave/workspace/Lucene-Solr-Tests-4.x-Java6/solr/build/solr-core/test-files/solr/collection1/conf/schema.xml to /configs/conf1/schema.xml
[junit4:junit4]   2> 758 T110 oascc.SolrZkClient.makePath makePath: /configs/conf1/schema.xml
[junit4:junit4]   2> 863 T110 oasc.AbstractZkTestCase.putConfig put /usr/home/hudson/hudson-slave/workspace/Lucene-Solr-Tests-4.x-Java6/solr/build/solr-core/test-files/solr/collection1/conf/solrconfig.xml to /configs/conf1/solrconfig.xml
[junit4:junit4]   2> 865 T110 oascc.SolrZkClient.makePath makePath: /configs/conf1/solrconfig.xml
[junit4:junit4]   2> 888 T110 oasc.AbstractZkTestCase.putConfig put /usr/home/hudson/hudson-slave/workspace/Lucene-Solr-Tests-4.x-Java6/solr/build/solr-core/test-files/solr/collection1/conf/stopwords.txt to /configs/conf1/stopwords.txt
[junit4:junit4]   2> 889 T110 oascc.SolrZkClient.makePath makePath: /configs/conf1/stopwords.txt
[junit4:junit4]   2> 894 T110 oasc.AbstractZkTestCase.putConfig put /usr/home/hudson/hudson-slave/workspace/Lucene-Solr-Tests-4.x-Java6/solr/build/solr-core/test-files/solr/collection1/conf/protwords.txt to /configs/conf1/protwords.txt
[junit4:junit4]   2> 894 T110 oascc.SolrZkClient.makePath makePath: /configs/conf1/protwords.txt
[junit4:junit4]   2> 898 T110 oasc.AbstractZkTestCase.putConfig put /usr/home/hudson/hudson-slave/workspace/Lucene-Solr-Tests-4.x-Java6/solr/build/solr-core/test-files/solr/collection1/conf/currency.xml to /configs/conf1/currency.xml
[junit4:junit4]   2> 898 T110 oascc.SolrZkClient.makePath makePath: /configs/conf1/currency.xml
[junit4:junit4]   2> 902 T110 oasc.AbstractZkTestCase.putConfig put /usr/home/hudson/hudson-slave/workspace/Lucene-Solr-Tests-4.x-Java6/solr/build/solr-core/test-files/solr/collection1/conf/open-exchange-rates.json to /configs/conf1/open-exchange-rates.json
[junit4:junit4]   2> 903 T110 oascc.SolrZkClient.makePath makePath: /configs/conf1/open-exchange-rates.json
[junit4:junit4]   2> 906 T110 oasc.AbstractZkTestCase.putConfig put /usr/home/hudson/hudson-slave/workspace/Lucene-Solr-Tests-4.x-Java6/solr/build/solr-core/test-files/solr/collection1/conf/mapping-ISOLatin1Accent.txt to /configs/conf1/mapping-ISOLatin1Accent.txt
[junit4:junit4]   2> 907 T110 oascc.SolrZkClient.makePath makePath: /configs/conf1/mapping-ISOLatin1Accent.txt
[junit4:junit4]   2> 911 T110 oasc.AbstractZkTestCase.putConfig put /usr/home/hudson/hudson-slave/workspace/Lucene-Solr-Tests-4.x-Java6/solr/build/solr-core/test-files/solr/collection1/conf/old_synonyms.txt to /configs/conf1/old_synonyms.txt
[junit4:junit4]   2> 911 T110 oascc.SolrZkClient.makePath makePath: /configs/conf1/old_synonyms.txt
[junit4:junit4]   2> 915 T110 oasc.AbstractZkTestCase.putConfig put /usr/home/hudson/hudson-slave/workspace/Lucene-Solr-Tests-4.x-Java6/solr/build/solr-core/test-files/solr/collection1/conf/synonyms.txt to /configs/conf1/synonyms.txt
[junit4:junit4]   2> 916 T110 oascc.SolrZkClient.makePath makePath: /configs/conf1/synonyms.txt
[junit4:junit4]   2> 919 T115 oazs.PrepRequestProcessor.pRequest Processed session termination for sessionid: 0x139cbbaec270001
[junit4:junit4]   2> 920 T119 oaz.ClientCnxn$EventThread.run EventThread shut down
[junit4:junit4]   2> 920 T110 oaz.ZooKeeper.close Session: 0x139cbbaec270001 closed
[junit4:junit4]   2> 920 T112 oazs.NIOServerCnxn.closeSock Closed socket connection for client /140.211.11.196:39262 which had sessionid 0x139cbbaec270001
[junit4:junit4]   2> 1575 T110 oejs.Server.doStart jetty-8.1.2.v20120308
[junit4:junit4]   2> 1882 T110 oejs.AbstractConnector.doStart Started SocketConnector@0.0.0.0:39263
[junit4:junit4]   2> 1925 T110 oasc.SolrResourceLoader.locateSolrHome JNDI not configured for solr (NoInitialContextEx)
[junit4:junit4]   2> 1926 T110 oasc.SolrResourceLoader.locateSolrHome using system property solr.solr.home: /usr/home/hudson/hudson-slave/workspace/Lucene-Solr-Tests-4.x-Java6/solr/build/solr-core/test-files/solr
[junit4:junit4]   2> 1926 T110 oasc.SolrResourceLoader.<init> new SolrResourceLoader for deduced Solr Home: '/usr/home/hudson/hudson-slave/workspace/Lucene-Solr-Tests-4.x-Java6/solr/build/solr-core/test-files/solr/'
[junit4:junit4]   2> 1974 T110 oass.SolrDispatchFilter.init SolrDispatchFilter.init()
[junit4:junit4]   2> 1975 T110 oasc.SolrResourceLoader.locateSolrHome JNDI not configured for solr (NoInitialContextEx)
[junit4:junit4]   2> 1976 T110 oasc.SolrResourceLoader.locateSolrHome using system property solr.solr.home: /usr/home/hudson/hudson-slave/workspace/Lucene-Solr-Tests-4.x-Java6/solr/build/solr-core/test-files/solr
[junit4:junit4]   2> 1976 T110 oasc.CoreContainer$Initializer.initialize looking for solr.xml: /usr/home/hudson/hudson-slave/workspace/Lucene-Solr-Tests-4.x-Java6/solr/build/solr-core/test-files/solr/solr.xml
[junit4:junit4]   2> 1977 T110 oasc.CoreContainer.<init> New CoreContainer 20203524
[junit4:junit4]   2> 1977 T110 oasc.CoreContainer.load Loading CoreContainer using Solr Home: '/usr/home/hudson/hudson-slave/workspace/Lucene-Solr-Tests-4.x-Java6/solr/build/solr-core/test-files/solr/'
[junit4:junit4]   2> 1978 T110 oasc.SolrResourceLoader.<init> new SolrResourceLoader for directory: '/usr/home/hudson/hudson-slave/workspace/Lucene-Solr-Tests-4.x-Java6/solr/build/solr-core/test-files/solr/'
[junit4:junit4]   2> 2034 T110 oasc.CoreContainer.load Registering Log Listener
[junit4:junit4]   2> 2063 T110 oasc.CoreContainer.initZooKeeper Zookeeper client=127.0.0.1:39260/solr
[junit4:junit4]   2> 2109 T110 oaz.ZooKeeper.<init> Initiating client connection, connectString=127.0.0.1:39260/solr sessionTimeout=5000 watcher=org.apache.solr.common.cloud.ConnectionManager@67be33b9
[junit4:junit4]   2> 2110 T130 oaz.ClientCnxn$SendThread.startConnect Opening socket connection to server /127.0.0.1:39260
[junit4:junit4]   2> 2110 T110 oascc.ConnectionManager.waitForConnected Waiting for client to connect to ZooKeeper
[junit4:junit4]   2> 2403 T130 oaz.ClientCnxn$SendThread.primeConnection Socket connection established to localhost/127.0.0.1:39260, initiating session
[junit4:junit4]   2> 2375 T112 oazs.NIOServerCnxn$Factory.run Accepted socket connection from /140.211.11.196:39264
[junit4:junit4]   2> 2404 T112 oazs.NIOServerCnxn.readConnectRequest Client attempting to establish new session at /140.211.11.196:39264
[junit4:junit4]   2> 2431 T114 oazs.NIOServerCnxn.finishSessionInit Established session 0x139cbbaec270002 with negotiated timeout 5000 for client /140.211.11.196:39264
[junit4:junit4]   2> 2431 T130 oaz.ClientCnxn$SendThread.readConnectResult Session establishment complete on server localhost/127.0.0.1:39260, sessionid = 0x139cbbaec270002, negotiated timeout = 5000
[junit4:junit4]   2> 2432 T131 oascc.ConnectionManager.process Watcher org.apache.solr.common.cloud.ConnectionManager@67be33b9 name:ZooKeeperConnection Watcher:127.0.0.1:39260/solr got event WatchedEvent state:SyncConnected type:None path:null path:null type:None
[junit4:junit4]   2> 2432 T110 oascc.ConnectionManager.waitForConnected Client is connected to ZooKeeper
[junit4:junit4]   2> 2453 T115 oazs.PrepRequestProcessor.pRequest Got user-level KeeperException when processing sessionid:0x139cbbaec270002 type:create cxid:0x2 zxid:0xfffffffffffffffe txntype:unknown reqpath:n/a Error Path:/solr/overseer Error:KeeperErrorCode = NodeExists for /solr/overseer
[junit4:junit4]   2> 2466 T110 oascc.SolrZkClient.makePath makePath: /live_nodes
[junit4:junit4]   2> 2469 T110 oasc.ZkController.createEphemeralLiveNode Register node as live in ZooKeeper:/live_nodes/127.0.0.1:39263_solr
[junit4:junit4]   2> 2476 T115 oazs.PrepRequestProcessor.pRequest Got user-level KeeperException when processing sessionid:0x139cbbaec270002 type:delete cxid:0x7 zxid:0xfffffffffffffffe txntype:unknown reqpath:n/a Error Path:/solr/live_nodes/127.0.0.1:39263_solr Error:KeeperErrorCode = NoNode for /solr/live_nodes/127.0.0.1:39263_solr
[junit4:junit4]   2> 2478 T110 oascc.SolrZkClient.makePath makePath: /live_nodes/127.0.0.1:39263_solr
[junit4:junit4]   2> 2483 T110 oashc.HttpShardHandlerFactory.getParameter Setting socketTimeout to: 0
[junit4:junit4]   2> 2483 T110 oashc.HttpShardHandlerFactory.getParameter Setting urlScheme to: http://
[junit4:junit4]   2> 2484 T110 oashc.HttpShardHandlerFactory.getParameter Setting connTimeout to: 0
[junit4:junit4]   2> 2484 T110 oashc.HttpShardHandlerFactory.getParameter Setting maxConnectionsPerHost to: 20
[junit4:junit4]   2> 2485 T110 oashc.HttpShardHandlerFactory.getParameter Setting corePoolSize to: 0
[junit4:junit4]   2> 2485 T110 oashc.HttpShardHandlerFactory.getParameter Setting maximumPoolSize to: 2147483647
[junit4:junit4]   2> 2486 T110 oashc.HttpShardHandlerFactory.getParameter Setting maxThreadIdleTime to: 5
[junit4:junit4]   2> 2486 T110 oashc.HttpShardHandlerFactory.getParameter Setting sizeOfQueue to: -1
[junit4:junit4]   2> 2487 T110 oashc.HttpShardHandlerFactory.getParameter Setting fairnessPolicy to: false
[junit4:junit4]   2> 2487 T110 oascsi.HttpClientUtil.createClient Creating new http client, config:maxConnectionsPerHost=20&maxConnections=10000&socketTimeout=0&connTimeout=0&retry=false
[junit4:junit4]   2> 2519 T110 oascc.SolrZkClient.makePath makePath: /overseer_elect/election
[junit4:junit4]   2> 2563 T115 oazs.PrepRequestProcessor.pRequest Got user-level KeeperException when processing sessionid:0x139cbbaec270002 type:delete cxid:0x15 zxid:0xfffffffffffffffe txntype:unknown reqpath:n/a Error Path:/solr/overseer_elect/leader Error:KeeperErrorCode = NoNode for /solr/overseer_elect/leader
[junit4:junit4]   2> 2566 T110 oascc.SolrZkClient.makePath makePath: /overseer_elect/leader
[junit4:junit4]   2> 2586 T110 oasc.Overseer.start Overseer (id=88325671396769794-127.0.0.1:39263_solr-n_0000000000) starting
[junit4:junit4]   2> 2588 T115 oazs.PrepRequestProcessor.pRequest Got user-level KeeperException when processing sessionid:0x139cbbaec270002 type:create cxid:0x1a zxid:0xfffffffffffffffe txntype:unknown reqpath:n/a Error Path:/solr/overseer Error:KeeperErrorCode = NodeExists for /solr/overseer
[junit4:junit4]   2> 2608 T115 oazs.PrepRequestProcessor.pRequest Got user-level KeeperException when processing sessionid:0x139cbbaec270002 type:create cxid:0x1b zxid:0xfffffffffffffffe txntype:unknown reqpath:n/a Error Path:/solr/overseer Error:KeeperErrorCode = NodeExists for /solr/overseer
[junit4:junit4]   2> 2610 T115 oazs.PrepRequestProcessor.pRequest Got user-level KeeperException when processing sessionid:0x139cbbaec270002 type:create cxid:0x1c zxid:0xfffffffffffffffe txntype:unknown reqpath:n/a Error Path:/solr/overseer Error:KeeperErrorCode = NodeExists for /solr/overseer
[junit4:junit4]   2> 2627 T115 oazs.PrepRequestProcessor.pRequest Got user-level KeeperException when processing sessionid:0x139cbbaec270002 type:create cxid:0x1d zxid:0xfffffffffffffffe txntype:unknown reqpath:n/a Error Path:/solr/overseer Error:KeeperErrorCode = NodeExists for /solr/overseer
[junit4:junit4]   2> 2630 T133 oasc.OverseerCollectionProcessor.run Process current queue of collection creations
[junit4:junit4]   2> 2631 T110 oascc.SolrZkClient.makePath makePath: /clusterstate.json
[junit4:junit4]   2> 2671 T110 oascc.ZkStateReader.createClusterStateWatchersAndUpdate Updating cluster state from ZooKeeper... 
[junit4:junit4]   2> 2715 T132 oasc.Overseer$ClusterStateUpdater.run Starting to work on the main queue
[junit4:junit4]   2> 2795 T110 oasc.CoreContainer.create Creating SolrCore 'collection1' using instanceDir: /usr/home/hudson/hudson-slave/workspace/Lucene-Solr-Tests-4.x-Java6/solr/build/solr-core/test-files/solr/collection1
[junit4:junit4]   2> 2796 T110 oasc.ZkController.createCollectionZkNode Check for collection zkNode:control_collection
[junit4:junit4]   2> 2798 T110 oasc.ZkController.createCollectionZkNode Collection zkNode exists
[junit4:junit4]   2> 2798 T110 oasc.ZkController.readConfigName Load collection config from:/collections/control_collection
[junit4:junit4]   2> 2802 T110 oasc.SolrResourceLoader.<init> new SolrResourceLoader for directory: '/usr/home/hudson/hudson-slave/workspace/Lucene-Solr-Tests-4.x-Java6/solr/build/solr-core/test-files/solr/collection1/'
[junit4:junit4]   2> 2804 T110 oasc.SolrResourceLoader.replaceClassLoader Adding 'file:/usr/home/hudson/hudson-slave/workspace/Lucene-Solr-Tests-4.x-Java6/solr/build/solr-core/test-files/solr/collection1/lib/README' to classloader
[junit4:junit4]   2> 2805 T110 oasc.SolrResourceLoader.replaceClassLoader Adding 'file:/usr/home/hudson/hudson-slave/workspace/Lucene-Solr-Tests-4.x-Java6/solr/build/solr-core/test-files/solr/collection1/lib/classes/' to classloader
[junit4:junit4]   2> 2958 T110 oasc.SolrConfig.<init> Using Lucene MatchVersion: LUCENE_40
[junit4:junit4]   2> 3062 T110 oasc.SolrConfig.<init> Loaded SolrConfig: solrconfig.xml
[junit4:junit4]   2> 3164 T110 oass.IndexSchema.readSchema Reading Solr Schema
[junit4:junit4]   2> 3175 T110 oass.IndexSchema.readSchema Schema name=test
[junit4:junit4]   2> 3984 T110 oass.OpenExchangeRatesOrgProvider.init Initialized with rates=open-exchange-rates.json, refreshInterval=1440.
[junit4:junit4]   2> 4000 T110 oass.IndexSchema.readSchema default search field in schema is text
[junit4:junit4]   2> 4006 T110 oass.IndexSchema.readSchema unique key field: id
[junit4:junit4]   2> 4066 T110 oass.FileExchangeRateProvider.reload Reloading exchange rates from file currency.xml
[junit4:junit4]   2> 4091 T110 oass.FileExchangeRateProvider.reload Reloading exchange rates from file currency.xml
[junit4:junit4]   2> 4103 T110 oass.OpenExchangeRatesOrgProvider.reload Reloading exchange rates from open-exchange-rates.json
[junit4:junit4]   2> 4106 T110 oass.OpenExchangeRatesOrgProvider.reload Reloading exchange rates from open-exchange-rates.json
[junit4:junit4]   2> 4114 T110 oasc.SolrCore.<init> [collection1] Opening new SolrCore at /usr/home/hudson/hudson-slave/workspace/Lucene-Solr-Tests-4.x-Java6/solr/build/solr-core/test-files/solr/collection1/, dataDir=./org.apache.solr.cloud.BasicDistributedZk2Test-1347742788277/control/data/
[junit4:junit4]   2> 4116 T110 oasc.JmxMonitoredMap.<init> JMX monitoring is enabled. Adding Solr mbeans to JMX Server: com.sun.jmx.mbeanserver.JmxMBeanServer@4ec1a0eb
[junit4:junit4]   2> 4168 T110 oasc.SolrCore.getNewIndexDir WARNING New index directory detected: old=null new=./org.apache.solr.cloud.BasicDistributedZk2Test-1347742788277/control/data/index/
[junit4:junit4]   2> 4171 T110 oasc.SolrCore.initIndex WARNING [collection1] Solr index directory './org.apache.solr.cloud.BasicDistributedZk2Test-1347742788277/control/data/index' doesn't exist. Creating new index...
[junit4:junit4]   2> 4172 T110 oasc.CachingDirectoryFactory.get return new directory for /usr/home/hudson/hudson-slave/workspace/Lucene-Solr-Tests-4.x-Java6/solr/build/solr-core/test/J1/./org.apache.solr.cloud.BasicDistributedZk2Test-1347742788277/control/data/index forceNew:false
[junit4:junit4]   2> 4194 T110 oasc.SolrDeletionPolicy.onCommit SolrDeletionPolicy.onCommit: commits:num=1
[junit4:junit4]   2> 		commit{dir=NRTCachingDirectory(org.apache.lucene.store.NIOFSDirectory@/usr/home/hudson/hudson-slave/workspace/Lucene-Solr-Tests-4.x-Java6/solr/build/solr-core/test/J1/org.apache.solr.cloud.BasicDistributedZk2Test-1347742788277/control/data/index lockFactory=org.apache.lucene.store.NativeFSLockFactory@735e0463; maxCacheMB=48.0 maxMergeSizeMB=4.0),segFN=segments_1,generation=1,filenames=[segments_1]
[junit4:junit4]   2> 4195 T110 oasc.SolrDeletionPolicy.updateCommits newest commit = 1
[junit4:junit4]   2> 4196 T110 oasc.SolrCore.initWriters created xml: solr.XMLResponseWriter
[junit4:junit4]   2> 4199 T110 oasup.UpdateRequestProcessorChain.init inserting DistributedUpdateProcessorFactory into updateRequestProcessorChain "dedupe"
[junit4:junit4]   2> 4199 T110 oasup.UpdateRequestProcessorChain.init inserting DistributedUpdateProcessorFactory into updateRequestProcessorChain "dedupe-allfields"
[junit4:junit4]   2> 4200 T110 oasup.UpdateRequestProcessorChain.init inserting DistributedUpdateProcessorFactory into updateRequestProcessorChain "stored_sig"
[junit4:junit4]   2> 4200 T110 oasup.UpdateRequestProcessorChain.init inserting DistributedUpdateProcessorFactory into updateRequestProcessorChain "uniq-fields"
[junit4:junit4]   2> 4201 T110 oasup.UpdateRequestProcessorChain.init inserting DistributedUpdateProcessorFactory into updateRequestProcessorChain "distrib-dup-test-chain-implicit"
[junit4:junit4]   2> 4202 T110 oasc.RequestHandlers.initHandlersFromConfig adding lazy requestHandler: solr.ReplicationHandler
[junit4:junit4]   2> 4203 T110 oasc.RequestHandlers.initHandlersFromConfig created /replication: solr.ReplicationHandler
[junit4:junit4]   2> 4204 T110 oasc.RequestHandlers.initHandlersFromConfig created standard: solr.StandardRequestHandler
[junit4:junit4]   2> 4205 T110 oasc.RequestHandlers.initHandlersFromConfig created /get: solr.RealTimeGetHandler
[junit4:junit4]   2> 4205 T110 oasc.RequestHandlers.initHandlersFromConfig created dismax: solr.SearchHandler
[junit4:junit4]   2> 4206 T110 oasc.RequestHandlers.initHandlersFromConfig created mock: org.apache.solr.core.MockQuerySenderListenerReqHandler
[junit4:junit4]   2> 4207 T110 oasc.RequestHandlers.initHandlersFromConfig created /admin/: org.apache.solr.handler.admin.AdminHandlers
[junit4:junit4]   2> 4208 T110 oasc.RequestHandlers.initHandlersFromConfig created defaults: solr.StandardRequestHandler
[junit4:junit4]   2> 4209 T110 oasc.RequestHandlers.initHandlersFromConfig adding lazy requestHandler: solr.StandardRequestHandler
[junit4:junit4]   2> 4209 T110 oasc.RequestHandlers.initHandlersFromConfig created lazy: solr.StandardRequestHandler
[junit4:junit4]   2> 4210 T110 oasc.RequestHandlers.initHandlersFromConfig created /update: solr.UpdateRequestHandler
[junit4:junit4]   2> 4211 T110 oasc.RequestHandlers.initHandlersFromConfig created /terms: org.apache.solr.handler.component.SearchHandler
[junit4:junit4]   2> 4211 T110 oasc.RequestHandlers.initHandlersFromConfig created spellCheckCompRH: org.apache.solr.handler.component.SearchHandler
[junit4:junit4]   2> 4212 T110 oasc.RequestHandlers.initHandlersFromConfig created spellCheckCompRH_Direct: org.apache.solr.handler.component.SearchHandler
[junit4:junit4]   2> 4213 T110 oasc.RequestHandlers.initHandlersFromConfig created spellCheckWithWordbreak: org.apache.solr.handler.component.SearchHandler
[junit4:junit4]   2> 4214 T110 oasc.RequestHandlers.initHandlersFromConfig created spellCheckWithWordbreak_Direct: org.apache.solr.handler.component.SearchHandler
[junit4:junit4]   2> 4215 T110 oasc.RequestHandlers.initHandlersFromConfig created spellCheckCompRH1: org.apache.solr.handler.component.SearchHandler
[junit4:junit4]   2> 4216 T110 oasc.RequestHandlers.initHandlersFromConfig created tvrh: org.apache.solr.handler.component.SearchHandler
[junit4:junit4]   2> 4216 T110 oasc.RequestHandlers.initHandlersFromConfig created /mlt: solr.MoreLikeThisHandler
[junit4:junit4]   2> 4218 T110 oasc.RequestHandlers.initHandlersFromConfig created /debug/dump: solr.DumpRequestHandler
[junit4:junit4]   2> 4222 T110 oashl.XMLLoader.init xsltCacheLifetimeSeconds=60
[junit4:junit4]   2> 4229 T110 oasc.SolrCore.initDeprecatedSupport WARNING solrconfig.xml uses deprecated <admin/gettableFiles>, Please update your config to use the ShowFileRequestHandler.
[junit4:junit4]   2> 4231 T110 oasc.SolrCore.initDeprecatedSupport WARNING adding ShowFileRequestHandler with hidden files: [SCHEMA.XML, OLD_SYNONYMS.TXT, STOPWORDS.TXT, PROTWORDS.TXT, OPEN-EXCHANGE-RATES.JSON, SYNONYMS.TXT, CURRENCY.XML, MAPPING-ISOLATIN1ACCENT.TXT]
[junit4:junit4]   2> 4236 T110 oass.SolrIndexSearcher.<init> Opening Searcher@5588d23 main
[junit4:junit4]   2> 4238 T110 oasu.CommitTracker.<init> Hard AutoCommit: disabled
[junit4:junit4]   2> 4238 T110 oasu.CommitTracker.<init> Soft AutoCommit: disabled
[junit4:junit4]   2> 4239 T110 oashc.SpellCheckComponent.inform Initializing spell checkers
[junit4:junit4]   2> 4252 T110 oass.DirectSolrSpellChecker.init init: {name=direct,classname=DirectSolrSpellChecker,field=lowerfilt,minQueryLength=3}
[junit4:junit4]   2> 4540 T134 oasc.SolrCore.registerSearcher [collection1] Registered new searcher Searcher@5588d23 main{StandardDirectoryReader(segments_1:1)}
[junit4:junit4]   2> 4554 T115 oazs.PrepRequestProcessor.pRequest Got user-level KeeperException when processing sessionid:0x139cbbaec270002 type:create cxid:0x59 zxid:0xfffffffffffffffe txntype:unknown reqpath:n/a Error Path:/solr/overseer/queue Error:KeeperErrorCode = NoNode for /solr/overseer/queue
[junit4:junit4]   2> 4561 T110 oasc.CoreContainer.register registering core: collection1
[junit4:junit4]   2> 4562 T110 oasc.ZkController.register Register shard - core:collection1 address:http://127.0.0.1:39263/solr shardId:control_shard
[junit4:junit4]   2> 4597 T110 oascsi.HttpClientUtil.createClient Creating new http client, config:maxConnections=10000&maxConnectionsPerHost=20&connTimeout=30000&socketTimeout=30000&retry=false
[junit4:junit4]   2> 4629 T110 oascc.SolrZkClient.makePath makePath: /collections/control_collection/leader_elect/control_shard/election
[junit4:junit4]   2> 4660 T115 oazs.PrepRequestProcessor.pRequest Got user-level KeeperException when processing sessionid:0x139cbbaec270002 type:delete cxid:0x68 zxid:0xfffffffffffffffe txntype:unknown reqpath:n/a Error Path:/solr/collections/control_collection/leaders Error:KeeperErrorCode = NoNode for /solr/collections/control_collection/leaders
[junit4:junit4]   2> 4661 T110 oasc.ShardLeaderElectionContext.runLeaderProcess Running the leader process.
[junit4:junit4]   2> 4662 T115 oazs.PrepRequestProcessor.pRequest Got user-level KeeperException when processing sessionid:0x139cbbaec270002 type:create cxid:0x69 zxid:0xfffffffffffffffe txntype:unknown reqpath:n/a Error Path:/solr/overseer Error:KeeperErrorCode = NodeExists for /solr/overseer
[junit4:junit4]   2> 4737 T132 oascc.ZkStateReader.updateClusterState Updating cloud state from ZooKeeper... 
[junit4:junit4]   2> 4762 T115 oazs.PrepRequestProcessor.pRequest Got user-level KeeperException when processing sessionid:0x139cbbaec270002 type:create cxid:0x70 zxid:0xfffffffffffffffe txntype:unknown reqpath:n/a Error Path:/solr/overseer/queue-work Error:KeeperErrorCode = NoNode for /solr/overseer/queue-work
[junit4:junit4]   2> 4814 T131 oascc.ZkStateReader$2.process A cluster state change has occurred - updating...
[junit4:junit4]   2> 5167 T110 oasc.ShardLeaderElectionContext.waitForReplicasToComeUp Enough replicas found to continue.
[junit4:junit4]   2> 5168 T110 oasc.ShardLeaderElectionContext.runLeaderProcess I may be the new leader - try and sync
[junit4:junit4]   2> 5169 T110 oasc.SyncStrategy.sync Sync replicas to http://127.0.0.1:39263/solr/collection1/
[junit4:junit4]   2> 5170 T110 oasc.SyncStrategy.syncReplicas Sync Success - now sync replicas to me
[junit4:junit4]   2> 5171 T110 oasc.SyncStrategy.syncToMe http://127.0.0.1:39263/solr/collection1/ has no replicas
[junit4:junit4]   2> 5171 T110 oasc.ShardLeaderElectionContext.runLeaderProcess I am the new leader: http://127.0.0.1:39263/solr/collection1/
[junit4:junit4]   2> 5172 T110 oascc.SolrZkClient.makePath makePath: /collections/control_collection/leaders/control_shard
[junit4:junit4]   2> 5233 T115 oazs.PrepRequestProcessor.pRequest Got user-level KeeperException when processing sessionid:0x139cbbaec270002 type:create cxid:0x8e zxid:0xfffffffffffffffe txntype:unknown reqpath:n/a Error Path:/solr/overseer Error:KeeperErrorCode = NodeExists for /solr/overseer
[junit4:junit4]   2> 5330 T132 oascc.ZkStateReader.updateClusterState Updating cloud state from ZooKeeper... 
[junit4:junit4]   2> 5353 T131 oascc.ZkStateReader$2.process A cluster state change has occurred - updating...
[junit4:junit4]   2> 5390 T110 oasc.ZkController.register We are http://127.0.0.1:39263/solr/collection1/ and leader is http://127.0.0.1:39263/solr/collection1/
[junit4:junit4]   2> 5392 T110 oasc.ZkController.register No LogReplay needed for core=collection1 baseURL=http://127.0.0.1:39263/solr
[junit4:junit4]   2> 5392 T110 oasc.ZkController.checkRecovery I am the leader, no recovery necessary
[junit4:junit4]   2> 5400 T110 oascc.ZkStateReader.updateClusterState Updating cloud state from ZooKeeper... 
[junit4:junit4]   2> 5402 T110 oass.SolrDispatchFilter.init user.dir=/usr/home/hudson/hudson-slave/workspace/Lucene-Solr-Tests-4.x-Java6/solr/build/solr-core/test/J1
[junit4:junit4]   2> 5403 T110 oass.SolrDispatchFilter.init SolrDispatchFilter.init() done
[junit4:junit4]   2> 5572 T110 oascsi.HttpClientUtil.createClient Creating new http client, config:maxConnections=128&maxConnectionsPerHost=32&followRedirects=false
[junit4:junit4]   2> 5864 T132 oascc.ZkStateReader.updateClusterState Updating cloud state from ZooKeeper... 
[junit4:junit4]   2> 5881 T110 oejs.Server.doStart jetty-8.1.2.v20120308
[junit4:junit4]   2> 5884 T110 oejs.AbstractConnector.doStart Started SocketConnector@0.0.0.0:39268
[junit4:junit4]   2> 5885 T110 oasc.SolrResourceLoader.locateSolrHome JNDI not configured for solr (NoInitialContextEx)
[junit4:junit4]   2> 5886 T110 oasc.SolrResourceLoader.locateSolrHome using system property solr.solr.home: /usr/home/hudson/hudson-slave/workspace/Lucene-Solr-Tests-4.x-Java6/solr/build/solr-core/test/J1/./solrtest-jetty1-1347742793881
[junit4:junit4]   2> 5887 T110 oasc.SolrResourceLoader.<init> new SolrResourceLoader for deduced Solr Home: '/usr/home/hudson/hudson-slave/workspace/Lucene-Solr-Tests-4.x-Java6/solr/build/solr-core/test/J1/./solrtest-jetty1-1347742793881/'
[junit4:junit4]   2> 5892 T131 oascc.ZkStateReader$2.process A cluster state change has occurred - updating...
[junit4:junit4]   2> 5954 T110 oass.SolrDispatchFilter.init SolrDispatchFilter.init()
[junit4:junit4]   2> 5955 T110 oasc.SolrResourceLoader.locateSolrHome JNDI not configured for solr (NoInitialContextEx)
[junit4:junit4]   2> 5956 T110 oasc.SolrResourceLoader.locateSolrHome using system property solr.solr.home: /usr/home/hudson/hudson-slave/workspace/Lucene-Solr-Tests-4.x-Java6/solr/build/solr-core/test/J1/./solrtest-jetty1-1347742793881
[junit4:junit4]   2> 5956 T110 oasc.CoreContainer$Initializer.initialize looking for solr.xml: /usr/home/hudson/hudson-slave/workspace/Lucene-Solr-Tests-4.x-Java6/solr/build/solr-core/test/J1/./solrtest-jetty1-1347742793881/solr.xml
[junit4:junit4]   2> 5957 T110 oasc.CoreContainer.<init> New CoreContainer 1076691502
[junit4:junit4]   2> 5958 T110 oasc.CoreContainer.load Loading CoreContainer using Solr Home: '/usr/home/hudson/hudson-slave/workspace/Lucene-Solr-Tests-4.x-Java6/solr/build/solr-core/test/J1/./solrtest-jetty1-1347742793881/'
[junit4:junit4]   2> 5959 T110 oasc.SolrResourceLoader.<init> new SolrResourceLoader for directory: '/usr/home/hudson/hudson-slave/workspace/Lucene-Solr-Tests-4.x-Java6/solr/build/solr-core/test/J1/./solrtest-jetty1-1347742793881/'
[junit4:junit4]   2> 6010 T110 oasc.CoreContainer.load Registering Log Listener
[junit4:junit4]   2> 6034 T110 oasc.CoreContainer.initZooKeeper Zookeeper client=127.0.0.1:39260/solr
[junit4:junit4]   2> 6035 T110 oaz.ZooKeeper.<init> Initiating client connection, connectString=127.0.0.1:39260/solr sessionTimeout=5000 watcher=org.apache.solr.common.cloud.ConnectionManager@57c28260
[junit4:junit4]   2> 6037 T144 oaz.ClientCnxn$SendThread.startConnect Opening socket connection to server /127.0.0.1:39260
[junit4:junit4]   2> 6037 T110 oascc.ConnectionManager.waitForConnected Waiting for client to connect to ZooKeeper
[junit4:junit4]   2> 6039 T144 oaz.ClientCnxn$SendThread.primeConnection Socket connection established to localhost/127.0.0.1:39260, initiating session
[junit4:junit4]   2> 6039 T112 oazs.NIOServerCnxn$Factory.run Accepted socket connection from /140.211.11.196:39269
[junit4:junit4]   2> 6039 T112 oazs.NIOServerCnxn.readConnectRequest Client attempting to establish new session at /140.211.11.196:39269
[junit4:junit4]   2> 6041 T114 oazs.NIOServerCnxn.finishSessionInit Established session 0x139cbbaec270003 with negotiated timeout 5000 for client /140.211.11.196:39269
[junit4:junit4]   2> 6041 T144 oaz.ClientCnxn$SendThread.readConnectResult Session establishment complete on server localhost/127.0.0.1:39260, sessionid = 0x139cbbaec270003, negotiated timeout = 5000
[junit4:junit4]   2> 6042 T145 oascc.ConnectionManager.process Watcher org.apache.solr.common.cloud.ConnectionManager@57c28260 name:ZooKeeperConnection Watcher:127.0.0.1:39260/solr got event WatchedEvent state:SyncConnected type:None path:null path:null type:None
[junit4:junit4]   2> 6042 T110 oascc.ConnectionManager.waitForConnected Client is connected to ZooKeeper
[junit4:junit4]   2> 6043 T115 oazs.PrepRequestProcessor.pRequest Got user-level KeeperException when processing sessionid:0x139cbbaec270003 type:create cxid:0x1 zxid:0xfffffffffffffffe txntype:unknown reqpath:n/a Error Path:/solr/overseer Error:KeeperErrorCode = NodeExists for /solr/overseer
[junit4:junit4]   2> 6045 T115 oazs.PrepRequestProcessor.pRequest Got user-level KeeperException when processing sessionid:0x139cbbaec270003 type:create cxid:0x2 zxid:0xfffffffffffffffe txntype:unknown reqpath:n/a Error Path:/solr/overseer Error:KeeperErrorCode = NodeExists for /solr/overseer
[junit4:junit4]   2> 6047 T110 oasc.ZkController.createEphemeralLiveNode Register node as live in ZooKeeper:/live_nodes/127.0.0.1:39268_solr
[junit4:junit4]   2> 6048 T115 oazs.PrepRequestProcessor.pRequest Got user-level KeeperException when processing sessionid:0x139cbbaec270003 type:delete cxid:0x4 zxid:0xfffffffffffffffe txntype:unknown reqpath:n/a Error Path:/solr/live_nodes/127.0.0.1:39268_solr Error:KeeperErrorCode = NoNode for /solr/live_nodes/127.0.0.1:39268_solr
[junit4:junit4]   2> 6055 T110 oascc.SolrZkClient.makePath makePath: /live_nodes/127.0.0.1:39268_solr
[junit4:junit4]   2> 6059 T131 oascc.ZkStateReader$3.process Updating live nodes
[junit4:junit4]   2> 6061 T110 oashc.HttpShardHandlerFactory.getParameter Setting socketTimeout to: 0
[junit4:junit4]   2> 6062 T110 oashc.HttpShardHandlerFactory.getParameter Setting urlScheme to: http://
[junit4:junit4]   2> 6062 T110 oashc.HttpShardHandlerFactory.getParameter Setting connTimeout to: 0
[junit4:junit4]   2> 6063 T110 oashc.HttpShardHandlerFactory.getParameter Setting maxConnectionsPerHost to: 20
[junit4:junit4]   2> 6064 T110 oashc.HttpShardHandlerFactory.getParameter Setting corePoolSize to: 0
[junit4:junit4]   2> 6065 T110 oashc.HttpShardHandlerFactory.getParameter Setting maximumPoolSize to: 2147483647
[junit4:junit4]   2> 6065 T110 oashc.HttpShardHandlerFactory.getParameter Setting maxThreadIdleTime to: 5
[junit4:junit4]   2> 6066 T110 oashc.HttpShardHandlerFactory.getParameter Setting sizeOfQueue to: -1
[junit4:junit4]   2> 6067 T110 oashc.HttpShardHandlerFactory.getParameter Setting fairnessPolicy to: false
[junit4:junit4]   2> 6067 T110 oascsi.HttpClientUtil.createClient Creating new http client, config:maxConnectionsPerHost=20&maxConnections=10000&socketTimeout=0&connTimeout=0&retry=false
[junit4:junit4]   2> 6104 T110 oascc.ZkStateReader.createClusterStateWatchersAndUpdate Updating cluster state from ZooKeeper... 
[junit4:junit4]   2> 6114 T110 oasc.CoreContainer.create Creating SolrCore 'collection1' using instanceDir: /usr/home/hudson/hudson-slave/workspace/Lucene-Solr-Tests-4.x-Java6/solr/build/solr-core/test/J1/./solrtest-jetty1-1347742793881/collection1
[junit4:junit4]   2> 6115 T110 oasc.ZkController.createCollectionZkNode Check for collection zkNode:collection1
[junit4:junit4]   2> 6116 T110 oasc.ZkController.createCollectionZkNode Collection zkNode exists
[junit4:junit4]   2> 6117 T110 oasc.ZkController.readConfigName Load collection config from:/collections/collection1
[junit4:junit4]   2> 6119 T110 oasc.SolrResourceLoader.<init> new SolrResourceLoader for directory: '/usr/home/hudson/hudson-slave/workspace/Lucene-Solr-Tests-4.x-Java6/solr/build/solr-core/test/J1/./solrtest-jetty1-1347742793881/collection1/'
[junit4:junit4]   2> 6122 T110 oasc.SolrResourceLoader.replaceClassLoader Adding 'file:/usr/home/hudson/hudson-slave/workspace/Lucene-Solr-Tests-4.x-Java6/solr/build/solr-core/test/J1/solrtest-jetty1-1347742793881/collection1/lib/README' to classloader
[junit4:junit4]   2> 6123 T110 oasc.SolrResourceLoader.replaceClassLoader Adding 'file:/usr/home/hudson/hudson-slave/workspace/Lucene-Solr-Tests-4.x-Java6/solr/build/solr-core/test/J1/solrtest-jetty1-1347742793881/collection1/lib/classes/' to classloader
[junit4:junit4]   2> 6207 T110 oasc.SolrConfig.<init> Using Lucene MatchVersion: LUCENE_40
[junit4:junit4]   2> 6323 T110 oasc.SolrConfig.<init> Loaded SolrConfig: solrconfig.xml
[junit4:junit4]   2> 6425 T110 oass.IndexSchema.readSchema Reading Solr Schema
[junit4:junit4]   2> 6455 T110 oass.IndexSchema.readSchema Schema name=test
[junit4:junit4]   2> 7358 T110 oass.OpenExchangeRatesOrgProvider.init Initialized with rates=open-exchange-rates.json, refreshInterval=1440.
[junit4:junit4]   2> 7376 T110 oass.IndexSchema.readSchema default search field in schema is text
[junit4:junit4]   2> 7387 T110 oass.IndexSchema.readSchema unique key field: id
[junit4:junit4]   2> 7411 T110 oass.FileExchangeRateProvider.reload Reloading exchange rates from file currency.xml
[junit4:junit4]   2> 7418 T110 oass.FileExchangeRateProvider.reload Reloading exchange rates from file currency.xml
[junit4:junit4]   2> 7426 T110 oass.OpenExchangeRatesOrgProvider.reload Reloading exchange rates from open-exchange-rates.json
[junit4:junit4]   2> 7431 T110 oass.OpenExchangeRatesOrgProvider.reload Reloading exchange rates from open-exchange-rates.json
[junit4:junit4]   2> 7435 T110 oasc.SolrCore.<init> [collection1] Opening new SolrCore at /usr/home/hudson/hudson-slave/workspace/Lucene-Solr-Tests-4.x-Java6/solr/build/solr-core/test/J1/./solrtest-jetty1-1347742793881/collection1/, dataDir=./org.apache.solr.cloud.BasicDistributedZk2Test-1347742788277/jetty1/
[junit4:junit4]   2> 7436 T110 oasc.JmxMonitoredMap.<init> JMX monitoring is enabled. Adding Solr mbeans to JMX Server: com.sun.jmx.mbeanserver.JmxMBeanServer@4ec1a0eb
[junit4:junit4]   2> 7438 T110 oasc.SolrCore.getNewIndexDir WARNING New index directory detected: old=null new=./org.apache.solr.cloud.BasicDistributedZk2Test-1347742788277/jetty1/index/
[junit4:junit4]   2> 7439 T110 oasc.SolrCore.initIndex WARNING [collection1] Solr index directory './org.apache.solr.cloud.BasicDistributedZk2Test-1347742788277/jetty1/index' doesn't exist. Creating new index...
[junit4:junit4]   2> 7440 T110 oasc.CachingDirectoryFactory.get return new directory for /usr/home/hudson/hudson-slave/workspace/Lucene-Solr-Tests-4.x-Java6/solr/build/solr-core/test/J1/./org.apache.solr.cloud.BasicDistributedZk2Test-1347742788277/jetty1/index forceNew:false
[junit4:junit4]   2> 7459 T110 oasc.SolrDeletionPolicy.onCommit SolrDeletionPolicy.onCommit: commits:num=1
[junit4:junit4]   2> 		commit{dir=NRTCachingDirectory(org.apache.lucene.store.NIOFSDirectory@/usr/home/hudson/hudson-slave/workspace/Lucene-Solr-Tests-4.x-Java6/solr/build/solr-core/test/J1/org.apache.solr.cloud.BasicDistributedZk2Test-1347742788277/jetty1/index lockFactory=org.apache.lucene.store.NativeFSLockFactory@2c85ebfd; maxCacheMB=48.0 maxMergeSizeMB=4.0),segFN=segments_1,generation=1,filenames=[segments_1]
[junit4:junit4]   2> 7460 T110 oasc.SolrDeletionPolicy.updateCommits newest commit = 1
[junit4:junit4]   2> 7461 T110 oasc.SolrCore.initWriters created xml: solr.XMLResponseWriter
[junit4:junit4]   2> 7466 T110 oasup.UpdateRequestProcessorChain.init inserting DistributedUpdateProcessorFactory into updateRequestProcessorChain "dedupe"
[junit4:junit4]   2> 7467 T110 oasup.UpdateRequestProcessorChain.init inserting DistributedUpdateProcessorFactory into updateRequestProcessorChain "dedupe-allfields"
[junit4:junit4]   2> 7468 T110 oasup.UpdateRequestProcessorChain.init inserting DistributedUpdateProcessorFactory into updateRequestProcessorChain "stored_sig"
[junit4:junit4]   2> 7469 T110 oasup.UpdateRequestProcessorChain.init inserting DistributedUpdateProcessorFactory into updateRequestProcessorChain "uniq-fields"
[junit4:junit4]   2> 7471 T110 oasup.UpdateRequestProcessorChain.init inserting DistributedUpdateProcessorFactory into updateRequestProcessorChain "distrib-dup-test-chain-implicit"
[junit4:junit4]   2> 7471 T110 oasc.RequestHandlers.initHandlersFromConfig adding lazy requestHandler: solr.ReplicationHandler
[junit4:junit4]   2> 7472 T110 oasc.RequestHandlers.initHandlersFromConfig created /replication: solr.ReplicationHandler
[junit4:junit4]   2> 7474 T110 oasc.RequestHandlers.initHandlersFromConfig created standard: solr.StandardRequestHandler
[junit4:junit4]   2> 7475 T110 oasc.RequestHandlers.initHandlersFromConfig created /get: solr.RealTimeGetHandler
[junit4:junit4]   2> 7477 T110 oasc.RequestHandlers.initHandlersFromConfig created dismax: solr.SearchHandler
[junit4:junit4]   2> 7478 T110 oasc.RequestHandlers.initHandlersFromConfig created mock: org.apache.solr.core.MockQuerySenderListenerReqHandler
[junit4:junit4]   2> 7479 T110 oasc.RequestHandlers.initHandlersFromConfig created /admin/: org.apache.solr.handler.admin.AdminHandlers
[junit4:junit4]   2> 7481 T110 oasc.RequestHandlers.initHandlersFromConfig created defaults: solr.StandardRequestHandler
[junit4:junit4]   2> 7481 T110 oasc.RequestHandlers.initHandlersFromConfig adding lazy requestHandler: solr.StandardRequestHandler
[junit4:junit4]   2> 7482 T110 oasc.RequestHandlers.initHandlersFromConfig created lazy: solr.StandardRequestHandler
[junit4:junit4]   2> 7484 T110 oasc.RequestHandlers.initHandlersFromConfig created /update: solr.UpdateRequestHandler
[junit4:junit4]   2> 7485 T110 oasc.RequestHandlers.initHandlersFromConfig created /terms: org.apache.solr.handler.component.SearchHandler
[junit4:junit4]   2> 7487 T110 oasc.RequestHandlers.initHandlersFromConfig created spellCheckCompRH: org.apache.solr.handler.component.SearchHandler
[junit4:junit4]   2> 7489 T110 oasc.RequestHandlers.initHandlersFromConfig created spellCheckCompRH_Direct: org.apache.solr.handler.component.SearchHandler
[junit4:junit4]   2> 7490 T110 oasc.RequestHandlers.initHandlersFromConfig created spellCheckWithWordbreak: org.apache.solr.handler.component.SearchHandler
[junit4:junit4]   2> 7491 T110 oasc.RequestHandlers.initHandlersFromConfig created spellCheckWithWordbreak_Direct: org.apache.solr.handler.component.SearchHandler
[junit4:junit4]   2> 7493 T110 oasc.RequestHandlers.initHandlersFromConfig created spellCheckCompRH1: org.apache.solr.handler.component.SearchHandler
[junit4:junit4]   2> 7494 T110 oasc.RequestHandlers.initHandlersFromConfig created tvrh: org.apache.solr.handler.component.SearchHandler
[junit4:junit4]   2> 7495 T110 oasc.RequestHandlers.initHandlersFromConfig created /mlt: solr.MoreLikeThisHandler
[junit4:junit4]   2> 7497 T110 oasc.RequestHandlers.initHandlersFromConfig created /debug/dump: solr.DumpRequestHandler
[junit4:junit4]   2> 7504 T110 oashl.XMLLoader.init xsltCacheLifetimeSeconds=60
[junit4:junit4]   2> 7514 T110 oasc.SolrCore.initDeprecatedSupport WARNING solrconfig.xml uses deprecated <admin/gettableFiles>, Please update your config to use the ShowFileRequestHandler.
[junit4:junit4]   2> 7517 T110 oasc.SolrCore.initDeprecatedSupport WARNING adding ShowFileRequestHandler with hidden files: [SCHEMA.XML, OLD_SYNONYMS.TXT, STOPWORDS.TXT, PROTWORDS.TXT, OPEN-EXCHANGE-RATES.JSON, SYNONYMS.TXT, CURRENCY.XML, MAPPING-ISOLATIN1ACCENT.TXT]
[junit4:junit4]   2> 7524 T110 oass.SolrIndexSearcher.<init> Opening Searcher@5d518bbd main
[junit4:junit4]   2> 7527 T110 oasu.CommitTracker.<init> Hard AutoCommit: disabled
[junit4:junit4]   2> 7528 T110 oasu.CommitTracker.<init> Soft AutoCommit: disabled
[junit4:junit4]   2> 7529 T110 oashc.SpellCheckComponent.inform Initializing spell checkers
[junit4:junit4]   2> 7549 T110 oass.DirectSolrSpellChecker.init init: {name=direct,classname=DirectSolrSpellChecker,field=lowerfilt,minQueryLength=3}
[junit4:junit4]   2> 7610 T146 oasc.SolrCore.registerSearcher [collection1] Registered new searcher Searcher@5d518bbd main{StandardDirectoryReader(segments_1:1)}
[junit4:junit4]   2> 7918 T132 oascc.ZkStateReader.updateClusterState Updating cloud state from ZooKeeper... 
[junit4:junit4]   2> 7968 T145 oascc.ZkStateReader$2.process A cluster state change has occurred - updating...
[junit4:junit4]   2> 7968 T131 oascc.ZkStateReader$2.process A cluster state change has occurred - updating...
[junit4:junit4]   2> 8128 T110 oasc.CoreContainer.register registering core: collection1
[junit4:junit4]   2> 8129 T110 oasc.ZkController.register Register shard - core:collection1 address:http://127.0.0.1:39268/solr shardId:shard1
[junit4:junit4]   2> 8131 T110 oascc.SolrZkClient.makePath makePath: /collections/collection1/leader_elect/shard1/election
[junit4:junit4]   2> 8150 T115 oazs.PrepRequestProcessor.pRequest Got user-level KeeperException when processing sessionid:0x139cbbaec270003 type:delete cxid:0x42 zxid:0xfffffffffffffffe txntype:unknown reqpath:n/a Error Path:/solr/collections/collection1/leaders Error:KeeperErrorCode = NoNode for /solr/collections/collection1/leaders
[junit4:junit4]   2> 8151 T110 oasc.ShardLeaderElectionContext.runLeaderProcess Running the leader process.
[junit4:junit4]   2> 8152 T115 oazs.PrepRequestProcessor.pRequest Got user-level KeeperException when processing sessionid:0x139cbbaec270003 type:create cxid:0x43 zxid:0xfffffffffffffffe txntype:unknown reqpath:n/a Error Path:/solr/overseer Error:KeeperErrorCode = NodeExists for /solr/overseer
[junit4:junit4]   2> 8161 T110 oasc.ShardLeaderElectionContext.waitForReplicasToComeUp Enough replicas found to continue.
[junit4:junit4]   2> 8162 T110 oasc.ShardLeaderElectionContext.runLeaderProcess I may be the new leader - try and sync
[junit4:junit4]   2> 8162 T110 oasc.SyncStrategy.sync Sync replicas to http://127.0.0.1:39268/solr/collection1/
[junit4:junit4]   2> 8163 T110 oasc.SyncStrategy.syncReplicas Sync Success - now sync replicas to me
[junit4:junit4]   2> 8163 T110 oasc.SyncStrategy.syncToMe http://127.0.0.1:39268/solr/collection1/ has no replicas
[junit4:junit4]   2> 8164 T110 oasc.ShardLeaderElectionContext.runLeaderProcess I am the new leader: http://127.0.0.1:39268/solr/collection1/
[junit4:junit4]   2> 8164 T110 oascc.SolrZkClient.makePath makePath: /collections/collection1/leaders/shard1
[junit4:junit4]   2> 8170 T115 oazs.PrepRequestProcessor.pRequest Got user-level KeeperException when processing sessionid:0x139cbbaec270003 type:create cxid:0x4d zxid:0xfffffffffffffffe txntype:unknown reqpath:n/a Error Path:/solr/overseer Error:KeeperErrorCode = NodeExists for /solr/overseer
[junit4:junit4]   2> 8483 T132 oascc.ZkStateReader.updateClusterState Updating cloud state from ZooKeeper... 
[junit4:junit4]   2> 8507 T145 oascc.ZkStateReader$2.process A cluster state change has occurred - updating...
[junit4:junit4]   2> 8507 T131 oascc.ZkStateReader$2.process A cluster state change has occurred - updating...
[junit4:junit4]   2> 8537 T110 oasc.ZkController.register We are http://127.0.0.1:39268/solr/collection1/ and leader is http://127.0.0.1:39268/solr/collection1/
[junit4:junit4]   2> 8538 T110 oasc.ZkController.register No LogReplay needed for core=collection1 baseURL=http://127.0.0.1:39268/solr
[junit4:junit4]   2> 8538 T110 oasc.ZkController.checkRecovery I am the leader, no recovery necessary
[junit4:junit4]   2> 8545 T110 oascc.ZkStateReader.updateClusterState Updating cloud state from ZooKeeper... 
[junit4:junit4]   2> 8547 T110 oass.SolrDispatchFilter.init user.dir=/usr/home/hudson/hudson-slave/workspace/Lucene-Solr-Tests-4.x-Java6/solr/build/solr-core/test/J1
[junit4:junit4]   2> 8548 T110 oass.SolrDispatchFilter.init SolrDispatchFilter.init() done
[junit4:junit4]   2> 8549 T110 oascsi.HttpClientUtil.createClient Creating new http client, config:maxConnections=128&maxConnectionsPerHost=32&followRedirects=false
[junit4:junit4]   2> 8848 T110 oejs.Server.doStart jetty-8.1.2.v20120308
[junit4:junit4]   2> 8851 T110 oejs.AbstractConnector.doStart Started SocketConnector@0.0.0.0:39270
[junit4:junit4]   2> 8852 T110 oasc.SolrResourceLoader.locateSolrHome JNDI not configured for solr (NoInitialContextEx)
[junit4:junit4]   2> 8853 T110 oasc.SolrResourceLoader.locateSolrHome using system property solr.solr.home: /usr/home/hudson/hudson-slave/workspace/Lucene-Solr-Tests-4.x-Java6/solr/build/solr-core/test/J1/./solrtest-jetty2-1347742796848
[junit4:junit4]   2> 8854 T110 oasc.SolrResourceLoader.<init> new SolrResourceLoader for deduced Solr Home: '/usr/home/hudson/hudson-slave/workspace/Lucene-Solr-Tests-4.x-Java6/solr/build/solr-core/test/J1/./solrtest-jetty2-1347742796848/'
[junit4:junit4]   2> 8915 T110 oass.SolrDispatchFilter.init SolrDispatchFilter.init()
[junit4:junit4]   2> 8916 T110 oasc.SolrResourceLoader.locateSolrHome JNDI not configured for solr (NoInitialContextEx)
[junit4:junit4]   2> 8917 T110 oasc.SolrResourceLoader.locateSolrHome using system property solr.solr.home: /usr/home/hudson/hudson-slave/workspace/Lucene-Solr-Tests-4.x-Java6/solr/build/solr-core/test/J1/./solrtest-jetty2-1347742796848
[junit4:junit4]   2> 8918 T110 oasc.CoreContainer$Initializer.initialize looking for solr.xml: /usr/home/hudson/hudson-slave/workspace/Lucene-Solr-Tests-4.x-Java6/solr/build/solr-core/test/J1/./solrtest-jetty2-1347742796848/solr.xml
[junit4:junit4]   2> 8918 T110 oasc.CoreContainer.<init> New CoreContainer 1167883284
[junit4:junit4]   2> 8919 T110 oasc.CoreContainer.load Loading CoreContainer using Solr Home: '/usr/home/hudson/hudson-slave/workspace/Lucene-Solr-Tests-4.x-Java6/solr/build/solr-core/test/J1/./solrtest-jetty2-1347742796848/'
[junit4:junit4]   2> 8920 T110 oasc.SolrResourceLoader.<init> new SolrResourceLoader for directory: '/usr/home/hudson/hudson-slave/workspace/Lucene-Solr-Tests-4.x-Java6/solr/build/solr-core/test/J1/./solrtest-jetty2-1347742796848/'
[junit4:junit4]   2> 8965 T110 oasc.CoreContainer.load Registering Log Listener
[junit4:junit4]   2> 8988 T110 oasc.CoreContainer.initZooKeeper Zookeeper client=127.0.0.1:39260/solr
[junit4:junit4]   2> 8989 T110 oaz.ZooKeeper.<init> Initiating client connection, connectString=127.0.0.1:39260/solr sessionTimeout=5000 watcher=org.apache.solr.common.cloud.ConnectionManager@7e4d6803
[junit4:junit4]   2> 8991 T156 oaz.ClientCnxn$SendThread.startConnect Opening socket connection to server /127.0.0.1:39260
[junit4:junit4]   2> 8991 T110 oascc.ConnectionManager.waitForConnected Waiting for client to connect to ZooKeeper
[junit4:junit4]   2> 8993 T156 oaz.ClientCnxn$SendThread.primeConnection Socket connection established to localhost/127.0.0.1:39260, initiating session
[junit4:junit4]   2> 8993 T112 oazs.NIOServerCnxn$Factory.run Accepted socket connection from /140.211.11.196:39271
[junit4:junit4]   2> 8994 T112 oazs.NIOServerCnxn.readConnectRequest Client attempting to establish new session at /140.211.11.196:39271
[junit4:junit4]   2> 8996 T114 oazs.NIOServerCnxn.finishSessionInit Established session 0x139cbbaec270004 with negotiated timeout 5000 for client /140.211.11.196:39271
[junit4:junit4]   2> 8996 T156 oaz.ClientCnxn$SendThread.readConnectResult Session establishment complete on server localhost/127.0.0.1:39260, sessionid = 0x139cbbaec270004, negotiated timeout = 5000
[junit4:junit4]   2> 8997 T157 oascc.ConnectionManager.process Watcher org.apache.solr.common.cloud.ConnectionManager@7e4d6803 name:ZooKeeperConnection Watcher:127.0.0.1:39260/solr got event WatchedEvent state:SyncConnected type:None path:null path:null type:None
[junit4:junit4]   2> 8997 T110 oascc.ConnectionManager.waitForConnected Client is connected to ZooKeeper
[junit4:junit4]   2> 8999 T115 oazs.PrepRequestProcessor.pRequest Got user-level KeeperException when processing sessionid:0x139cbbaec270004 type:create cxid:0x1 zxid:0xfffffffffffffffe txntype:unknown reqpath:n/a Error Path:/solr/overseer Error:KeeperErrorCode = NodeExists for /solr/overseer
[junit4:junit4]   2> 9009 T115 oazs.PrepRequestProcessor.pRequest Got user-level KeeperException when processing sessionid:0x139cbbaec270004 type:create cxid:0x2 zxid:0xfffffffffffffffe txntype:unknown reqpath:n/a Error Path:/solr/overseer Error:KeeperErrorCode = NodeExists for /solr/overseer
[junit4:junit4]   2> 9012 T110 oasc.ZkController.createEphemeralLiveNode Register node as live in ZooKeeper:/live_nodes/127.0.0.1:39270_solr
[junit4:junit4]   2> 9013 T115 oazs.PrepRequestProcessor.pRequest Got user-level KeeperException when processing sessionid:0x139cbbaec270004 type:delete cxid:0x4 zxid:0xfffffffffffffffe txntype:unknown reqpath:n/a Error Path:/solr/live_nodes/127.0.0.1:39270_solr Error:KeeperErrorCode = NoNode for /solr/live_nodes/127.0.0.1:39270_solr
[junit4:junit4]   2> 9015 T110 oascc.SolrZkClient.makePath makePath: /live_nodes/127.0.0.1:39270_solr
[junit4:junit4]   2> 9019 T145 oascc.ZkStateReader$3.process Updating live nodes
[junit4:junit4]   2> 9019 T131 oascc.ZkStateReader$3.process Updating live nodes
[junit4:junit4]   2> 9019 T132 oascc.ZkStateReader.updateClusterState Updating cloud state from ZooKeeper... 
[junit4:junit4]   2> 9021 T110 oashc.HttpShardHandlerFactory.getParameter Setting socketTimeout to: 0
[junit4:junit4]   2> 9022 T110 oashc.HttpShardHandlerFactory.getParameter Setting urlScheme to: http://
[junit4:junit4]   2> 9022 T110 oashc.HttpShardHandlerFactory.getParameter Setting connTimeout to: 0
[junit4:junit4]   2> 9023 T110 oashc.HttpShardHandlerFactory.getParameter Setting maxConnectionsPerHost to: 20
[junit4:junit4]   2> 9024 T110 oashc.HttpShardHandlerFactory.getParameter Setting corePoolSize to: 0
[junit4:junit4]   2> 9025 T110 oashc.HttpShardHandlerFactory.getParameter Setting maximumPoolSize to: 2147483647
[junit4:junit4]   2> 9025 T110 oashc.HttpShardHandlerFactory.getParameter Setting maxThreadIdleTime to: 5
[junit4:junit4]   2> 9026 T110 oashc.HttpShardHandlerFactory.getParameter Setting sizeOfQueue to: -1
[junit4:junit4]   2> 9027 T110 oashc.HttpShardHandlerFactory.getParameter Setting fairnessPolicy to: false
[junit4:junit4]   2> 9028 T110 oascsi.HttpClientUtil.createClient Creating new http client, config:maxConnectionsPerHost=20&maxConnections=10000&socketTimeout=0&connTimeout=0&retry=false
[junit4:junit4]   2> 9033 T145 oascc.ZkStateReader$2.process A cluster state change has occurred - updating...
[junit4:junit4]   2> 9046 T131 oascc.ZkStateReader$2.process A cluster state change has occurred - updating...
[junit4:junit4]   2> 9063 T110 oascc.ZkStateReader.createClusterStateWatchersAndUpdate Updating cluster state from ZooKeeper... 
[junit4:junit4]   2> 9096 T110 oasc.CoreContainer.create Creating SolrCore 'collection1' using instanceDir: /usr/home/hudson/hudson-slave/workspace/Lucene-Solr-Tests-4.x-Java6/solr/build/solr-core/test/J1/./solrtest-jetty2-1347742796848/collection1
[junit4:junit4]   2> 9097 T110 oasc.ZkController.createCollectionZkNode Check for collection zkNode:collection1
[junit4:junit4]   2> 9099 T110 oasc.ZkController.createCollectionZkNode Collection zkNode exists
[junit4:junit4]   2> 9100 T110 oasc.ZkController.readConfigName Load collection config from:/collections/collection1
[junit4:junit4]   2> 9102 T110 oasc.SolrResourceLoader.<init> new SolrResourceLoader for directory: '/usr/home/hudson/hudson-slave/workspace/Lucene-Solr-Tests-4.x-Java6/solr/build/solr-core/test/J1/./solrtest-jetty2-1347742796848/collection1/'
[junit4:junit4]   2> 9104 T110 oasc.SolrResourceLoader.replaceClassLoader Adding 'file:/usr/home/hudson/hudson-slave/workspace/Lucene-Solr-Tests-4.x-Java6/solr/build/solr-core/test/J1/solrtest-jetty2-1347742796848/collection1/lib/README' to classloader
[junit4:junit4]   2> 9105 T110 oasc.SolrResourceLoader.replaceClassLoader Adding 'file:/usr/home/hudson/hudson-slave/workspace/Lucene-Solr-Tests-4.x-Java6/solr/build/solr-core/test/J1/solrtest-jetty2-1347742796848/collection1/lib/classes/' to classloader
[junit4:junit4]   2> 9176 T110 oasc.SolrConfig.<init> Using Lucene MatchVersion: LUCENE_40
[junit4:junit4]   2> 9303 T110 oasc.SolrConfig.<init> Loaded SolrConfig: solrconfig.xml
[junit4:junit4]   2> 9406 T110 oass.IndexSchema.readSchema Reading Solr Schema
[junit4:junit4]   2> 9423 T110 oass.IndexSchema.readSchema Schema name=test
[junit4:junit4]   2> 10284 T110 oass.OpenExchangeRatesOrgProvider.init Initialized with rates=open-exchange-rates.json, refreshInterval=1440.
[junit4:junit4]   2> 10302 T110 oass.IndexSchema.readSchema default search field in schema is text
[junit4:junit4]   2> 10307 T110 oass.IndexSchema.readSchema unique key field: id
[junit4:junit4]   2> 10330 T110 oass.FileExchangeRateProvider.reload Reloading exchange rates from file currency.xml
[junit4:junit4]   2> 10337 T110 oass.FileExchangeRateProvider.reload Reloading exchange rates from file currency.xml
[junit4:junit4]   2> 10346 T110 oass.OpenExchangeRatesOrgProvider.reload Reloading exchange rates from open-exchange-rates.json
[junit4:junit4]   2> 10354 T110 oass.OpenExchangeRatesOrgProvider.reload Reloading exchange rates from open-exchange-rates.json
[junit4:junit4]   2> 10358 T110 oasc.SolrCore.<init> [collection1] Opening new SolrCore at /usr/home/hudson/hudson-slave/workspace/Lucene-Solr-Tests-4.x-Java6/solr/build/solr-core/test/J1/./solrtest-jetty2-1347742796848/collection1/, dataDir=./org.apache.solr.cloud.BasicDistributedZk2Test-1347742788277/jetty2/
[junit4:junit4]   2> 10359 T110 oasc.JmxMonitoredMap.<init> JMX monitoring is enabled. Adding Solr mbeans to JMX Server: com.sun.jmx.mbeanserver.JmxMBeanServer@4ec1a0eb
[junit4:junit4]   2> 10361 T110 oasc.SolrCore.getNewIndexDir WARNING New index directory detected: old=null new=./org.apache.solr.cloud.BasicDistributedZk2Test-1347742788277/jetty2/index/
[junit4:junit4]   2> 10363 T110 oasc.SolrCore.initIndex WARNING [collection1] Solr index directory './org.apache.solr.cloud.BasicDistributedZk2Test-1347742788277/jetty2/index' doesn't exist. Creating new index...
[junit4:junit4]   2> 10364 T110 oasc.CachingDirectoryFactory.get return new directory for /usr/home/hudson/hudson-slave/workspace/Lucene-Solr-Tests-4.x-Java6/solr/build/solr-core/test/J1/./org.apache.solr.cloud.BasicDistributedZk2Test-1347742788277/jetty2/index forceNew:false
[junit4:junit4]   2> 10383 T110 oasc.SolrDeletionPolicy.onCommit SolrDeletionPolicy.onCommit: commits:num=1
[junit4:junit4]   2> 		commit{dir=NRTCachingDirectory(org.apache.lucene.store.NIOFSDirectory@/usr/home/hudson/hudson-slave/workspace/Lucene-Solr-Tests-4.x-Java6/solr/build/solr-core/test/J1/org.apache.solr.cloud.BasicDistributedZk2Test-1347742788277/jetty2/index lockFactory=org.apache.lucene.store.NativeFSLockFactory@1ff1a404; maxCacheMB=48.0 maxMergeSizeMB=4.0),segFN=segments_1,generation=1,filenames=[segments_1]
[junit4:junit4]   2> 10384 T110 oasc.SolrDeletionPolicy.updateCommits newest commit = 1
[junit4:junit4]   2> 10386 T110 oasc.SolrCore.initWriters created xml: solr.XMLResponseWriter
[junit4:junit4]   2> 10389 T110 oasup.UpdateRequestProcessorChain.init inserting DistributedUpdateProcessorFactory into updateRequestProcessorChain "dedupe"
[junit4:junit4]   2> 10390 T110 oasup.UpdateRequestProcessorChain.init inserting DistributedUpdateProcessorFactory into updateRequestProcessorChain "dedupe-allfields"
[junit4:junit4]   2> 10391 T110 oasup.UpdateRequestProcessorChain.init inserting DistributedUpdateProcessorFactory into updateRequestProcessorChain "stored_sig"
[junit4:junit4]   2> 10391 T110 oasup.UpdateRequestProcessorChain.init inserting DistributedUpdateProcessorFactory into updateRequestProcessorChain "uniq-fields"
[junit4:junit4]   2> 10392 T110 oasup.UpdateRequestProcessorChain.init inserting DistributedUpdateProcessorFactory into updateRequestProcessorChain "distrib-dup-test-chain-implicit"
[junit4:junit4]   2> 10392 T110 oasc.RequestHandlers.initHandlersFromConfig adding lazy requestHandler: solr.ReplicationHandler
[junit4:junit4]   2> 10393 T110 oasc.RequestHandlers.initHandlersFromConfig created /replication: solr.ReplicationHandler
[junit4:junit4]   2> 10394 T110 oasc.RequestHandlers.initHandlersFromConfig created standard: solr.StandardRequestHandler
[junit4:junit4]   2> 10395 T110 oasc.RequestHandlers.initHandlersFromConfig created /get: solr.RealTimeGetHandler
[junit4:junit4]   2> 10396 T110 oasc.RequestHandlers.initHandlersFromConfig created dismax: solr.SearchHandler
[junit4:junit4]   2> 10396 T110 oasc.RequestHandlers.initHandlersFromConfig created mock: org.apache.solr.core.MockQuerySenderListenerReqHandler
[junit4:junit4]   2> 10397 T110 oasc.RequestHandlers.initHandlersFromConfig created /admin/: org.apache.solr.handler.admin.AdminHandlers
[junit4:junit4]   2> 10398 T110 oasc.RequestHandlers.initHandlersFromConfig created defaults: solr.StandardRequestHandler
[junit4:junit4]   2> 10398 T110 oasc.RequestHandlers.initHandlersFromConfig adding lazy requestHandler: solr.StandardRequestHandler
[junit4:junit4]   2> 10399 T110 oasc.RequestHandlers.initHandlersFromConfig created lazy: solr.StandardRequestHandler
[junit4:junit4]   2> 10400 T110 oasc.RequestHandlers.initHandlersFromConfig created /update: solr.UpdateRequestHandler
[junit4:junit4]   2> 10401 T110 oasc.RequestHandlers.initHandlersFromConfig created /terms: org.apache.solr.handler.component.SearchHandler
[junit4:junit4]   2> 10401 T110 oasc.RequestHandlers.initHandlersFromConfig created spellCheckCompRH: org.apache.solr.handler.component.SearchHandler
[junit4:junit4]   2> 10402 T110 oasc.RequestHandlers.initHandlersFromConfig created spellCheckCompRH_Direct: org.apache.solr.handler.component.SearchHandler
[junit4:junit4]   2> 10403 T110 oasc.RequestHandlers.initHandlersFromConfig created spellCheckWithWordbreak: org.apache.solr.handler.component.SearchHandler
[junit4:junit4]   2> 10404 T110 oasc.RequestHandlers.initHandlersFromConfig created spellCheckWithWordbreak_Direct: org.apache.solr.handler.component.SearchHandler
[junit4:junit4]   2> 10405 T110 oasc.RequestHandlers.initHandlersFromConfig created spellCheckCompRH1: org.apache.solr.handler.component.SearchHandler
[junit4:junit4]   2> 10405 T110 oasc.RequestHandlers.initHandlersFromConfig created tvrh: org.apache.solr.handler.component.SearchHandler
[junit4:junit4]   2> 10406 T110 oasc.RequestHandlers.initHandlersFromConfig created /mlt: solr.MoreLikeThisHandler
[junit4:junit4]   2> 10407 T110 oasc.RequestHandlers.initHandlersFromConfig created /debug/dump: solr.DumpRequestHandler
[junit4:junit4]   2> 10411 T110 oashl.XMLLoader.init xsltCacheLifetimeSeconds=60
[junit4:junit4]   2> 10416 T110 oasc.SolrCore.initDeprecatedSupport WARNING solrconfig.xml uses deprecated <admin/gettableFiles>, Please update your config to use the ShowFileRequestHandler.
[junit4:junit4]   2> 10418 T110 oasc.SolrCore.initDeprecatedSupport WARNING adding ShowFileRequestHandler with hidden files: [SCHEMA.XML, OLD_SYNONYMS.TXT, STOPWORDS.TXT, PROTWORDS.TXT, OPEN-EXCHANGE-RATES.JSON, SYNONYMS.TXT, CURRENCY.XML, MAPPING-ISOLATIN1ACCENT.TXT]
[junit4:junit4]   2> 10422 T110 oass.SolrIndexSearcher.<init> Opening Searcher@2ddf2690 main
[junit4:junit4]   2> 10423 T110 oasu.CommitTracker.<init> Hard AutoCommit: disabled
[junit4:junit4]   2> 10424 T110 oasu.CommitTracker.<init> Soft AutoCommit: disabled
[junit4:junit4]   2> 10425 T110 oashc.SpellCheckComponent.inform Initializing spell checkers
[junit4:junit4]   2> 10432 T110 oass.DirectSolrSpellChecker.init init: {name=direct,classname=DirectSolrSpellChecker,field=lowerfilt,minQueryLength=3}
[junit4:junit4]   2> 10485 T158 oasc.SolrCore.registerSearcher [collection1] Registered new searcher Searcher@2ddf2690 main{StandardDirectoryReader(segments_1:1)}
[junit4:junit4]   2> 10558 T132 oascc.ZkStateReader.updateClusterState Updating cloud state from ZooKeeper... 
[junit4:junit4]   2> 10577 T145 oascc.ZkStateReader$2.process A cluster state change has occurred - updating...
[junit4:junit4]   2> 10577 T157 oascc.ZkStateReader$2.process A cluster state change has occurred - updating...
[junit4:junit4]   2> 10577 T131 oascc.ZkStateReader$2.process A cluster state change has occurred - updating...
[junit4:junit4]   2> 10995 T110 oasc.CoreContainer.register registering core: collection1
[junit4:junit4]   2> 10995 T110 oasc.ZkController.register Register shard - core:collection1 address:http://127.0.0.1:39270/solr shardId:shard2
[junit4:junit4]   2> 10997 T110 oascc.SolrZkClient.makePath makePath: /collections/collection1/leader_elect/shard2/election
[junit4:junit4]   2> 11036 T115 oazs.PrepRequestProcessor.pRequest Got user-level KeeperException when processing sessionid:0x139cbbaec270004 type:delete cxid:0x41 zxid:0xfffffffffffffffe txntype:unknown reqpath:n/a Error Path:/solr/collections/collection1/leaders/shard2 Error:KeeperErrorCode = NoNode for /solr/collections/collection1/leaders/shard2
[junit4:junit4]   2> 11038 T110 oasc.ShardLeaderElectionContext.runLeaderProcess Running the leader process.
[junit4:junit4]   2> 11039 T115 oazs.PrepRequestProcessor.pRequest Got user-level KeeperException when processing sessionid:0x139cbbaec270004 type:create cxid:0x42 zxid:0xfffffffffffffffe txntype:unknown reqpath:n/a Error Path:/solr/overseer Error:KeeperErrorCode = NodeExists for /solr/overseer
[junit4:junit4]   2> 11048 T110 oasc.ShardLeaderElectionContext.waitForReplicasToComeUp Enough replicas found to continue.
[junit4:junit4]   2> 11049 T110 oasc.ShardLeaderElectionContext.runLeaderProcess I may be the new leader - try and sync
[junit4:junit4]   2> 11049 T110 oasc.SyncStrategy.sync Sync replicas to http://127.0.0.1:39270/solr/collection1/
[junit4:junit4]   2> 11050 T110 oasc.SyncStrategy.syncReplicas Sync Success - now sync replicas to me
[junit4:junit4]   2> 11051 T110 oasc.SyncStrategy.syncToMe http://127.0.0.1:39270/solr/collection1/ has no replicas
[junit4:junit4]   2> 11051 T110 oasc.ShardLeaderElectionContext.runLeaderProcess I am the new leader: http://127.0.0.1:39270/solr/collection1/
[junit4:junit4]   2> 11052 T110 oascc.SolrZkClient.makePath makePath: /collections/collection1/leaders/shard2
[junit4:junit4]   2> 11059 T115 oazs.PrepRequestProcessor.pRequest Got user-level KeeperException when processing sessionid:0x139cbbaec270004 type:create cxid:0x4b zxid:0xfffffffffffffffe txntype:unknown reqpath:n/a Error Path:/solr/overseer Error:KeeperErrorCode = NodeExists for /solr/overseer
[junit4:junit4]   2> 11084 T132 oascc.ZkStateReader.updateClusterState Updating cloud state from ZooKeeper... 
[junit4:junit4]   2> 11108 T131 oascc.ZkStateReader$2.process A cluster state change has occurred - updating...
[junit4:junit4]   2> 11109 T145 oascc.ZkStateReader$2.process A cluster state change has occurred - updating...
[junit4:junit4]   2> 11109 T157 oascc.ZkStateReader$2.process A cluster state change has occurred - updating...
[junit4:junit4]   2> 11115 T110 oasc.ZkController.register We are http://127.0.0.1:39270/solr/collection1/ and leader is http://127.0.0.1:39270/solr/collection1/
[junit4:junit4]   2> 11115 T110 oasc.ZkController.register No LogReplay needed for core=collection1 baseURL=http://127.0.0.1:39270/solr
[junit4:junit4]   2> 11116 T110 oasc.ZkController.checkRecovery I am the leader, no recovery necessary
[junit4:junit4]   2> 11122 T110 oascc.ZkStateReader.updateClusterState Updating cloud state from ZooKeeper... 
[junit4:junit4]   2> 11123 T110 oass.SolrDispatchFilter.init user.dir=/usr/home/hudson/hudson-slave/workspace/Lucene-Solr-Tests-4.x-Java6/solr/build/solr-core/test/J1
[junit4:junit4]   2> 11124 T110 oass.SolrDispatchFilter.init SolrDispatchFilter.init() done
[junit4:junit4]   2> 11124 T110 oascsi.HttpClientUtil.createClient Creating new http client, config:maxConnections=128&maxConnectionsPerHost=32&followRedirects=false
[junit4:junit4]   2> 11372 T110 oejs.Server.doStart jetty-8.1.2.v20120308
[junit4:junit4]   2> 11376 T110 oejs.AbstractConnector.doStart Started SocketConnector@0.0.0.0:39274
[junit4:junit4]   2> 11377 T110 oasc.SolrResourceLoader.locateSolrHome JNDI not configured for solr (NoInitialContextEx)
[junit4:junit4]   2> 11378 T110 oasc.SolrResourceLoader.locateSolrHome using system property solr.solr.home: /usr/home/hudson/hudson-slave/workspace/Lucene-Solr-Tests-4.x-Java6/solr/build/solr-core/test/J1/./solrtest-jetty3-1347742799416
[junit4:junit4]   2> 11379 T110 oasc.SolrResourceLoader.<init> new SolrResourceLoader for deduced Solr Home: '/usr/home/hudson/hudson-slave/workspace/Lucene-Solr-Tests-4.x-Java6/solr/build/solr-core/test/J1/./solrtest-jetty3-1347742799416/'
[junit4:junit4]   2> 11442 T110 oass.SolrDispatchFilter.init SolrDispatchFilter.init()
[junit4:junit4]   2> 11443 T110 oasc.SolrResourceLoader.locateSolrHome JNDI not configured for solr (NoInitialContextEx)
[junit4:junit4]   2> 11444 T110 oasc.SolrResourceLoader.locateSolrHome using system property solr.solr.home: /usr/home/hudson/hudson-slave/workspace/Lucene-Solr-Tests-4.x-Java6/solr/build/solr-core/test/J1/./solrtest-jetty3-1347742799416
[junit4:junit4]   2> 11444 T110 oasc.CoreContainer$Initializer.initialize looking for solr.xml: /usr/home/hudson/hudson-slave/workspace/Lucene-Solr-Tests-4.x-Java6/solr/build/solr-core/test/J1/./solrtest-jetty3-1347742799416/solr.xml
[junit4:junit4]   2> 11444 T110 oasc.CoreContainer.<init> New CoreContainer 1064561384
[junit4:junit4]   2> 11445 T110 oasc.CoreContainer.load Loading CoreContainer using Solr Home: '/usr/home/hudson/hudson-slave/workspace/Lucene-Solr-Tests-4.x-Java6/solr/build/solr-core/test/J1/./solrtest-jetty3-1347742799416/'
[junit4:junit4]   2> 11445 T110 oasc.SolrResourceLoader.<init> new SolrResourceLoader for directory: '/usr/home/hudson/hudson-slave/workspace/Lucene-Solr-Tests-4.x-Java6/solr/build/solr-core/test/J1/./solrtest-jetty3-1347742799416/'
[junit4:junit4]   2> 11479 T110 oasc.CoreContainer.load Registering Log Listener
[junit4:junit4]   2> 11496 T110 oasc.CoreContainer.initZooKeeper Zookeeper client=127.0.0.1:39260/solr
[junit4:junit4]   2> 11497 T110 oaz.ZooKeeper.<init> Initiating client connection, connectString=127.0.0.1:39260/solr sessionTimeout=5000 watcher=org.apache.solr.common.cloud.ConnectionManager@65a164c9
[junit4:junit4]   2> 11499 T168 oaz.ClientCnxn$SendThread.startConnect Opening socket connection to server /127.0.0.1:39260
[junit4:junit4]   2> 11499 T110 oascc.ConnectionManager.waitForConnected Waiting for client to connect to ZooKeeper
[junit4:junit4]   2> 11501 T168 oaz.ClientCnxn$SendThread.primeConnection Socket connection established to localhost/127.0.0.1:39260, initiating session
[junit4:junit4]   2> 11501 T112 oazs.NIOServerCnxn$Factory.run Accepted socket connection from /140.211.11.196:39275
[junit4:junit4]   2> 11502 T112 oazs.NIOServerCnxn.readConnectRequest Client attempting to establish new session at /140.211.11.196:39275
[junit4:junit4]   2> 11506 T114 oazs.NIOServerCnxn.finishSessionInit Established session 0x139cbbaec270005 with negotiated timeout 5000 for client /140.211.11.196:39275
[junit4:junit4]   2> 11506 T168 oaz.ClientCnxn$SendThread.readConnectResult Session establishment complete on server localhost/127.0.0.1:39260, sessionid = 0x139cbbaec270005, negotiated timeout = 5000
[junit4:junit4]   2> 11506 T169 oascc.ConnectionManager.process Watcher org.apache.solr.common.cloud.ConnectionManager@65a164c9 name:ZooKeeperConnection Watcher:127.0.0.1:39260/solr got event WatchedEvent state:SyncConnected type:None path:null path:null type:None
[junit4:junit4]   2> 11506 T110 oascc.ConnectionManager.waitForConnected Client is connected to ZooKeeper
[junit4:junit4]   2> 11508 T115 oazs.PrepRequestProcessor.pRequest Got user-level KeeperException when processing sessionid:0x139cbbaec270005 type:create cxid:0x1 zxid:0xfffffffffffffffe txntype:unknown reqpath:n/a Error Path:/solr/overseer Error:KeeperErrorCode = NodeExists for /solr/overseer
[junit4:junit4]   2> 11517 T115 oazs.PrepRequestProcessor.pRequest Got user-level KeeperException when processing sessionid:0x139cbbaec270005 type:create cxid:0x2 zxid:0xfffffffffffffffe txntype:unknown reqpath:n/a Error Path:/solr/overseer Error:KeeperErrorCode = NodeExists for /solr/overseer
[junit4:junit4]   2> 11519 T110 oasc.ZkController.createEphemeralLiveNode Register node as live in ZooKeeper:/live_nodes/127.0.0.1:39274_solr
[junit4:junit4]   2> 11521 T115 oazs.PrepRequestProcessor.pRequest Got user-level KeeperException when processing sessionid:0x139cbbaec270005 type:delete cxid:0x4 zxid:0xfffffffffffffffe txntype:unknown reqpath:n/a Error Path:/solr/live_nodes/127.0.0.1:39274_solr Error:KeeperErrorCode = NoNode for /solr/live_nodes/127.0.0.1:39274_solr
[junit4:junit4]   2> 11524 T110 oascc.SolrZkClient.makePath makePath: /live_nodes/127.0.0.1:39274_solr
[junit4:junit4]   2> 11528 T145 oascc.ZkStateReader$3.process Updating live nodes
[junit4:junit4]   2> 11528 T131 oascc.ZkStateReader$3.process Updating live nodes
[junit4:junit4]   2> 11528 T157 oascc.ZkStateReader$3.process Updating live nodes
[junit4:junit4]   2> 11530 T110 oashc.HttpShardHandlerFactory.getParameter Setting socketTimeout to: 0
[junit4:junit4]   2> 11531 T110 oashc.HttpShardHandlerFactory.getParameter Setting urlScheme to: http://
[junit4:junit4]   2> 11531 T110 oashc.HttpShardHandlerFactory.getParameter Setting connTimeout to: 0
[junit4:junit4]   2> 11532 T110 oashc.HttpShardHandlerFactory.getParameter Setting maxConnectionsPerHost to: 20
[junit4:junit4]   2> 11532 T110 oashc.HttpShardHandlerFactory.getParameter Setting corePoolSize to: 0
[junit4:junit4]   2> 11533 T110 oashc.HttpShardHandlerFactory.getParameter Setting maximumPoolSize to: 2147483647
[junit4:junit4]   2> 11533 T110 oashc.HttpShardHandlerFactory.getParameter Setting maxThreadIdleTime to: 5
[junit4:junit4]   2> 11534 T110 oashc.HttpShardHandlerFactory.getParameter Setting sizeOfQueue to: -1
[junit4:junit4]   2> 11535 T110 oashc.HttpShardHandlerFactory.getParameter Setting fairnessPolicy to: false
[junit4:junit4]   2> 11535 T110 oascsi.HttpClientUtil.createClient Creating new http client, config:maxConnectionsPerHost=20&maxConnections=10000&socketTimeout=0&connTimeout=0&retry=false
[junit4:junit4]   2> 11560 T110 oascc.ZkStateReader.createClusterStateWatchersAndUpdate Updating cluster state from ZooKeeper... 
[junit4:junit4]   2> 11572 T110 oasc.CoreContainer.create Creating SolrCore 'collection1' using instanceDir: /usr/home/hudson/hudson-slave/workspace/Lucene-Solr-Tests-4.x-Java6/solr/build/solr-core/test/J1/./solrtest-jetty3-1347742799416/collection1
[junit4:junit4]   2> 11573 T110 oasc.ZkController.createCollectionZkNode Check for collection zkNode:collection1
[junit4:junit4]   2> 11574 T110 oasc.ZkController.createCollectionZkNode Collection zkNode exists
[junit4:junit4]   2> 11575 T110 oasc.ZkController.readConfigName Load collection config from:/collections/collection1
[junit4:junit4]   2> 11580 T110 oasc.SolrResourceLoader.<init> new SolrResourceLoader for directory: '/usr/home/hudson/hudson-slave/workspace/Lucene-Solr-Tests-4.x-Java6/solr/build/solr-core/test/J1/./solrtest-jetty3-1347742799416/collection1/'
[junit4:junit4]   2> 11582 T110 oasc.SolrResourceLoader.replaceClassLoader Adding 'file:/usr/home/hudson/hudson-slave/workspace/Lucene-Solr-Tests-4.x-Java6/solr/build/solr-core/test/J1/solrtest-jetty3-1347742799416/collection1/lib/classes/' to classloader
[junit4:junit4]   2> 11583 T110 oasc.SolrResourceLoader.replaceClassLoader Adding 'file:/usr/home/hudson/hudson-slave/workspace/Lucene-Solr-Tests-4.x-Java6/solr/build/solr-core/test/J1/solrtest-jetty3-1347742799416/collection1/lib/README' to classloader
[junit4:junit4]   2> 11623 T132 oascc.ZkStateReader.updateClusterState Updating cloud state from ZooKeeper... 
[junit4:junit4]   2> 11637 T169 oascc.ZkStateReader$2.process A cluster state change has occurred - updating...
[junit4:junit4]   2> 11637 T157 oascc.ZkStateReader$2.process A cluster state change has occurred - updating...
[junit4:junit4]   2> 11637 T145 oascc.ZkStateReader$2.process A cluster state change has occurred - updating...
[junit4:junit4]   2> 11637 T131 oascc.ZkStateReader$2.process A cluster state change has occurred - updating...
[junit4:junit4]   2> 11655 T110 oasc.SolrConfig.<init> Using Lucene MatchVersion: LUCENE_40
[junit4:junit4]   2> 11740 T110 oasc.SolrConfig.<init> Loaded SolrConfig: solrconfig.xml
[junit4:junit4]   2> 11842 T110 oass.IndexSchema.readSchema Reading Solr Schema
[junit4:junit4]   2> 11854 T110 oass.IndexSchema.readSchema Schema name=test
[junit4:junit4]   2> 12638 T110 oass.OpenExchangeRatesOrgProvider.init Initialized with rates=open-exchange-rates.json, refreshInterval=1440.
[junit4:junit4]   2> 12650 T110 oass.IndexSchema.readSchema default search field in schema is text
[junit4:junit4]   2> 12655 T110 oass.IndexSchema.readSchema unique key field: id
[junit4:junit4]   2> 12686 T110 oass.FileExchangeRateProvider.reload Reloading exchange rates from file currency.xml
[junit4:junit4]   2> 12694 T110 oass.FileExchangeRateProvider.reload Reloading exchange rates from file currency.xml
[junit4:junit4]   2> 12703 T110 oass.OpenExchangeRatesOrgProvider.reload Reloading exchange rates from open-exchange-rates.json
[junit4:junit4]   2> 12707 T110 oass.OpenExchangeRatesOrgProvider.reload Reloading exchange rates from open-exchange-rates.json
[junit4:junit4]   2> 12714 T110 oasc.SolrCore.<init> [collection1] Opening new SolrCore at /usr/home/hudson/hudson-slave/workspace/Lucene-Solr-Tests-4.x-Java6/solr/build/solr-core/test/J1/./solrtest-jetty3-1347742799416/collection1/, dataDir=./org.apache.solr.cloud.BasicDistributedZk2Test-1347742788277/jetty3/
[junit4:junit4]   2> 12715 T110 oasc.JmxMonitoredMap.<init> JMX monitoring is enabled. Adding Solr mbeans to JMX Server: com.sun.jmx.mbeanserver.JmxMBeanServer@4ec1a0eb
[junit4:junit4]   2> 12718 T110 oasc.SolrCore.getNewIndexDir WARNING New index directory detected: old=null new=./org.apache.solr.cloud.BasicDistributedZk2Test-1347742788277/jetty3/index/
[junit4:junit4]   2> 12721 T110 oasc.SolrCore.initIndex WARNING [collection1] Solr index directory './org.apache.solr.cloud.BasicDistributedZk2Test-1347742788277/jetty3/index' doesn't exist. Creating new index...
[junit4:junit4]   2> 12723 T110 oasc.CachingDirectoryFactory.get return new directory for /usr/home/hudson/hudson-slave/workspace/Lucene-Solr-Tests-4.x-Java6/solr/build/solr-core/test/J1/./org.apache.solr.cloud.BasicDistributedZk2Test-1347742788277/jetty3/index forceNew:false
[junit4:junit4]   2> 12732 T110 oasc.SolrDeletionPolicy.onCommit SolrDeletionPolicy.onCommit: commits:num=1
[junit4:junit4]   2> 		commit{dir=NRTCachingDirectory(org.apache.lucene.store.NIOFSDirectory@/usr/home/hudson/hudson-slave/workspace/Lucene-Solr-Tests-4.x-Java6/solr/build/solr-core/test/J1/org.apache.solr.cloud.BasicDistributedZk2Test-1347742788277/jetty3/index lockFactory=org.apache.lucene.store.NativeFSLockFactory@3d55f8b; maxCacheMB=48.0 maxMergeSizeMB=4.0),segFN=segments_1,generation=1,filenames=[segments_1]
[junit4:junit4]   2> 12733 T110 oasc.SolrDeletionPolicy.updateCommits newest commit = 1
[junit4:junit4]   2> 12734 T110 oasc.SolrCore.initWriters created xml: solr.XMLResponseWriter
[junit4:junit4]   2> 12737 T110 oasup.UpdateRequestProcessorChain.init inserting DistributedUpdateProcessorFactory into updateRequestProcessorChain "dedupe"
[junit4:junit4]   2> 12738 T110 oasup.UpdateRequestProcessorChain.init inserting DistributedUpdateProcessorFactory into updateRequestProcessorChain "dedupe-allfields"
[junit4:junit4]   2> 12738 T110 oasup.UpdateRequestProcessorChain.init inserting DistributedUpdateProcessorFactory into updateRequestProcessorChain "stored_sig"
[junit4:junit4]   2> 12739 T110 oasup.UpdateRequestProcessorChain.init inserting DistributedUpdateProcessorFactory into updateRequestProcessorChain "uniq-fields"
[junit4:junit4]   2> 12740 T110 oasup.UpdateRequestProcessorChain.init inserting DistributedUpdateProcessorFactory into updateRequestProcessorChain "distrib-dup-test-chain-implicit"
[junit4:junit4]   2> 12740 T110 oasc.RequestHandlers.initHandlersFromConfig adding lazy requestHandler: solr.ReplicationHandler
[junit4:junit4]   2> 12741 T110 oasc.RequestHandlers.initHandlersFromConfig created /replication: solr.ReplicationHandler
[junit4:junit4]   2> 12742 T110 oasc.RequestHandlers.initHandlersFromConfig created standard: solr.StandardRequestHandler
[junit4:junit4]   2> 12743 T110 oasc.RequestHandlers.initHandlersFromConfig created /get: solr.RealTimeGetHandler
[junit4:junit4]   2> 12743 T110 oasc.RequestHandlers.initHandlersFromConfig created dismax: solr.SearchHandler
[junit4:junit4]   2> 12744 T110 oasc.RequestHandlers.initHandlersFromConfig created mock: org.apache.solr.core.MockQuerySenderListenerReqHandler
[junit4:junit4]   2> 12745 T110 oasc.RequestHandlers.initHandlersFromConfig created /admin/: org.apache.solr.handler.admin.AdminHandlers
[junit4:junit4]   2> 12746 T110 oasc.RequestHandlers.initHandlersFromConfig created defaults: solr.StandardRequestHandler
[junit4:junit4]   2> 12746 T110 oasc.RequestHandlers.initHandlersFromConfig adding lazy requestHandler: solr.StandardRequestHandler
[junit4:junit4]   2> 12747 T110 oasc.RequestHandlers.initHandlersFromConfig created lazy: solr.StandardRequestHandler
[junit4:junit4]   2> 12748 T110 oasc.RequestHandlers.initHandlersFromConfig created /update: solr.UpdateRequestHandler
[junit4:junit4]   2> 12748 T110 oasc.RequestHandlers.initHandlersFromConfig created /terms: org.apache.solr.handler.component.SearchHandler
[junit4:junit4]   2> 12750 T110 oasc.RequestHandlers.initHandlersFromConfig created spellCheckCompRH: org.apache.solr.handler.component.SearchHandler
[junit4:junit4]   2> 12751 T110 oasc.RequestHandlers.initHandlersFromConfig created spellCheckCompRH_Direct: org.apache.solr.handler.component.SearchHandler
[junit4:junit4]   2> 12752 T110 oasc.RequestHandlers.initHandlersFromConfig created spellCheckWithWordbreak: org.apache.solr.handler.component.SearchHandler
[junit4:junit4]   2> 12753 T110 oasc.RequestHandlers.initHandlersFromConfig created spellCheckWithWordbreak_Direct: org.apache.solr.handler.component.SearchHandler
[junit4:junit4]   2> 12754 T110 oasc.RequestHandlers.initHandlersFromConfig created spellCheckCompRH1: org.apache.solr.handler.component.SearchHandler
[junit4:junit4]   2> 12756 T110 oasc.RequestHandlers.initHandlersFromConfig created tvrh: org.apache.solr.handler.component.SearchHandler
[junit4:junit4]   2> 12757 T110 oasc.RequestHandlers.initHandlersFromConfig created /mlt: solr.MoreLikeThisHandler
[junit4:junit4]   2> 12758 T110 oasc.RequestHandlers.initHandlersFromConfig created /debug/dump: solr.DumpRequestHandler
[junit4:junit4]   2> 12764 T110 oashl.XMLLoader.init xsltCacheLifetimeSeconds=60
[junit4:junit4]   2> 12772 T110 oasc.SolrCore.initDeprecatedSupport WARNING solrconfig.xml uses deprecated <admin/gettableFiles>, Please update your config to use the ShowFileRequestHandler.
[junit4:junit4]   2> 12774 T110 oasc.SolrCore.initDeprecatedSupport WARNING adding ShowFileRequestHandler with hidden files: [SCHEMA.XML, OLD_SYNONYMS.TXT, STOPWORDS.TXT, PROTWORDS.TXT, OPEN-EXCHANGE-RATES.JSON, SYNONYMS.TXT, CURRENCY.XML, MAPPING-ISOLATIN1ACCENT.TXT]
[junit4:junit4]   2> 12781 T110 oass.SolrIndexSearcher.<init> Opening Searcher@21256598 main
[junit4:junit4]   2> 12783 T110 oasu.CommitTracker.<init> Hard AutoCommit: disabled
[junit4:junit4]   2> 12784 T110 oasu.CommitTracker.<init> Soft AutoCommit: disabled
[junit4:junit4]   2> 12785 T110 oashc.SpellCheckComponent.inform Initializing spell checkers
[junit4:junit4]   2> 12796 T110 oass.DirectSolrSpellChecker.init init: {name=direct,classname=DirectSolrSpellChecker,field=lowerfilt,minQueryLength=3}
[junit4:junit4]   2> 12859 T170 oasc.SolrCore.registerSearcher [collection1] Registered new searcher Searcher@21256598 main{StandardDirectoryReader(segments_1:1)}
[junit4:junit4]   2> 13152 T132 oascc.ZkStateReader.updateClusterState Updating cloud state from ZooKeeper... 
[junit4:junit4]   2> 13168 T145 oascc.ZkStateReader$2.process A cluster state change has occurred - updating...
[junit4:junit4]   2> 13169 T131 oascc.ZkStateReader$2.process A cluster state change has occurred - updating...
[junit4:junit4]   2> 13169 T169 oascc.ZkStateReader$2.process A cluster state change has occurred - updating...
[junit4:junit4]   2> 13169 T157 oascc.ZkStateReader$2.process A cluster state change has occurred - updating...
[junit4:junit4]   2> 13368 T110 oasc.CoreContainer.register registering core: collection1
[junit4:junit4]   2> 13369 T110 oasc.ZkController.register Register shard - core:collection1 address:http://127.0.0.1:39274/solr shardId:shard1
[junit4:junit4]   2> 13377 T110 oasc.ZkController.register We are http://127.0.0.1:39274/solr/collection1/ and leader is http://127.0.0.1:39268/solr/collection1/
[junit4:junit4]   2> 13389 T110 oasc.ZkController.register No LogReplay needed for core=collection1 baseURL=http://127.0.0.1:39274/solr
[junit4:junit4]   2> 13389 T110 oasc.ZkController.checkRecovery Core needs to recover:collection1
[junit4:junit4]   2> 13390 T110 oasu.DefaultSolrCoreState.doRecovery Running recovery - first canceling any ongoing recovery
[junit4:junit4]   2> ASYNC  NEW_CORE C22 name=collection1 org.apache.solr.core.SolrCore@4be7c107 url=http://127.0.0.1:39274/solr/collection1 node=127.0.0.1:39274_solr
[junit4:junit4]   2> 13408 T171 C22 P39274 oasc.RecoveryStrategy.run Starting recovery process.  core=collection1 recoveringAfterStartup=true
[junit4:junit4]   2> 13409 T171 C22 P39274 oasc.RecoveryStrategy.doRecovery ###### startupVersions=[]
[junit4:junit4]   2> 13409 T110 oascc.ZkStateReader.updateClusterState Updating cloud state from ZooKeeper... 
[junit4:junit4]   2> 13414 T171 C22 P39274 oasc.RecoveryStrategy.doRecovery Attempting to PeerSync from http://127.0.0.1:39268/solr/collection1/ core=collection1 - recoveringAfterStartup=true
[junit4:junit4]   2> 13415 T110 oass.SolrDispatchFilter.init user.dir=/usr/home/hudson/hudson-slave/workspace/Lucene-Solr-Tests-4.x-Java6/solr/build/solr-core/test/J1
[junit4:junit4]   2> 13416 T110 oass.SolrDispatchFilter.init SolrDispatchFilter.init() done
[junit4:junit4]   2> 13417 T110 oascsi.HttpClientUtil.createClient Creating new http client, config:maxConnections=128&maxConnectionsPerHost=32&followRedirects=false
[junit4:junit4]   2> 13430 T171 C22 P39274 oascsi.HttpClientUtil.createClient Creating new http client, config:maxConnectionsPerHost=20&maxConnections=10000&connTimeout=30000&socketTimeout=30000&retry=false
[junit4:junit4]   2> 13471 T171 C22 P39274 oasu.PeerSync.sync PeerSync: core=collection1 url=http://127.0.0.1:39274/solr START replicas=[http://127.0.0.1:39268/solr/collection1/] nUpdates=100
[junit4:junit4]   2> 13523 T171 C22 P39274 oasu.PeerSync.sync WARNING no frame of reference to tell of we've missed updates
[junit4:junit4]   2> 13539 T171 C22 P39274 oasc.RecoveryStrategy.doRecovery PeerSync Recovery was not successful - trying replication. core=collection1
[junit4:junit4]   2> 13539 T171 C22 P39274 oasc.RecoveryStrategy.doRecovery Starting Replication Recovery. core=collection1
[junit4:junit4]   2> 13540 T171 C22 P39274 oascsi.HttpClientUtil.createClient Creating new http client, config:maxConnections=128&maxConnectionsPerHost=32&followRedirects=false
[junit4:junit4]   2> 13676 T132 oascc.ZkStateReader.updateClusterState Updating cloud state from ZooKeeper... 
[junit4:junit4]   2> 13685 T145 oascc.ZkStateReader$2.process A cluster state change has occurred - updating...
[junit4:junit4]   2> 13685 T131 oascc.ZkStateReader$2.process A cluster state change has occurred - updating...
[junit4:junit4]   2> 13685 T157 oascc.ZkStateReader$2.process A cluster state change has occurred - updating...
[junit4:junit4]   2> 13685 T169 oascc.ZkStateReader$2.process A cluster state change has occurred - updating...
[junit4:junit4]   2> 13790 T110 oejs.Server.doStart jetty-8.1.2.v20120308
[junit4:junit4]   2> 13802 T110 oejs.AbstractConnector.doStart Started SocketConnector@0.0.0.0:39276
[junit4:junit4]   2> 13803 T110 oasc.SolrResourceLoader.locateSolrHome JNDI not configured for solr (NoInitialContextEx)
[junit4:junit4]   2> 13803 T110 oasc.SolrResourceLoader.locateSolrHome using system property solr.solr.home: /usr/home/hudson/hudson-slave/workspace/Lucene-Solr-Tests-4.x-Java6/solr/build/solr-core/test/J1/./solrtest-jetty4-1347742801707
[junit4:junit4]   2> 13804 T110 oasc.SolrResourceLoader.<init> new SolrResourceLoader for deduced Solr Home: '/usr/home/hudson/hudson-slave/workspace/Lucene-Solr-Tests-4.x-Java6/solr/build/solr-core/test/J1/./solrtest-jetty4-1347742801707/'
[junit4:junit4]   2> 14117 T110 oass.SolrDispatchFilter.init SolrDispatchFilter.init()
[junit4:junit4]   2> 14118 T110 oasc.SolrResourceLoader.locateSolrHome JNDI not configured for solr (NoInitialContextEx)
[junit4:junit4]   2> 14119 T110 oasc.SolrResourceLoader.locateSolrHome using system property solr.solr.home: /usr/home/hudson/hudson-slave/workspace/Lucene-Solr-Tests-4.x-Java6/solr/build/solr-core/test/J1/./solrtest-jetty4-1347742801707
[junit4:junit4]   2> 14119 T110 oasc.CoreContainer$Initializer.initialize looking for solr.xml: /usr/home/hudson/hudson-slave/workspace/Lucene-Solr-Tests-4.x-Java6/solr/build/solr-core/test/J1/./solrtest-jetty4-1347742801707/solr.xml
[junit4:junit4]   2> 14120 T110 oasc.CoreContainer.<init> New CoreContainer 1034620739
[junit4:junit4]   2> 14121 T110 oasc.CoreContainer.load Loading CoreContainer using Solr Home: '/usr/home/hudson/hudson-slave/workspace/Lucene-Solr-Tests-4.x-Java6/solr/build/solr-core/test/J1/./solrtest-jetty4-1347742801707/'
[junit4:junit4]   2> 14122 T110 oasc.SolrResourceLoader.<init> new SolrResourceLoader for directory: '/usr/home/hudson/hudson-slave/workspace/Lucene-Solr-Tests-4.x-Java6/solr/build/solr-core/test/J1/./solrtest-jetty4-1347742801707/'
[junit4:junit4]   2> 14490 T110 oasc.CoreContainer.load Registering Log Listener
[junit4:junit4]   2> 14642 T110 oasc.CoreContainer.initZooKeeper Zookeeper client=127.0.0.1:39260/solr
[junit4:junit4]   2> 14643 T110 oaz.ZooKeeper.<init> Initiating client connection, connectString=127.0.0.1:39260/solr sessionTimeout=5000 watcher=org.apache.solr.common.cloud.ConnectionManager@2c9a53a2
[junit4:junit4]   2> 14644 T182 oaz.ClientCnxn$SendThread.startConnect Opening socket connection to server /127.0.0.1:39260
[junit4:junit4]   2> 14644 T110 oascc.ConnectionManager.waitForConnected Waiting for client to connect to ZooKeeper
[junit4:junit4]   2> 14646 T182 oaz.ClientCnxn$SendThread.primeConnection Socket connection established to localhost/127.0.0.1:39260, initiating session
[junit4:junit4]   2> 14646 T112 oazs.NIOServerCnxn$Factory.run Accepted socket connection from /140.211.11.196:39279
[junit4:junit4]   2> 14647 T112 oazs.NIOServerCnxn.readConnectRequest Client attempting to establish new session at /140.211.11.196:39279
[junit4:junit4]   2> 14677 T114 oazs.NIOServerCnxn.finishSessionInit Established session 0x139cbbaec270006 with negotiated timeout 5000 for client /140.211.11.196:39279
[junit4:junit4]   2> 14677 T182 oaz.ClientCnxn$SendThread.readConnectResult Session establishment complete on server localhost/127.0.0.1:39260, sessionid = 0x139cbbaec270006, negotiated timeout = 5000
[junit4:junit4]   2> 14678 T183 oascc.ConnectionManager.process Watcher org.apache.solr.common.cloud.ConnectionManager@2c9a53a2 name:ZooKeeperConnection Watcher:127.0.0.1:39260/solr got event WatchedEvent state:SyncConnected type:None path:null path:null type:None
[junit4:junit4]   2> 14678 T110 oascc.ConnectionManager.waitForConnected Client is connected to ZooKeeper
[junit4:junit4]   2> 14680 T115 oazs.PrepRequestProcessor.pRequest Got user-level KeeperException when processing sessionid:0x139cbbaec270006 type:create cxid:0x1 zxid:0xfffffffffffffffe txntype:unknown reqpath:n/a Error Path:/solr/overseer Error:KeeperErrorCode = NodeExists for /solr/overseer
[junit4:junit4]   2> 14681 T115 oazs.PrepRequestProcessor.pRequest Got user-level KeeperException when processing sessionid:0x139cbbaec270006 type:create cxid:0x2 zxid:0xfffffffffffffffe txntype:unknown reqpath:n/a Error Path:/solr/overseer Error:KeeperErrorCode = NodeExists for /solr/overseer
[junit4:junit4]   2> 14683 T110 oasc.ZkController.createEphemeralLiveNode Register node as live in ZooKeeper:/live_nodes/127.0.0.1:39276_solr
[junit4:junit4]   2> 14684 T115 oazs.PrepRequestProcessor.pRequest Got user-level KeeperException when processing sessionid:0x139cbbaec270006 type:delete cxid:0x4 zxid:0xfffffffffffffffe txntype:unknown reqpath:n/a Error Path:/solr/live_nodes/127.0.0.1:39276_solr Error:KeeperErrorCode = NoNode for /solr/live_nodes/127.0.0.1:39276_solr
[junit4:junit4]   2> 14692 T110 oascc.SolrZkClient.makePath makePath: /live_nodes/127.0.0.1:39276_solr
[junit4:junit4]   2> 14696 T169 oascc.ZkStateReader$3.process Updating live nodes
[junit4:junit4]   2> 14696 T145 oascc.ZkStateReader$3.process Updating live nodes
[junit4:junit4]   2> 14696 T157 oascc.ZkStateReader$3.process Updating live nodes
[junit4:junit4]   2> 14696 T131 oascc.ZkStateReader$3.process Updating live nodes
[junit4:junit4]   2> 14699 T110 oashc.HttpShardHandlerFactory.getParameter Setting socketTimeout to: 0
[junit4:junit4]   2> 14700 T110 oashc.HttpShardHandlerFactory.getParameter Setting urlScheme to: http://
[junit4:junit4]   2> 14701 T110 oashc.HttpShardHandlerFactory.getParameter Setting connTimeout to: 0
[junit4:junit4]   2> 14701 T110 oashc.HttpShardHandlerFactory.getParameter Setting maxConnectionsPerHost to: 20
[junit4:junit4]   2> 14702 T110 oashc.HttpShardHandlerFactory.getParameter Setting corePoolSize to: 0
[junit4:junit4]   2> 14702 T110 oashc.HttpShardHandlerFactory.getParameter Setting maximumPoolSize to: 2147483647
[junit4:junit4]   2> 14703 T110 oashc.HttpShardHandlerFactory.getParameter Setting maxThreadIdleTime to: 5
[junit4:junit4]   2> 14703 T110 oashc.HttpShardHandlerFactory.getParameter Setting sizeOfQueue to: -1
[junit4:junit4]   2> 14704 T110 oashc.HttpShardHandlerFactory.getParameter Setting fairnessPolicy to: false
[junit4:junit4]   2> 14704 T110 oascsi.HttpClientUtil.createClient Creating new http client, config:maxConnectionsPerHost=20&maxConnections=10000&socketTimeout=0&connTimeout=0&retry=false
[junit4:junit4]   2> 14732 T110 oascc.ZkStateReader.createClusterStateWatchersAndUpdate Updating cluster state from ZooKeeper... 
[junit4:junit4]   2> 14791 T110 oasc.CoreContainer.create Creating SolrCore 'collection1' using instanceDir: /usr/home/hudson/hudson-slave/workspace/Lucene-Solr-Tests-4.x-Java6/solr/build/solr-core/test/J1/./solrtest-jetty4-1347742801707/collection1
[junit4:junit4]   2> 14792 T110 oasc.ZkController.createCollectionZkNode Check for collection zkNode:collection1
[junit4:junit4]   2> 14793 T110 oasc.ZkController.createCollectionZkNode Collection zkNode exists
[junit4:junit4]   2> 14794 T110 oasc.ZkController.readConfigName Load collection config from:/collections/collection1
[junit4:junit4]   2> 14797 T110 oasc.SolrResourceLoader.<init> new SolrResourceLoader for directory: '/usr/home/hudson/hudson-slave/workspace/Lucene-Solr-Tests-4.x-Java6/solr/build/solr-core/test/J1/./solrtest-jetty4-1347742801707/collection1/'
[junit4:junit4]   2> 14799 T110 oasc.SolrResourceLoader.replaceClassLoader Adding 'file:/usr/home/hudson/hudson-slave/workspace/Lucene-Solr-Tests-4.x-Java6/solr/build/solr-core/test/J1/solrtest-jetty4-1347742801707/collection1/lib/README' to classloader
[junit4:junit4]   2> 14800 T110 oasc.SolrResourceLoader.replaceClassLoader Adding 'file:/usr/home/hudson/hudson-slave/workspace/Lucene-Solr-Tests-4.x-Java6/solr/build/solr-core/test/J1/solrtest-jetty4-1347742801707/collection1/lib/classes/' to classloader
[junit4:junit4]   2> 15705 T110 oasc.SolrConfig.<init> Using Lucene MatchVersion: LUCENE_40
[junit4:junit4]   2> ASYNC  NEW_CORE C23 name=collection1 org.apache.solr.core.SolrCore@2c697b96 url=http://127.0.0.1:39268/solr/collection1 node=127.0.0.1:39268_solr
[junit4:junit4]   2> 15944 T138 C23 P39268 REQ /get {distrib=false&qt=/get&wt=javabin&version=2&getVersions=100} status=0 QTime=8 
[junit4:junit4]   2> 16149 T110 oasc.SolrConfig.<init> Loaded SolrConfig: solrconfig.xml
[junit4:junit4]   2> 16250 T110 oass.IndexSchema.readSchema Reading Solr Schema
[junit4:junit4]   2> 16262 T110 oass.IndexSchema.readSchema Schema name=test
[junit4:junit4]   2> 16772 T110 oass.OpenExchangeRatesOrgProvider.init Initialized with rates=open-exchange-rates.json, refreshInterval=1440.
[junit4:junit4]   2> 16781 T110 oass.IndexSchema.readSchema default search field in schema is text
[junit4:junit4]   2> 16784 T110 oass.IndexSchema.readSchema unique key field: id
[junit4:junit4]   2> 16808 T110 oass.FileExchangeRateProvider.reload Reloading exchange rates from file currency.xml
[junit4:junit4]   2> 16812 T110 oass.FileExchangeRateProvider.reload Reloading exchange rates from file currency.xml
[junit4:junit4]   2> 16816 T110 oass.OpenExchangeRatesOrgProvider.reload Reloading exchange rates from open-exchange-rates.json
[junit4:junit4]   2> 16819 T110 oass.OpenExchangeRatesOrgProvider.reload Reloading exchange rates from open-exchange-rates.json
[junit4:junit4]   2> 16821 T110 oasc.SolrCore.<init> [collection1] Opening new SolrCore at /usr/home/hudson/hudson-slave/workspace/Lucene-Solr-Tests-4.x-Java6/solr/build/solr-core/test/J1/./solrtest-jetty4-1347742801707/collection1/, dataDir=./org.apache.solr.cloud.BasicDistributedZk2Test-1347742788277/jetty4/
[junit4:junit4]   2> 16821 T110 oasc.JmxMonitoredMap.<init> JMX monitoring is enabled. Adding Solr mbeans to JMX Server: com.sun.jmx.mbeanserver.JmxMBeanServer@4ec1a0eb
[junit4:junit4]   2> 16822 T110 oasc.SolrCore.getNewIndexDir WARNING New index directory detected: old=null new=./org.apache.solr.cloud.BasicDistributedZk2Test-1347742788277/jetty4/index/
[junit4:junit4]   2> 16823 T110 oasc.SolrCore.initIndex WARNING [collection1] Solr index directory './org.apache.solr.cloud.BasicDistributedZk2Test-1347742788277/jetty4/index' doesn't exist. Creating new index...
[junit4:junit4]   2> 16824 T110 oasc.CachingDirectoryFactory.get return new directory for /usr/home/hudson/hudson-slave/workspace/Lucene-Solr-Tests-4.x-Java6/solr/build/solr-core/test/J1/./org.apache.solr.cloud.BasicDistributedZk2Test-1347742788277/jetty4/index forceNew:false
[junit4:junit4]   2> 16831 T110 oasc.SolrDeletionPolicy.onCommit SolrDeletionPolicy.onCommit: commits:num=1
[junit4:junit4]   2> 		commit{dir=NRTCachingDirectory(org.apache.lucene.store.NIOFSDirectory@/usr/home/hudson/hudson-slave/workspace/Lucene-Solr-Tests-4.x-Java6/solr/build/solr-core/test/J1/org.apache.solr.cloud.BasicDistributedZk2Test-1347742788277/jetty4/index lockFactory=org.apache.lucene.store.NativeFSLockFactory@2d787e42; maxCacheMB=48.0 maxMergeSizeMB=4.0),segFN=segments_1,generation=1,filenames=[segments_1]
[junit4:junit4]   2> 16831 T110 oasc.SolrDeletionPolicy.updateCommits newest commit = 1
[junit4:junit4]   2> 16832 T110 oasc.SolrCore.initWriters created xml: solr.XMLResponseWriter
[junit4:junit4]   2> 16834 T110 oasup.UpdateRequestProcessorChain.init inserting DistributedUpdateProcessorFactory into updateRequestProcessorChain "dedupe"
[junit4:junit4]   2> 16834 T110 oasup.UpdateRequestProcessorChain.init inserting DistributedUpdateProcessorFactory into updateRequestProcessorChain "dedupe-allfields"
[junit4:junit4]   2> 16835 T110 oasup.UpdateRequestProcessorChain.init inserting DistributedUpdateProcessorFactory into updateRequestProcessorChain "stored_sig"
[junit4:junit4]   2> 16835 T110 oasup.UpdateRequestProcessorChain.init inserting DistributedUpdateProcessorFactory into updateRequestProcessorChain "uniq-fields"
[junit4:junit4]   2> 16836 T110 oasup.UpdateRequestProcessorChain.init inserting DistributedUpdateProcessorFactory into updateRequestProcessorChain "distrib-dup-test-chain-implicit"
[junit4:junit4]   2> 16836 T110 oasc.RequestHandlers.initHandlersFromConfig adding lazy requestHandler: solr.ReplicationHandler
[junit4:junit4]   2> 16836 T110 oasc.RequestHandlers.initHandlersFromConfig created /replication: solr.ReplicationHandler
[junit4:junit4]   2> 16837 T110 oasc.RequestHandlers.initHandlersFromConfig created standard: solr.StandardRequestHandler
[junit4:junit4]   2> 16837 T110 oasc.RequestHandlers.initHandlersFromConfig created /get: solr.RealTimeGetHandler
[junit4:junit4]   2> 16838 T110 oasc.RequestHandlers.initHandlersFromConfig created dismax: solr.SearchHandler
[junit4:junit4]   2> 16838 T110 oasc.RequestHandlers.initHandlersFromConfig created mock: org.apache.solr.core.MockQuerySenderListenerReqHandler
[junit4:junit4]   2> 16839 T110 oasc.RequestHandlers.initHandlersFromConfig created /admin/: org.apache.solr.handler.admin.AdminHandlers
[junit4:junit4]   2> 16839 T110 oasc.RequestHandlers.initHandlersFromConfig created defaults: solr.StandardRequestHandler
[junit4:junit4]   2> 16840 T110 oasc.RequestHandlers.initHandlersFromConfig adding lazy requestHandler: solr.StandardRequestHandler
[junit4:junit4]   2> 16840 T110 oasc.RequestHandlers.initHandlersFromConfig created lazy: solr.StandardRequestHandler
[junit4:junit4]   2> 16841 T110 oasc.RequestHandlers.initHandlersFromConfig created /update: solr.UpdateRequestHandler
[junit4:junit4]   2> 16841 T110 oasc.RequestHandlers.initHandlersFromConfig created /terms: org.apache.solr.handler.component.SearchHandler
[junit4:junit4]   2> 16842 T110 oasc.RequestHandlers.initHandlersFromConfig created spellCheckCompRH: org.apache.solr.handler.component.SearchHandler
[junit4:junit4]   2> 16842 T110 oasc.RequestHandlers.initHandlersFromConfig created spellCheckCompRH_Direct: org.apache.solr.handler.component.SearchHandler
[junit4:junit4]   2> 16843 T110 oasc.RequestHandlers.initHandlersFromConfig created spellCheckWithWordbreak: org.apache.solr.handler.component.SearchHandler
[junit4:junit4]   2> 16843 T110 oasc.RequestHandlers.initHandlersFromConfig created spellCheckWithWordbreak_Direct: org.apache.solr.handler.component.SearchHandler
[junit4:junit4]   2> 16844 T110 oasc.RequestHandlers.initHandlersFromConfig created spellCheckCompRH1: org.apache.solr.handler.component.SearchHandler
[junit4:junit4]   2> 16844 T110 oasc.RequestHandlers.initHandlersFromConfig created tvrh: org.apache.solr.handler.component.SearchHandler
[junit4:junit4]   2> 16845 T110 oasc.RequestHandlers.initHandlersFromConfig created /mlt: solr.MoreLikeThisHandler
[junit4:junit4]   2> 16846 T110 oasc.RequestHandlers.initHandlersFromConfig created /debug/dump: solr.DumpRequestHandler
[junit4:junit4]   2> 16848 T110 oashl.XMLLoader.init xsltCacheLifetimeSeconds=60
[junit4:junit4]   2> 16852 T110 oasc.SolrCore.initDeprecatedSupport WARNING solrconfig.xml uses deprecated <admin/gettableFiles>, Please update your config to use the ShowFileRequestHandler.
[junit4:junit4]   2> 16853 T110 oasc.SolrCore.initDeprecatedSupport WARNING adding ShowFileRequestHandler with hidden files: [SCHEMA.XML, OLD_SYNONYMS.TXT, STOPWORDS.TXT, PROTWORDS.TXT, OPEN-EXCHANGE-RATES.JSON, SYNONYMS.TXT, CURRENCY.XML, MAPPING-ISOLATIN1ACCENT.TXT]
[junit4:junit4]   2> 16856 T110 oass.SolrIndexSearcher.<init> Opening Searcher@7e670aa5 main
[junit4:junit4]   2> 16857 T110 oasu.CommitTracker.<init> Hard AutoCommit: disabled
[junit4:junit4]   2> 16858 T110 oasu.CommitTracker.<init> Soft AutoCommit: disabled
[junit4:junit4]   2> 16858 T110 oashc.SpellCheckComponent.inform Initializing spell checkers
[junit4:junit4]   2> 16864 T110 oass.DirectSolrSpellChecker.init init: {name=direct,classname=DirectSolrSpellChecker,field=lowerfilt,minQueryLength=3}
[junit4:junit4]   2> 16907 T184 oasc.SolrCore.registerSearcher [collection1] Registered new searcher Searcher@7e670aa5 main{StandardDirectoryReader(segments_1:1)}
[junit4:junit4]   2> 17213 T132 oascc.ZkStateReader.updateClusterState Updating cloud state from ZooKeeper... 
[junit4:junit4]   2> 17233 T183 oascc.ZkStateReader$2.process A cluster state change has occurred - updating...
[junit4:junit4]   2> 17233 T169 oascc.ZkStateReader$2.process A cluster state change has occurred - updating...
[junit4:junit4]   2> 17233 T157 oascc.ZkStateReader$2.process A cluster state change has occurred - updating...
[junit4:junit4]   2> 17233 T131 oascc.ZkStateReader$2.process A cluster state change has occurred - updating...
[junit4:junit4]   2> 17233 T145 oascc.ZkStateReader$2.process A cluster state change has occurred - updating...
[junit4:junit4]   2> 17414 T110 oasc.CoreContainer.register registering core: collection1
[junit4:junit4]   2> 17414 T110 oasc.ZkController.register Register shard - core:collection1 address:http://127.0.0.1:39276/solr shardId:shard2
[junit4:junit4]   2> 17418 T110 oasc.ZkController.register We are http://127.0.0.1:39276/solr/collection1/ and leader is http://127.0.0.1:39270/solr/collection1/
[junit4:junit4]   2> 17418 T110 oasc.ZkController.register No LogReplay needed for core=collection1 baseURL=http://127.0.0.1:39276/solr
[junit4:junit4]   2> 17418 T110 oasc.ZkController.checkRecovery Core needs to recover:collection1
[junit4:junit4]   2> 17418 T110 oasu.DefaultSolrCoreState.doRecovery Running recovery - first canceling any ongoing recovery
[junit4:junit4]   2> ASYNC  NEW_CORE C24 name=collection1 org.apache.solr.core.SolrCore@5fdfe2da url=http://127.0.0.1:39276/solr/collection1 node=127.0.0.1:39276_solr
[junit4:junit4]   2> 17422 T185 C24 P39276 oasc.RecoveryStrategy.run Starting recovery process.  core=collection1 recoveringAfterStartup=true
[junit4:junit4]   2> 17422 T185 C24 P39276 oasc.RecoveryStrategy.doRecovery ###### startupVersions=[]
[junit4:junit4]   2> 17422 T110 oascc.ZkStateReader.updateClusterState Updating cloud state from ZooKeeper... 
[junit4:junit4]   2> 17424 T185 C24 P39276 oasc.RecoveryStrategy.doRecovery Attempting to PeerSync from http://127.0.0.1:39270/solr/collection1/ core=collection1 - recoveringAfterStartup=true
[junit4:junit4]   2> 17424 T185 C24 P39276 oasu.PeerSync.sync PeerSync: core=collection1 url=http://127.0.0.1:39276/solr START replicas=[http://127.0.0.1:39270/solr/collection1/] nUpdates=100
[junit4:junit4]   2> 17424 T110 oass.SolrDispatchFilter.init user.dir=/usr/home/hudson/hudson-slave/workspace/Lucene-Solr-Tests-4.x-Java6/solr/build/solr-core/test/J1
[junit4:junit4]   2> 17424 T185 C24 P39276 oasu.PeerSync.sync WARNING no frame of reference to tell of we've missed updates
[junit4:junit4]   2> 17424 T110 oass.SolrDispatchFilter.init SolrDispatchFilter.init() done
[junit4:junit4]   2> 17425 T185 C24 P39276 oasc.RecoveryStrategy.doRecovery PeerSync Recovery was not successful - trying replication. core=collection1
[junit4:junit4]   2> 17425 T110 oascsi.HttpClientUtil.createClient Creating new http client, config:maxConnections=128&maxConnectionsPerHost=32&followRedirects=false
[junit4:junit4]   2> 17425 T185 C24 P39276 oasc.RecoveryStrategy.doRecovery Starting Replication Recovery. core=collection1
[junit4:junit4]   2> 17426 T185 C24 P39276 oascsi.HttpClientUtil.createClient Creating new http client, config:maxConnections=128&maxConnectionsPerHost=32&followRedirects=false
[junit4:junit4]   2> ASYNC  NEW_CORE C25 name=collection1 org.apache.solr.core.SolrCore@116d1bc0 url=http://127.0.0.1:39270/solr/collection1 node=127.0.0.1:39270_solr
[junit4:junit4]   2> 17432 T149 C25 P39270 REQ /get {distrib=false&qt=/get&wt=javabin&version=2&getVersions=100} status=0 QTime=0 
[junit4:junit4]   2> 17442 T110 oaz.ZooKeeper.<init> Initiating client connection, connectString=127.0.0.1:39260/solr sessionTimeout=10000 watcher=org.apache.solr.common.cloud.ConnectionManager@2c16e68f
[junit4:junit4]   2> 17443 T187 oaz.ClientCnxn$SendThread.startConnect Opening socket connection to server /127.0.0.1:39260
[junit4:junit4]   2> 17443 T110 oascc.ConnectionManager.waitForConnected Waiting for client to connect to ZooKeeper
[junit4:junit4]   2> 17443 T187 oaz.ClientCnxn$SendThread.primeConnection Socket connection established to localhost/127.0.0.1:39260, initiating session
[junit4:junit4]   2> 17444 T112 oazs.NIOServerCnxn$Factory.run Accepted socket connection from /140.211.11.196:39285
[junit4:junit4]   2> 17444 T112 oazs.NIOServerCnxn.readConnectRequest Client attempting to establish new session at /140.211.11.196:39285
[junit4:junit4]   2> 17445 T114 oazs.NIOServerCnxn.finishSessionInit Established session 0x139cbbaec270007 with negotiated timeout 10000 for client /140.211.11.196:39285
[junit4:junit4]   2> 17446 T187 oaz.ClientCnxn$SendThread.readConnectResult Session establishment complete on server localhost/127.0.0.1:39260, sessionid = 0x139cbbaec270007, negotiated timeout = 10000
[junit4:junit4]   2> 17446 T188 oascc.ConnectionManager.process Watcher org.apache.solr.common.cloud.ConnectionManager@2c16e68f name:ZooKeeperConnection Watcher:127.0.0.1:39260/solr got event WatchedEvent state:SyncConnected type:None path:null path:null type:None
[junit4:junit4]   2> 17446 T110 oascc.ConnectionManager.waitForConnected Client is connected to ZooKeeper
[junit4:junit4]   2> 17447 T110 oascc.ZkStateReader.createClusterStateWatchersAndUpdate Updating cluster state from ZooKeeper... 
[junit4:junit4]   2> 17450 T110 oasc.ChaosMonkey.monkeyLog monkey: init - expire sessions:true cause connection loss:true
[junit4:junit4]   2> 17451 T110 oascsi.HttpClientUtil.createClient Creating new http client, config:
[junit4:junit4]   2> 17460 T110 oascc.ZkStateReader.updateClusterState Updating cloud state from ZooKeeper... 
[junit4:junit4]   2> ASYNC  NEW_CORE C26 name=collection1 org.apache.solr.core.SolrCore@3513ee76 url=http://127.0.0.1:39263/solr/collection1 node=127.0.0.1:39263_solr
[junit4:junit4]   2> 17525 T123 C26 P39263 oascsi.HttpClientUtil.createClient Creating new http client, config:maxConnections=500&maxConnectionsPerHost=16
[junit4:junit4]   2> 17557 T123 C26 P39263 oasc.SolrDeletionPolicy.onInit SolrDeletionPolicy.onInit: commits:num=1
[junit4:junit4]   2> 		commit{dir=NRTCachingDirectory(org.apache.lucene.store.NIOFSDirectory@/usr/home/hudson/hudson-slave/workspace/Lucene-Solr-Tests-4.x-Java6/solr/build/solr-core/test/J1/org.apache.solr.cloud.BasicDistributedZk2Test-1347742788277/control/data/index lockFactory=org.apache.lucene.store.NativeFSLockFactory@735e0463; maxCacheMB=48.0 maxMergeSizeMB=4.0),segFN=segments_1,generation=1,filenames=[segments_1]
[junit4:junit4]   2> 17558 T123 C26 P39263 oasc.SolrDeletionPolicy.updateCommits newest commit = 1
[junit4:junit4]   2> 17581 T123 C26 P39263 /update {wt=javabin&version=2} {add=[1 (1413210760362852352)]} 0 65
[junit4:junit4]   2> 17582 T110 oaz.ZooKeeper.<init> Initiating client connection, connectString=127.0.0.1:39260/solr sessionTimeout=10000 watcher=org.apache.solr.common.cloud.ConnectionManager@239fe6ec
[junit4:junit4]   2> 17583 T189 oaz.ClientCnxn$SendThread.startConnect Opening socket connection to server /127.0.0.1:39260
[junit4:junit4]   2> 17583 T110 oascc.ConnectionManager.waitForConnected Waiting for client to connect to ZooKeeper
[junit4:junit4]   2> 17584 T189 oaz.ClientCnxn$SendThread.primeConnection Socket connection established to localhost/127.0.0.1:39260, initiating session
[junit4:junit4]   2> 17585 T112 oazs.NIOServerCnxn$Factory.run Accepted socket connection from /140.211.11.196:39287
[junit4:junit4]   2> 17585 T112 oazs.NIOServerCnxn.readConnectRequest Client attempting to establish new session at /140.211.11.196:39287
[junit4:junit4]   2> 17586 T114 oazs.NIOServerCnxn.finishSessionInit Established session 0x139cbbaec270008 with negotiated timeout 10000 for client /140.211.11.196:39287
[junit4:junit4]   2> 17586 T189 oaz.ClientCnxn$SendThread.readConnectResult Session establishment complete on server localhost/127.0.0.1:39260, sessionid = 0x139cbbaec270008, negotiated timeout = 10000
[junit4:junit4]   2> 17587 T190 oascc.ConnectionManager.process Watcher org.apache.solr.common.cloud.ConnectionManager@239fe6ec name:ZooKeeperConnection Watcher:127.0.0.1:39260/solr got event WatchedEvent state:SyncConnected type:None path:null path:null type:None
[junit4:junit4]   2> 17587 T110 oascc.ConnectionManager.waitForConnected Client is connected to ZooKeeper
[junit4:junit4]   2> 17588 T110 oascc.ZkStateReader.createClusterStateWatchersAndUpdate Updating cluster state from ZooKeeper... 
[junit4:junit4]   2> 17647 T139 C23 P39268 oasc.SolrDeletionPolicy.onInit SolrDeletionPolicy.onInit: commits:num=1
[junit4:junit4]   2> 		commit{dir=NRTCachingDirectory(org.apache.lucene.store.NIOFSDirectory@/usr/home/hudson/hudson-slave/workspace/Lucene-Solr-Tests-4.x-Java6/solr/build/solr-core/test/J1/org.apache.solr.cloud.BasicDistributedZk2Test-1347742788277/jetty1/index lockFactory=org.apache.lucene.store.NativeFSLockFactory@2c85ebfd; maxCacheMB=48.0 maxMergeSizeMB=4.0),segFN=segments_1,generation=1,filenames=[segments_1]
[junit4:junit4]   2> 17647 T139 C23 P39268 oasc.SolrDeletionPolicy.updateCommits newest commit = 1
[junit4:junit4]   2>  C22_STATE=coll:collection1 core:collection1 props:{shard=shard1, roles=null, state=recovering, core=collection1, collection=collection1, node_name=127.0.0.1:39274_solr, base_url=http://127.0.0.1:39274/solr}
[junit4:junit4]   2> 17664 T161 C22 P39274 oasc.SolrDeletionPolicy.onInit SolrDeletionPolicy.onInit: commits:num=1
[junit4:junit4]   2> 		commit{dir=NRTCachingDirectory(org.apache.lucene.store.NIOFSDirectory@/usr/home/hudson/hudson-slave/workspace/Lucene-Solr-Tests-4.x-Java6/solr/build/solr-core/test/J1/org.apache.solr.cloud.BasicDistributedZk2Test-1347742788277/jetty3/index lockFactory=org.apache.lucene.store.NativeFSLockFactory@3d55f8b; maxCacheMB=48.0 maxMergeSizeMB=4.0),segFN=segments_1,generation=1,filenames=[segments_1]
[junit4:junit4]   2> 17664 T161 C22 P39274 oasc.SolrDeletionPolicy.updateCommits newest commit = 1
[junit4:junit4]   2> 17669 T161 C22 P39274 REQ /update {update.distrib=FROMLEADER&distrib.from=http://127.0.0.1:39268/solr/collection1/&wt=javabin&version=2} status=0 QTime=9 
[junit4:junit4]   2> 17670 T139 C23 P39268 REQ /update {distrib.from=http://127.0.0.1:39270/solr/collection1/&update.distrib=TOLEADER&wt=javabin&version=2} status=0 QTime=27 
[junit4:junit4]   2> 17670 T151 C25 P39270 /update {wt=javabin&version=2} {add=[1]} 0 70
[junit4:junit4]   2> 17671 T110 oasc.AbstractDistribZkTestBase.waitForRecoveriesToFinish Wait for recoveries to finish - collection: collection1 failOnTimeout:true timeout (sec):1800
[junit4:junit4]   2> 17672 T110 oascc.ZkStateReader.updateClusterState Updating cloud state from ZooKeeper... 
[junit4:junit4]   2> 17738 T132 oascc.ZkStateReader.updateClusterState Updating cloud state from ZooKeeper... 
[junit4:junit4]   2> 17750 T183 oascc.ZkStateReader$2.process A cluster state change has occurred - updating...
[junit4:junit4]   2> 17750 T131 oascc.ZkStateReader$2.process A cluster state change has occurred - updating...
[junit4:junit4]   2> 17750 T188 oascc.ZkStateReader$2.process A cluster state change has occurred - updating...
[junit4:junit4]   2> 17750 T157 oascc.ZkStateReader$2.process A cluster state change has occurred - updating...
[junit4:junit4]   2> 17750 T169 oascc.ZkStateReader$2.process A cluster state change has occurred - updating...
[junit4:junit4]   2> 17751 T190 oascc.ZkStateReader$2.process A cluster state change has occurred - updating...
[junit4:junit4]   2> 17750 T145 oascc.ZkStateReader$2.process A cluster state change has occurred - updating...
[junit4:junit4]   2> 18166 T171 C22 P39274 oasc.RecoveryStrategy.doRecovery Begin buffering updates. core=collection1
[junit4:junit4]   2> 18166 T171 C22 P39274 oasu.UpdateLog.bufferUpdates Starting to buffer updates. FSUpdateLog{state=ACTIVE, tlog=tlog{file=./org.apache.solr.cloud.BasicDistributedZk2Test-1347742788277/jetty3/tlog/tlog.0000000000000000000 refcount=1}}
[junit4:junit4]   2> 18166 T171 C22 P39274 oasc.RecoveryStrategy.replicate Attempting to replicate from http://127.0.0.1:39268/solr/collection1/. core=collection1
[junit4:junit4]   2> 18166 T171 C22 P39274 oascsi.HttpClientUtil.createClient Creating new http client, config:maxConnections=128&maxConnectionsPerHost=32&followRedirects=false
[junit4:junit4]   2> 18185 T140 C23 P39268 oasu.DirectUpdateHandler2.commit start commit{flags=0,_version_=0,optimize=false,openSearcher=true,waitSearcher=true,expungeDeletes=false,softCommit=false}
[junit4:junit4]   2> 18334 T140 C23 P39268 oasc.SolrDeletionPolicy.onCommit SolrDeletionPolicy.onCommit: commits:num=2
[junit4:junit4]   2> 		commit{dir=NRTCachingDirectory(org.apache.lucene.store.NIOFSDirectory@/usr/home/hudson/hudson-slave/workspace/Lucene-Solr-Tests-4.x-Java6/solr/build/solr-core/test/J1/org.apache.solr.cloud.BasicDistributedZk2Test-1347742788277/jetty1/index lockFactory=org.apache.lucene.store.NativeFSLockFactory@2c85ebfd; maxCacheMB=48.0 maxMergeSizeMB=4.0),segFN=segments_1,generation=1,filenames=[segments_1]
[junit4:junit4]   2> 		commit{dir=NRTCachingDirectory(org.apache.lucene.store.NIOFSDirectory@/usr/home/hudson/hudson-slave/workspace/Lucene-Solr-Tests-4.x-Java6/solr/build/solr-core/test/J1/org.apache.solr.cloud.BasicDistributedZk2Test-1347742788277/jetty1/index lockFactory=org.apache.lucene.store.NativeFSLockFactory@2c85ebfd; maxCacheMB=48.0 maxMergeSizeMB=4.0),segFN=segments_2,generation=2,filenames=[_0_MockSep_0.pos, _0_MockVariableIntBlock_0.doc, _0_MockVariableIntBlock_0.skp, _0_Pulsing40_0.prx, _0_NestedPulsing_0.tip, _0_Pulsing40_0.frq, _0_NestedPulsing_0.tim, _0_MockVariableIntBlock_0.pyl, _0_MockVariableIntBlock_0.tib, _0_MockSep_0.skp, _0_Pulsing40_0.tip, _0_MockVariableIntBlock_0.pos, _0_MockSep_0.doc, _0.si, _0_MockVariableIntBlock_0.tii, _0.fnm, _0_Pulsing40_0.tim, _0_NestedPulsing_0.frq, _0_nrm.cfs, _0_NestedPulsing_0.prx, _0_MockSep_0.tib, _0_nrm.cfe, _0_MockVariableIntBlock_0.frq, segments_2, _0_MockSep_0.frq, _0.fdx, _0_MockSep_0.tii, _0_MockSep_0.pyl, _0.fdt]
[junit4:junit4]   2> 18335 T140 C23 P39268 oasc.SolrDeletionPolicy.updateCommits newest commit = 2
[junit4:junit4]   2> 18376 T140 C23 P39268 oass.SolrIndexSearcher.<init> Opening Searcher@26ff158 main
[junit4:junit4]   2> 18378 T140 C23 P39268 oasu.DirectUpdateHandler2.commit end_commit_flush
[junit4:junit4]   2> 18379 T146 oasc.SolrCore.registerSearcher [collection1] Registered new searcher Searcher@26ff158 main{StandardDirectoryReader(segments_2:3 _0(4.0.0.2):C1)}
[junit4:junit4]   2> 18380 T140 C23 P39268 /update {waitSearcher=true&commit=true&commit_end_point=true&wt=javabin&softCommit=false&version=2} {commit=} 0 195
[junit4:junit4]   2> 18435 T171 C22 P39274 oash.ReplicationHandler.inform Commits will be reserved for  10000
[junit4:junit4]   2> 18436 T171 C22 P39274 oascsi.HttpClientUtil.createClient Creating new http client, config:connTimeout=5000&socketTimeout=20000&allowCompression=false&maxConnections=10000&maxConnectionsPerHost=10000
[junit4:junit4]   2> 18465 T171 C22 P39274 oash.SnapPuller.<init>  No value set for 'pollInterval'. Timer Task not started.
[junit4:junit4]   2> 18521 T141 C23 P39268 oash.ReplicationHandler.inform Commits will be reserved for  10000
[junit4:junit4]   2> 18522 T141 C23 P39268 REQ /replication {command=indexversion&wt=javabin&qt=/replication&version=2} status=0 QTime=53 
[junit4:junit4]   2> 18523 T171 C22 P39274 oash.SnapPuller.fetchLatestIndex Master's generation: 2
[junit4:junit4]   2> 18523 T171 C22 P39274 oash.SnapPuller.fetchLatestIndex Slave's generation: 1
[junit4:junit4]   2> 18523 T171 C22 P39274 oash.SnapPuller.fetchLatestIndex Starting replication process
[junit4:junit4]   2> 18536 T141 C23 P39268 REQ /replication {command=filelist&generation=2&wt=javabin&qt=/replication&version=2} status=0 QTime=10 
[junit4:junit4]   2> 18538 T171 C22 P39274 oash.SnapPuller.fetchLatestIndex Number of files in latest index in master: 29
[junit4:junit4]   2> 18545 T171 C22 P39274 oash.SnapPuller.fetchLatestIndex Starting download to ./org.apache.solr.cloud.BasicDistributedZk2Test-1347742788277/jetty3/index.20120915220006811 fullCopy=true
[junit4:junit4]   2> 18558 T141 C23 P39268 REQ /replication {file=_0_MockSep_0.pos&command=filecontent&checksum=true&generation=2&qt=/replication&wt=filestream} status=0 QTime=6 
[junit4:junit4]   2> 18576 T141 C23 P39268 REQ /replication {file=_0_MockVariableIntBlock_0.doc&command=filecontent&checksum=true&generation=2&qt=/replication&wt=filestream} status=0 QTime=0 
[junit4:junit4]   2> 18582 T141 C23 P39268 REQ /replication {file=_0_MockVariableIntBlock_0.skp&command=filecontent&checksum=true&generation=2&qt=/replication&wt=filestream} status=0 QTime=1 
[junit4:junit4]   2> 18583 T171 C22 P39274 oash.SnapPuller$FileFetcher.fetchPackets WARNING No content recieved for file: {name=_0_MockVariableIntBlock_0.skp, lastmodified=1347742806000, size=0}
[junit4:junit4]   2> 18587 T141 C23 P39268 REQ /replication {file=_0_NestedPulsing_0.tip&command=filecontent&checksum=true&generation=2&qt=/replication&wt=filestream} status=0 QTime=0 
[junit4:junit4]   2> 18593 T141 C23 P39268 REQ /replication {file=_0_Pulsing40_0.prx&command=filecontent&checksum=true&generation=2&qt=/replication&wt=filestream} status=0 QTime=1 
[junit4:junit4]   2> 18597 T141 C23 P39268 REQ /replication {file=_0_Pulsing40_0.frq&command=filecontent&checksum=true&generation=2&qt=/replication&wt=filestream} status=0 QTime=0 
[junit4:junit4]   2> 18603 T141 C23 P39268 REQ /replication {file=_0_NestedPulsing_0.tim&command=filecontent&checksum=true&generation=2&qt=/replication&wt=filestream} status=0 QTime=1 
[junit4:junit4]   2> 18607 T141 C23 P39268 REQ /replication {file=_0_MockVariableIntBlock_0.pyl&command=filecontent&checksum=true&generation=2&qt=/replication&wt=filestream} status=0 QTime=0 
[junit4:junit4]   2> 18609 T171 C22 P39274 oash.SnapPuller$FileFetcher.fetchPackets WARNING No content recieved for file: {name=_0_MockVariableIntBlock_0.pyl, lastmodified=1347742806000, size=0}
[junit4:junit4]   2> 18612 T141 C23 P39268 REQ /replication {file=_0_MockSep_0.skp&command=filecontent&checksum=true&generation=2&qt=/replication&wt=filestream} status=0 QTime=0 
[junit4:junit4]   2> 18614 T171 C22 P39274 oash.SnapPuller$FileFetcher.fetchPackets WARNING No content recieved for file: {name=_0_MockSep_0.skp, lastmodified=1347742806000, size=0}
[junit4:junit4]   2> 18617 T141 C23 P39268 REQ /replication {file=_0_MockVariableIntBlock_0.tib&command=filecontent&checksum=true&generation=2&qt=/replication&wt=filestream} status=0 QTime=0 
[junit4:junit4]   2> 18622 T141 C23 P39268 REQ /replication {file=_0_MockVariableIntBlock_0.pos&command=filecontent&checksum=true&generation=2&qt=/replication&wt=filestream} status=0 QTime=0 
[junit4:junit4]   2> 18644 T141 C23 P39268 REQ /replication {file=_0_Pulsing40_0.tip&command=filecontent&checksum=true&generation=2&qt=/replication&wt=filestream} status=0 QTime=1 
[junit4:junit4]   2> 18648 T141 C23 P39268 REQ /replication {file=_0.si&command=filecontent&checksum=true&generation=2&qt=/replication&wt=filestream} status=0 QTime=0 
[junit4:junit4]   2> 18653 T141 C23 P39268 REQ /replication {file=_0_MockSep_0.doc&command=filecontent&checksum=true&generation=2&qt=/replication&wt=filestream} status=0 QTime=0 
[junit4:junit4]   2> 18657 T141 C23 P39268 REQ /replication {file=_0_MockVariableIntBlock_0.tii&command=filecontent&checksum=true&generation=2&qt=/replication&wt=filestream} status=0 QTime=0 
[junit4:junit4]   2> 18662 T141 C23 P39268 REQ /replication {file=_0_Pulsing40_0.tim&command=filecontent&checksum=true&generation=2&qt=/replication&wt=filestream} status=0 QTime=0 
[junit4:junit4]   2> 18667 T141 C23 P39268 REQ /replication {file=_0.fnm&command=filecontent&checksum=true&generation=2&qt=/replication&wt=filestream} status=0 QTime=0 
[junit4:junit4]   2> 18671 T141 C23 P39268 REQ /replication {file=_0_NestedPulsing_0.frq&command=filecontent&checksum=true&generation=2&qt=/replication&wt=filestream} status=0 QTime=0 
[junit4:junit4]   2> 18674 T110 oascc.ZkStateReader.updateClusterState Updating cloud state from ZooKeeper... 
[junit4:junit4]   2> 18675 T141 C23 P39268 REQ /replication {file=_0_nrm.cfs&command=filecontent&checksum=true&generation=2&qt=/replication&wt=filestream} status=0 QTime=0 
[junit4:junit4]   2> 18679 T141 C23 P39268 REQ /replication {file=_0_NestedPulsing_0.prx&command=filecontent&checksum=true&generation=2&qt=/replication&wt=filestream} status=0 QTime=0 
[junit4:junit4]   2> 18683 T141 C23 P39268 REQ /replication {file=_0_MockSep_0.tib&command=filecontent&checksum=true&generation=2&qt=/replication&wt=filestream} status=0 QTime=0 
[junit4:junit4]   2> 18687 T141 C23 P39268 REQ /replication {file=_0_MockVariableIntBlock_0.frq&command=filecontent&checksum=true&generation=2&qt=/replication&wt=filestream} status=0 QTime=0 
[junit4:junit4]   2> 18691 T141 C23 P39268 REQ /replication {file=_0_nrm.cfe&command=filecontent&checksum=true&generation=2&qt=/replication&wt=filestream} status=0 QTime=0 
[junit4:junit4]   2> 18695 T141 C23 P39268 REQ /replication {file=_0_MockSep_0.frq&command=filecontent&checksum=true&generation=2&qt=/replication&wt=filestream} status=0 QTime=0 
[junit4:junit4]   2> 18699 T141 C23 P39268 REQ /replication {file=segments_2&command=filecontent&checksum=true&generation=2&qt=/replication&wt=filestream} status=0 QTime=0 
[junit4:junit4]   2> 18703 T141 C23 P39268 REQ /replication {file=_0.fdx&command=filecontent&checksum=true&generation=2&qt=/replication&wt=filestream} status=0 QTime=0 
[junit4:junit4]   2> 18707 T141 C23 P39268 REQ /replication {file=_0_MockSep_0.tii&command=filecontent&checksum=true&generation=2&qt=/replication&wt=filestream} status=0 QTime=0 
[junit4:junit4]   2> 18711 T141 C23 P39268 REQ /replication {file=_0_MockSep_0.pyl&command=filecontent&checksum=true&generation=2&qt=/replication&wt=filestream} status=0 QTime=0 
[junit4:junit4]   2> 18712 T171 C22 P39274 oash.SnapPuller$FileFetcher.fetchPackets WARNING No content recieved for file: {name=_0_MockSep_0.pyl, lastmodified=1347742806000, size=0}
[junit4:junit4]   2> 18715 T141 C23 P39268 REQ /replication {file=_0.fdt&command=filecontent&checksum=true&generation=2&qt=/replication&wt=filestream} status=0 QTime=0 
[junit4:junit4]   2> 18716 T171 C22 P39274 oash.SnapPuller.fetchLatestIndex Total time taken for download : 0 secs
[junit4:junit4]   2> 18717 T171 C22 P39274 oash.SnapPuller.modifyIndexProps New index installed. Updating index properties... index=index.20120915220006811
[junit4:junit4]   2> 18727 T171 C22 P39274 oasu.DefaultSolrCoreState.newIndexWriter Creating new IndexWriter...
[junit4:junit4]   2> 18727 T171 C22 P39274 oasu.DefaultSolrCoreState.newIndexWriter Waiting until IndexWriter is unused... core=collection1
[junit4:junit4]   2> 18727 T171 C22 P39274 oasu.DefaultSolrCoreState.newIndexWriter Rollback old IndexWriter... core=collection1
[junit4:junit4]   2> 18731 T171 C22 P39274 oasc.SolrCore.getNewIndexDir WARNING New index directory detected: old=./org.apache.solr.cloud.BasicDistributedZk2Test-1347742788277/jetty3/index/ new=./org.apache.solr.cloud.BasicDistributedZk2Test-1347742788277/jetty3/index.20120915220006811
[junit4:junit4]   2> 18732 T171 C22 P39274 oasc.CachingDirectoryFactory.get return new directory for /usr/home/hudson/hudson-slave/workspace/Lucene-Solr-Tests-4.x-Java6/solr/build/solr-core/test/J1/./org.apache.solr.cloud.BasicDistributedZk2Test-1347742788277/jetty3/index.20120915220006811 forceNew:true
[junit4:junit4]   2> 18740 T171 C22 P39274 oasc.SolrDeletionPolicy.onInit SolrDeletionPolicy.onInit: commits:num=1
[junit4:junit4]   2> 		commit{dir=NRTCachingDirectory(org.apache.lucene.store.NIOFSDirectory@/usr/home/hudson/hudson-slave/workspace/Lucene-Solr-Tests-4.x-Java6/solr/build/solr-core/test/J1/org.apache.solr.cloud.BasicDistributedZk2Test-1347742788277/jetty3/index.20120915220006811 lockFactory=org.apache.lucene.store.NativeFSLockFactory@7e97b122; maxCacheMB=48.0 maxMergeSizeMB=4.0),segFN=segments_2,generation=2,filenames=[_0_MockSep_0.pos, _0_MockVariableIntBlock_0.doc, _0_MockVariableIntBlock_0.skp, _0_NestedPulsing_0.tip, _0_Pulsing40_0.prx, _0_Pulsing40_0.frq, _0_NestedPulsing_0.tim, _0_MockVariableIntBlock_0.pyl, _0_MockSep_0.skp, _0_MockVariableIntBlock_0.tib, _0_MockVariableIntBlock_0.pos, _0_Pulsing40_0.tip, _0_MockSep_0.doc, _0.si, _0_MockVariableIntBlock_0.tii, _0.fnm, _0_Pulsing40_0.tim, _0_NestedPulsing_0.frq, _0_nrm.cfs, _0_NestedPulsing_0.prx, _0_MockSep_0.tib, _0_nrm.cfe, _0_MockVariableIntBlock_0.frq, segments_2, _0_MockSep_0.frq, _0.fdx, _0_MockSep_0.tii, _0_MockSep_0.pyl, _0.fdt]
[junit4:junit4]   2> 18740 T171 C22 P39274 oasc.SolrDeletionPolicy.updateCommits newest commit = 2
[junit4:junit4]   2> 18740 T171 C22 P39274 oasu.DefaultSolrCoreState.newIndexWriter New IndexWriter is ready to be used.
[junit4:junit4]   2> 18745 T171 C22 P39274 oass.SolrIndexSearcher.<init> Opening Searcher@3d6762fe main
[junit4:junit4]   2> 18748 T170 oasc.SolrCore.registerSearcher [collection1] Registered new searcher Searcher@3d6762fe main{StandardDirectoryReader(segments_2:3:nrt _0(4.0.0.2):C1)}
[junit4:junit4]   2> 18749 T170 oasc.CachingDirectoryFactory.close Closing directory:/usr/home/hudson/hudson-slave/workspace/Lucene-Solr-Tests-4.x-Java6/solr/build/solr-core/test/J1/./org.apache.solr.cloud.BasicDistributedZk2Test-1347742788277/jetty3/index
[junit4:junit4]   2> 18749 T170 oash.SnapPuller$2.onClose removing old index directory ./org.apache.solr.cloud.BasicDistributedZk2Test-1347742788277/jetty3/index
[junit4:junit4]   2> 18751 T171 C22 P39274 oasu.DirectUpdateHandler2.commit start commit{flags=0,_version_=0,optimize=false,openSearcher=false,waitSearcher=false,expungeDeletes=false,softCommit=false}
[junit4:junit4]   2> 18752 T171 C22 P39274 oasu.DirectUpdateHandler2.commit end_commit_flush
[junit4:junit4]   2> 18752 T171 C22 P39274 oasc.RecoveryStrategy.replay Replaying buffered documents. core=collection1
[junit4:junit4]   2> 18752 T194 C22 P39274 oasu.UpdateLog$LogReplayer.doReplay WARNING Starting log replay tlog{file=./org.apache.solr.cloud.BasicDistributedZk2Test-1347742788277/jetty3/tlog/tlog.0000000000000000000 refcount=2} active=true starting pos=430
[junit4:junit4]   2> 18752 T194 C22 P39274 oasu.DirectUpdateHandler2.commit start commit{flags=2,_version_=0,optimize=false,openSearcher=true,waitSearcher=true,expungeDeletes=false,softCommit=false}
[junit4:junit4]   2> 18754 T194 C22 P39274 oass.SolrIndexSearcher.<init> Opening Searcher@f8a01ae main
[junit4:junit4]   2> 18754 T194 C22 P39274 oasu.DirectUpdateHandler2.commit end_commit_flush
[junit4:junit4]   2> 18756 T170 oasc.SolrCore.registerSearcher [collection1] Registered new searcher Searcher@f8a01ae main{StandardDirectoryReader(segments_2:3:nrt _0(4.0.0.2):C1)}
[junit4:junit4]   2> 18757 T194 C22 P39274 oasu.UpdateLog$LogReplayer.run WARNING Log replay finished. recoveryInfo=RecoveryInfo{adds=0 deletes=0 deleteByQuery=0 errors=0 positionOfStart=430}
[junit4:junit4]   2> 18757 T171 C22 P39274 oasc.RecoveryStrategy.doRecovery Replication Recovery was successful - registering as Active. core=collection1
[junit4:junit4]   2> 18763 T171 C22 P39274 oasc.RecoveryStrategy.doRecovery Finished recovery process. core=collection1
[junit4:junit4]   2> 18764 T132 oascc.ZkStateReader.updateClusterState Updating cloud state from ZooKeeper... 
[junit4:junit4]   2> 18791 T157 oascc.ZkStateReader$2.process A cluster state change has occurred - updating...
[junit4:junit4]   2> 18791 T169 oascc.ZkStateReader$2.process A cluster state change has occurred - updating...
[junit4:junit4]   2> 18791 T190 oascc.ZkStateReader$2.process A cluster state change has occurred - updating...
[junit4:junit4]   2> 18791 T131 oascc.ZkStateReader$2.process A cluster state change has occurred - updating...
[junit4:junit4]   2> 18791 T145 oascc.ZkStateReader$2.process A cluster state change has occurred - updating...
[junit4:junit4]   2> 18791 T188 oascc.ZkStateReader$2.process A cluster state change has occurred - updating...
[junit4:junit4]   2> 18791 T183 oascc.ZkStateReader$2.process A cluster state change has occurred - updating...
[junit4:junit4]   2> 19676 T110 oascc.ZkStateReader.updateClusterState Updating cloud state from ZooKeeper... 
[junit4:junit4]   2>  C24_STATE=coll:collection1 core:collection1 props:{shard=shard2, roles=null, state=recovering, core=collection1, collection=collection1, node_name=127.0.0.1:39276_solr, base_url=http://127.0.0.1:39276/solr}
[junit4:junit4]   2> 20442 T185 C24 P39276 oasc.RecoveryStrategy.doRecovery Begin buffering updates. core=collection1
[junit4:junit4]   2> 20442 T185 C24 P39276 oasu.UpdateLog.bufferUpdates Starting to buffer updates. FSUpdateLog{state=ACTIVE, tlog=null}
[junit4:junit4]   2> 20442 T185 C24 P39276 oasc.RecoveryStrategy.replicate Attempting to replicate from http://127.0.0.1:39270/solr/collection1/. core=collection1
[junit4:junit4]   2> 20442 T185 C24 P39276 oascsi.HttpClientUtil.createClient Creating new http client, config:maxConnections=128&maxConnectionsPerHost=32&followRedirects=false
[junit4:junit4]   2> 20455 T152 C25 P39270 oasu.DirectUpdateHandler2.commit start commit{flags=0,_version_=0,optimize=false,openSearcher=true,waitSearcher=true,expungeDeletes=false,softCommit=false}
[junit4:junit4]   2> 20462 T152 C25 P39270 oasc.SolrDeletionPolicy.onInit SolrDeletionPolicy.onInit: commits:num=1
[junit4:junit4]   2> 		commit{dir=NRTCachingDirectory(org.apache.lucene.store.NIOFSDirectory@/usr/home/hudson/hudson-slave/workspace/Lucene-Solr-Tests-4.x-Java6/solr/build/solr-core/test/J1/org.apache.solr.cloud.BasicDistributedZk2Test-1347742788277/jetty2/index lockFactory=org.apache.lucene.store.NativeFSLockFactory@1ff1a404; maxCacheMB=48.0 maxMergeSizeMB=4.0),segFN=segments_1,generation=1,filenames=[segments_1]
[junit4:junit4]   2> 20463 T152 C25 P39270 oasc.SolrDeletionPolicy.updateCommits newest commit = 1
[junit4:junit4]   2> 20464 T152 C25 P39270 oass.SolrIndexSearcher.<init> Opening Searcher@53511133 main
[junit4:junit4]   2> 20465 T152 C25 P39270 oasu.DirectUpdateHandler2.commit end_commit_flush
[junit4:junit4]   2> 20468 T158 oasc.SolrCore.registerSearcher [collection1] Registered new searcher Searcher@53511133 main{StandardDirectoryReader(segments_1:1)}
[junit4:junit4]   2> 20469 T152 C25 P39270 /update {waitSearcher=true&commit=true&commit_end_point=true&wt=javabin&softCommit=false&version=2} {commit=} 0 14
[junit4:junit4]   2> 20470 T185 C24 P39276 oash.ReplicationHandler.inform Commits will be reserved for  10000
[junit4:junit4]   2> 20470 T185 C24 P39276 oash.SnapPuller.<init>  No value set for 'pollInterval'. Timer Task not started.
[junit4:junit4]   2> 20473 T153 C25 P39270 oash.ReplicationHandler.inform Commits will be reserved for  10000
[junit4:junit4]   2> 20473 T153 C25 P39270 REQ /replication {command=indexversion&wt=javabin&qt=/replication&version=2} status=0 QTime=1 
[junit4:junit4]   2> 20479 T185 C24 P39276 oasc.SolrDeletionPolicy.onInit SolrDeletionPolicy.onInit: commits:num=1
[junit4:junit4]   2> 		commit{dir=NRTCachingDirectory(org.apache.lucene.store.NIOFSDirectory@/usr/home/hudson/hudson-slave/workspace/Lucene-Solr-Tests-4.x-Java6/solr/build/solr-core/test/J1/org.apache.solr.cloud.BasicDistributedZk2Test-1347742788277/jetty4/index lockFactory=org.apache.lucene.store.NativeFSLockFactory@2d787e42; maxCacheMB=48.0 maxMergeSizeMB=4.0),segFN=segments_1,generation=1,filenames=[segments_1]
[junit4:junit4]   2> 20480 T185 C24 P39276 oasc.SolrDeletionPolicy.updateCommits newest commit = 1
[junit4:junit4]   2> 20481 T185 C24 P39276 oasu.DirectUpdateHandler2.commit start commit{flags=0,_version_=0,optimize=false,openSearcher=true,waitSearcher=true,expungeDeletes=false,softCommit=false}
[junit4:junit4]   2> 20486 T185 C24 P39276 oasc.SolrDeletionPolicy.onCommit SolrDeletionPolicy.onCommit: commits:num=2
[junit4:junit4]   2> 		commit{dir=NRTCachingDirectory(org.apache.lucene.store.NIOFSDirectory@/usr/home/hudson/hudson-slave/workspace/Lucene-Solr-Tests-4.x-Java6/solr/build/solr-core/test/J1/org.apache.solr.cloud.BasicDistributedZk2Test-1347742788277/jetty4/index lockFactory=org.apache.lucene.store.NativeFSLockFactory@2d787e42; maxCacheMB=48.0 maxMergeSizeMB=4.0),segFN=segments_1,generation=1,filenames=[segments_1]
[junit4:junit4]   2> 		commit{dir=NRTCachingDirectory(org.apache.lucene.store.NIOFSDirectory@/usr/home/hudson/hudson-slave/workspace/Lucene-Solr-Tests-4.x-Java6/solr/build/solr-core/test/J1/org.apache.solr.cloud.BasicDistributedZk2Test-1347742788277/jetty4/index lockFactory=org.apache.lucene.store.NativeFSLockFactory@2d787e42; maxCacheMB=48.0 maxMergeSizeMB=4.0),segFN=segments_2,generation=2,filenames=[segments_2]
[junit4:junit4]   2> 20486 T185 C24 P39276 oasc.SolrDeletionPolicy.updateCommits newest commit = 2
[junit4:junit4]   2> 20491 T185 C24 P39276 oass.SolrIndexSearcher.<init> Opening Searcher@6e1f3a7e main
[junit4:junit4]   2> 20491 T185 C24 P39276 oasu.DirectUpdateHandler2.commit end_commit_flush
[junit4:junit4]   2> 20493 T184 oasc.SolrCore.registerSearcher [collection1] Registered new searcher Searcher@6e1f3a7e main{StandardDirectoryReader(segments_2:2)}
[junit4:junit4]   2> 20493 T185 C24 P39276 oasc.RecoveryStrategy.replay No replay needed. core=collection1
[junit4:junit4]   2> 20493 T185 C24 P39276 oasc.RecoveryStrategy.doRecovery Replication Recovery was successful - registering as Active. core=collection1
[junit4:junit4]   2> 20496 T185 C24 P39276 oasc.RecoveryStrategy.doRecovery Finished recovery process. core=collection1
[junit4:junit4]   2> 20679 T110 oascc.ZkStateReader.updateClusterState Updating cloud state from ZooKeeper... 
[junit4:junit4]   2> 20817 T132 oascc.ZkStateReader.updateClusterState Updating cloud state from ZooKeeper... 
[junit4:junit4]   2> 20832 T183 oascc.ZkStateReader$2.process A cluster state change has occurred - updating...
[junit4:junit4]   2> 20832 T157 oascc.ZkStateReader$2.process A cluster state change has occurred - updating...
[junit4:junit4]   2> 20832 T145 oascc.ZkStateReader$2.process A cluster state change has occurred - updating...
[junit4:junit4]   2> 20832 T131 oascc.ZkStateReader$2.process A cluster state change has occurred - updating...
[junit4:junit4]   2> 20832 T188 oascc.ZkStateReader$2.process A cluster state change has occurred - updating...
[junit4:junit4]   2> 20832 T190 oascc.ZkStateReader$2.process A cluster state change has occurred - updating...
[junit4:junit4]   2> 20832 T169 oascc.ZkStateReader$2.process A cluster state change has occurred - updating...
[junit4:junit4]   2> 21681 T110 oascc.ZkStateReader.updateClusterState Updating cloud state from ZooKeeper... 
[junit4:junit4]   2> 21686 T123 C26 P39263 oasu.DirectUpdateHandler2.commit start commit{flags=0,_version_=0,optimize=false,openSearcher=true,waitSearcher=true,expungeDeletes=false,softCommit=false}
[junit4:junit4]   2> 21837 T123 C26 P39263 oasc.SolrDeletionPolicy.onCommit SolrDeletionPolicy.onCommit: commits:num=2
[junit4:junit4]   2> 		commit{dir=NRTCachingDirectory(org.apache.lucene.store.NIOFSDirectory@/usr/home/hudson/hudson-slave/workspace/Lucene-Solr-Tests-4.x-Java6/solr/build/solr-core/test/J1/org.apache.solr.cloud.BasicDistributedZk2Test-1347742788277/control/data/index lockFactory=org.apache.lucene.store.NativeFSLockFactory@735e0463; maxCacheMB=48.0 maxMergeSizeMB=4.0),segFN=segments_1,generation=1,filenames=[segments_1]
[junit4:junit4]   2> 		commit{dir=NRTCachingDirectory(org.apache.lucene.store.NIOFSDirectory@/usr/home/hudson/hudson-slave/workspace/Lucene-Solr-Tests-4.x-Java6/solr/build/solr-core/test/J1/org.apache.solr.cloud.BasicDistributedZk2Test-1347742788277/control/data/index lockFactory=org.apache.lucene.store.NativeFSLockFactory@735e0463; maxCacheMB=48.0 maxMergeSizeMB=4.0),segFN=segments_2,generation=2,filenames=[_0_MockSep_0.pos, _0_MockVariableIntBlock_0.doc, _0_MockVariableIntBlock_0.skp, _0_Pulsing40_0.prx, _0_NestedPulsing_0.tip, _0_Pulsing40_0.frq, _0_NestedPulsing_0.tim, _0_MockVariableIntBlock_0.pyl, _0_MockVariableIntBlock_0.tib, _0_MockSep_0.skp, _0_Pulsing40_0.tip, _0_MockVariableIntBlock_0.pos, _0_MockSep_0.doc, _0.si, _0_MockVariableIntBlock_0.tii, _0.fnm, _0_Pulsing40_0.tim, _0_NestedPulsing_0.frq, _0_nrm.cfs, _0_NestedPulsing_0.prx, _0_MockSep_0.tib, _0_nrm.cfe, _0_MockVariableIntBlock_0.frq, segments_2, _0_MockSep_0.frq, _0.fdx, _0_MockSep_0.tii, _0_MockSep_0.pyl, _0.fdt]
[junit4:junit4]   2> 21838 T123 C26 P39263 oasc.SolrDeletionPolicy.updateCommits newest commit = 2
[junit4:junit4]   2> 21857 T123 C26 P39263 oass.SolrIndexSearcher.<init> Opening Searcher@11ff6d57 main
[junit4:junit4]   2> 21857 T123 C26 P39263 oasu.DirectUpdateHandler2.commit end_commit_flush
[junit4:junit4]   2> 21859 T134 oasc.SolrCore.registerSearcher [collection1] Registered new searcher Searcher@11ff6d57 main{StandardDirectoryReader(segments_2:3 _0(4.0.0.2):C1)}
[junit4:junit4]   2> 21860 T123 C26 P39263 /update {waitSearcher=true&wt=javabin&commit=true&softCommit=false&version=2} {commit=} 0 175
[junit4:junit4]   2> 21863 T151 C25 P39270 oasu.DirectUpdateHandler2.commit start commit{flags=0,_version_=0,optimize=false,openSearcher=true,waitSearcher=true,expungeDeletes=false,softCommit=false}
[junit4:junit4]   2> 21867 T151 C25 P39270 oass.SolrIndexSearcher.<init> Opening Searcher@6b515d29 main
[junit4:junit4]   2> 21868 T151 C25 P39270 oasu.DirectUpdateHandler2.commit end_commit_flush
[junit4:junit4]   2> 21871 T158 oasc.SolrCore.registerSearcher [collection1] Registered new searcher Searcher@6b515d29 main{StandardDirectoryReader(segments_1:1)}
[junit4:junit4]   2> 21872 T151 C25 P39270 oasu.SolrCmdDistributor.distribCommit Distrib commit to:[StdNode: http://127.0.0.1:39268/solr/collection1/, StdNode: http://127.0.0.1:39274/solr/collection1/, StdNode: http://127.0.0.1:39276/solr/collection1/]
[junit4:junit4]   2>  C22_STATE=coll:collection1 core:collection1 props:{shard=shard1, roles=null, state=active, core=collection1, collection=collection1, node_name=127.0.0.1:39274_solr, base_url=http://127.0.0.1:39274/solr}
[junit4:junit4]   2> 21875 T161 C22 P39274 oasu.DirectUpdateHandler2.commit start commit{flags=0,_version_=0,optimize=false,openSearcher=true,waitSearcher=true,expungeDeletes=false,softCommit=false}
[junit4:junit4]   2> 21876 T139 C23 P39268 oasu.DirectUpdateHandler2.commit start commit{flags=0,_version_=0,optimize=false,openSearcher=true,waitSearcher=true,expungeDeletes=false,softCommit=false}
[junit4:junit4]   2> 21878 T161 C22 P39274 oass.SolrIndexSearcher.<init> Opening Searcher@4e9b1a46 main
[junit4:junit4]   2> 21878 T161 C22 P39274 oasu.DirectUpdateHandler2.commit end_commit_flush
[junit4:junit4]   2> 21880 T170 oasc.SolrCore.registerSearcher [collection1] Registered new searcher Searcher@4e9b1a46 main{StandardDirectoryReader(segments_2:3:nrt _0(4.0.0.2):C1)}
[junit4:junit4]   2> 21888 T161 C22 P39274 /update {waitSearcher=true&commit=true&wt=javabin&commit_end_point=true&expungeDeletes=false&softCommit=false&version=2} {commit=} 0 13
[junit4:junit4]   2>  C24_STATE=coll:collection1 core:collection1 props:{shard=shard2, roles=null, state=active, core=collection1, collection=collection1, node_name=127.0.0.1:39276_solr, base_url=http://127.0.0.1:39276/solr}
[junit4:junit4]   2> 21891 T175 C24 P39276 oasu.DirectUpdateHandler2.commit start commit{flags=0,_version_=0,optimize=false,openSearcher=true,waitSearcher=true,expungeDeletes=false,softCommit=false}
[junit4:junit4]   2> 21895 T175 C24 P39276 oass.SolrIndexSearcher.<init> Opening Searcher@2eac671f main
[junit4:junit4]   2> 21896 T175 C24 P39276 oasu.DirectUpdateHandler2.commit end_commit_flush
[junit4:junit4]   2> 21897 T184 oasc.SolrCore.registerSearcher [collection1] Registered new searcher Searcher@2eac671f main{StandardDirectoryReader(segments_2:2)}
[junit4:junit4]   2> 21898 T175 C24 P39276 /update {waitSearcher=true&commit=true&wt=javabin&commit_end_point=true&expungeDeletes=false&softCommit=false&version=2} {commit=} 0 7
[junit4:junit4]   2> 21901 T139 C23 P39268 oass.SolrIndexSearcher.<init> Opening Searcher@29b7c4cd main
[junit4:junit4]   2> 21902 T139 C23 P39268 oasu.DirectUpdateHandler2.commit end_commit_flush
[junit4:junit4]   2> 21904 T146 oasc.SolrCore.registerSearcher [collection1] Registered new searcher Searcher@29b7c4cd main{StandardDirectoryReader(segments_2:3 _0(4.0.0.2):C1)}
[junit4:junit4]   2> 21904 T139 C23 P39268 /update {waitSearcher=true&commit=true&wt=javabin&commit_end_point=true&expungeDeletes=false&softCommit=false&version=2} {commit=} 0 29
[junit4:junit4]   2> 21905 T151 C25 P39270 /update {waitSearcher=true&wt=javabin&commit=true&softCommit=false&version=2} {commit=} 0 42
[junit4:junit4]   2> 21933 T124 C26 P39263 REQ /select {fl=id,score&shard.url=127.0.0.1:39263/solr/collection1/&NOW=1347742810202&start=0&q=*:*&distrib=false&isShard=true&wt=javabin&fsv=true&rows=10&version=2} hits=1 status=0 QTime=1 
[junit4:junit4]   2> 21977 T124 C26 P39263 REQ /select {shard.url=127.0.0.1:39263/solr/collection1/&NOW=1347742810202&q=*:*&ids=1&distrib=false&isShard=true&wt=javabin&version=2} status=0 QTime=8 
[junit4:junit4]   2> 21979 T123 C26 P39263 REQ /select {wt=javabin&q=*:*&version=2} hits=1 status=0 QTime=50 
[junit4:junit4]   2> 21979 T110 oaz.ZooKeeper.<init> Initiating client connection, connectString=127.0.0.1:39260/solr sessionTimeout=10000 watcher=org.apache.solr.common.cloud.ConnectionManager@6e99ecd
[junit4:junit4]   2> 21980 T198 oaz.ClientCnxn$SendThread.startConnect Opening socket connection to server /127.0.0.1:39260
[junit4:junit4]   2> 21980 T110 oascc.ConnectionManager.waitForConnected Waiting for client to connect to ZooKeeper
[junit4:junit4]   2> 21981 T198 oaz.ClientCnxn$SendThread.primeConnection Socket connection established to localhost/127.0.0.1:39260, initiating session
[junit4:junit4]   2> 21981 T112 oazs.NIOServerCnxn$Factory.run Accepted socket connection from /140.211.11.196:40613
[junit4:junit4]   2> 21982 T112 oazs.NIOServerCnxn.readConnectRequest Client attempting to establish new session at /140.211.11.196:40613
[junit4:junit4]   2> 21983 T114 oazs.NIOServerCnxn.finishSessionInit Established session 0x139cbbaec270009 with negotiated timeout 10000 for client /140.211.11.196:40613
[junit4:junit4]   2> 21983 T198 oaz.ClientCnxn$SendThread.readConnectResult Session establishment complete on server localhost/127.0.0.1:39260, sessionid = 0x139cbbaec270009, negotiated timeout = 10000
[junit4:junit4]   2> 21983 T199 oascc.ConnectionManager.process Watcher org.apache.solr.common.cloud.ConnectionManager@6e99ecd name:ZooKeeperConnection Watcher:127.0.0.1:39260/solr got event WatchedEvent state:SyncConnected type:None path:null path:null type:None
[junit4:junit4]   2> 21984 T110 oascc.ConnectionManager.waitForConnected Client is connected to ZooKeeper
[junit4:junit4]   2> 21984 T110 oascc.ZkStateReader.createClusterStateWatchersAndUpdate Updating cluster state from ZooKeeper... 
[junit4:junit4]   2> 21986 T115 oazs.PrepRequestProcessor.pRequest Processed session termination for sessionid: 0x139cbbaec270009
[junit4:junit4]   2> 21987 T199 oaz.ClientCnxn$EventThread.run EventThread shut down
[junit4:junit4]   2> 21987 T110 oaz.ZooKeeper.close Session: 0x139cbbaec270009 closed
[junit4:junit4]   2> 21987 T112 oazs.NIOServerCnxn.closeSock Closed socket connection for client /140.211.11.196:40613 which had sessionid 0x139cbbaec270009
[junit4:junit4]   2> 21989 T142 C23 P39268 REQ /select {distrib=false&wt=javabin&q=*:*&version=2} hits=1 status=0 QTime=0 
[junit4:junit4]   2> 21992 T154 C25 P39270 REQ /select {distrib=false&wt=javabin&q=*:*&version=2} hits=0 status=0 QTime=0 
[junit4:junit4]   2> 21997 T155 C25 P39270 REQ /select {fl=id,score&shard.url=127.0.0.1:39270/solr/collection1/|127.0.0.1:39276/solr/collection1/&NOW=1347742810267&start=0&q=*:*&distrib=false&isShard=true&wt=javabin&fsv=true&rows=10&version=2} hits=0 status=0 QTime=0 
[junit4:junit4]   2> 22003 T162 C22 P39274 REQ /select {fl=id,score&shard.url=127.0.0.1:39268/solr/collection1/|127.0.0.1:39274/solr/collection1/&NOW=1347742810267&start=0&q=*:*&distrib=false&isShard=true&wt=javabin&fsv=true&rows=10&version=2} hits=1 status=0 QTime=0 
[junit4:junit4]   2> 22007 T162 C22 P39274 REQ /select {shard.url=127.0.0.1:39268/solr/collection1/|127.0.0.1:39274/solr/collection1/&NOW=1347742810267&q=*:*&ids=1&distrib=false&isShard=true&wt=javabin&version=2} status=0 QTime=1 
[junit4:junit4]   2> 22008 T176 C24 P39276 REQ /select {wt=javabin&q=*:*&version=2} hits=1 status=0 QTime=14 
[junit4:junit4]   2> 22016 T123 C26 P39263 /update {wt=javabin&version=2} {add=[2 (1413210765037404160)]} 0 5
[junit4:junit4]   2> 22033 T175 C24 P39276 REQ /update {update.distrib=FROMLEADER&distrib.from=http://127.0.0.1:39270/solr/collection1/&wt=javabin&version=2} status=0 QTime=5 
[junit4:junit4]   2> 22034 T150 C25 P39270 REQ /update {distrib.from=http://127.0.0.1:39268/solr/collection1/&update.distrib=TOLEADER&wt=javabin&version=2} status=0 QTime=12 
[junit4:junit4]   2> 22035 T143 C23 P39268 /update {wt=javabin&version=2} {add=[2]} 0 16
[junit4:junit4]   2> 22041 T123 C26 P39263 /update {wt=javabin&version=2} {add=[3 (1413210765065715712)]} 0 3
[junit4:junit4]   2> 22055 T175 C24 P39276 REQ /update {update.distrib=FROMLEADER&distrib.from=http://127.0.0.1:39270/solr/collection1/&wt=javabin&version=2} status=0 QTime=3 
[junit4:junit4]   2> 22056 T150 C25 P39270 REQ /update {distrib.from=http://127.0.0.1:39268/solr/collection1/&update.distrib=TOLEADER&wt=javabin&version=2} status=0 QTime=9 
[junit4:junit4]   2> 22056 T143 C23 P39268 /update {wt=javabin&version=2} {add=[3]} 0 12
[junit4:junit4]   2> 22062 T123 C26 P39263 /update {wt=javabin&version=2} {add=[4 (1413210765087735808)]} 0 3
[junit4:junit4]   2> 22081 T161 C22 P39274 REQ /update {update.distrib=FROMLEADER&distrib.from=http://127.0.0.1:39268/solr/collection1/&wt=javabin&version=2} status=0 QTime=5 
[junit4:junit4]   2> 22081 T139 C23 P39268 REQ /update {distrib.from=http://127.0.0.1:39270/solr/collection1/&update.distrib=TOLEADER&wt=javabin&version=2} status=0 QTime=12 
[junit4:junit4]   2> 22082 T151 C25 P39270 /update {wt=javabin&version=2} {add=[4]} 0 17
[junit4:junit4]   2> 22088 T123 C26 P39263 /update {wt=javabin&version=2} {add=[5 (1413210765114998784)]} 0 3
[junit4:junit4]   2> 22100 T175 C24 P39276 REQ /update {distrib.from=http://127.0.0.1:39270/solr/collection1/&update.distrib=FROMLEADER&wt=javabin&version=2} status=0 QTime=3 
[junit4:junit4]   2> 22101 T151 C25 P39270 /update {wt=javabin&version=2} {add=[5 (1413210765121290240)]} 0 10
[junit4:junit4]   2> 22107 T123 C26 P39263 /update {wt=javabin&version=2} {add=[6 (1413210765134921728)]} 0 3
[junit4:junit4]   2> 22117 T175 C24 P39276 REQ /update {distrib.from=http://127.0.0.1:39270/solr/collection1/&update.distrib=FROMLEADER&wt=javabin&version=2} status=0 QTime=3 
[junit4:junit4]   2> 22118 T151 C25 P39270 /update {wt=javabin&version=2} {add=[6 (1413210765140164608)]} 0 9
[junit4:junit4]   2> 22123 T123 C26 P39263 /update {wt=javabin&version=2} {add=[7 (1413210765151698944)]} 0 3
[junit4:junit4]   2> 22136 T175 C24 P39276 REQ /update {update.distrib=FROMLEADER&distrib.from=http://127.0.0.1:39270/solr/collection1/&wt=javabin&version=2} status=0 QTime=2 
[junit4:junit4]   2> 22137 T150 C25 P39270 REQ /update {distrib.from=http://127.0.0.1:39268/solr/collection1/&update.distrib=TOLEADER&wt=javabin&version=2} status=0 QTime=8 
[junit4:junit4]   2> 22137 T143 C23 P39268 /update {wt=javabin&version=2} {add=[7]} 0 11
[junit4:junit4]   2> 22142 T123 C26 P39263 /update {wt=javabin&version=2} {add=[8 (1413210765172670464)]} 0 2
[junit4:junit4]   2> 22152 T161 C22 P39274 REQ /update {distrib.from=http://127.0.0.1:39268/solr/collection1/&update.distrib=FROMLEADER&wt=javabin&version=2} status=0 QTime=2 
[junit4:junit4]   2> 22153 T143 C23 P39268 /update {wt=javabin&version=2} {add=[8 (1413210765177913344)]} 0 8
[junit4:junit4]   2> 22158 T123 C26 P39263 /update {wt=javabin&version=2} {add=[9 (1413210765189447680)]} 0 2
[junit4:junit4]   2> 22168 T175 C24 P39276 REQ /update {distrib.from=http://127.0.0.1:39270/solr/collection1/&update.distrib=FROMLEADER&wt=javabin&version=2} status=0 QTime=2 
[junit4:junit4]   2> 22169 T151 C25 P39270 /update {wt=javabin&version=2} {add=[9 (1413210765194690560)]} 0 8
[junit4:junit4]   2> 22174 T123 C26 P39263 /update {wt=javabin&version=2} {add=[10 (1413210765206224896)]} 0 2
[junit4:junit4]   2> 22184 T161 C22 P39274 REQ /update {distrib.from=http://127.0.0.1:39268/solr/collection1/&update.distrib=FROMLEADER&wt=javabin&version=2} status=0 QTime=2 
[junit4:junit4]   2> 22185 T143 C23 P39268 /update {wt=javabin&version=2} {add=[10 (1413210765211467776)]} 0 8
[junit4:junit4]   2> 22208 T123 C26 P39263 /update {wt=javabin&version=2} {add=[11 (1413210765221953536)]} 0 21
[junit4:junit4]   2> 22220 T161 C22 P39274 REQ /update {distrib.from=http://127.0.0.1:39268/solr/collection1/&update.distrib=FROMLEADER&wt=javabin&version=2} status=0 QTime=3 
[junit4:junit4]   2> 22220 T143 C23 P39268 /update {wt=javabin&version=2} {add=[11 (1413210765247119360)]} 0 9
[junit4:junit4]   2> 22226 T123 C26 P39263 /update {wt=javabin&version=2} {add=[12 (1413210765259702272)]} 0 3
[junit4:junit4]   2> 22241 T161 C22 P39274 REQ /update {update.distrib=FROMLEADER&distrib.from=http://127.0.0.1:39268/solr/collection1/&wt=javabin&version=2} status=0 QTime=3 
[junit4:junit4]   2> 22241 T139 C23 P39268 REQ /update {distrib.from=http://127.0.0.1:39270/solr/collection1/&update.distrib=TOLEADER&wt=javabin&version=2} status=0 QTime=9 
[junit4:junit4]   2> 22242 T151 C25 P39270 /update {wt=javabin&version=2} {add=[12]} 0 13
[junit4:junit4]   2> 22247 T123 C26 P39263 /update {wt=javabin&version=2} {add=[13 (1413210765282770944)]} 0 2
[junit4:junit4]   2> 22258 T161 C22 P39274 REQ /update {distrib.from=http://127.0.0.1:39268/solr/collection1/&update.distrib=FROMLEADER&wt=javabin&version=2} status=0 QTime=2 
[junit4:junit4]   2> 22259 T143 C23 P39268 /update {wt=javabin&version=2} {add=[13 (1413210765288013824)]} 0 9
[junit4:junit4]   2> 22264 T123 C26 P39263 /update {wt=javabin&version=2} {add=[14 (1413210765300596736)]} 0 2
[junit4:junit4]   2> 22278 T161 C22 P39274 REQ /update {update.distrib=FROMLEADER&distrib.from=http://127.0.0.1:39268/solr/collection1/&wt=javabin&version=2} status=0 QTime=2 
[junit4:junit4]   2> 22279 T139 C23 P39268 REQ /update {distrib.from=http://127.0.0.1:39270/solr/collection1/&update.distrib=TOLEADER&wt=javabin&version=2} status=0 QTime=8 
[junit4:junit4]   2> 22280 T151 C25 P39270 /update {wt=javabin&version=2} {add=[14]} 0 13
[junit4:junit4]   2> 22284 T123 C26 P39263 /update {wt=javabin&version=2} {add=[15 (1413210765321568256)]} 0 2
[junit4:junit4]   2> 22293 T161 C22 P39274 REQ /update {distrib.from=http://127.0.0.1:39268/solr/collection1/&update.distrib=FROMLEADER&wt=javabin&version=2} status=0 QTime=3 
[junit4:junit4]   2> 22294 T143 C23 P39268 /update {wt=javabin&version=2} {add=[15 (1413210765325762560)]} 0 8
[junit4:junit4]   2> 22298 T123 C26 P39263 /update {wt=javabin&version=2} {add=[16 (1413210765336248320)]} 0 2
[junit4:junit4]   2> 22308 T161 C22 P39274 REQ /update {distrib.from=http://127.0.0.1:39268/solr/collection1/&update.distrib=FROMLEADER&wt=javabin&version=2} status=0 QTime=3 
[junit4:junit4]   2> 22309 T143 C23 P39268 /update {wt=javabin&version=2} {add=[16 (1413210765341491200)]} 0 8
[junit4:junit4]   2> 22320 T123 C26 P39263 /update {wt=javabin&version=2} {add=[17 (1413210765355122688)]} 0 8
[junit4:junit4]   2> 22344 T175 C24 P39276 REQ /update {update.distrib=FROMLEADER&distrib.from=http://127.0.0.1:39270/solr/collection1/&wt=javabin&version=2} status=0 QTime=5 
[junit4:junit4]   2> 22345 T150 C25 P39270 REQ /update {distrib.from=http://127.0.0.1:39268/solr/collection1/&update.distrib=TOLEADER&wt=javabin&version=2} status=0 QTime=16 
[junit4:junit4]   2> 22346 T143 C23 P39268 /update {wt=javabin&version=2} {add=[17]} 0 21
[junit4:junit4]   2> 22351 T123 C26 P39263 /update {wt=javabin&version=2} {add=[100 (1413210765390774272)]} 0 3
[junit4:junit4]   2> 22408 T161 C22 P39274 REQ /update {update.distrib=FROMLEADER&distrib.from=http://127.0.0.1:39268/solr/collection1/&wt=javabin&version=2} status=0 QTime=20 
[junit4:junit4]   2> 22409 T139 C23 P39268 REQ /update {distrib.from=http://127.0.0.1:39270/solr/collection1/&update.distrib=TOLEADER&wt=javabin&version=2} status=0 QTime=51 
[junit4:junit4]   2> 22410 T151 C25 P39270 /update {wt=javabin&version=2} {add=[100]} 0 56
[junit4:junit4]   2> 22414 T123 C26 P39263 /update {wt=javabin&version=2} {add=[101 (1413210765457883136)]} 0 2
[junit4:junit4]   2> 22429 T161 C22 P39274 REQ /update {update.distrib=FROMLEADER&distrib.from=http://127.0.0.1:39268/solr/collection1/&wt=javabin&version=2} status=0 QTime=3 
[junit4:junit4]   2> 22430 T139 C23 P39268 REQ /update {distrib.from=http://127.0.0.1:39270/solr/collection1/&update.distrib=TOLEADER&wt=javabin&version=2} status=0 QTime=10 
[junit4:junit4]   2> 22431 T151 C25 P39270 /update {wt=javabin&version=2} {add=[101]} 0 14
[junit4:junit4]   2> 22435 T123 C26 P39263 /update {wt=javabin&version=2} {add=[102 (1413210765479903232)]} 0 2
[junit4:junit4]   2> 22445 T161 C22 P39274 REQ /update {distrib.from=http://127.0.0.1:39268/solr/collection1/&update.distrib=FROMLEADER&wt=javabin&version=2} status=0 QTime=2 
[junit4:junit4]   2> 22446 T143 C23 P39268 /update {wt=javabin&version=2} {add=[102 (1413210765484097536)]} 0 8
[junit4:junit4]   2> 22507 T123 C26 P39263 /update {wt=javabin&version=2} {add=[103 (1413210765496680448)]} 0 58
[junit4:junit4]   2> 22535 T175 C24 P39276 REQ /update {distrib.from=http://127.0.0.1:39270/solr/collection1/&update.distrib=FROMLEADER&wt=javabin&version=2} status=0 QTime=20 
[junit4:junit4]   2> 22536 T151 C25 P39270 /update {wt=javabin&version=2} {add=[103 (1413210765560643584)]} 0 26
[junit4:junit4]   2> 22542 T123 C26 P39263 /update {wt=javabin&version=2} {add=[104 (1413210765591052288)]} 0 3
[junit4:junit4]   2> 22554 T175 C24 P39276 REQ /update {update.distrib=FROMLEADER&distrib.from=http://127.0.0.1:39270/solr/collection1/&wt=javabin&version=2} status=0 QTime=2 
[junit4:junit4]   2> 22554 T150 C25 P39270 REQ /update {distrib.from=http://127.0.0.1:39268/solr/collection1/&update.distrib=TOLEADER&wt=javabin&version=2} status=0 QTime=6 
[junit4:junit4]   2> 22555 T143 C23 P39268 /update {wt=javabin&version=2} {add=[104]} 0 10
[junit4:junit4]   2> 22559 T123 C26 P39263 /update {wt=javabin&version=2} {add=[105 (1413210765609926656)]} 0 2
[junit4:junit4]   2> 22604 T175 C24 P39276 REQ /update {update.distrib=FROMLEADER&distrib.from=http://127.0.0.1:39270/solr/collection1/&wt=javabin&version=2} status=0 QTime=18 
[junit4:junit4]   2> 22604 T150 C25 P39270 REQ /update {distrib.from=http://127.0.0.1:39268/solr/collection1/&update.distrib=TOLEADER&wt=javabin&version=2} status=0 QTime=39 
[junit4:junit4]   2> 22605 T143 C23 P39268 /update {wt=javabin&version=2} {add=[105]} 0 43
[junit4:junit4]   2> 22610 T123 C26 P39263 /update {wt=javabin&version=2} {add=[106 (1413210765663404032)]} 0 2
[junit4:junit4]   2> 22622 T175 C24 P39276 REQ /update {distrib.from=http://127.0.0.1:39270/solr/collection1/&update.distrib=FROMLEADER&wt=javabin&version=2} status=0 QTime=3 
[junit4:junit4]   2> 22622 T151 C25 P39270 /update {wt=javabin&version=2} {add=[106 (1413210765667598336)]} 0 9
[junit4:junit4]   2> 22627 T123 C26 P39263 /update {wt=javabin&version=2} {add=[107 (1413210765681229824)]} 0 2
[junit4:junit4]   2> 22640 T161 C22 P39274 REQ /update {update.distrib=FROMLEADER&distrib.from=http://127.0.0.1:39268/solr/collection1/&wt=javabin&version=2} status=0 QTime=2 
[junit4:junit4]   2> 22641 T139 C23 P39268 REQ /update {distrib.from=http://127.0.0.1:39270/solr/collection1/&update.distrib=TOLEADER&wt=javabin&version=2} status=0 QTime=7 
[junit4:junit4]   2> 22642 T151 C25 P39270 /update {wt=javabin&version=2} {add=[107]} 0 12
[junit4:junit4]   2> 22647 T123 C26 P39263 /update {wt=javabin&version=2} {add=[108 (1413210765702201344)]} 0 2
[junit4:junit4]   2> 22657 T161 C22 P39274 REQ /update {distrib.from=http://127.0.0.1:39268/solr/collection1/&update.distrib=FROMLEADER&wt=javabin&version=2} status=0 QTime=2 
[junit4:junit4]   2> 22658 T143 C23 P39268 /update {wt=javabin&version=2} {add=[108 (1413210765707444224)]} 0 8
[junit4:junit4]   2> 22663 T123 C26 P39263 /update {wt=javabin&version=2} {add=[109 (1413210765718978560)]} 0 2
[junit4:junit4]   2> 22676 T161 C22 P39274 REQ /update {update.distrib=FROMLEADER&distrib.from=http://127.0.0.1:39268/solr/collection1/&wt=javabin&version=2} status=0 QTime=2 
[junit4:junit4]   2> 22677 T139 C23 P39268 REQ /update {distrib.from=http://127.0.0.1:39270/solr/collection1/&update.distrib=TOLEADER&wt=javabin&version=2} status=0 QTime=8 
[junit4:junit4]   2> 22678 T151 C25 P39270 /update {wt=javabin&version=2} {add=[109]} 0 12
[junit4:junit4]   2> 22683 T123 C26 P39263 /update {wt=javabin&version=2} {add=[110 (1413210765739950080)]} 0 2
[junit4:junit4]   2> 22693 T161 C22 P39274 REQ /update {distrib.from=http://127.0.0.1:39268/solr/collection1/&update.distrib=FROMLEADER&wt=javabin&version=2} status=0 QTime=2 
[junit4:junit4]   2> 22693 T143 C23 P39268 /update {wt=javabin&version=2} {add=[110 (1413210765745192960)]} 0 7
[junit4:junit4]   2> 22698 T123 C26 P39263 /update {wt=javabin&version=2} {add=[111 (1413210765755678720)]} 0 2
[junit4:junit4]   2> 22708 T161 C22 P39274 REQ /update {distrib.from=http://127.0.0.1:39268/solr/collection1/&update.distrib=FROMLEADER&wt=javabin&version=2} status=0 QTime=2 
[junit4:junit4]   2> 22708 T143 C23 P39268 /update {wt=javabin&version=2} {add=[111 (1413210765760921600)]} 0 7
[junit4:junit4]   2> 22713 T123 C26 P39263 /update {wt=javabin&version=2} {add=[112 (1413210765771407360)]} 0 2
[junit4:junit4]   2> 22726 T175 C24 P39276 REQ /update {distrib.from=http://127.0.0.1:39270/solr/collection1/&update.distrib=FROMLEADER&wt=javabin&version=2} status=0 QTime=2 
[junit4:junit4]   2> 22727 T151 C25 P39270 /update {wt=javabin&version=2} {add=[112 (1413210765776650240)]} 0 11
[junit4:junit4]   2> 22745 T123 C26 P39263 /update {wt=javabin&version=2} {add=[113 (1413210765791330304)]} 0 15
[junit4:junit4]   2> 22758 T161 C22 P39274 REQ /update {update.distrib=FROMLEADER&distrib.from=http://127.0.0.1:39268/solr/collection1/&wt=javabin&version=2} status=0 QTime=2 
[junit4:junit4]   2> 22758 T139 C23 P39268 REQ /update {distrib.from=http://127.0.0.1:39270/solr/collection1/&update.distrib=TOLEADER&wt=javabin&version=2} status=0 QTime=7 
[junit4:junit4]   2> 22759 T151 C25 P39270 /update {wt=javabin&version=2} {add=[113]} 0 11
[junit4:junit4]   2> 22765 T123 C26 P39263 /update {wt=javabin&version=2} {add=[114 (1413210765824884736)]} 0 3
[junit4:junit4]   2> 22778 T161 C22 P39274 REQ /update {update.distrib=FROMLEADER&distrib.from=http://127.0.0.1:39268/solr/collection1/&wt=javabin&version=2} status=0 QTime=2 
[junit4:junit4]   2> 22778 T139 C23 P39268 REQ /update {distrib.from=http://127.0.0.1:39270/solr/collection1/&update.distrib=TOLEADER&wt=javabin&version=2} status=0 QTime=7 
[junit4:junit4]   2> 22779 T151 C25 P39270 /update {wt=javabin&version=2} {add=[114]} 0 11
[junit4:junit4]   2> 22784 T123 C26 P39263 /update {wt=javabin&version=2} {add=[115 (1413210765845856256)]} 0 2
[junit4:junit4]   2> 22792 T175 C24 P39276 REQ /update {distrib.from=http://127.0.0.1:39270/solr/collection1/&update.distrib=FROMLEADER&wt=javabin&version=2} status=0 QTime=1 
[junit4:junit4]   2> 22793 T151 C25 P39270 /update {wt=javabin&version=2} {add=[115 (1413210765850050560)]} 0 6
[junit4:junit4]   2> 22797 T123 C26 P39263 /update {wt=javabin&version=2} {add=[116 (1413210765859487744)]} 0 2
[junit4:junit4]   2> 22805 T175 C24 P39276 REQ /update {distrib.from=http://127.0.0.1:39270/solr/collection1/&update.distrib=FROMLEADER&wt=javabin&version=2} status=0 QTime=1 
[junit4:junit4]   2> 22806 T151 C25 P39270 /update {wt=javabin&version=2} {add=[116 (1413210765864730624)]} 0 6
[junit4:junit4]   2> 22811 T123 C26 P39263 /update {wt=javabin&version=2} {add=[117 (1413210765874167808)]} 0 2
[junit4:junit4]   2> 22821 T175 C24 P39276 REQ /update {update.distrib=FROMLEADER&distrib.from=http://127.0.0.1:39270/solr/collection1/&wt=javabin&version=2} status=0 QTime=1 
[junit4:junit4]   2> 22822 T150 C25 P39270 REQ /update {distrib.from=http://127.0.0.1:39268/solr/collection1/&update.distrib=TOLEADER&wt=javabin&version=2} status=0 QTime=6 
[junit4:junit4]   2> 22823 T143 C23 P39268 /update {wt=javabin&version=2} {add=[117]} 0 10
[junit4:junit4]   2> 22828 T123 C26 P39263 /update {wt=javabin&version=2} {add=[118 (1413210765891993600)]} 0 2
[junit4:junit4]   2> 22869 T161 C22 P39274 REQ /update {distrib.from=http://127.0.0.1:39268/solr/collection1/&update.distrib=FROMLEADER&wt=javabin&version=2} status=0 QTime=14 
[junit4:junit4]   2> 22870 T143 C23 P39268 /update {wt=javabin&version=2} {add=[118 (1413210765897236480)]} 0 39
[junit4:junit4]   2> 22874 T123 C26 P39263 /update {wt=javabin&version=2} {add=[119 (1413210765940228096)]} 0 2
[junit4:junit4]   2> 22885 T175 C24 P39276 REQ /update {update.distrib=FROMLEADER&distrib.from=http://127.0.0.1:39270/solr/collection1/&wt=javabin&version=2} status=0 QTime=1 
[junit4:junit4]   2> 22886 T150 C25 P39270 REQ /update {distrib.from=http://127.0.0.1:39268/solr/collection1/&update.distrib=TOLEADER&wt=javabin&version=2} status=0 QTime=6 
[junit4:junit4]   2> 22887 T143 C23 P39268 /update {wt=javabin&version=2} {add=[119]} 0 10
[junit4:junit4]   2> 22892 T123 C26 P39263 /update {wt=javabin&version=2} {add=[120 (1413210765959102464)]} 0 2
[junit4:junit4]   2> 22903 T175 C24 P39276 REQ /update {update.distrib=FROMLEADER&distrib.from=http://127.0.

[...truncated too long message...]

ion because CoreContainer is shutdown
[junit4:junit4]   2> 317806 T183 oasc.SolrCore.close [collection1]  CLOSING SolrCore org.apache.solr.core.SolrCore@5fdfe2da
[junit4:junit4]   2> 317814 T183 oasc.JmxMonitoredMap$SolrDynamicMBean.getMBeanInfo WARNING Could not getStatistics on info bean Lazy[solr.ReplicationHandler] java.lang.IllegalArgumentException: /usr/home/hudson/hudson-slave/workspace/Lucene-Solr-Tests-4.x-Java6/solr/build/solr-core/test/J1/org.apache.solr.cloud.BasicDistributedZk2Test-1347742788277/jetty4/index does not exist
[junit4:junit4]   2> 	at org.apache.commons.io.FileUtils.sizeOfDirectory(FileUtils.java:2074)
[junit4:junit4]   2> 	at org.apache.solr.handler.ReplicationHandler.getIndexSize(ReplicationHandler.java:477)
[junit4:junit4]   2> 	at org.apache.solr.handler.ReplicationHandler.getStatistics(ReplicationHandler.java:525)
[junit4:junit4]   2> 	at org.apache.solr.core.RequestHandlers$LazyRequestHandlerWrapper.getStatistics(RequestHandlers.java:310)
[junit4:junit4]   2> 	at org.apache.solr.core.JmxMonitoredMap$SolrDynamicMBean.getMBeanInfo(JmxMonitoredMap.java:231)
[junit4:junit4]   2> 	at com.sun.jmx.interceptor.DefaultMBeanServerInterceptor.getClassName(DefaultMBeanServerInterceptor.java:1824)
[junit4:junit4]   2> 	at com.sun.jmx.interceptor.DefaultMBeanServerInterceptor.safeGetClassName(DefaultMBeanServerInterceptor.java:1661)
[junit4:junit4]   2> 	at com.sun.jmx.interceptor.DefaultMBeanServerInterceptor.checkMBeanPermission(DefaultMBeanServerInterceptor.java:1833)
[junit4:junit4]   2> 	at com.sun.jmx.interceptor.DefaultMBeanServerInterceptor.getAttribute(DefaultMBeanServerInterceptor.java:680)
[junit4:junit4]   2> 	at com.sun.jmx.mbeanserver.JmxMBeanServer.getAttribute(JmxMBeanServer.java:672)
[junit4:junit4]   2> 	at org.apache.solr.core.JmxMonitoredMap.unregister(JmxMonitoredMap.java:174)
[junit4:junit4]   2> 	at org.apache.solr.core.JmxMonitoredMap.clear(JmxMonitoredMap.java:116)
[junit4:junit4]   2> 	at org.apache.solr.core.SolrCore.close(SolrCore.java:864)
[junit4:junit4]   2> 	at org.apache.solr.cloud.ShardLeaderElectionContext.runLeaderProcess(ElectionContext.java:213)
[junit4:junit4]   2> 	at org.apache.solr.cloud.LeaderElector.runIamLeaderProcess(LeaderElector.java:158)
[junit4:junit4]   2> 	at org.apache.solr.cloud.LeaderElector.checkIfIamLeader(LeaderElector.java:102)
[junit4:junit4]   2> 	at org.apache.solr.cloud.LeaderElector.access$000(LeaderElector.java:56)
[junit4:junit4]   2> 	at org.apache.solr.cloud.LeaderElector$1.process(LeaderElector.java:131)
[junit4:junit4]   2> 	at org.apache.zookeeper.ClientCnxn$EventThread.processEvent(ClientCnxn.java:526)
[junit4:junit4]   2> 	at org.apache.zookeeper.ClientCnxn$EventThread.run(ClientCnxn.java:502)
[junit4:junit4]   2> 
[junit4:junit4]   2> 317816 T183 oasc.JmxMonitoredMap$SolrDynamicMBean.getMBeanInfo WARNING Could not getStatistics on info bean Lazy[solr.ReplicationHandler] java.lang.IllegalArgumentException: /usr/home/hudson/hudson-slave/workspace/Lucene-Solr-Tests-4.x-Java6/solr/build/solr-core/test/J1/org.apache.solr.cloud.BasicDistributedZk2Test-1347742788277/jetty4/index does not exist
[junit4:junit4]   2> 	at org.apache.commons.io.FileUtils.sizeOfDirectory(FileUtils.java:2074)
[junit4:junit4]   2> 	at org.apache.solr.handler.ReplicationHandler.getIndexSize(ReplicationHandler.java:477)
[junit4:junit4]   2> 	at org.apache.solr.handler.ReplicationHandler.getStatistics(ReplicationHandler.java:525)
[junit4:junit4]   2> 	at org.apache.solr.core.RequestHandlers$LazyRequestHandlerWrapper.getStatistics(RequestHandlers.java:310)
[junit4:junit4]   2> 	at org.apache.solr.core.JmxMonitoredMap$SolrDynamicMBean.getMBeanInfo(JmxMonitoredMap.java:231)
[junit4:junit4]   2> 	at com.sun.jmx.interceptor.DefaultMBeanServerInterceptor.getClassName(DefaultMBeanServerInterceptor.java:1824)
[junit4:junit4]   2> 	at com.sun.jmx.interceptor.DefaultMBeanServerInterceptor.safeGetClassName(DefaultMBeanServerInterceptor.java:1661)
[junit4:junit4]   2> 	at com.sun.jmx.interceptor.DefaultMBeanServerInterceptor.checkMBeanPermission(DefaultMBeanServerInterceptor.java:1833)
[junit4:junit4]   2> 	at com.sun.jmx.interceptor.DefaultMBeanServerInterceptor.exclusiveUnregisterMBean(DefaultMBeanServerInterceptor.java:436)
[junit4:junit4]   2> 	at com.sun.jmx.interceptor.DefaultMBeanServerInterceptor.unregisterMBean(DefaultMBeanServerInterceptor.java:421)
[junit4:junit4]   2> 	at com.sun.jmx.mbeanserver.JmxMBeanServer.unregisterMBean(JmxMBeanServer.java:540)
[junit4:junit4]   2> 	at org.apache.solr.core.JmxMonitoredMap.unregister(JmxMonitoredMap.java:175)
[junit4:junit4]   2> 	at org.apache.solr.core.JmxMonitoredMap.clear(JmxMonitoredMap.java:116)
[junit4:junit4]   2> 	at org.apache.solr.core.SolrCore.close(SolrCore.java:864)
[junit4:junit4]   2> 	at org.apache.solr.cloud.ShardLeaderElectionContext.runLeaderProcess(ElectionContext.java:213)
[junit4:junit4]   2> 	at org.apache.solr.cloud.LeaderElector.runIamLeaderProcess(LeaderElector.java:158)
[junit4:junit4]   2> 	at org.apache.solr.cloud.LeaderElector.checkIfIamLeader(LeaderElector.java:102)
[junit4:junit4]   2> 	at org.apache.solr.cloud.LeaderElector.access$000(LeaderElector.java:56)
[junit4:junit4]   2> 	at org.apache.solr.cloud.LeaderElector$1.process(LeaderElector.java:131)
[junit4:junit4]   2> 	at org.apache.zookeeper.ClientCnxn$EventThread.processEvent(ClientCnxn.java:526)
[junit4:junit4]   2> 	at org.apache.zookeeper.ClientCnxn$EventThread.run(ClientCnxn.java:502)
[junit4:junit4]   2> 
[junit4:junit4]   2> 317823 T183 oasc.SolrCore.closeSearcher [collection1] Closing main searcher on request.
[junit4:junit4]   2> 317828 T183 oasu.DirectUpdateHandler2.close closing DirectUpdateHandler2{commits=5,autocommits=0,soft autocommits=0,optimizes=0,rollbacks=0,expungeDeletes=0,docsPending=0,adds=0,deletesById=0,deletesByQuery=0,errors=0,cumulative_adds=35,cumulative_deletesById=0,cumulative_deletesByQuery=0,cumulative_errors=0}
[junit4:junit4]   2> 317828 T183 oasu.DefaultSolrCoreState.decref SolrCoreState ref count has reached 0 - closing IndexWriter
[junit4:junit4]   2> 317830 T183 oasu.DefaultSolrCoreState.decref Closing SolrCoreState - canceling any ongoing recovery
[junit4:junit4]   2> 317831 T183 oascc.ZkStateReader$3.process Updating live nodes
[junit4:junit4]   2> 317831 T183 oascc.ZkStateReader$3.process WARNING ZooKeeper watch triggered, but Solr cannot talk to ZK
[junit4:junit4]   2> 317831 T183 oascc.ZkStateReader$2.process A cluster state change has occurred - updating...
[junit4:junit4]   2> 317831 T183 oascc.ZkStateReader$2.process WARNING ZooKeeper watch triggered, but Solr cannot talk to ZK
[junit4:junit4]   2> 317831 T183 oascc.ConnectionManager.process Watcher org.apache.solr.common.cloud.ConnectionManager@2c9a53a2 name:ZooKeeperConnection Watcher:127.0.0.1:39260/solr got event WatchedEvent state:Disconnected type:None path:null path:null type:None
[junit4:junit4]   2> 317832 T183 oascc.ConnectionManager.process Client->ZooKeeper status change trigger but we are already closed
[junit4:junit4]   2> 317832 T183 oaz.ClientCnxn$EventThread.run EventThread shut down
[junit4:junit4]   2> NOTE: test params are: codec=Lucene40: {n_f1=PostingsFormat(name=MockSep), foo_b=PostingsFormat(name=NestedPulsing), foo_d=Pulsing40(freqCutoff=18 minBlockSize=43 maxBlockSize=88), foo_f=PostingsFormat(name=NestedPulsing), n_tl1=PostingsFormat(name=MockSep), n_d1=MockVariableIntBlock(baseBlockSize=8), rnd_b=Pulsing40(freqCutoff=18 minBlockSize=43 maxBlockSize=88), intDefault=PostingsFormat(name=MockSep), n_td1=PostingsFormat(name=MockSep), id=Pulsing40(freqCutoff=18 minBlockSize=43 maxBlockSize=88), timestamp=MockVariableIntBlock(baseBlockSize=8), range_facet_sl=Pulsing40(freqCutoff=18 minBlockSize=43 maxBlockSize=88), range_facet_si=MockVariableIntBlock(baseBlockSize=8), oddField_s=Pulsing40(freqCutoff=18 minBlockSize=43 maxBlockSize=88), multiDefault=MockVariableIntBlock(baseBlockSize=8), n_tf1=MockVariableIntBlock(baseBlockSize=8), n_dt1=PostingsFormat(name=MockSep), n_ti1=Pulsing40(freqCutoff=18 minBlockSize=43 maxBlockSize=88), range_facet_l=MockVariableIntBlock(baseBlockSize=8), text=PostingsFormat(name=NestedPulsing), _version_=PostingsFormat(name=MockSep), SubjectTerms_mfacet=PostingsFormat(name=MockSep), a_t=MockVariableIntBlock(baseBlockSize=8), n_tdt1=PostingsFormat(name=MockSep), other_tl1=PostingsFormat(name=MockSep), n_l1=MockVariableIntBlock(baseBlockSize=8), a_si=PostingsFormat(name=MockSep)}, sim=DefaultSimilarity, locale=sv, timezone=Africa/Niamey
[junit4:junit4]   2> NOTE: FreeBSD 9.0-RELEASE amd64/Sun Microsystems Inc. 1.6.0_32 (64-bit)/cpus=16,threads=2,free=46219000,total=170983424
[junit4:junit4]   2> NOTE: All tests run in this JVM: [TestRTGBase, TestRealTimeGet, UUIDFieldTest, StatelessScriptUpdateProcessorFactoryTest, TestPropInject, TestValueSourceCache, LegacyHTMLStripCharFilterTest, TestRecovery, DirectUpdateHandlerTest, BasicDistributedZk2Test]
[junit4:junit4] Completed on J1 in 318.53s, 1 test, 1 failure <<< FAILURES!

[...truncated 514 lines...]
BUILD FAILED
/usr/home/hudson/hudson-slave/workspace/Lucene-Solr-Tests-4.x-Java6/build.xml:32: The following error occurred while executing this line:
/usr/home/hudson/hudson-slave/workspace/Lucene-Solr-Tests-4.x-Java6/solr/build.xml:146: The following error occurred while executing this line:
/usr/home/hudson/hudson-slave/workspace/Lucene-Solr-Tests-4.x-Java6/lucene/module-build.xml:63: The following error occurred while executing this line:
/usr/home/hudson/hudson-slave/workspace/Lucene-Solr-Tests-4.x-Java6/lucene/common-build.xml:1133: The following error occurred while executing this line:
/usr/home/hudson/hudson-slave/workspace/Lucene-Solr-Tests-4.x-Java6/lucene/common-build.xml:810: There were test failures: 229 suites, 927 tests, 1 failure, 6 ignored (1 assumption)

Total time: 31 minutes 6 seconds
Build step 'Invoke Ant' marked build as failure
Recording test results
Email was triggered for: Failure
Sending email for trigger: Failure



Mime
View raw message