lucene-dev mailing list archives

Site index · List index
Message view « Date » · « Thread »
Top « Date » · « Thread »
From Policeman Jenkins Server <jenk...@sd-datasolutions.de>
Subject [JENKINS] Lucene-Solr-4.x-Linux (64bit/ibm-j9-jdk7) - Build # 1307 - Failure!
Date Sun, 23 Sep 2012 19:03:11 GMT
Build: http://jenkins.sd-datasolutions.de/job/Lucene-Solr-4.x-Linux/1307/
Java: 64bit/ibm-j9-jdk7 -Xjit:exclude={org/apache/lucene/util/fst/FST.pack(IIF)Lorg/apache/lucene/util/fst/FST;}

2 tests failed.
REGRESSION:  org.apache.solr.cloud.BasicDistributedZkTest.testDistribSearch

Error Message:
.response[id=2][range_facet_si]==null

Stack Trace:
junit.framework.AssertionFailedError: .response[id=2][range_facet_si]==null
	at __randomizedtesting.SeedInfo.seed([E46A8309362DEB31:658C0D1141728B0D]:0)
	at junit.framework.Assert.fail(Assert.java:50)
	at org.apache.solr.BaseDistributedSearchTestCase.compareResponses(BaseDistributedSearchTestCase.java:686)
	at org.apache.solr.BaseDistributedSearchTestCase.query(BaseDistributedSearchTestCase.java:396)
	at org.apache.solr.cloud.BasicDistributedZkTest.doTest(BasicDistributedZkTest.java:310)
	at org.apache.solr.BaseDistributedSearchTestCase.testDistribSearch(BaseDistributedSearchTestCase.java:695)
	at sun.reflect.NativeMethodAccessorImpl.invoke0(Native Method)
	at sun.reflect.NativeMethodAccessorImpl.invoke(NativeMethodAccessorImpl.java:88)
	at sun.reflect.DelegatingMethodAccessorImpl.invoke(DelegatingMethodAccessorImpl.java:55)
	at java.lang.reflect.Method.invoke(Method.java:613)
	at com.carrotsearch.randomizedtesting.RandomizedRunner.invoke(RandomizedRunner.java:1559)
	at com.carrotsearch.randomizedtesting.RandomizedRunner.access$600(RandomizedRunner.java:79)
	at com.carrotsearch.randomizedtesting.RandomizedRunner$6.evaluate(RandomizedRunner.java:737)
	at com.carrotsearch.randomizedtesting.RandomizedRunner$7.evaluate(RandomizedRunner.java:773)
	at com.carrotsearch.randomizedtesting.RandomizedRunner$8.evaluate(RandomizedRunner.java:787)
	at com.carrotsearch.randomizedtesting.rules.SystemPropertiesRestoreRule$1.evaluate(SystemPropertiesRestoreRule.java:53)
	at org.apache.lucene.util.TestRuleSetupTeardownChained$1.evaluate(TestRuleSetupTeardownChained.java:50)
	at org.apache.lucene.util.TestRuleFieldCacheSanity$1.evaluate(TestRuleFieldCacheSanity.java:51)
	at org.apache.lucene.util.AbstractBeforeAfterRule$1.evaluate(AbstractBeforeAfterRule.java:45)
	at com.carrotsearch.randomizedtesting.rules.SystemPropertiesInvariantRule$1.evaluate(SystemPropertiesInvariantRule.java:55)
	at org.apache.lucene.util.TestRuleThreadAndTestName$1.evaluate(TestRuleThreadAndTestName.java:48)
	at org.apache.lucene.util.TestRuleIgnoreAfterMaxFailures$1.evaluate(TestRuleIgnoreAfterMaxFailures.java:70)
	at org.apache.lucene.util.TestRuleMarkFailure$1.evaluate(TestRuleMarkFailure.java:48)
	at com.carrotsearch.randomizedtesting.rules.StatementAdapter.evaluate(StatementAdapter.java:36)
	at com.carrotsearch.randomizedtesting.ThreadLeakControl$StatementRunner.run(ThreadLeakControl.java:358)
	at com.carrotsearch.randomizedtesting.ThreadLeakControl.forkTimeoutingTask(ThreadLeakControl.java:782)
	at com.carrotsearch.randomizedtesting.ThreadLeakControl$3.evaluate(ThreadLeakControl.java:442)
	at com.carrotsearch.randomizedtesting.RandomizedRunner.runSingleTest(RandomizedRunner.java:746)
	at com.carrotsearch.randomizedtesting.RandomizedRunner$3.evaluate(RandomizedRunner.java:648)
	at com.carrotsearch.randomizedtesting.RandomizedRunner$4.evaluate(RandomizedRunner.java:682)
	at com.carrotsearch.randomizedtesting.RandomizedRunner$5.evaluate(RandomizedRunner.java:693)
	at com.carrotsearch.randomizedtesting.rules.StatementAdapter.evaluate(StatementAdapter.java:36)
	at com.carrotsearch.randomizedtesting.rules.SystemPropertiesRestoreRule$1.evaluate(SystemPropertiesRestoreRule.java:53)
	at org.apache.lucene.util.AbstractBeforeAfterRule$1.evaluate(AbstractBeforeAfterRule.java:45)
	at org.apache.lucene.util.TestRuleStoreClassName$1.evaluate(TestRuleStoreClassName.java:42)
	at com.carrotsearch.randomizedtesting.rules.SystemPropertiesInvariantRule$1.evaluate(SystemPropertiesInvariantRule.java:55)
	at com.carrotsearch.randomizedtesting.rules.NoShadowingOrOverridesOnMethodsRule$1.evaluate(NoShadowingOrOverridesOnMethodsRule.java:39)
	at com.carrotsearch.randomizedtesting.rules.NoShadowingOrOverridesOnMethodsRule$1.evaluate(NoShadowingOrOverridesOnMethodsRule.java:39)
	at com.carrotsearch.randomizedtesting.rules.StatementAdapter.evaluate(StatementAdapter.java:36)
	at org.apache.lucene.util.TestRuleAssertionsRequired$1.evaluate(TestRuleAssertionsRequired.java:43)
	at org.apache.lucene.util.TestRuleMarkFailure$1.evaluate(TestRuleMarkFailure.java:48)
	at org.apache.lucene.util.TestRuleIgnoreAfterMaxFailures$1.evaluate(TestRuleIgnoreAfterMaxFailures.java:70)
	at org.apache.lucene.util.TestRuleIgnoreTestSuites$1.evaluate(TestRuleIgnoreTestSuites.java:55)
	at com.carrotsearch.randomizedtesting.rules.StatementAdapter.evaluate(StatementAdapter.java:36)
	at com.carrotsearch.randomizedtesting.ThreadLeakControl$StatementRunner.run(ThreadLeakControl.java:358)
	at java.lang.Thread.run(Thread.java:777)


REGRESSION:  org.apache.solr.handler.component.DistributedQueryElevationComponentTest.testDistribSearch

Error Message:
Server at http://127.0.0.1:34515/solr returned non ok status:500, message:Server Error

Stack Trace:
org.apache.solr.common.SolrException: Server at http://127.0.0.1:34515/solr returned non ok status:500, message:Server Error
	at __randomizedtesting.SeedInfo.seed([E46A8309362DEB31:658C0D1141728B0D]:0)
	at org.apache.solr.client.solrj.impl.HttpSolrServer.request(HttpSolrServer.java:373)
	at org.apache.solr.client.solrj.impl.HttpSolrServer.request(HttpSolrServer.java:182)
	at org.apache.solr.client.solrj.request.QueryRequest.process(QueryRequest.java:90)
	at org.apache.solr.client.solrj.SolrServer.query(SolrServer.java:324)
	at org.apache.solr.BaseDistributedSearchTestCase.queryServer(BaseDistributedSearchTestCase.java:371)
	at org.apache.solr.BaseDistributedSearchTestCase.query(BaseDistributedSearchTestCase.java:394)
	at org.apache.solr.BaseDistributedSearchTestCase.query(BaseDistributedSearchTestCase.java:376)
	at org.apache.solr.handler.component.DistributedQueryElevationComponentTest.doTest(DistributedQueryElevationComponentTest.java:83)
	at org.apache.solr.BaseDistributedSearchTestCase.testDistribSearch(BaseDistributedSearchTestCase.java:695)
	at sun.reflect.NativeMethodAccessorImpl.invoke0(Native Method)
	at sun.reflect.NativeMethodAccessorImpl.invoke(NativeMethodAccessorImpl.java:88)
	at sun.reflect.DelegatingMethodAccessorImpl.invoke(DelegatingMethodAccessorImpl.java:55)
	at java.lang.reflect.Method.invoke(Method.java:613)
	at com.carrotsearch.randomizedtesting.RandomizedRunner.invoke(RandomizedRunner.java:1559)
	at com.carrotsearch.randomizedtesting.RandomizedRunner.access$600(RandomizedRunner.java:79)
	at com.carrotsearch.randomizedtesting.RandomizedRunner$6.evaluate(RandomizedRunner.java:737)
	at com.carrotsearch.randomizedtesting.RandomizedRunner$7.evaluate(RandomizedRunner.java:773)
	at com.carrotsearch.randomizedtesting.RandomizedRunner$8.evaluate(RandomizedRunner.java:787)
	at com.carrotsearch.randomizedtesting.rules.SystemPropertiesRestoreRule$1.evaluate(SystemPropertiesRestoreRule.java:53)
	at org.apache.lucene.util.TestRuleSetupTeardownChained$1.evaluate(TestRuleSetupTeardownChained.java:50)
	at org.apache.lucene.util.TestRuleFieldCacheSanity$1.evaluate(TestRuleFieldCacheSanity.java:51)
	at org.apache.lucene.util.AbstractBeforeAfterRule$1.evaluate(AbstractBeforeAfterRule.java:45)
	at com.carrotsearch.randomizedtesting.rules.SystemPropertiesInvariantRule$1.evaluate(SystemPropertiesInvariantRule.java:55)
	at org.apache.lucene.util.TestRuleThreadAndTestName$1.evaluate(TestRuleThreadAndTestName.java:48)
	at org.apache.lucene.util.TestRuleIgnoreAfterMaxFailures$1.evaluate(TestRuleIgnoreAfterMaxFailures.java:70)
	at org.apache.lucene.util.TestRuleMarkFailure$1.evaluate(TestRuleMarkFailure.java:48)
	at com.carrotsearch.randomizedtesting.rules.StatementAdapter.evaluate(StatementAdapter.java:36)
	at com.carrotsearch.randomizedtesting.ThreadLeakControl$StatementRunner.run(ThreadLeakControl.java:358)
	at com.carrotsearch.randomizedtesting.ThreadLeakControl.forkTimeoutingTask(ThreadLeakControl.java:782)
	at com.carrotsearch.randomizedtesting.ThreadLeakControl$3.evaluate(ThreadLeakControl.java:442)
	at com.carrotsearch.randomizedtesting.RandomizedRunner.runSingleTest(RandomizedRunner.java:746)
	at com.carrotsearch.randomizedtesting.RandomizedRunner$3.evaluate(RandomizedRunner.java:648)
	at com.carrotsearch.randomizedtesting.RandomizedRunner$4.evaluate(RandomizedRunner.java:682)
	at com.carrotsearch.randomizedtesting.RandomizedRunner$5.evaluate(RandomizedRunner.java:693)
	at com.carrotsearch.randomizedtesting.rules.StatementAdapter.evaluate(StatementAdapter.java:36)
	at com.carrotsearch.randomizedtesting.rules.SystemPropertiesRestoreRule$1.evaluate(SystemPropertiesRestoreRule.java:53)
	at org.apache.lucene.util.AbstractBeforeAfterRule$1.evaluate(AbstractBeforeAfterRule.java:45)
	at org.apache.lucene.util.TestRuleStoreClassName$1.evaluate(TestRuleStoreClassName.java:42)
	at com.carrotsearch.randomizedtesting.rules.SystemPropertiesInvariantRule$1.evaluate(SystemPropertiesInvariantRule.java:55)
	at com.carrotsearch.randomizedtesting.rules.NoShadowingOrOverridesOnMethodsRule$1.evaluate(NoShadowingOrOverridesOnMethodsRule.java:39)
	at com.carrotsearch.randomizedtesting.rules.NoShadowingOrOverridesOnMethodsRule$1.evaluate(NoShadowingOrOverridesOnMethodsRule.java:39)
	at com.carrotsearch.randomizedtesting.rules.StatementAdapter.evaluate(StatementAdapter.java:36)
	at org.apache.lucene.util.TestRuleAssertionsRequired$1.evaluate(TestRuleAssertionsRequired.java:43)
	at org.apache.lucene.util.TestRuleMarkFailure$1.evaluate(TestRuleMarkFailure.java:48)
	at org.apache.lucene.util.TestRuleIgnoreAfterMaxFailures$1.evaluate(TestRuleIgnoreAfterMaxFailures.java:70)
	at org.apache.lucene.util.TestRuleIgnoreTestSuites$1.evaluate(TestRuleIgnoreTestSuites.java:55)
	at com.carrotsearch.randomizedtesting.rules.StatementAdapter.evaluate(StatementAdapter.java:36)
	at com.carrotsearch.randomizedtesting.ThreadLeakControl$StatementRunner.run(ThreadLeakControl.java:358)
	at java.lang.Thread.run(Thread.java:777)




Build Log:
[...truncated 7959 lines...]
[junit4:junit4] Suite: org.apache.solr.cloud.BasicDistributedZkTest
[junit4:junit4]   2> 4 T1328 oas.SolrTestCaseJ4.setUp ###Starting testDistribSearch
[junit4:junit4]   2> Creating dataDir: /mnt/ssd/jenkins/workspace/Lucene-Solr-4.x-Linux/solr/build/solr-core/test/J0/./solrtest-BasicDistributedZkTest-1348426825792
[junit4:junit4]   2> 5 T1328 oasc.ZkTestServer.run STARTING ZK TEST SERVER
[junit4:junit4]   2> 6 T1329 oazs.ZooKeeperServer.setTickTime tickTime set to 1000
[junit4:junit4]   2> 6 T1329 oazs.NIOServerCnxn$Factory.<init> binding to port 0.0.0.0/0.0.0.0:0
[junit4:junit4]   2> 7 T1329 oazsp.FileTxnSnapLog.save Snapshotting: 0
[junit4:junit4]   2> 105 T1328 oasc.ZkTestServer.run start zk server on port:41208
[junit4:junit4]   2> 106 T1328 oaz.ZooKeeper.<init> Initiating client connection, connectString=127.0.0.1:41208 sessionTimeout=10000 watcher=org.apache.solr.common.cloud.ConnectionManager@7851421f
[junit4:junit4]   2> 107 T1334 oaz.ClientCnxn$SendThread.startConnect Opening socket connection to server /127.0.0.1:41208
[junit4:junit4]   2> 107 T1328 oascc.ConnectionManager.waitForConnected Waiting for client to connect to ZooKeeper
[junit4:junit4]   2> 107 T1334 oaz.ClientCnxn$SendThread.primeConnection Socket connection established to localhost.localdomain/127.0.0.1:41208, initiating session
[junit4:junit4]   2> 107 T1330 oazs.NIOServerCnxn$Factory.run Accepted socket connection from /127.0.0.1:53382
[junit4:junit4]   2> 108 T1330 oazs.NIOServerCnxn.readConnectRequest Client attempting to establish new session at /127.0.0.1:53382
[junit4:junit4]   2> 108 T1332 oazsp.FileTxnLog.append Creating new log file: log.1
[junit4:junit4]   2> 183 T1332 oazs.NIOServerCnxn.finishSessionInit Established session 0x139f48080430000 with negotiated timeout 10000 for client /127.0.0.1:53382
[junit4:junit4]   2> 183 T1334 oaz.ClientCnxn$SendThread.readConnectResult Session establishment complete on server localhost.localdomain/127.0.0.1:41208, sessionid = 0x139f48080430000, negotiated timeout = 10000
[junit4:junit4]   2> 183 T1335 oascc.ConnectionManager.process Watcher org.apache.solr.common.cloud.ConnectionManager@7851421f name:ZooKeeperConnection Watcher:127.0.0.1:41208 got event WatchedEvent state:SyncConnected type:None path:null path:null type:None
[junit4:junit4]   2> 184 T1328 oascc.ConnectionManager.waitForConnected Client is connected to ZooKeeper
[junit4:junit4]   2> 184 T1328 oascc.SolrZkClient.makePath makePath: /solr
[junit4:junit4]   2> 187 T1333 oazs.PrepRequestProcessor.pRequest Processed session termination for sessionid: 0x139f48080430000
[junit4:junit4]   2> 187 T1335 oaz.ClientCnxn$EventThread.run EventThread shut down
[junit4:junit4]   2> 187 T1328 oaz.ZooKeeper.close Session: 0x139f48080430000 closed
[junit4:junit4]   2> 187 T1330 oazs.NIOServerCnxn.closeSock Closed socket connection for client /127.0.0.1:53382 which had sessionid 0x139f48080430000
[junit4:junit4]   2> 188 T1328 oaz.ZooKeeper.<init> Initiating client connection, connectString=127.0.0.1:41208/solr sessionTimeout=10000 watcher=org.apache.solr.common.cloud.ConnectionManager@f142a391
[junit4:junit4]   2> 188 T1336 oaz.ClientCnxn$SendThread.startConnect Opening socket connection to server /127.0.0.1:41208
[junit4:junit4]   2> 188 T1328 oascc.ConnectionManager.waitForConnected Waiting for client to connect to ZooKeeper
[junit4:junit4]   2> 189 T1336 oaz.ClientCnxn$SendThread.primeConnection Socket connection established to localhost.localdomain/127.0.0.1:41208, initiating session
[junit4:junit4]   2> 189 T1330 oazs.NIOServerCnxn$Factory.run Accepted socket connection from /127.0.0.1:53383
[junit4:junit4]   2> 189 T1330 oazs.NIOServerCnxn.readConnectRequest Client attempting to establish new session at /127.0.0.1:53383
[junit4:junit4]   2> 190 T1332 oazs.NIOServerCnxn.finishSessionInit Established session 0x139f48080430001 with negotiated timeout 10000 for client /127.0.0.1:53383
[junit4:junit4]   2> 190 T1336 oaz.ClientCnxn$SendThread.readConnectResult Session establishment complete on server localhost.localdomain/127.0.0.1:41208, sessionid = 0x139f48080430001, negotiated timeout = 10000
[junit4:junit4]   2> 191 T1337 oascc.ConnectionManager.process Watcher org.apache.solr.common.cloud.ConnectionManager@f142a391 name:ZooKeeperConnection Watcher:127.0.0.1:41208/solr got event WatchedEvent state:SyncConnected type:None path:null path:null type:None
[junit4:junit4]   2> 191 T1328 oascc.ConnectionManager.waitForConnected Client is connected to ZooKeeper
[junit4:junit4]   2> 191 T1328 oascc.SolrZkClient.makePath makePath: /collections/collection1
[junit4:junit4]   2> 193 T1328 oascc.SolrZkClient.makePath makePath: /collections/collection1/shards
[junit4:junit4]   2> 195 T1328 oascc.SolrZkClient.makePath makePath: /collections/control_collection
[junit4:junit4]   2> 196 T1328 oascc.SolrZkClient.makePath makePath: /collections/control_collection/shards
[junit4:junit4]   2> 201 T1328 oasc.AbstractZkTestCase.putConfig put /mnt/ssd/jenkins/workspace/Lucene-Solr-4.x-Linux/solr/build/solr-core/test-files/solr/collection1/conf/solrconfig.xml to /configs/conf1/solrconfig.xml
[junit4:junit4]   2> 202 T1328 oascc.SolrZkClient.makePath makePath: /configs/conf1/solrconfig.xml
[junit4:junit4]   2> 205 T1328 oasc.AbstractZkTestCase.putConfig put /mnt/ssd/jenkins/workspace/Lucene-Solr-4.x-Linux/solr/build/solr-core/test-files/solr/collection1/conf/schema.xml to /configs/conf1/schema.xml
[junit4:junit4]   2> 206 T1328 oascc.SolrZkClient.makePath makePath: /configs/conf1/schema.xml
[junit4:junit4]   2> 208 T1328 oasc.AbstractZkTestCase.putConfig put /mnt/ssd/jenkins/workspace/Lucene-Solr-4.x-Linux/solr/build/solr-core/test-files/solr/collection1/conf/solrconfig.xml to /configs/conf1/solrconfig.xml
[junit4:junit4]   2> 209 T1328 oascc.SolrZkClient.makePath makePath: /configs/conf1/solrconfig.xml
[junit4:junit4]   2> 211 T1328 oasc.AbstractZkTestCase.putConfig put /mnt/ssd/jenkins/workspace/Lucene-Solr-4.x-Linux/solr/build/solr-core/test-files/solr/collection1/conf/stopwords.txt to /configs/conf1/stopwords.txt
[junit4:junit4]   2> 211 T1328 oascc.SolrZkClient.makePath makePath: /configs/conf1/stopwords.txt
[junit4:junit4]   2> 213 T1328 oasc.AbstractZkTestCase.putConfig put /mnt/ssd/jenkins/workspace/Lucene-Solr-4.x-Linux/solr/build/solr-core/test-files/solr/collection1/conf/protwords.txt to /configs/conf1/protwords.txt
[junit4:junit4]   2> 213 T1328 oascc.SolrZkClient.makePath makePath: /configs/conf1/protwords.txt
[junit4:junit4]   2> 215 T1328 oasc.AbstractZkTestCase.putConfig put /mnt/ssd/jenkins/workspace/Lucene-Solr-4.x-Linux/solr/build/solr-core/test-files/solr/collection1/conf/currency.xml to /configs/conf1/currency.xml
[junit4:junit4]   2> 215 T1328 oascc.SolrZkClient.makePath makePath: /configs/conf1/currency.xml
[junit4:junit4]   2> 217 T1328 oasc.AbstractZkTestCase.putConfig put /mnt/ssd/jenkins/workspace/Lucene-Solr-4.x-Linux/solr/build/solr-core/test-files/solr/collection1/conf/open-exchange-rates.json to /configs/conf1/open-exchange-rates.json
[junit4:junit4]   2> 217 T1328 oascc.SolrZkClient.makePath makePath: /configs/conf1/open-exchange-rates.json
[junit4:junit4]   2> 219 T1328 oasc.AbstractZkTestCase.putConfig put /mnt/ssd/jenkins/workspace/Lucene-Solr-4.x-Linux/solr/build/solr-core/test-files/solr/collection1/conf/mapping-ISOLatin1Accent.txt to /configs/conf1/mapping-ISOLatin1Accent.txt
[junit4:junit4]   2> 220 T1328 oascc.SolrZkClient.makePath makePath: /configs/conf1/mapping-ISOLatin1Accent.txt
[junit4:junit4]   2> 221 T1328 oasc.AbstractZkTestCase.putConfig put /mnt/ssd/jenkins/workspace/Lucene-Solr-4.x-Linux/solr/build/solr-core/test-files/solr/collection1/conf/old_synonyms.txt to /configs/conf1/old_synonyms.txt
[junit4:junit4]   2> 222 T1328 oascc.SolrZkClient.makePath makePath: /configs/conf1/old_synonyms.txt
[junit4:junit4]   2> 223 T1328 oasc.AbstractZkTestCase.putConfig put /mnt/ssd/jenkins/workspace/Lucene-Solr-4.x-Linux/solr/build/solr-core/test-files/solr/collection1/conf/synonyms.txt to /configs/conf1/synonyms.txt
[junit4:junit4]   2> 223 T1328 oascc.SolrZkClient.makePath makePath: /configs/conf1/synonyms.txt
[junit4:junit4]   2> 225 T1333 oazs.PrepRequestProcessor.pRequest Processed session termination for sessionid: 0x139f48080430001
[junit4:junit4]   2> 225 T1330 oazs.NIOServerCnxn.closeSock Closed socket connection for client /127.0.0.1:53383 which had sessionid 0x139f48080430001
[junit4:junit4]   2> 225 T1328 oaz.ZooKeeper.close Session: 0x139f48080430001 closed
[junit4:junit4]   2> 226 T1337 oaz.ClientCnxn$EventThread.run EventThread shut down
[junit4:junit4]   2> 227 T1328 oejs.Server.doStart jetty-8.1.2.v20120308
[junit4:junit4]   2> 229 T1328 oejs.AbstractConnector.doStart Started SocketConnector@0.0.0.0:46282
[junit4:junit4]   2> 229 T1328 oasc.SolrResourceLoader.locateSolrHome JNDI not configured for solr (NoInitialContextEx)
[junit4:junit4]   2> 230 T1328 oasc.SolrResourceLoader.locateSolrHome using system property solr.solr.home: /mnt/ssd/jenkins/workspace/Lucene-Solr-4.x-Linux/solr/build/solr-core/test-files/solr
[junit4:junit4]   2> 230 T1328 oasc.SolrResourceLoader.<init> new SolrResourceLoader for deduced Solr Home: '/mnt/ssd/jenkins/workspace/Lucene-Solr-4.x-Linux/solr/build/solr-core/test-files/solr/'
[junit4:junit4]   2> 238 T1328 oass.SolrDispatchFilter.init SolrDispatchFilter.init()
[junit4:junit4]   2> 239 T1328 oasc.SolrResourceLoader.locateSolrHome JNDI not configured for solr (NoInitialContextEx)
[junit4:junit4]   2> 239 T1328 oasc.SolrResourceLoader.locateSolrHome using system property solr.solr.home: /mnt/ssd/jenkins/workspace/Lucene-Solr-4.x-Linux/solr/build/solr-core/test-files/solr
[junit4:junit4]   2> 239 T1328 oasc.CoreContainer$Initializer.initialize looking for solr.xml: /mnt/ssd/jenkins/workspace/Lucene-Solr-4.x-Linux/solr/build/solr-core/test-files/solr/solr.xml
[junit4:junit4]   2> 240 T1328 oasc.CoreContainer.<init> New CoreContainer 1439283119
[junit4:junit4]   2> 240 T1328 oasc.CoreContainer.load Loading CoreContainer using Solr Home: '/mnt/ssd/jenkins/workspace/Lucene-Solr-4.x-Linux/solr/build/solr-core/test-files/solr/'
[junit4:junit4]   2> 241 T1328 oasc.SolrResourceLoader.<init> new SolrResourceLoader for directory: '/mnt/ssd/jenkins/workspace/Lucene-Solr-4.x-Linux/solr/build/solr-core/test-files/solr/'
[junit4:junit4]   2> 252 T1328 oasc.CoreContainer.load Registering Log Listener
[junit4:junit4]   2> 259 T1328 oasc.CoreContainer.initZooKeeper Zookeeper client=127.0.0.1:41208/solr
[junit4:junit4]   2> 259 T1328 oaz.ZooKeeper.<init> Initiating client connection, connectString=127.0.0.1:41208/solr sessionTimeout=5000 watcher=org.apache.solr.common.cloud.ConnectionManager@f6cc9959
[junit4:junit4]   2> 260 T1347 oaz.ClientCnxn$SendThread.startConnect Opening socket connection to server /127.0.0.1:41208
[junit4:junit4]   2> 260 T1328 oascc.ConnectionManager.waitForConnected Waiting for client to connect to ZooKeeper
[junit4:junit4]   2> 261 T1347 oaz.ClientCnxn$SendThread.primeConnection Socket connection established to localhost.localdomain/127.0.0.1:41208, initiating session
[junit4:junit4]   2> 261 T1330 oazs.NIOServerCnxn$Factory.run Accepted socket connection from /127.0.0.1:53384
[junit4:junit4]   2> 261 T1330 oazs.NIOServerCnxn.readConnectRequest Client attempting to establish new session at /127.0.0.1:53384
[junit4:junit4]   2> 263 T1332 oazs.NIOServerCnxn.finishSessionInit Established session 0x139f48080430002 with negotiated timeout 5000 for client /127.0.0.1:53384
[junit4:junit4]   2> 263 T1347 oaz.ClientCnxn$SendThread.readConnectResult Session establishment complete on server localhost.localdomain/127.0.0.1:41208, sessionid = 0x139f48080430002, negotiated timeout = 5000
[junit4:junit4]   2> 263 T1348 oascc.ConnectionManager.process Watcher org.apache.solr.common.cloud.ConnectionManager@f6cc9959 name:ZooKeeperConnection Watcher:127.0.0.1:41208/solr got event WatchedEvent state:SyncConnected type:None path:null path:null type:None
[junit4:junit4]   2> 264 T1328 oascc.ConnectionManager.waitForConnected Client is connected to ZooKeeper
[junit4:junit4]   2> 265 T1333 oazs.PrepRequestProcessor.pRequest Got user-level KeeperException when processing sessionid:0x139f48080430002 type:create cxid:0x2 zxid:0xfffffffffffffffe txntype:unknown reqpath:n/a Error Path:/solr/overseer Error:KeeperErrorCode = NodeExists for /solr/overseer
[junit4:junit4]   2> 265 T1328 oascc.SolrZkClient.makePath makePath: /live_nodes
[junit4:junit4]   2> 267 T1328 oasc.ZkController.createEphemeralLiveNode Register node as live in ZooKeeper:/live_nodes/127.0.0.1:46282_solr
[junit4:junit4]   2> 267 T1333 oazs.PrepRequestProcessor.pRequest Got user-level KeeperException when processing sessionid:0x139f48080430002 type:delete cxid:0x7 zxid:0xfffffffffffffffe txntype:unknown reqpath:n/a Error Path:/solr/live_nodes/127.0.0.1:46282_solr Error:KeeperErrorCode = NoNode for /solr/live_nodes/127.0.0.1:46282_solr
[junit4:junit4]   2> 268 T1328 oascc.SolrZkClient.makePath makePath: /live_nodes/127.0.0.1:46282_solr
[junit4:junit4]   2> 269 T1328 oashc.HttpShardHandlerFactory.getParameter Setting socketTimeout to: 0
[junit4:junit4]   2> 269 T1328 oashc.HttpShardHandlerFactory.getParameter Setting urlScheme to: http://
[junit4:junit4]   2> 270 T1328 oashc.HttpShardHandlerFactory.getParameter Setting connTimeout to: 0
[junit4:junit4]   2> 270 T1328 oashc.HttpShardHandlerFactory.getParameter Setting maxConnectionsPerHost to: 20
[junit4:junit4]   2> 271 T1328 oashc.HttpShardHandlerFactory.getParameter Setting corePoolSize to: 0
[junit4:junit4]   2> 271 T1328 oashc.HttpShardHandlerFactory.getParameter Setting maximumPoolSize to: 2147483647
[junit4:junit4]   2> 272 T1328 oashc.HttpShardHandlerFactory.getParameter Setting maxThreadIdleTime to: 5
[junit4:junit4]   2> 272 T1328 oashc.HttpShardHandlerFactory.getParameter Setting sizeOfQueue to: -1
[junit4:junit4]   2> 272 T1328 oashc.HttpShardHandlerFactory.getParameter Setting fairnessPolicy to: false
[junit4:junit4]   2> 273 T1328 oascsi.HttpClientUtil.createClient Creating new http client, config:maxConnectionsPerHost=20&maxConnections=10000&socketTimeout=0&connTimeout=0&retry=false
[junit4:junit4]   2> 277 T1328 oascc.SolrZkClient.makePath makePath: /overseer_elect/election
[junit4:junit4]   2> 279 T1333 oazs.PrepRequestProcessor.pRequest Got user-level KeeperException when processing sessionid:0x139f48080430002 type:delete cxid:0x15 zxid:0xfffffffffffffffe txntype:unknown reqpath:n/a Error Path:/solr/overseer_elect/leader Error:KeeperErrorCode = NoNode for /solr/overseer_elect/leader
[junit4:junit4]   2> 280 T1328 oascc.SolrZkClient.makePath makePath: /overseer_elect/leader
[junit4:junit4]   2> 281 T1328 oasc.Overseer.start Overseer (id=88370500455301122-127.0.0.1:46282_solr-n_0000000000) starting
[junit4:junit4]   2> 282 T1333 oazs.PrepRequestProcessor.pRequest Got user-level KeeperException when processing sessionid:0x139f48080430002 type:create cxid:0x1a zxid:0xfffffffffffffffe txntype:unknown reqpath:n/a Error Path:/solr/overseer Error:KeeperErrorCode = NodeExists for /solr/overseer
[junit4:junit4]   2> 282 T1333 oazs.PrepRequestProcessor.pRequest Got user-level KeeperException when processing sessionid:0x139f48080430002 type:create cxid:0x1b zxid:0xfffffffffffffffe txntype:unknown reqpath:n/a Error Path:/solr/overseer Error:KeeperErrorCode = NodeExists for /solr/overseer
[junit4:junit4]   2> 283 T1333 oazs.PrepRequestProcessor.pRequest Got user-level KeeperException when processing sessionid:0x139f48080430002 type:create cxid:0x1c zxid:0xfffffffffffffffe txntype:unknown reqpath:n/a Error Path:/solr/overseer Error:KeeperErrorCode = NodeExists for /solr/overseer
[junit4:junit4]   2> 283 T1333 oazs.PrepRequestProcessor.pRequest Got user-level KeeperException when processing sessionid:0x139f48080430002 type:create cxid:0x1d zxid:0xfffffffffffffffe txntype:unknown reqpath:n/a Error Path:/solr/overseer Error:KeeperErrorCode = NodeExists for /solr/overseer
[junit4:junit4]   2> 284 T1350 oasc.OverseerCollectionProcessor.run Process current queue of collection creations
[junit4:junit4]   2> 284 T1328 oascc.SolrZkClient.makePath makePath: /clusterstate.json
[junit4:junit4]   2> 286 T1328 oascc.ZkStateReader.createClusterStateWatchersAndUpdate Updating cluster state from ZooKeeper... 
[junit4:junit4]   2> 287 T1349 oasc.Overseer$ClusterStateUpdater.run Starting to work on the main queue
[junit4:junit4]   2> 289 T1328 oasc.CoreContainer.create Creating SolrCore 'collection1' using instanceDir: /mnt/ssd/jenkins/workspace/Lucene-Solr-4.x-Linux/solr/build/solr-core/test-files/solr/collection1
[junit4:junit4]   2> 290 T1328 oasc.ZkController.createCollectionZkNode Check for collection zkNode:control_collection
[junit4:junit4]   2> 290 T1328 oasc.ZkController.createCollectionZkNode Collection zkNode exists
[junit4:junit4]   2> 291 T1328 oasc.ZkController.readConfigName Load collection config from:/collections/control_collection
[junit4:junit4]   2> 291 T1328 oasc.SolrResourceLoader.<init> new SolrResourceLoader for directory: '/mnt/ssd/jenkins/workspace/Lucene-Solr-4.x-Linux/solr/build/solr-core/test-files/solr/collection1/'
[junit4:junit4]   2> 292 T1328 oasc.SolrResourceLoader.replaceClassLoader Adding 'file:/mnt/ssd/jenkins/workspace/Lucene-Solr-4.x-Linux/solr/build/solr-core/test-files/solr/collection1/lib/README' to classloader
[junit4:junit4]   2> 293 T1328 oasc.SolrResourceLoader.replaceClassLoader Adding 'file:/mnt/ssd/jenkins/workspace/Lucene-Solr-4.x-Linux/solr/build/solr-core/test-files/solr/collection1/lib/classes/' to classloader
[junit4:junit4]   2> 316 T1328 oasc.SolrConfig.<init> Using Lucene MatchVersion: LUCENE_41
[junit4:junit4]   2> 349 T1328 oasc.SolrConfig.<init> Loaded SolrConfig: solrconfig.xml
[junit4:junit4]   2> 350 T1328 oass.IndexSchema.readSchema Reading Solr Schema
[junit4:junit4]   2> 355 T1328 oass.IndexSchema.readSchema Schema name=test
[junit4:junit4]   2> 637 T1328 oass.OpenExchangeRatesOrgProvider.init Initialized with rates=open-exchange-rates.json, refreshInterval=1440.
[junit4:junit4]   2> 642 T1328 oass.IndexSchema.readSchema default search field in schema is text
[junit4:junit4]   2> 645 T1328 oass.IndexSchema.readSchema unique key field: id
[junit4:junit4]   2> 653 T1328 oass.FileExchangeRateProvider.reload Reloading exchange rates from file currency.xml
[junit4:junit4]   2> 656 T1328 oass.FileExchangeRateProvider.reload Reloading exchange rates from file currency.xml
[junit4:junit4]   2> 660 T1328 oass.OpenExchangeRatesOrgProvider.reload Reloading exchange rates from open-exchange-rates.json
[junit4:junit4]   2> 661 T1328 oass.OpenExchangeRatesOrgProvider.reload Reloading exchange rates from open-exchange-rates.json
[junit4:junit4]   2> 662 T1328 oasc.SolrCore.<init> [collection1] Opening new SolrCore at /mnt/ssd/jenkins/workspace/Lucene-Solr-4.x-Linux/solr/build/solr-core/test-files/solr/collection1/, dataDir=./org.apache.solr.cloud.BasicDistributedZkTest-1348426825792/control/data/
[junit4:junit4]   2> 663 T1328 oasc.JmxMonitoredMap.<init> JMX monitoring is enabled. Adding Solr mbeans to JMX Server: com.sun.jmx.mbeanserver.JmxMBeanServer@124ba712
[junit4:junit4]   2> 664 T1328 oasc.SolrCore.getNewIndexDir WARNING New index directory detected: old=null new=./org.apache.solr.cloud.BasicDistributedZkTest-1348426825792/control/data/index/
[junit4:junit4]   2> 664 T1328 oasc.SolrCore.initIndex WARNING [collection1] Solr index directory './org.apache.solr.cloud.BasicDistributedZkTest-1348426825792/control/data/index' doesn't exist. Creating new index...
[junit4:junit4]   2> 665 T1328 oasc.CachingDirectoryFactory.get return new directory for /mnt/ssd/jenkins/workspace/Lucene-Solr-4.x-Linux/solr/build/solr-core/test/J0/./org.apache.solr.cloud.BasicDistributedZkTest-1348426825792/control/data/index forceNew:false
[junit4:junit4]   2> 668 T1328 oasc.SolrDeletionPolicy.onCommit SolrDeletionPolicy.onCommit: commits:num=1
[junit4:junit4]   2> 		commit{dir=NRTCachingDirectory(org.apache.lucene.store.MMapDirectory@/mnt/ssd/jenkins/workspace/Lucene-Solr-4.x-Linux/solr/build/solr-core/test/J0/org.apache.solr.cloud.BasicDistributedZkTest-1348426825792/control/data/index lockFactory=org.apache.lucene.store.NativeFSLockFactory@54de0487; maxCacheMB=48.0 maxMergeSizeMB=4.0),segFN=segments_1,generation=1,filenames=[segments_1]
[junit4:junit4]   2> 669 T1328 oasc.SolrDeletionPolicy.updateCommits newest commit = 1
[junit4:junit4]   2> 670 T1328 oasc.SolrCore.initWriters created xml: solr.XMLResponseWriter
[junit4:junit4]   2> 671 T1328 oasup.UpdateRequestProcessorChain.init inserting DistributedUpdateProcessorFactory into updateRequestProcessorChain "dedupe"
[junit4:junit4]   2> 672 T1328 oasup.UpdateRequestProcessorChain.init inserting DistributedUpdateProcessorFactory into updateRequestProcessorChain "dedupe-allfields"
[junit4:junit4]   2> 672 T1328 oasup.UpdateRequestProcessorChain.init inserting DistributedUpdateProcessorFactory into updateRequestProcessorChain "stored_sig"
[junit4:junit4]   2> 673 T1328 oasup.UpdateRequestProcessorChain.init inserting DistributedUpdateProcessorFactory into updateRequestProcessorChain "uniq-fields"
[junit4:junit4]   2> 673 T1328 oasup.UpdateRequestProcessorChain.init inserting DistributedUpdateProcessorFactory into updateRequestProcessorChain "distrib-dup-test-chain-implicit"
[junit4:junit4]   2> 674 T1328 oasc.RequestHandlers.initHandlersFromConfig adding lazy requestHandler: solr.ReplicationHandler
[junit4:junit4]   2> 674 T1328 oasc.RequestHandlers.initHandlersFromConfig created /replication: solr.ReplicationHandler
[junit4:junit4]   2> 675 T1328 oasc.RequestHandlers.initHandlersFromConfig created standard: solr.StandardRequestHandler
[junit4:junit4]   2> 675 T1328 oasc.RequestHandlers.initHandlersFromConfig created /get: solr.RealTimeGetHandler
[junit4:junit4]   2> 676 T1328 oasc.RequestHandlers.initHandlersFromConfig created dismax: solr.SearchHandler
[junit4:junit4]   2> 676 T1328 oasc.RequestHandlers.initHandlersFromConfig created mock: org.apache.solr.core.MockQuerySenderListenerReqHandler
[junit4:junit4]   2> 677 T1328 oasc.RequestHandlers.initHandlersFromConfig created /admin/: org.apache.solr.handler.admin.AdminHandlers
[junit4:junit4]   2> 677 T1328 oasc.RequestHandlers.initHandlersFromConfig created defaults: solr.StandardRequestHandler
[junit4:junit4]   2> 678 T1328 oasc.RequestHandlers.initHandlersFromConfig adding lazy requestHandler: solr.StandardRequestHandler
[junit4:junit4]   2> 678 T1328 oasc.RequestHandlers.initHandlersFromConfig created lazy: solr.StandardRequestHandler
[junit4:junit4]   2> 679 T1328 oasc.RequestHandlers.initHandlersFromConfig created /update: solr.UpdateRequestHandler
[junit4:junit4]   2> 679 T1328 oasc.RequestHandlers.initHandlersFromConfig created /terms: org.apache.solr.handler.component.SearchHandler
[junit4:junit4]   2> 680 T1328 oasc.RequestHandlers.initHandlersFromConfig created spellCheckCompRH: org.apache.solr.handler.component.SearchHandler
[junit4:junit4]   2> 681 T1328 oasc.RequestHandlers.initHandlersFromConfig created spellCheckCompRH_Direct: org.apache.solr.handler.component.SearchHandler
[junit4:junit4]   2> 681 T1328 oasc.RequestHandlers.initHandlersFromConfig created spellCheckWithWordbreak: org.apache.solr.handler.component.SearchHandler
[junit4:junit4]   2> 682 T1328 oasc.RequestHandlers.initHandlersFromConfig created spellCheckWithWordbreak_Direct: org.apache.solr.handler.component.SearchHandler
[junit4:junit4]   2> 682 T1328 oasc.RequestHandlers.initHandlersFromConfig created spellCheckCompRH1: org.apache.solr.handler.component.SearchHandler
[junit4:junit4]   2> 683 T1328 oasc.RequestHandlers.initHandlersFromConfig created tvrh: org.apache.solr.handler.component.SearchHandler
[junit4:junit4]   2> 683 T1328 oasc.RequestHandlers.initHandlersFromConfig created /mlt: solr.MoreLikeThisHandler
[junit4:junit4]   2> 684 T1328 oasc.RequestHandlers.initHandlersFromConfig created /debug/dump: solr.DumpRequestHandler
[junit4:junit4]   2> 685 T1328 oashl.XMLLoader.init xsltCacheLifetimeSeconds=60
[junit4:junit4]   2> 686 T1328 oasc.SolrCore.initDeprecatedSupport WARNING solrconfig.xml uses deprecated <admin/gettableFiles>, Please update your config to use the ShowFileRequestHandler.
[junit4:junit4]   2> 687 T1328 oasc.SolrCore.initDeprecatedSupport WARNING adding ShowFileRequestHandler with hidden files: [OLD_SYNONYMS.TXT, PROTWORDS.TXT, STOPWORDS.TXT, OPEN-EXCHANGE-RATES.JSON, CURRENCY.XML, SCHEMA.XML, SYNONYMS.TXT, MAPPING-ISOLATIN1ACCENT.TXT]
[junit4:junit4]   2> 689 T1328 oass.SolrIndexSearcher.<init> Opening Searcher@f6ef3997 main
[junit4:junit4]   2> 690 T1328 oasu.CommitTracker.<init> Hard AutoCommit: disabled
[junit4:junit4]   2> 690 T1328 oasu.CommitTracker.<init> Soft AutoCommit: disabled
[junit4:junit4]   2> 691 T1328 oashc.SpellCheckComponent.inform Initializing spell checkers
[junit4:junit4]   2> 695 T1328 oass.DirectSolrSpellChecker.init init: {name=direct,classname=DirectSolrSpellChecker,field=lowerfilt,minQueryLength=3}
[junit4:junit4]   2> 714 T1351 oasc.SolrCore.registerSearcher [collection1] Registered new searcher Searcher@f6ef3997 main{StandardDirectoryReader(segments_1:1)}
[junit4:junit4]   2> 716 T1333 oazs.PrepRequestProcessor.pRequest Got user-level KeeperException when processing sessionid:0x139f48080430002 type:create cxid:0x50 zxid:0xfffffffffffffffe txntype:unknown reqpath:n/a Error Path:/solr/overseer/queue Error:KeeperErrorCode = NoNode for /solr/overseer/queue
[junit4:junit4]   2> 718 T1328 oasc.CoreContainer.register registering core: collection1
[junit4:junit4]   2> 718 T1328 oasc.ZkController.register Register shard - core:collection1 address:http://127.0.0.1:46282/solr shardId:control_shard
[junit4:junit4]   2> 719 T1328 oascc.SolrZkClient.makePath makePath: /collections/control_collection/leader_elect/control_shard/election
[junit4:junit4]   2> 725 T1333 oazs.PrepRequestProcessor.pRequest Got user-level KeeperException when processing sessionid:0x139f48080430002 type:delete cxid:0x5f zxid:0xfffffffffffffffe txntype:unknown reqpath:n/a Error Path:/solr/collections/control_collection/leaders Error:KeeperErrorCode = NoNode for /solr/collections/control_collection/leaders
[junit4:junit4]   2> 725 T1328 oasc.ShardLeaderElectionContext.runLeaderProcess Running the leader process.
[junit4:junit4]   2> 726 T1333 oazs.PrepRequestProcessor.pRequest Got user-level KeeperException when processing sessionid:0x139f48080430002 type:create cxid:0x60 zxid:0xfffffffffffffffe txntype:unknown reqpath:n/a Error Path:/solr/overseer Error:KeeperErrorCode = NodeExists for /solr/overseer
[junit4:junit4]   2> 789 T1349 oascc.ZkStateReader.updateClusterState Updating cloud state from ZooKeeper... 
[junit4:junit4]   2> 790 T1333 oazs.PrepRequestProcessor.pRequest Got user-level KeeperException when processing sessionid:0x139f48080430002 type:create cxid:0x67 zxid:0xfffffffffffffffe txntype:unknown reqpath:n/a Error Path:/solr/overseer/queue-work Error:KeeperErrorCode = NoNode for /solr/overseer/queue-work
[junit4:junit4]   2> 794 T1348 oascc.ZkStateReader$2.process A cluster state change has occurred - updating...
[junit4:junit4]   2> 1228 T1328 oasc.ShardLeaderElectionContext.waitForReplicasToComeUp Enough replicas found to continue.
[junit4:junit4]   2> 1228 T1328 oasc.ShardLeaderElectionContext.runLeaderProcess I may be the new leader - try and sync
[junit4:junit4]   2> 1229 T1328 oasc.SyncStrategy.sync Sync replicas to http://127.0.0.1:46282/solr/collection1/
[junit4:junit4]   2> 1229 T1328 oasc.SyncStrategy.syncReplicas Sync Success - now sync replicas to me
[junit4:junit4]   2> 1230 T1328 oasc.SyncStrategy.syncToMe http://127.0.0.1:46282/solr/collection1/ has no replicas
[junit4:junit4]   2> 1230 T1328 oasc.ShardLeaderElectionContext.runLeaderProcess I am the new leader: http://127.0.0.1:46282/solr/collection1/
[junit4:junit4]   2> 1230 T1328 oascc.SolrZkClient.makePath makePath: /collections/control_collection/leaders/control_shard
[junit4:junit4]   2> 1233 T1333 oazs.PrepRequestProcessor.pRequest Got user-level KeeperException when processing sessionid:0x139f48080430002 type:create cxid:0x85 zxid:0xfffffffffffffffe txntype:unknown reqpath:n/a Error Path:/solr/overseer Error:KeeperErrorCode = NodeExists for /solr/overseer
[junit4:junit4]   2> 1297 T1349 oascc.ZkStateReader.updateClusterState Updating cloud state from ZooKeeper... 
[junit4:junit4]   2> 1301 T1348 oascc.ZkStateReader$2.process A cluster state change has occurred - updating...
[junit4:junit4]   2> 1335 T1328 oasc.ZkController.register We are http://127.0.0.1:46282/solr/collection1/ and leader is http://127.0.0.1:46282/solr/collection1/
[junit4:junit4]   2> 1336 T1328 oasc.ZkController.register No LogReplay needed for core=collection1 baseURL=http://127.0.0.1:46282/solr
[junit4:junit4]   2> 1336 T1328 oasc.ZkController.checkRecovery I am the leader, no recovery necessary
[junit4:junit4]   2> 1338 T1328 oascc.ZkStateReader.updateClusterState Updating cloud state from ZooKeeper... 
[junit4:junit4]   2> 1339 T1328 oass.SolrDispatchFilter.init user.dir=/mnt/ssd/jenkins/workspace/Lucene-Solr-4.x-Linux/solr/build/solr-core/test/J0
[junit4:junit4]   2> 1339 T1328 oass.SolrDispatchFilter.init SolrDispatchFilter.init() done
[junit4:junit4]   2> 1340 T1328 oascsi.HttpClientUtil.createClient Creating new http client, config:maxConnections=128&maxConnectionsPerHost=32&followRedirects=false
[junit4:junit4]   2> 1397 T1328 oejs.Server.doStart jetty-8.1.2.v20120308
[junit4:junit4]   2> 1399 T1328 oejs.AbstractConnector.doStart Started SocketConnector@0.0.0.0:46961
[junit4:junit4]   2> 1399 T1328 oasc.SolrResourceLoader.locateSolrHome JNDI not configured for solr (NoInitialContextEx)
[junit4:junit4]   2> 1400 T1328 oasc.SolrResourceLoader.locateSolrHome using system property solr.solr.home: /mnt/ssd/jenkins/workspace/Lucene-Solr-4.x-Linux/solr/build/solr-core/test/J0/./solrtest-jetty1-1348426827131
[junit4:junit4]   2> 1400 T1328 oasc.SolrResourceLoader.<init> new SolrResourceLoader for deduced Solr Home: '/mnt/ssd/jenkins/workspace/Lucene-Solr-4.x-Linux/solr/build/solr-core/test/J0/./solrtest-jetty1-1348426827131/'
[junit4:junit4]   2> 1408 T1328 oass.SolrDispatchFilter.init SolrDispatchFilter.init()
[junit4:junit4]   2> 1409 T1328 oasc.SolrResourceLoader.locateSolrHome JNDI not configured for solr (NoInitialContextEx)
[junit4:junit4]   2> 1409 T1328 oasc.SolrResourceLoader.locateSolrHome using system property solr.solr.home: /mnt/ssd/jenkins/workspace/Lucene-Solr-4.x-Linux/solr/build/solr-core/test/J0/./solrtest-jetty1-1348426827131
[junit4:junit4]   2> 1409 T1328 oasc.CoreContainer$Initializer.initialize looking for solr.xml: /mnt/ssd/jenkins/workspace/Lucene-Solr-4.x-Linux/solr/build/solr-core/test/J0/./solrtest-jetty1-1348426827131/solr.xml
[junit4:junit4]   2> 1410 T1328 oasc.CoreContainer.<init> New CoreContainer -1798037131
[junit4:junit4]   2> 1410 T1328 oasc.CoreContainer.load Loading CoreContainer using Solr Home: '/mnt/ssd/jenkins/workspace/Lucene-Solr-4.x-Linux/solr/build/solr-core/test/J0/./solrtest-jetty1-1348426827131/'
[junit4:junit4]   2> 1411 T1328 oasc.SolrResourceLoader.<init> new SolrResourceLoader for directory: '/mnt/ssd/jenkins/workspace/Lucene-Solr-4.x-Linux/solr/build/solr-core/test/J0/./solrtest-jetty1-1348426827131/'
[junit4:junit4]   2> 1422 T1328 oasc.CoreContainer.load Registering Log Listener
[junit4:junit4]   2> 1429 T1328 oasc.CoreContainer.initZooKeeper Zookeeper client=127.0.0.1:41208/solr
[junit4:junit4]   2> 1430 T1328 oaz.ZooKeeper.<init> Initiating client connection, connectString=127.0.0.1:41208/solr sessionTimeout=5000 watcher=org.apache.solr.common.cloud.ConnectionManager@1b206f7
[junit4:junit4]   2> 1430 T1361 oaz.ClientCnxn$SendThread.startConnect Opening socket connection to server /127.0.0.1:41208
[junit4:junit4]   2> 1430 T1328 oascc.ConnectionManager.waitForConnected Waiting for client to connect to ZooKeeper
[junit4:junit4]   2> 1431 T1361 oaz.ClientCnxn$SendThread.primeConnection Socket connection established to localhost.localdomain/127.0.0.1:41208, initiating session
[junit4:junit4]   2> 1431 T1330 oazs.NIOServerCnxn$Factory.run Accepted socket connection from /127.0.0.1:53385
[junit4:junit4]   2> 1432 T1330 oazs.NIOServerCnxn.readConnectRequest Client attempting to establish new session at /127.0.0.1:53385
[junit4:junit4]   2> 1432 T1332 oazs.NIOServerCnxn.finishSessionInit Established session 0x139f48080430003 with negotiated timeout 5000 for client /127.0.0.1:53385
[junit4:junit4]   2> 1433 T1361 oaz.ClientCnxn$SendThread.readConnectResult Session establishment complete on server localhost.localdomain/127.0.0.1:41208, sessionid = 0x139f48080430003, negotiated timeout = 5000
[junit4:junit4]   2> 1433 T1362 oascc.ConnectionManager.process Watcher org.apache.solr.common.cloud.ConnectionManager@1b206f7 name:ZooKeeperConnection Watcher:127.0.0.1:41208/solr got event WatchedEvent state:SyncConnected type:None path:null path:null type:None
[junit4:junit4]   2> 1433 T1328 oascc.ConnectionManager.waitForConnected Client is connected to ZooKeeper
[junit4:junit4]   2> 1434 T1333 oazs.PrepRequestProcessor.pRequest Got user-level KeeperException when processing sessionid:0x139f48080430003 type:create cxid:0x1 zxid:0xfffffffffffffffe txntype:unknown reqpath:n/a Error Path:/solr/overseer Error:KeeperErrorCode = NodeExists for /solr/overseer
[junit4:junit4]   2> 1434 T1333 oazs.PrepRequestProcessor.pRequest Got user-level KeeperException when processing sessionid:0x139f48080430003 type:create cxid:0x2 zxid:0xfffffffffffffffe txntype:unknown reqpath:n/a Error Path:/solr/overseer Error:KeeperErrorCode = NodeExists for /solr/overseer
[junit4:junit4]   2> 1435 T1328 oasc.ZkController.createEphemeralLiveNode Register node as live in ZooKeeper:/live_nodes/127.0.0.1:46961_solr
[junit4:junit4]   2> 1436 T1333 oazs.PrepRequestProcessor.pRequest Got user-level KeeperException when processing sessionid:0x139f48080430003 type:delete cxid:0x4 zxid:0xfffffffffffffffe txntype:unknown reqpath:n/a Error Path:/solr/live_nodes/127.0.0.1:46961_solr Error:KeeperErrorCode = NoNode for /solr/live_nodes/127.0.0.1:46961_solr
[junit4:junit4]   2> 1436 T1328 oascc.SolrZkClient.makePath makePath: /live_nodes/127.0.0.1:46961_solr
[junit4:junit4]   2> 1437 T1348 oascc.ZkStateReader$3.process Updating live nodes
[junit4:junit4]   2> 1438 T1328 oashc.HttpShardHandlerFactory.getParameter Setting socketTimeout to: 0
[junit4:junit4]   2> 1438 T1328 oashc.HttpShardHandlerFactory.getParameter Setting urlScheme to: http://
[junit4:junit4]   2> 1439 T1328 oashc.HttpShardHandlerFactory.getParameter Setting connTimeout to: 0
[junit4:junit4]   2> 1439 T1328 oashc.HttpShardHandlerFactory.getParameter Setting maxConnectionsPerHost to: 20
[junit4:junit4]   2> 1440 T1328 oashc.HttpShardHandlerFactory.getParameter Setting corePoolSize to: 0
[junit4:junit4]   2> 1440 T1328 oashc.HttpShardHandlerFactory.getParameter Setting maximumPoolSize to: 2147483647
[junit4:junit4]   2> 1440 T1328 oashc.HttpShardHandlerFactory.getParameter Setting maxThreadIdleTime to: 5
[junit4:junit4]   2> 1441 T1328 oashc.HttpShardHandlerFactory.getParameter Setting sizeOfQueue to: -1
[junit4:junit4]   2> 1441 T1328 oashc.HttpShardHandlerFactory.getParameter Setting fairnessPolicy to: false
[junit4:junit4]   2> 1442 T1328 oascsi.HttpClientUtil.createClient Creating new http client, config:maxConnectionsPerHost=20&maxConnections=10000&socketTimeout=0&connTimeout=0&retry=false
[junit4:junit4]   2> 1446 T1328 oascc.ZkStateReader.createClusterStateWatchersAndUpdate Updating cluster state from ZooKeeper... 
[junit4:junit4]   2> 1450 T1328 oasc.CoreContainer.create Creating SolrCore 'collection1' using instanceDir: /mnt/ssd/jenkins/workspace/Lucene-Solr-4.x-Linux/solr/build/solr-core/test/J0/./solrtest-jetty1-1348426827131/collection1
[junit4:junit4]   2> 1450 T1328 oasc.ZkController.createCollectionZkNode Check for collection zkNode:collection1
[junit4:junit4]   2> 1451 T1328 oasc.ZkController.createCollectionZkNode Collection zkNode exists
[junit4:junit4]   2> 1451 T1328 oasc.ZkController.readConfigName Load collection config from:/collections/collection1
[junit4:junit4]   2> 1452 T1328 oasc.SolrResourceLoader.<init> new SolrResourceLoader for directory: '/mnt/ssd/jenkins/workspace/Lucene-Solr-4.x-Linux/solr/build/solr-core/test/J0/./solrtest-jetty1-1348426827131/collection1/'
[junit4:junit4]   2> 1453 T1328 oasc.SolrResourceLoader.replaceClassLoader Adding 'file:/mnt/ssd/jenkins/workspace/Lucene-Solr-4.x-Linux/solr/build/solr-core/test/J0/solrtest-jetty1-1348426827131/collection1/lib/README' to classloader
[junit4:junit4]   2> 1454 T1328 oasc.SolrResourceLoader.replaceClassLoader Adding 'file:/mnt/ssd/jenkins/workspace/Lucene-Solr-4.x-Linux/solr/build/solr-core/test/J0/solrtest-jetty1-1348426827131/collection1/lib/classes/' to classloader
[junit4:junit4]   2> 1478 T1328 oasc.SolrConfig.<init> Using Lucene MatchVersion: LUCENE_41
[junit4:junit4]   2> 1511 T1328 oasc.SolrConfig.<init> Loaded SolrConfig: solrconfig.xml
[junit4:junit4]   2> 1512 T1328 oass.IndexSchema.readSchema Reading Solr Schema
[junit4:junit4]   2> 1516 T1328 oass.IndexSchema.readSchema Schema name=test
[junit4:junit4]   2> 1791 T1328 oass.OpenExchangeRatesOrgProvider.init Initialized with rates=open-exchange-rates.json, refreshInterval=1440.
[junit4:junit4]   2> 1796 T1328 oass.IndexSchema.readSchema default search field in schema is text
[junit4:junit4]   2> 1798 T1328 oass.IndexSchema.readSchema unique key field: id
[junit4:junit4]   2> 1803 T1349 oascc.ZkStateReader.updateClusterState Updating cloud state from ZooKeeper... 
[junit4:junit4]   2> 1806 T1348 oascc.ZkStateReader$2.process A cluster state change has occurred - updating...
[junit4:junit4]   2> 1806 T1362 oascc.ZkStateReader$2.process A cluster state change has occurred - updating...
[junit4:junit4]   2> 1808 T1328 oass.FileExchangeRateProvider.reload Reloading exchange rates from file currency.xml
[junit4:junit4]   2> 1812 T1328 oass.FileExchangeRateProvider.reload Reloading exchange rates from file currency.xml
[junit4:junit4]   2> 1816 T1328 oass.OpenExchangeRatesOrgProvider.reload Reloading exchange rates from open-exchange-rates.json
[junit4:junit4]   2> 1817 T1328 oass.OpenExchangeRatesOrgProvider.reload Reloading exchange rates from open-exchange-rates.json
[junit4:junit4]   2> 1818 T1328 oasc.SolrCore.<init> [collection1] Opening new SolrCore at /mnt/ssd/jenkins/workspace/Lucene-Solr-4.x-Linux/solr/build/solr-core/test/J0/./solrtest-jetty1-1348426827131/collection1/, dataDir=./org.apache.solr.cloud.BasicDistributedZkTest-1348426825792/jetty1/
[junit4:junit4]   2> 1818 T1328 oasc.JmxMonitoredMap.<init> JMX monitoring is enabled. Adding Solr mbeans to JMX Server: com.sun.jmx.mbeanserver.JmxMBeanServer@124ba712
[junit4:junit4]   2> 1819 T1328 oasc.SolrCore.getNewIndexDir WARNING New index directory detected: old=null new=./org.apache.solr.cloud.BasicDistributedZkTest-1348426825792/jetty1/index/
[junit4:junit4]   2> 1820 T1328 oasc.SolrCore.initIndex WARNING [collection1] Solr index directory './org.apache.solr.cloud.BasicDistributedZkTest-1348426825792/jetty1/index' doesn't exist. Creating new index...
[junit4:junit4]   2> 1821 T1328 oasc.CachingDirectoryFactory.get return new directory for /mnt/ssd/jenkins/workspace/Lucene-Solr-4.x-Linux/solr/build/solr-core/test/J0/./org.apache.solr.cloud.BasicDistributedZkTest-1348426825792/jetty1/index forceNew:false
[junit4:junit4]   2> 1824 T1328 oasc.SolrDeletionPolicy.onCommit SolrDeletionPolicy.onCommit: commits:num=1
[junit4:junit4]   2> 		commit{dir=NRTCachingDirectory(org.apache.lucene.store.MMapDirectory@/mnt/ssd/jenkins/workspace/Lucene-Solr-4.x-Linux/solr/build/solr-core/test/J0/org.apache.solr.cloud.BasicDistributedZkTest-1348426825792/jetty1/index lockFactory=org.apache.lucene.store.NativeFSLockFactory@61637eab; maxCacheMB=48.0 maxMergeSizeMB=4.0),segFN=segments_1,generation=1,filenames=[segments_1]
[junit4:junit4]   2> 1825 T1328 oasc.SolrDeletionPolicy.updateCommits newest commit = 1
[junit4:junit4]   2> 1826 T1328 oasc.SolrCore.initWriters created xml: solr.XMLResponseWriter
[junit4:junit4]   2> 1828 T1328 oasup.UpdateRequestProcessorChain.init inserting DistributedUpdateProcessorFactory into updateRequestProcessorChain "dedupe"
[junit4:junit4]   2> 1828 T1328 oasup.UpdateRequestProcessorChain.init inserting DistributedUpdateProcessorFactory into updateRequestProcessorChain "dedupe-allfields"
[junit4:junit4]   2> 1829 T1328 oasup.UpdateRequestProcessorChain.init inserting DistributedUpdateProcessorFactory into updateRequestProcessorChain "stored_sig"
[junit4:junit4]   2> 1829 T1328 oasup.UpdateRequestProcessorChain.init inserting DistributedUpdateProcessorFactory into updateRequestProcessorChain "uniq-fields"
[junit4:junit4]   2> 1830 T1328 oasup.UpdateRequestProcessorChain.init inserting DistributedUpdateProcessorFactory into updateRequestProcessorChain "distrib-dup-test-chain-implicit"
[junit4:junit4]   2> 1830 T1328 oasc.RequestHandlers.initHandlersFromConfig adding lazy requestHandler: solr.ReplicationHandler
[junit4:junit4]   2> 1831 T1328 oasc.RequestHandlers.initHandlersFromConfig created /replication: solr.ReplicationHandler
[junit4:junit4]   2> 1832 T1328 oasc.RequestHandlers.initHandlersFromConfig created standard: solr.StandardRequestHandler
[junit4:junit4]   2> 1832 T1328 oasc.RequestHandlers.initHandlersFromConfig created /get: solr.RealTimeGetHandler
[junit4:junit4]   2> 1833 T1328 oasc.RequestHandlers.initHandlersFromConfig created dismax: solr.SearchHandler
[junit4:junit4]   2> 1833 T1328 oasc.RequestHandlers.initHandlersFromConfig created mock: org.apache.solr.core.MockQuerySenderListenerReqHandler
[junit4:junit4]   2> 1834 T1328 oasc.RequestHandlers.initHandlersFromConfig created /admin/: org.apache.solr.handler.admin.AdminHandlers
[junit4:junit4]   2> 1835 T1328 oasc.RequestHandlers.initHandlersFromConfig created defaults: solr.StandardRequestHandler
[junit4:junit4]   2> 1835 T1328 oasc.RequestHandlers.initHandlersFromConfig adding lazy requestHandler: solr.StandardRequestHandler
[junit4:junit4]   2> 1836 T1328 oasc.RequestHandlers.initHandlersFromConfig created lazy: solr.StandardRequestHandler
[junit4:junit4]   2> 1836 T1328 oasc.RequestHandlers.initHandlersFromConfig created /update: solr.UpdateRequestHandler
[junit4:junit4]   2> 1837 T1328 oasc.RequestHandlers.initHandlersFromConfig created /terms: org.apache.solr.handler.component.SearchHandler
[junit4:junit4]   2> 1838 T1328 oasc.RequestHandlers.initHandlersFromConfig created spellCheckCompRH: org.apache.solr.handler.component.SearchHandler
[junit4:junit4]   2> 1838 T1328 oasc.RequestHandlers.initHandlersFromConfig created spellCheckCompRH_Direct: org.apache.solr.handler.component.SearchHandler
[junit4:junit4]   2> 1839 T1328 oasc.RequestHandlers.initHandlersFromConfig created spellCheckWithWordbreak: org.apache.solr.handler.component.SearchHandler
[junit4:junit4]   2> 1840 T1328 oasc.RequestHandlers.initHandlersFromConfig created spellCheckWithWordbreak_Direct: org.apache.solr.handler.component.SearchHandler
[junit4:junit4]   2> 1840 T1328 oasc.RequestHandlers.initHandlersFromConfig created spellCheckCompRH1: org.apache.solr.handler.component.SearchHandler
[junit4:junit4]   2> 1841 T1328 oasc.RequestHandlers.initHandlersFromConfig created tvrh: org.apache.solr.handler.component.SearchHandler
[junit4:junit4]   2> 1841 T1328 oasc.RequestHandlers.initHandlersFromConfig created /mlt: solr.MoreLikeThisHandler
[junit4:junit4]   2> 1842 T1328 oasc.RequestHandlers.initHandlersFromConfig created /debug/dump: solr.DumpRequestHandler
[junit4:junit4]   2> 1843 T1328 oashl.XMLLoader.init xsltCacheLifetimeSeconds=60
[junit4:junit4]   2> 1845 T1328 oasc.SolrCore.initDeprecatedSupport WARNING solrconfig.xml uses deprecated <admin/gettableFiles>, Please update your config to use the ShowFileRequestHandler.
[junit4:junit4]   2> 1846 T1328 oasc.SolrCore.initDeprecatedSupport WARNING adding ShowFileRequestHandler with hidden files: [OLD_SYNONYMS.TXT, PROTWORDS.TXT, STOPWORDS.TXT, OPEN-EXCHANGE-RATES.JSON, CURRENCY.XML, SCHEMA.XML, SYNONYMS.TXT, MAPPING-ISOLATIN1ACCENT.TXT]
[junit4:junit4]   2> 1848 T1328 oass.SolrIndexSearcher.<init> Opening Searcher@528ca668 main
[junit4:junit4]   2> 1849 T1328 oasu.CommitTracker.<init> Hard AutoCommit: disabled
[junit4:junit4]   2> 1849 T1328 oasu.CommitTracker.<init> Soft AutoCommit: disabled
[junit4:junit4]   2> 1850 T1328 oashc.SpellCheckComponent.inform Initializing spell checkers
[junit4:junit4]   2> 1854 T1328 oass.DirectSolrSpellChecker.init init: {name=direct,classname=DirectSolrSpellChecker,field=lowerfilt,minQueryLength=3}
[junit4:junit4]   2> 1875 T1363 oasc.SolrCore.registerSearcher [collection1] Registered new searcher Searcher@528ca668 main{StandardDirectoryReader(segments_1:1)}
[junit4:junit4]   2> 2309 T1349 oascc.ZkStateReader.updateClusterState Updating cloud state from ZooKeeper... 
[junit4:junit4]   2> 2392 T1348 oascc.ZkStateReader$2.process A cluster state change has occurred - updating...
[junit4:junit4]   2> 2392 T1362 oascc.ZkStateReader$2.process A cluster state change has occurred - updating...
[junit4:junit4]   2> 2879 T1328 oasc.CoreContainer.register registering core: collection1
[junit4:junit4]   2> 2879 T1328 oasc.ZkController.register Register shard - core:collection1 address:http://127.0.0.1:46961/solr shardId:shard1
[junit4:junit4]   2> 2880 T1328 oascc.SolrZkClient.makePath makePath: /collections/collection1/leader_elect/shard1/election
[junit4:junit4]   2> 2884 T1333 oazs.PrepRequestProcessor.pRequest Got user-level KeeperException when processing sessionid:0x139f48080430003 type:delete cxid:0x43 zxid:0xfffffffffffffffe txntype:unknown reqpath:n/a Error Path:/solr/collections/collection1/leaders Error:KeeperErrorCode = NoNode for /solr/collections/collection1/leaders
[junit4:junit4]   2> 2884 T1328 oasc.ShardLeaderElectionContext.runLeaderProcess Running the leader process.
[junit4:junit4]   2> 2885 T1333 oazs.PrepRequestProcessor.pRequest Got user-level KeeperException when processing sessionid:0x139f48080430003 type:create cxid:0x44 zxid:0xfffffffffffffffe txntype:unknown reqpath:n/a Error Path:/solr/overseer Error:KeeperErrorCode = NodeExists for /solr/overseer
[junit4:junit4]   2> 2886 T1328 oasc.ShardLeaderElectionContext.waitForReplicasToComeUp Enough replicas found to continue.
[junit4:junit4]   2> 2887 T1328 oasc.ShardLeaderElectionContext.runLeaderProcess I may be the new leader - try and sync
[junit4:junit4]   2> 2887 T1328 oasc.SyncStrategy.sync Sync replicas to http://127.0.0.1:46961/solr/collection1/
[junit4:junit4]   2> 2887 T1328 oasc.SyncStrategy.syncReplicas Sync Success - now sync replicas to me
[junit4:junit4]   2> 2888 T1328 oasc.SyncStrategy.syncToMe http://127.0.0.1:46961/solr/collection1/ has no replicas
[junit4:junit4]   2> 2888 T1328 oasc.ShardLeaderElectionContext.runLeaderProcess I am the new leader: http://127.0.0.1:46961/solr/collection1/
[junit4:junit4]   2> 2889 T1328 oascc.SolrZkClient.makePath makePath: /collections/collection1/leaders/shard1
[junit4:junit4]   2> 2891 T1333 oazs.PrepRequestProcessor.pRequest Got user-level KeeperException when processing sessionid:0x139f48080430003 type:create cxid:0x4e zxid:0xfffffffffffffffe txntype:unknown reqpath:n/a Error Path:/solr/overseer Error:KeeperErrorCode = NodeExists for /solr/overseer
[junit4:junit4]   2> 2895 T1349 oascc.ZkStateReader.updateClusterState Updating cloud state from ZooKeeper... 
[junit4:junit4]   2> 2900 T1362 oascc.ZkStateReader$2.process A cluster state change has occurred - updating...
[junit4:junit4]   2> 2900 T1348 oascc.ZkStateReader$2.process A cluster state change has occurred - updating...
[junit4:junit4]   2> 2942 T1328 oasc.ZkController.register We are http://127.0.0.1:46961/solr/collection1/ and leader is http://127.0.0.1:46961/solr/collection1/
[junit4:junit4]   2> 2943 T1328 oasc.ZkController.register No LogReplay needed for core=collection1 baseURL=http://127.0.0.1:46961/solr
[junit4:junit4]   2> 2943 T1328 oasc.ZkController.checkRecovery I am the leader, no recovery necessary
[junit4:junit4]   2> 2945 T1328 oascc.ZkStateReader.updateClusterState Updating cloud state from ZooKeeper... 
[junit4:junit4]   2> 2946 T1328 oass.SolrDispatchFilter.init user.dir=/mnt/ssd/jenkins/workspace/Lucene-Solr-4.x-Linux/solr/build/solr-core/test/J0
[junit4:junit4]   2> 2946 T1328 oass.SolrDispatchFilter.init SolrDispatchFilter.init() done
[junit4:junit4]   2> 2947 T1328 oascsi.HttpClientUtil.createClient Creating new http client, config:maxConnections=128&maxConnectionsPerHost=32&followRedirects=false
[junit4:junit4]   2> 2999 T1328 oejs.Server.doStart jetty-8.1.2.v20120308
[junit4:junit4]   2> 3001 T1328 oejs.AbstractConnector.doStart Started SocketConnector@0.0.0.0:43076
[junit4:junit4]   2> 3001 T1328 oasc.SolrResourceLoader.locateSolrHome JNDI not configured for solr (NoInitialContextEx)
[junit4:junit4]   2> 3002 T1328 oasc.SolrResourceLoader.locateSolrHome using system property solr.solr.home: /mnt/ssd/jenkins/workspace/Lucene-Solr-4.x-Linux/solr/build/solr-core/test/J0/./solrtest-jetty2-1348426828738
[junit4:junit4]   2> 3002 T1328 oasc.SolrResourceLoader.<init> new SolrResourceLoader for deduced Solr Home: '/mnt/ssd/jenkins/workspace/Lucene-Solr-4.x-Linux/solr/build/solr-core/test/J0/./solrtest-jetty2-1348426828738/'
[junit4:junit4]   2> 3011 T1328 oass.SolrDispatchFilter.init SolrDispatchFilter.init()
[junit4:junit4]   2> 3012 T1328 oasc.SolrResourceLoader.locateSolrHome JNDI not configured for solr (NoInitialContextEx)
[junit4:junit4]   2> 3012 T1328 oasc.SolrResourceLoader.locateSolrHome using system property solr.solr.home: /mnt/ssd/jenkins/workspace/Lucene-Solr-4.x-Linux/solr/build/solr-core/test/J0/./solrtest-jetty2-1348426828738
[junit4:junit4]   2> 3012 T1328 oasc.CoreContainer$Initializer.initialize looking for solr.xml: /mnt/ssd/jenkins/workspace/Lucene-Solr-4.x-Linux/solr/build/solr-core/test/J0/./solrtest-jetty2-1348426828738/solr.xml
[junit4:junit4]   2> 3013 T1328 oasc.CoreContainer.<init> New CoreContainer 933822573
[junit4:junit4]   2> 3013 T1328 oasc.CoreContainer.load Loading CoreContainer using Solr Home: '/mnt/ssd/jenkins/workspace/Lucene-Solr-4.x-Linux/solr/build/solr-core/test/J0/./solrtest-jetty2-1348426828738/'
[junit4:junit4]   2> 3014 T1328 oasc.SolrResourceLoader.<init> new SolrResourceLoader for directory: '/mnt/ssd/jenkins/workspace/Lucene-Solr-4.x-Linux/solr/build/solr-core/test/J0/./solrtest-jetty2-1348426828738/'
[junit4:junit4]   2> 3026 T1328 oasc.CoreContainer.load Registering Log Listener
[junit4:junit4]   2> 3033 T1328 oasc.CoreContainer.initZooKeeper Zookeeper client=127.0.0.1:41208/solr
[junit4:junit4]   2> 3033 T1328 oaz.ZooKeeper.<init> Initiating client connection, connectString=127.0.0.1:41208/solr sessionTimeout=5000 watcher=org.apache.solr.common.cloud.ConnectionManager@78999cfd
[junit4:junit4]   2> 3034 T1373 oaz.ClientCnxn$SendThread.startConnect Opening socket connection to server /127.0.0.1:41208
[junit4:junit4]   2> 3034 T1328 oascc.ConnectionManager.waitForConnected Waiting for client to connect to ZooKeeper
[junit4:junit4]   2> 3035 T1373 oaz.ClientCnxn$SendThread.primeConnection Socket connection established to localhost.localdomain/127.0.0.1:41208, initiating session
[junit4:junit4]   2> 3035 T1330 oazs.NIOServerCnxn$Factory.run Accepted socket connection from /127.0.0.1:53387
[junit4:junit4]   2> 3035 T1330 oazs.NIOServerCnxn.readConnectRequest Client attempting to establish new session at /127.0.0.1:53387
[junit4:junit4]   2> 3036 T1332 oazs.NIOServerCnxn.finishSessionInit Established session 0x139f48080430004 with negotiated timeout 5000 for client /127.0.0.1:53387
[junit4:junit4]   2> 3036 T1373 oaz.ClientCnxn$SendThread.readConnectResult Session establishment complete on server localhost.localdomain/127.0.0.1:41208, sessionid = 0x139f48080430004, negotiated timeout = 5000
[junit4:junit4]   2> 3036 T1374 oascc.ConnectionManager.process Watcher org.apache.solr.common.cloud.ConnectionManager@78999cfd name:ZooKeeperConnection Watcher:127.0.0.1:41208/solr got event WatchedEvent state:SyncConnected type:None path:null path:null type:None
[junit4:junit4]   2> 3037 T1328 oascc.ConnectionManager.waitForConnected Client is connected to ZooKeeper
[junit4:junit4]   2> 3038 T1333 oazs.PrepRequestProcessor.pRequest Got user-level KeeperException when processing sessionid:0x139f48080430004 type:create cxid:0x1 zxid:0xfffffffffffffffe txntype:unknown reqpath:n/a Error Path:/solr/overseer Error:KeeperErrorCode = NodeExists for /solr/overseer
[junit4:junit4]   2> 3038 T1333 oazs.PrepRequestProcessor.pRequest Got user-level KeeperException when processing sessionid:0x139f48080430004 type:create cxid:0x2 zxid:0xfffffffffffffffe txntype:unknown reqpath:n/a Error Path:/solr/overseer Error:KeeperErrorCode = NodeExists for /solr/overseer
[junit4:junit4]   2> 3039 T1328 oasc.ZkController.createEphemeralLiveNode Register node as live in ZooKeeper:/live_nodes/127.0.0.1:43076_solr
[junit4:junit4]   2> 3039 T1333 oazs.PrepRequestProcessor.pRequest Got user-level KeeperException when processing sessionid:0x139f48080430004 type:delete cxid:0x4 zxid:0xfffffffffffffffe txntype:unknown reqpath:n/a Error Path:/solr/live_nodes/127.0.0.1:43076_solr Error:KeeperErrorCode = NoNode for /solr/live_nodes/127.0.0.1:43076_solr
[junit4:junit4]   2> 3040 T1328 oascc.SolrZkClient.makePath makePath: /live_nodes/127.0.0.1:43076_solr
[junit4:junit4]   2> 3042 T1348 oascc.ZkStateReader$3.process Updating live nodes
[junit4:junit4]   2> 3042 T1362 oascc.ZkStateReader$3.process Updating live nodes
[junit4:junit4]   2> 3043 T1328 oashc.HttpShardHandlerFactory.getParameter Setting socketTimeout to: 0
[junit4:junit4]   2> 3043 T1328 oashc.HttpShardHandlerFactory.getParameter Setting urlScheme to: http://
[junit4:junit4]   2> 3044 T1328 oashc.HttpShardHandlerFactory.getParameter Setting connTimeout to: 0
[junit4:junit4]   2> 3044 T1328 oashc.HttpShardHandlerFactory.getParameter Setting maxConnectionsPerHost to: 20
[junit4:junit4]   2> 3045 T1328 oashc.HttpShardHandlerFactory.getParameter Setting corePoolSize to: 0
[junit4:junit4]   2> 3045 T1328 oashc.HttpShardHandlerFactory.getParameter Setting maximumPoolSize to: 2147483647
[junit4:junit4]   2> 3046 T1328 oashc.HttpShardHandlerFactory.getParameter Setting maxThreadIdleTime to: 5
[junit4:junit4]   2> 3047 T1328 oashc.HttpShardHandlerFactory.getParameter Setting sizeOfQueue to: -1
[junit4:junit4]   2> 3047 T1328 oashc.HttpShardHandlerFactory.getParameter Setting fairnessPolicy to: false
[junit4:junit4]   2> 3048 T1328 oascsi.HttpClientUtil.createClient Creating new http client, config:maxConnectionsPerHost=20&maxConnections=10000&socketTimeout=0&connTimeout=0&retry=false
[junit4:junit4]   2> 3052 T1328 oascc.ZkStateReader.createClusterStateWatchersAndUpdate Updating cluster state from ZooKeeper... 
[junit4:junit4]   2> 3056 T1328 oasc.CoreContainer.create Creating SolrCore 'collection1' using instanceDir: /mnt/ssd/jenkins/workspace/Lucene-Solr-4.x-Linux/solr/build/solr-core/test/J0/./solrtest-jetty2-1348426828738/collection1
[junit4:junit4]   2> 3057 T1328 oasc.ZkController.createCollectionZkNode Check for collection zkNode:collection1
[junit4:junit4]   2> 3057 T1328 oasc.ZkController.createCollectionZkNode Collection zkNode exists
[junit4:junit4]   2> 3058 T1328 oasc.ZkController.readConfigName Load collection config from:/collections/collection1
[junit4:junit4]   2> 3059 T1328 oasc.SolrResourceLoader.<init> new SolrResourceLoader for directory: '/mnt/ssd/jenkins/workspace/Lucene-Solr-4.x-Linux/solr/build/solr-core/test/J0/./solrtest-jetty2-1348426828738/collection1/'
[junit4:junit4]   2> 3060 T1328 oasc.SolrResourceLoader.replaceClassLoader Adding 'file:/mnt/ssd/jenkins/workspace/Lucene-Solr-4.x-Linux/solr/build/solr-core/test/J0/solrtest-jetty2-1348426828738/collection1/lib/README' to classloader
[junit4:junit4]   2> 3060 T1328 oasc.SolrResourceLoader.replaceClassLoader Adding 'file:/mnt/ssd/jenkins/workspace/Lucene-Solr-4.x-Linux/solr/build/solr-core/test/J0/solrtest-jetty2-1348426828738/collection1/lib/classes/' to classloader
[junit4:junit4]   2> 3084 T1328 oasc.SolrConfig.<init> Using Lucene MatchVersion: LUCENE_41
[junit4:junit4]   2> 3119 T1328 oasc.SolrConfig.<init> Loaded SolrConfig: solrconfig.xml
[junit4:junit4]   2> 3120 T1328 oass.IndexSchema.readSchema Reading Solr Schema
[junit4:junit4]   2> 3124 T1328 oass.IndexSchema.readSchema Schema name=test
[junit4:junit4]   2> 3403 T1349 oascc.ZkStateReader.updateClusterState Updating cloud state from ZooKeeper... 
[junit4:junit4]   2> 3406 T1348 oascc.ZkStateReader$2.process A cluster state change has occurred - updating...
[junit4:junit4]   2> 3407 T1362 oascc.ZkStateReader$2.process A cluster state change has occurred - updating...
[junit4:junit4]   2> 3407 T1374 oascc.ZkStateReader$2.process A cluster state change has occurred - updating...
[junit4:junit4]   2> 3417 T1328 oass.OpenExchangeRatesOrgProvider.init Initialized with rates=open-exchange-rates.json, refreshInterval=1440.
[junit4:junit4]   2> 3422 T1328 oass.IndexSchema.readSchema default search field in schema is text
[junit4:junit4]   2> 3424 T1328 oass.IndexSchema.readSchema unique key field: id
[junit4:junit4]   2> 3434 T1328 oass.FileExchangeRateProvider.reload Reloading exchange rates from file currency.xml
[junit4:junit4]   2> 3438 T1328 oass.FileExchangeRateProvider.reload Reloading exchange rates from file currency.xml
[junit4:junit4]   2> 3442 T1328 oass.OpenExchangeRatesOrgProvider.reload Reloading exchange rates from open-exchange-rates.json
[junit4:junit4]   2> 3443 T1328 oass.OpenExchangeRatesOrgProvider.reload Reloading exchange rates from open-exchange-rates.json
[junit4:junit4]   2> 3444 T1328 oasc.SolrCore.<init> [collection1] Opening new SolrCore at /mnt/ssd/jenkins/workspace/Lucene-Solr-4.x-Linux/solr/build/solr-core/test/J0/./solrtest-jetty2-1348426828738/collection1/, dataDir=./org.apache.solr.cloud.BasicDistributedZkTest-1348426825792/jetty2/
[junit4:junit4]   2> 3445 T1328 oasc.JmxMonitoredMap.<init> JMX monitoring is enabled. Adding Solr mbeans to JMX Server: com.sun.jmx.mbeanserver.JmxMBeanServer@124ba712
[junit4:junit4]   2> 3446 T1328 oasc.SolrCore.getNewIndexDir WARNING New index directory detected: old=null new=./org.apache.solr.cloud.BasicDistributedZkTest-1348426825792/jetty2/index/
[junit4:junit4]   2> 3446 T1328 oasc.SolrCore.initIndex WARNING [collection1] Solr index directory './org.apache.solr.cloud.BasicDistributedZkTest-1348426825792/jetty2/index' doesn't exist. Creating new index...
[junit4:junit4]   2> 3447 T1328 oasc.CachingDirectoryFactory.get return new directory for /mnt/ssd/jenkins/workspace/Lucene-Solr-4.x-Linux/solr/build/solr-core/test/J0/./org.apache.solr.cloud.BasicDistributedZkTest-1348426825792/jetty2/index forceNew:false
[junit4:junit4]   2> 3495 T1328 oasc.SolrDeletionPolicy.onCommit SolrDeletionPolicy.onCommit: commits:num=1
[junit4:junit4]   2> 		commit{dir=NRTCachingDirectory(org.apache.lucene.store.MMapDirectory@/mnt/ssd/jenkins/workspace/Lucene-Solr-4.x-Linux/solr/build/solr-core/test/J0/org.apache.solr.cloud.BasicDistributedZkTest-1348426825792/jetty2/index lockFactory=org.apache.lucene.store.NativeFSLockFactory@c72d81af; maxCacheMB=48.0 maxMergeSizeMB=4.0),segFN=segments_1,generation=1,filenames=[segments_1]
[junit4:junit4]   2> 3496 T1328 oasc.SolrDeletionPolicy.updateCommits newest commit = 1
[junit4:junit4]   2> 3497 T1328 oasc.SolrCore.initWriters created xml: solr.XMLResponseWriter
[junit4:junit4]   2> 3498 T1328 oasup.UpdateRequestProcessorChain.init inserting DistributedUpdateProcessorFactory into updateRequestProcessorChain "dedupe"
[junit4:junit4]   2> 3499 T1328 oasup.UpdateRequestProcessorChain.init inserting DistributedUpdateProcessorFactory into updateRequestProcessorChain "dedupe-allfields"
[junit4:junit4]   2> 3499 T1328 oasup.UpdateRequestProcessorChain.init inserting DistributedUpdateProcessorFactory into updateRequestProcessorChain "stored_sig"
[junit4:junit4]   2> 3500 T1328 oasup.UpdateRequestProcessorChain.init inserting DistributedUpdateProcessorFactory into updateRequestProcessorChain "uniq-fields"
[junit4:junit4]   2> 3500 T1328 oasup.UpdateRequestProcessorChain.init inserting DistributedUpdateProcessorFactory into updateRequestProcessorChain "distrib-dup-test-chain-implicit"
[junit4:junit4]   2> 3501 T1328 oasc.RequestHandlers.initHandlersFromConfig adding lazy requestHandler: solr.ReplicationHandler
[junit4:junit4]   2> 3502 T1328 oasc.RequestHandlers.initHandlersFromConfig created /replication: solr.ReplicationHandler
[junit4:junit4]   2> 3502 T1328 oasc.RequestHandlers.initHandlersFromConfig created standard: solr.StandardRequestHandler
[junit4:junit4]   2> 3503 T1328 oasc.RequestHandlers.initHandlersFromConfig created /get: solr.RealTimeGetHandler
[junit4:junit4]   2> 3503 T1328 oasc.RequestHandlers.initHandlersFromConfig created dismax: solr.SearchHandler
[junit4:junit4]   2> 3504 T1328 oasc.RequestHandlers.initHandlersFromConfig created mock: org.apache.solr.core.MockQuerySenderListenerReqHandler
[junit4:junit4]   2> 3504 T1328 oasc.RequestHandlers.initHandlersFromConfig created /admin/: org.apache.solr.handler.admin.AdminHandlers
[junit4:junit4]   2> 3505 T1328 oasc.RequestHandlers.initHandlersFromConfig created defaults: solr.StandardRequestHandler
[junit4:junit4]   2> 3505 T1328 oasc.RequestHandlers.initHandlersFromConfig adding lazy requestHandler: solr.StandardRequestHandler
[junit4:junit4]   2> 3506 T1328 oasc.RequestHandlers.initHandlersFromConfig created lazy: solr.StandardRequestHandler
[junit4:junit4]   2> 3507 T1328 oasc.RequestHandlers.initHandlersFromConfig created /update: solr.UpdateRequestHandler
[junit4:junit4]   2> 3507 T1328 oasc.RequestHandlers.initHandlersFromConfig created /terms: org.apache.solr.handler.component.SearchHandler
[junit4:junit4]   2> 3508 T1328 oasc.RequestHandlers.initHandlersFromConfig created spellCheckCompRH: org.apache.solr.handler.component.SearchHandler
[junit4:junit4]   2> 3508 T1328 oasc.RequestHandlers.initHandlersFromConfig created spellCheckCompRH_Direct: org.apache.solr.handler.component.SearchHandler
[junit4:junit4]   2> 3509 T1328 oasc.RequestHandlers.initHandlersFromConfig created spellCheckWithWordbreak: org.apache.solr.handler.component.SearchHandler
[junit4:junit4]   2> 3510 T1328 oasc.RequestHandlers.initHandlersFromConfig created spellCheckWithWordbreak_Direct: org.apache.solr.handler.component.SearchHandler
[junit4:junit4]   2> 3510 T1328 oasc.RequestHandlers.initHandlersFromConfig created spellCheckCompRH1: org.apache.solr.handler.component.SearchHandler
[junit4:junit4]   2> 3511 T1328 oasc.RequestHandlers.initHandlersFromConfig created tvrh: org.apache.solr.handler.component.SearchHandler
[junit4:junit4]   2> 3511 T1328 oasc.RequestHandlers.initHandlersFromConfig created /mlt: solr.MoreLikeThisHandler
[junit4:junit4]   2> 3512 T1328 oasc.RequestHandlers.initHandlersFromConfig created /debug/dump: solr.DumpRequestHandler
[junit4:junit4]   2> 3513 T1328 oashl.XMLLoader.init xsltCacheLifetimeSeconds=60
[junit4:junit4]   2> 3514 T1328 oasc.SolrCore.initDeprecatedSupport WARNING solrconfig.xml uses deprecated <admin/gettableFiles>, Please update your config to use the ShowFileRequestHandler.
[junit4:junit4]   2> 3515 T1328 oasc.SolrCore.initDeprecatedSupport WARNING adding ShowFileRequestHandler with hidden files: [OLD_SYNONYMS.TXT, PROTWORDS.TXT, STOPWORDS.TXT, OPEN-EXCHANGE-RATES.JSON, CURRENCY.XML, SCHEMA.XML, SYNONYMS.TXT, MAPPING-ISOLATIN1ACCENT.TXT]
[junit4:junit4]   2> 3517 T1328 oass.SolrIndexSearcher.<init> Opening Searcher@1a667293 main
[junit4:junit4]   2> 3518 T1328 oasu.CommitTracker.<init> Hard AutoCommit: disabled
[junit4:junit4]   2> 3519 T1328 oasu.CommitTracker.<init> Soft AutoCommit: disabled
[junit4:junit4]   2> 3520 T1328 oashc.SpellCheckComponent.inform Initializing spell checkers
[junit4:junit4]   2> 3523 T1328 oass.DirectSolrSpellChecker.init init: {name=direct,classname=DirectSolrSpellChecker,field=lowerfilt,minQueryLength=3}
[junit4:junit4]   2> 3543 T1375 oasc.SolrCore.registerSearcher [collection1] Registered new searcher Searcher@1a667293 main{StandardDirectoryReader(segments_1:1)}
[junit4:junit4]   2> 3909 T1349 oascc.ZkStateReader.updateClusterState Updating cloud state from ZooKeeper... 
[junit4:junit4]   2> 3913 T1374 oascc.ZkStateReader$2.process A cluster state change has occurred - updating...
[junit4:junit4]   2> 3913 T1362 oascc.ZkStateReader$2.process A cluster state change has occurred - updating...
[junit4:junit4]   2> 3914 T1348 oascc.ZkStateReader$2.process A cluster state change has occurred - updating...
[junit4:junit4]   2> 4047 T1328 oasc.CoreContainer.register registering core: collection1
[junit4:junit4]   2> 4047 T1328 oasc.ZkController.register Register shard - core:collection1 address:http://127.0.0.1:43076/solr shardId:shard2
[junit4:junit4]   2> 4049 T1328 oascc.SolrZkClient.makePath makePath: /collections/collection1/leader_elect/shard2/election
[junit4:junit4]   2> 4053 T1333 oazs.PrepRequestProcessor.pRequest Got user-level KeeperException when processing sessionid:0x139f48080430004 type:delete cxid:0x42 zxid:0xfffffffffffffffe txntype:unknown reqpath:n/a Error Path:/solr/collections/collection1/leaders/shard2 Error:KeeperErrorCode = NoNode for /solr/collections/collection1/leaders/shard2
[junit4:junit4]   2> 4054 T1328 oasc.ShardLeaderElectionContext.runLeaderProcess Running the leader process.
[junit4:junit4]   2> 4054 T1333 oazs.PrepRequestProcessor.pRequest Got user-level KeeperException when processing sessionid:0x139f48080430004 type:create cxid:0x43 zxid:0xfffffffffffffffe txntype:unknown reqpath:n/a Error Path:/solr/overseer Error:KeeperErrorCode = NodeExists for /solr/overseer
[junit4:junit4]   2> 4055 T1328 oasc.ShardLeaderElectionContext.waitForReplicasToComeUp Enough replicas found to continue.
[junit4:junit4]   2> 4056 T1328 oasc.ShardLeaderElectionContext.runLeaderProcess I may be the new leader - try and sync
[junit4:junit4]   2> 4056 T1328 oasc.SyncStrategy.sync Sync replicas to http://127.0.0.1:43076/solr/collection1/
[junit4:junit4]   2> 4057 T1328 oasc.SyncStrategy.syncReplicas Sync Success - now sync replicas to me
[junit4:junit4]   2> 4057 T1328 oasc.SyncStrategy.syncToMe http://127.0.0.1:43076/solr/collection1/ has no replicas
[junit4:junit4]   2> 4058 T1328 oasc.ShardLeaderElectionContext.runLeaderProcess I am the new leader: http://127.0.0.1:43076/solr/collection1/
[junit4:junit4]   2> 4058 T1328 oascc.SolrZkClient.makePath makePath: /collections/collection1/leaders/shard2
[junit4:junit4]   2> 4060 T1333 oazs.PrepRequestProcessor.pRequest Got user-level KeeperException when processing sessionid:0x139f48080430004 type:create cxid:0x4c zxid:0xfffffffffffffffe txntype:unknown reqpath:n/a Error Path:/solr/overseer Error:KeeperErrorCode = NodeExists for /solr/overseer
[junit4:junit4]   2> 4416 T1349 oascc.ZkStateReader.updateClusterState Updating cloud state from ZooKeeper... 
[junit4:junit4]   2> 4421 T1362 oascc.ZkStateReader$2.process A cluster state change has occurred - updating...
[junit4:junit4]   2> 4421 T1374 oascc.ZkStateReader$2.process A cluster state change has occurred - updating...
[junit4:junit4]   2> 4421 T1348 oascc.ZkStateReader$2.process A cluster state change has occurred - updating...
[junit4:junit4]   2> 4462 T1328 oasc.ZkController.register We are http://127.0.0.1:43076/solr/collection1/ and leader is http://127.0.0.1:43076/solr/collection1/
[junit4:junit4]   2> 4463 T1328 oasc.ZkController.register No LogReplay needed for core=collection1 baseURL=http://127.0.0.1:43076/solr
[junit4:junit4]   2> 4463 T1328 oasc.ZkController.checkRecovery I am the leader, no recovery necessary
[junit4:junit4]   2> 4465 T1328 oascc.ZkStateReader.updateClusterState Updating cloud state from ZooKeeper... 
[junit4:junit4]   2> 4466 T1328 oass.SolrDispatchFilter.init user.dir=/mnt/ssd/jenkins/workspace/Lucene-Solr-4.x-Linux/solr/build/solr-core/test/J0
[junit4:junit4]   2> 4466 T1328 oass.SolrDispatchFilter.init SolrDispatchFilter.init() done
[junit4:junit4]   2> 4467 T1328 oascsi.HttpClientUtil.createClient Creating new http client, config:maxConnections=128&maxConnectionsPerHost=32&followRedirects=false
[junit4:junit4]   2> 4522 T1328 oejs.Server.doStart jetty-8.1.2.v20120308
[junit4:junit4]   2> 4523 T1328 oejs.AbstractConnector.doStart Started SocketConnector@0.0.0.0:36391
[junit4:junit4]   2> 4524 T1328 oasc.SolrResourceLoader.locateSolrHome JNDI not configured for solr (NoInitialContextEx)
[junit4:junit4]   2> 4524 T1328 oasc.SolrResourceLoader.locateSolrHome using system property solr.solr.home: /mnt/ssd/jenkins/workspace/Lucene-Solr-4.x-Linux/solr/build/solr-core/test/J0/./solrtest-jetty3-1348426830258
[junit4:junit4]   2> 4525 T1328 oasc.SolrResourceLoader.<init> new SolrResourceLoader for deduced Solr Home: '/mnt/ssd/jenkins/workspace/Lucene-Solr-4.x-Linux/solr/build/solr-core/test/J0/./solrtest-jetty3-1348426830258/'
[junit4:junit4]   2> 4533 T1328 oass.SolrDispatchFilter.init SolrDispatchFilter.init()
[junit4:junit4]   2> 4534 T1328 oasc.SolrResourceLoader.locateSolrHome JNDI not configured for solr (NoInitialContextEx)
[junit4:junit4]   2> 4534 T1328 oasc.SolrResourceLoader.locateSolrHome using system property solr.solr.home: /mnt/ssd/jenkins/workspace/Lucene-Solr-4.x-Linux/solr/build/solr-core/test/J0/./solrtest-jetty3-1348426830258
[junit4:junit4]   2> 4534 T1328 oasc.CoreContainer$Initializer.initialize looking for solr.xml: /mnt/ssd/jenkins/workspace/Lucene-Solr-4.x-Linux/solr/build/solr-core/test/J0/./solrtest-jetty3-1348426830258/solr.xml
[junit4:junit4]   2> 4535 T1328 oasc.CoreContainer.<init> New CoreContainer -427915818
[junit4:junit4]   2> 4535 T1328 oasc.CoreContainer.load Loading CoreContainer using Solr Home: '/mnt/ssd/jenkins/workspace/Lucene-Solr-4.x-Linux/solr/build/solr-core/test/J0/./solrtest-jetty3-1348426830258/'
[junit4:junit4]   2> 4536 T1328 oasc.SolrResourceLoader.<init> new SolrResourceLoader for directory: '/mnt/ssd/jenkins/workspace/Lucene-Solr-4.x-Linux/solr/build/solr-core/test/J0/./solrtest-jetty3-1348426830258/'
[junit4:junit4]   2> 4549 T1328 oasc.CoreContainer.load Registering Log Listener
[junit4:junit4]   2> 4556 T1328 oasc.CoreContainer.initZooKeeper Zookeeper client=127.0.0.1:41208/solr
[junit4:junit4]   2> 4557 T1328 oaz.ZooKeeper.<init> Initiating client connection, connectString=127.0.0.1:41208/solr sessionTimeout=5000 watcher=org.apache.solr.common.cloud.ConnectionManager@b40deae3
[junit4:junit4]   2> 4557 T1385 oaz.ClientCnxn$SendThread.startConnect Opening socket connection to server /127.0.0.1:41208
[junit4:junit4]   2> 4557 T1328 oascc.ConnectionManager.waitForConnected Waiting for client to connect to ZooKeeper
[junit4:junit4]   2> 4558 T1385 oaz.ClientCnxn$SendThread.primeConnection Socket connection established to localhost.localdomain/127.0.0.1:41208, initiating session
[junit4:junit4]   2> 4558 T1330 oazs.NIOServerCnxn$Factory.run Accepted socket connection from /127.0.0.1:53388
[junit4:junit4]   2> 4559 T1330 oazs.NIOServerCnxn.readConnectRequest Client attempting to establish new session at /127.0.0.1:53388
[junit4:junit4]   2> 4559 T1332 oazs.NIOServerCnxn.finishSessionInit Established session 0x139f48080430005 with negotiated timeout 5000 for client /127.0.0.1:53388
[junit4:junit4]   2> 4559 T1385 oaz.ClientCnxn$SendThread.readConnectResult Session establishment complete on server localhost.localdomain/127.0.0.1:41208, sessionid = 0x139f48080430005, negotiated timeout = 5000
[junit4:junit4]   2> 4560 T1386 oascc.ConnectionManager.process Watcher org.apache.solr.common.cloud.ConnectionManager@b40deae3 name:ZooKeeperConnection Watcher:127.0.0.1:41208/solr got event WatchedEvent state:SyncConnected type:None path:null path:null type:None
[junit4:junit4]   2> 4560 T1328 oascc.ConnectionManager.waitForConnected Client is connected to ZooKeeper
[junit4:junit4]   2> 4561 T1333 oazs.PrepRequestProcessor.pRequest Got user-level KeeperException when processing sessionid:0x139f48080430005 type:create cxid:0x1 zxid:0xfffffffffffffffe txntype:unknown reqpath:n/a Error Path:/solr/overseer Error:KeeperErrorCode = NodeExists for /solr/overseer
[junit4:junit4]   2> 4561 T1333 oazs.PrepRequestProcessor.pRequest Got user-level KeeperException when processing sessionid:0x139f48080430005 type:create cxid:0x2 zxid:0xfffffffffffffffe txntype:unknown reqpath:n/a Error Path:/solr/overseer Error:KeeperErrorCode = NodeExists for /solr/overseer
[junit4:junit4]   2> 4562 T1328 oasc.ZkController.createEphemeralLiveNode Register node as live in ZooKeeper:/live_nodes/127.0.0.1:36391_solr
[junit4:junit4]   2> 4563 T1333 oazs.PrepRequestProcessor.pRequest Got user-level KeeperException when processing sessionid:0x139f48080430005 type:delete cxid:0x4 zxid:0xfffffffffffffffe txntype:unknown reqpath:n/a Error Path:/solr/live_nodes/127.0.0.1:36391_solr Error:KeeperErrorCode = NoNode for /solr/live_nodes/127.0.0.1:36391_solr
[junit4:junit4]   2> 4563 T1328 oascc.SolrZkClient.makePath makePath: /live_nodes/127.0.0.1:36391_solr
[junit4:junit4]   2> 4564 T1374 oascc.ZkStateReader$3.process Updating live nodes
[junit4:junit4]   2> 4564 T1362 oascc.ZkStateReader$3.process Updating live nodes
[junit4:junit4]   2> 4565 T1348 oascc.ZkStateReader$3.process Updating live nodes
[junit4:junit4]   2> 4565 T1328 oashc.HttpShardHandlerFactory.getParameter Setting socketTimeout to: 0
[junit4:junit4]   2> 4566 T1328 oashc.HttpShardHandlerFactory.getParameter Setting urlScheme to: http://
[junit4:junit4]   2> 4566 T1328 oashc.HttpShardHandlerFactory.getParameter Setting connTimeout to: 0
[junit4:junit4]   2> 4567 T1328 oashc.HttpShardHandlerFactory.getParameter Setting maxConnectionsPerHost to: 20
[junit4:junit4]   2> 4567 T1328 oashc.HttpShardHandlerFactory.getParameter Setting corePoolSize to: 0
[junit4:junit4]   2> 4568 T1328 oashc.HttpShardHandlerFactory.getParameter Setting maximumPoolSize to: 2147483647
[junit4:junit4]   2> 4568 T1328 oashc.HttpShardHandlerFactory.getParameter Setting maxThreadIdleTime to: 5
[junit4:junit4]   2> 4568 T1328 oashc.HttpShardHandlerFactory.getParameter Setting sizeOfQueue to: -1
[junit4:junit4]   2> 4569 T1328 oashc.HttpShardHandlerFactory.getParameter Setting fairnessPolicy to: false
[junit4:junit4]   2> 4569 T1328 oascsi.HttpClientUtil.createClient Creating new http client, config:maxConnectionsPerHost=20&maxConnections=10000&socketTimeout=0&connTimeout=0&retry=false
[junit4:junit4]   2> 4575 T1328 oascc.ZkStateReader.createClusterStateWatchersAndUpdate Updating cluster state from ZooKeeper... 
[junit4:junit4]   2> 4578 T1328 oasc.CoreContainer.create Creating SolrCore 'collection1' using instanceDir: /mnt/ssd/jenkins/workspace/Lucene-Solr-4.x-Linux/solr/build/solr-core/test/J0/./solrtest-jetty3-1348426830258/collection1
[junit4:junit4]   2> 4579 T1328 oasc.ZkController.createCollectionZkNode Check for collection zkNode:collection1
[junit4:junit4]   2> 4579 T1328 oasc.ZkController.createCollectionZkNode Collection zkNode exists
[junit4:junit4]   2> 4580 T1328 oasc.ZkController.readConfigName Load collection config from:/collections/collection1
[junit4:junit4]   2> 4581 T1328 oasc.SolrResourceLoader.<init> new SolrResourceLoader for directory: '/mnt/ssd/jenkins/workspace/Lucene-Solr-4.x-Linux/solr/build/solr-core/test/J0/./solrtest-jetty3-1348426830258/collection1/'
[junit4:junit4]   2> 4582 T1328 oasc.SolrResourceLoader.replaceClassLoader Adding 'file:/mnt/ssd/jenkins/workspace/Lucene-Solr-4.x-Linux/solr/build/solr-core/test/J0/solrtest-jetty3-1348426830258/collection1/lib/README' to classloader
[junit4:junit4]   2> 4582 T1328 oasc.SolrResourceLoader.replaceClassLoader Adding 'file:/mnt/ssd/jenkins/workspace/Lucene-Solr-4.x-Linux/solr/build/solr-core/test/J0/solrtest-jetty3-1348426830258/collection1/lib/classes/' to classloader
[junit4:junit4]   2> 4605 T1328 oasc.SolrConfig.<init> Using Lucene MatchVersion: LUCENE_41
[junit4:junit4]   2> 4650 T1328 oasc.SolrConfig.<init> Loaded SolrConfig: solrconfig.xml
[junit4:junit4]   2> 4651 T1328 oass.IndexSchema.readSchema Reading Solr Schema
[junit4:junit4]   2> 4654 T1328 oass.IndexSchema.readSchema Schema name=test
[junit4:junit4]   2> 4925 T1349 oascc.ZkStateReader.updateClusterState Updating cloud state from ZooKeeper... 
[junit4:junit4]   2> 4928 T1374 oascc.ZkStateReader$2.process A cluster state change has occurred - updating...
[junit4:junit4]   2> 4928 T1386 oascc.ZkStateReader$2.process A cluster state change has occurred - updating...
[junit4:junit4]   2> 4928 T1348 oascc.ZkStateReader$2.process A cluster state change has occurred - updating...
[junit4:junit4]   2> 4929 T1362 oascc.ZkStateReader$2.process A cluster state change has occurred - updating...
[junit4:junit4]   2> 4956 T1328 oass.OpenExchangeRatesOrgProvider.init Initialized with rates=open-exchange-rates.json, refreshInterval=1440.
[junit4:junit4]   2> 4961 T1328 oass.IndexSchema.readSchema default search field in schema is text
[junit4:junit4]   2> 4963 T1328 oass.IndexSchema.readSchema unique key field: id
[junit4:junit4]   2> 4971 T1328 oass.FileExchangeRateProvider.reload Reloading exchange rates from file currency.xml
[junit4:junit4]   2> 4974 T1328 oass.FileExchangeRateProvider.reload Reloading exchange rates from file currency.xml
[junit4:junit4]   2> 4979 T1328 oass.OpenExchangeRatesOrgProvider.reload Reloading exchange rates from open-exchange-rates.json
[junit4:junit4]   2> 4980 T1328 oass.OpenExchangeRatesOrgProvider.reload Reloading exchange rates from open-exchange-rates.json
[junit4:junit4]   2> 4981 T1328 oasc.SolrCore.<init> [collection1] Opening new SolrCore at /mnt/ssd/jenkins/workspace/Lucene-Solr-4.x-Linux/solr/build/solr-core/test/J0/./solrtest-jetty3-1348426830258/collection1/, dataDir=./org.apache.solr.cloud.BasicDistributedZkTest-1348426825792/jetty3/
[junit4:junit4]   2> 4982 T1328 oasc.JmxMonitoredMap.<init> JMX monitoring is enabled. Adding Solr mbeans to JMX Server: com.sun.jmx.mbeanserver.JmxMBeanServer@124ba712
[junit4:junit4]   2> 4983 T1328 oasc.SolrCore.getNewIndexDir WARNING New index directory detected: old=null new=./org.apache.solr.cloud.BasicDistributedZkTest-1348426825792/jetty3/index/
[junit4:junit4]   2> 4983 T1328 oasc.SolrCore.initIndex WARNING [collection1] Solr index directory './org.apache.solr.cloud.BasicDistributedZkTest-1348426825792/jetty3/index' doesn't exist. Creating new index...
[junit4:junit4]   2> 4984 T1328 oasc.CachingDirectoryFactory.get return new directory for /mnt/ssd/jenkins/workspace/Lucene-Solr-4.x-Linux/solr/build/solr-core/test/J0/./org.apache.solr.cloud.BasicDistributedZkTest-1348426825792/jetty3/index forceNew:false
[junit4:junit4]   2> 4988 T1328 oasc.SolrDeletionPolicy.onCommit SolrDeletionPolicy.onCommit: commits:num=1
[junit4:junit4]   2> 		commit{dir=NRTCachingDirectory(org.apache.lucene.store.MMapDirectory@/mnt/ssd/jenkins/workspace/Lucene-Solr-4.x-Linux/solr/build/solr-core/test/J0/org.apache.solr.cloud.BasicDistributedZkTest-1348426825792/jetty3/index lockFactory=org.apache.lucene.store.NativeFSLockFactory@a8d6a9b6; maxCacheMB=48.0 maxMergeSizeMB=4.0),segFN=segments_1,generation=1,filenames=[segments_1]
[junit4:junit4]   2> 4988 T1328 oasc.SolrDeletionPolicy.updateCommits newest commit = 1
[junit4:junit4]   2> 4989 T1328 oasc.SolrCore.initWriters created xml: solr.XMLResponseWriter
[junit4:junit4]   2> 4991 T1328 oasup.UpdateRequestProcessorChain.init inserting DistributedUpdateProcessorFactory into updateRequestProcessorChain "dedupe"
[junit4:junit4]   2> 4991 T1328 oasup.UpdateRequestProcessorChain.init inserting DistributedUpdateProcessorFactory into updateRequestProcessorChain "dedupe-allfields"
[junit4:junit4]   2> 4992 T1328 oasup.UpdateRequestProcessorChain.init inserting DistributedUpdateProcessorFactory into updateRequestProcessorChain "stored_sig"
[junit4:junit4]   2> 4992 T1328 oasup.UpdateRequestProcessorChain.init inserting DistributedUpdateProcessorFactory into updateRequestProcessorChain "uniq-fields"
[junit4:junit4]   2> 4993 T1328 oasup.UpdateRequestProcessorChain.init inserting DistributedUpdateProcessorFactory into updateRequestProcessorChain "distrib-dup-test-chain-implicit"
[junit4:junit4]   2> 4993 T1328 oasc.RequestHandlers.initHandlersFromConfig adding lazy requestHandler: solr.ReplicationHandler
[junit4:junit4]   2> 4994 T1328 oasc.RequestHandlers.initHandlersFromConfig created /replication: solr.ReplicationHandler
[junit4:junit4]   2> 4994 T1328 oasc.RequestHandlers.initHandlersFromConfig created standard: solr.StandardRequestHandler
[junit4:junit4]   2> 4995 T1328 oasc.RequestHandlers.initHandlersFromConfig created /get: solr.RealTimeGetHandler
[junit4:junit4]   2> 4996 T1328 oasc.RequestHandlers.initHandlersFromConfig created dismax: solr.SearchHandler
[junit4:junit4]   2> 4996 T1328 oasc.RequestHandlers.initHandlersFromConfig created mock: org.apache.solr.core.MockQuerySenderListenerReqHandler
[junit4:junit4]   2> 4997 T1328 oasc.RequestHandlers.initHandlersFromConfig created /admin/: org.apache.solr.handler.admin.AdminHandlers
[junit4:junit4]   2> 4997 T1328 oasc.RequestHandlers.initHandlersFromConfig created defaults: solr.StandardRequestHandler
[junit4:junit4]   2> 4998 T1328 oasc.RequestHandlers.initHandlersFromConfig adding lazy requestHandler: solr.StandardRequestHandler
[junit4:junit4]   2> 4998 T1328 oasc.RequestHandlers.initHandlersFromConfig created lazy: solr.StandardRequestHandler
[junit4:junit4]   2> 4999 T1328 oasc.RequestHandlers.initHandlersFromConfig created /update: solr.UpdateRequestHandler
[junit4:junit4]   2> 5000 T1328 oasc.RequestHandlers.initHandlersFromConfig created /terms: org.apache.solr.handler.component.SearchHandler
[junit4:junit4]   2> 5000 T1328 oasc.RequestHandlers.initHandlersFromConfig created spellCheckCompRH: org.apache.solr.handler.component.SearchHandler
[junit4:junit4]   2> 5001 T1328 oasc.RequestHandlers.initHandlersFromConfig created spellCheckCompRH_Direct: org.apache.solr.handler.component.SearchHandler
[junit4:junit4]   2> 5002 T1328 oasc.RequestHandlers.initHandlersFromConfig created spellCheckWithWordbreak: org.apache.solr.handler.component.SearchHandler
[junit4:junit4]   2> 5002 T1328 oasc.RequestHandlers.initHandlersFromConfig created spellCheckWithWordbreak_Direct: org.apache.solr.handler.component.SearchHandler
[junit4:junit4]   2> 5003 T1328 oasc.RequestHandlers.initHandlersFromConfig created spellCheckCompRH1: org.apache.solr.handler.component.SearchHandler
[junit4:junit4]   2> 5003 T1328 oasc.RequestHandlers.initHandlersFromConfig created tvrh: org.apache.solr.handler.component.SearchHandler
[junit4:junit4]   2> 5004 T1328 oasc.RequestHandlers.initHandlersFromConfig created /mlt: solr.MoreLikeThisHandler
[junit4:junit4]   2> 5005 T1328 oasc.RequestHandlers.initHandlersFromConfig created /debug/dump: solr.DumpRequestHandler
[junit4:junit4]   2> 5005 T1328 oashl.XMLLoader.init xsltCacheLifetimeSeconds=60
[junit4:junit4]   2> 5007 T1328 oasc.SolrCore.initDeprecatedSupport WARNING solrconfig.xml uses deprecated <admin/gettableFiles>, Please update your config to use the ShowFileRequestHandler.
[junit4:junit4]   2> 5008 T1328 oasc.SolrCore.initDeprecatedSupport WARNING adding ShowFileRequestHandler with hidden files: [OLD_SYNONYMS.TXT, PROTWORDS.TXT, STOPWORDS.TXT, OPEN-EXCHANGE-RATES.JSON, CURRENCY.XML, SCHEMA.XML, SYNONYMS.TXT, MAPPING-ISOLATIN1ACCENT.TXT]
[junit4:junit4]   2> 5010 T1328 oass.SolrIndexSearcher.<init> Opening Searcher@9e9170c3 main
[junit4:junit4]   2> 5011 T1328 oasu.CommitTracker.<init> Hard AutoCommit: disabled
[junit4:junit4]   2> 5012 T1328 oasu.CommitTracker.<init> Soft AutoCommit: disabled
[junit4:junit4]   2> 5012 T1328 oashc.SpellCheckComponent.inform Initializing spell checkers
[junit4:junit4]   2> 5016 T1328 oass.DirectSolrSpellChecker.init init: {name=direct,classname=DirectSolrSpellChecker,field=lowerfilt,minQueryLength=3}
[junit4:junit4]   2> 5039 T1387 oasc.SolrCore.registerSearcher [collection1] Registered new searcher Searcher@9e9170c3 main{StandardDirectoryReader(segments_1:1)}
[junit4:junit4]   2> 5432 T1349 oascc.ZkStateReader.updateClusterState Updating cloud state from ZooKeeper... 
[junit4:junit4]   2> 5436 T1348 oascc.ZkStateReader$2.process A cluster state change has occurred - updating...
[junit4:junit4]   2> 5436 T1374 oascc.ZkStateReader$2.process A cluster state change has occurred - updating...
[junit4:junit4]   2> 5436 T1386 oascc.ZkStateReader$2.process A cluster state change has occurred - updating...
[junit4:junit4]   2> 5436 T1362 oascc.ZkStateReader$2.process A cluster state change has occurred - updating...
[junit4:junit4]   2> 5542 T1328 oasc.CoreContainer.register registering core: collection1
[junit4:junit4]   2> 5543 T1328 oasc.ZkController.register Register shard - core:collection1 address:http://127.0.0.1:36391/solr shardId:shard1
[junit4:junit4]   2> 5546 T1328 oasc.ZkController.register We are http://127.0.0.1:36391/solr/collection1/ and leader is http://127.0.0.1:46961/solr/collection1/
[junit4:junit4]   2> 5547 T1328 oasc.ZkController.register No LogReplay needed for core=collection1 baseURL=http://127.0.0.1:36391/solr
[junit4:junit4]   2> 5547 T1328 oasc.ZkController.checkRecovery Core needs to recover:collection1
[junit4:junit4]   2> 5548 T1328 oasu.DefaultSolrCoreState.doRecovery Running recovery - first canceling any ongoing recovery
[junit4:junit4]   2> ASYNC  NEW_CORE C82 name=collection1 org.apache.solr.core.SolrCore@a7986ccb url=http://127.0.0.1:36391/solr/collection1 node=127.0.0.1:36391_solr
[junit4:junit4]   2> 5548 T1388 C82 P36391 oasc.RecoveryStrategy.run Starting recovery process.  core=collection1 recoveringAfterStartup=true
[junit4:junit4]   2> 5549 T1388 C82 P36391 oasc.RecoveryStrategy.doRecovery ###### startupVersions=[]
[junit4:junit4]   2> 5549 T1328 oascc.ZkStateReader.updateClusterState Updating cloud state from ZooKeeper... 
[junit4:junit4]   2> 5549 T1388 C82 P36391 oasc.RecoveryStrategy.doRecovery Attempting to PeerSync from http://127.0.0.1:46961/solr/collection1/ core=collection1 - recoveringAfterStartup=true
[junit4:junit4]   2> 5550 T1388 C82 P36391 oasu.PeerSync.sync PeerSync: core=collection1 url=http://127.0.0.1:36391/solr START replicas=[http://127.0.0.1:46961/solr/collection1/] nUpdates=100
[junit4:junit4]   2> 5550 T1328 oass.SolrDispatchFilter.init user.dir=/mnt/ssd/jenkins/workspace/Lucene-Solr-4.x-Linux/solr/build/solr-core/test/J0
[junit4:junit4]   2> 5550 T1388 C82 P36391 oasu.PeerSync.sync WARNING no frame of reference to tell of we've missed updates
[junit4:junit4]   2> 5550 T1388 C82 P36391 oasc.RecoveryStrategy.doRecovery PeerSync Recovery was not successful - trying replication. core=collection1
[junit4:junit4]   2> 5550 T1328 oass.SolrDispatchFilter.init SolrDispatchFilter.init() done
[junit4:junit4]   2> 5550 T1388 C82 P36391 oasc.RecoveryStrategy.doRecovery Starting Replication Recovery. core=collection1
[junit4:junit4]   2> 5551 T1388 C82 P36391 oascsi.HttpClientUtil.createClient Creating new http client, config:maxConnections=128&maxConnectionsPerHost=32&followRedirects=false
[junit4:junit4]   2> 5551 T1328 oascsi.HttpClientUtil.createClient Creating new http client, config:maxConnections=128&maxConnectionsPerHost=32&followRedirects=false
[junit4:junit4]   2> ASYNC  NEW_CORE C83 name=collection1 org.apache.solr.core.SolrCore@31478be9 url=http://127.0.0.1:46961/solr/collection1 node=127.0.0.1:46961_solr
[junit4:junit4]   2> 5555 T1354 C83 P46961 REQ /get {version=2&getVersions=100&qt=/get&wt=javabin&distrib=false} status=0 QTime=0 
[junit4:junit4]   2> 5555 T1328 oaz.ZooKeeper.<init> Initiating client connection, connectString=127.0.0.1:41208/solr sessionTimeout=10000 watcher=org.apache.solr.common.cloud.ConnectionManager@47e136d4
[junit4:junit4]   2> 5557 T1390 oaz.ClientCnxn$SendThread.startConnect Opening socket connection to server /127.0.0.1:41208
[junit4:junit4]   2> 5557 T1328 oascc.ConnectionManager.waitForConnected Waiting for client to connect to ZooKeeper
[junit4:junit4]   2> 5557 T1390 oaz.ClientCnxn$SendThread.primeConnection Socket connection established to localhost.localdomain/127.0.0.1:41208, initiating session
[junit4:junit4]   2> 5557 T1330 oazs.NIOServerCnxn$Factory.run Accepted socket connection from /127.0.0.1:53391
[junit4:junit4]   2> 5558 T1330 oazs.NIOServerCnxn.readConnectRequest Client attempting to establish new session at /127.0.0.1:53391
[junit4:junit4]   2> 5558 T1332 oazs.NIOServerCnxn.finishSessionInit Established session 0x139f48080430006 with negotiated timeout 10000 for client /127.0.0.1:53391
[junit4:junit4]   2> 5559 T1390 oaz.ClientCnxn$SendThread.readConnectResult Session establishment complete on server localhost.localdomain/127.0.0.1:41208, sessionid = 0x139f48080430006, negotiated timeout = 10000
[junit4:junit4]   2> 5559 T1391 oascc.ConnectionManager.process Watcher org.apache.solr.common.cloud.ConnectionManager@47e136d4 name:ZooKeeperConnection Watcher:127.0.0.1:41208/solr got event WatchedEvent state:SyncConnected type:None path:null path:null type:None
[junit4:junit4]   2> 5559 T1328 oascc.ConnectionManager.waitForConnected Client is connected to ZooKeeper
[junit4:junit4]   2> 5560 T1328 oascc.ZkStateReader.createClusterStateWatchersAndUpdate Updating cluster state from ZooKeeper... 
[junit4:junit4]   2> 5561 T1328 oasc.ChaosMonkey.monkeyLog monkey: init - expire sessions:true cause connection loss:true
[junit4:junit4]   2> 5561 T1328 oascsi.HttpClientUtil.createClient Creating new http client, config:
[junit4:junit4]   2> 5565 T1328 oascc.ZkStateReader.updateClusterState Updating cloud state from ZooKeeper... 
[junit4:junit4]   2> 5566 T1328 oasc.AbstractDistribZkTestBase.waitForRecoveriesToFinish Wait for recoveries to finish - collection: collection1 failOnTimeout:true timeout (sec):1800
[junit4:junit4]   2> 5566 T1328 oascc.ZkStateReader.updateClusterState Updating cloud state from ZooKeeper... 
[junit4:junit4]   2> 5938 T1349 oascc.ZkStateReader.updateClusterState Updating cloud state from ZooKeeper... 
[junit4:junit4]   2> 5942 T1391 oascc.ZkStateReader$2.process A cluster state change has occurred - updating...
[junit4:junit4]   2> 5942 T1374 oascc.ZkStateReader$2.process A cluster state change has occurred - updating...
[junit4:junit4]   2> 5942 T1348 oascc.ZkStateReader$2.process A cluster state change has occurred - updating...
[junit4:junit4]   2> 5942 T1386 oascc.ZkStateReader$2.process A cluster state change has occurred - updating...
[junit4:junit4]   2> 5942 T1362 oascc.ZkStateReader$2.process A cluster state change has occurred - updating...
[junit4:junit4]   2> 6567 T1328 oascc.ZkStateReader.updateClusterState Updating cloud state from ZooKeeper... 
[junit4:junit4]   2> 7569 T1328 oascc.ZkStateReader.updateClusterState Updating cloud state from ZooKeeper... 
[junit4:junit4]   2>  C82_STATE=coll:collection1 core:collection1 props:{base_url=http://127.0.0.1:36391/solr, state=recovering, node_name=127.0.0.1:36391_solr, roles=null, collection=collection1, shard=shard1, core=collection1}
[junit4:junit4]   2> 8558 T1388 C82 P36391 oasc.RecoveryStrategy.doRecovery Begin buffering updates. core=collection1
[junit4:junit4]   2> 8558 T1388 C82 P36391 oasu.UpdateLog.bufferUpdates Starting to buffer updates. FSUpdateLog{state=ACTIVE, tlog=null}
[junit4:junit4]   2> 8559 T1388 C82 P36391 oasc.RecoveryStrategy.replicate Attempting to replicate from http://127.0.0.1:46961/solr/collection1/. core=collection1
[junit4:junit4]   2> 8559 T1388 C82 P36391 oascsi.HttpClientUtil.createClient Creating new http client, config:maxConnections=128&maxConnectionsPerHost=32&followRedirects=false
[junit4:junit4]   2> 8566 T1356 C83 P46961 oasu.DirectUpdateHandler2.commit start commit{flags=0,_version_=0,optimize=false,openSearcher=true,waitSearcher=true,expungeDeletes=false,softCommit=false}
[junit4:junit4]   2> 8568 T1356 C83 P46961 oasc.SolrDeletionPolicy.onInit SolrDeletionPolicy.onInit: commits:num=1
[junit4:junit4]   2> 		commit{dir=NRTCachingDirectory(org.apache.lucene.store.MMapDirectory@/mnt/ssd/jenkins/workspace/Lucene-Solr-4.x-Linux/solr/build/solr-core/test/J0/org.apache.solr.cloud.BasicDistributedZkTest-1348426825792/jetty1/index lockFactory=org.apache.lucene.store.NativeFSLockFactory@61637eab; maxCacheMB=48.0 maxMergeSizeMB=4.0),segFN=segments_1,generation=1,filenames=[segments_1]
[junit4:junit4]   2> 8568 T1356 C83 P46961 oasc.SolrDeletionPolicy.updateCommits newest commit = 1
[junit4:junit4]   2> 8569 T1356 C83 P46961 oass.SolrIndexSearcher.<init> Opening Searcher@d7e236fd main
[junit4:junit4]   2> 8570 T1356 C83 P46961 oasu.DirectUpdateHandler2.commit end_commit_flush
[junit4:junit4]   2> 8571 T1363 oasc.SolrCore.registerSearcher [collection1] Registered new searcher Searcher@d7e236fd main{StandardDirectoryReader(segments_1:1)}
[junit4:junit4]   2> 8571 T1356 C83 P46961 /update {softCommit=false&commit_end_point=true&commit=true&version=2&waitSearcher=true&wt=javabin} {commit=} 0 5
[junit4:junit4]   2> 8571 T1328 oascc.ZkStateReader.updateClusterState Updating cloud state from ZooKeeper... 
[junit4:junit4]   2> 8572 T1388 C82 P36391 oash.ReplicationHandler.inform Commits will be reserved for  10000
[junit4:junit4]   2> 8572 T1388 C82 P36391 oash.SnapPuller.<init>  No value set for 'pollInterval'. Timer Task not started.
[junit4:junit4]   2> 8575 T1357 C83 P46961 oash.ReplicationHandler.inform Commits will be reserved for  10000
[junit4:junit4]   2> 8575 T1357 C83 P46961 REQ /replication {version=2&command=indexversion&qt=/replication&wt=javabin} status=0 QTime=1 
[junit4:junit4]   2> 8577 T1388 C82 P36391 oasc.SolrDeletionPolicy.onInit SolrDeletionPolicy.onInit: commits:num=1
[junit4:junit4]   2> 		commit{dir=NRTCachingDirectory(org.apache.lucene.store.MMapDirectory@/mnt/ssd/jenkins/workspace/Lucene-Solr-4.x-Linux/solr/build/solr-core/test/J0/org.apache.solr.cloud.BasicDistributedZkTest-1348426825792/jetty3/index lockFactory=org.apache.lucene.store.NativeFSLockFactory@a8d6a9b6; maxCacheMB=48.0 maxMergeSizeMB=4.0),segFN=segments_1,generation=1,filenames=[segments_1]
[junit4:junit4]   2> 8577 T1388 C82 P36391 oasc.SolrDeletionPolicy.updateCommits newest commit = 1
[junit4:junit4]   2> 8578 T1388 C82 P36391 oasu.DirectUpdateHandler2.commit start commit{flags=0,_version_=0,optimize=false,openSearcher=true,waitSearcher=true,expungeDeletes=false,softCommit=false}
[junit4:junit4]   2> 8582 T1388 C82 P36391 oasc.SolrDeletionPolicy.onCommit SolrDeletionPolicy.onCommit: commits:num=2
[junit4:junit4]   2> 		commit{dir=NRTCachingDirectory(org.apache.lucene.store.MMapDirectory@/mnt/ssd/jenkins/workspace/Lucene-Solr-4.x-Linux/solr/build/solr-core/test/J0/org.apache.solr.cloud.BasicDistributedZkTest-1348426825792/jetty3/index lockFactory=org.apache.lucene.store.NativeFSLockFactory@a8d6a9b6; maxCacheMB=48.0 maxMergeSizeMB=4.0),segFN=segments_1,generation=1,filenames=[segments_1]
[junit4:junit4]   2> 		commit{dir=NRTCachingDirectory(org.apache.lucene.store.MMapDirectory@/mnt/ssd/jenkins/workspace/Lucene-Solr-4.x-Linux/solr/build/solr-core/test/J0/org.apache.solr.cloud.BasicDistributedZkTest-1348426825792/jetty3/index lockFactory=org.apache.lucene.store.NativeFSLockFactory@a8d6a9b6; maxCacheMB=48.0 maxMergeSizeMB=4.0),segFN=segments_2,generation=2,filenames=[segments_2]
[junit4:junit4]   2> 8582 T1388 C82 P36391 oasc.SolrDeletionPolicy.updateCommits newest commit = 2
[junit4:junit4]   2> 8584 T1388 C82 P36391 oass.SolrIndexSearcher.<init> Opening Searcher@89b96148 main
[junit4:junit4]   2> 8585 T1388 C82 P36391 oasu.DirectUpdateHandler2.commit end_commit_flush
[junit4:junit4]   2> 8587 T1387 oasc.SolrCore.registerSearcher [collection1] Registered new searcher Searcher@89b96148 main{StandardDirectoryReader(segments_2:2)}
[junit4:junit4]   2> 8588 T1388 C82 P36391 oasc.RecoveryStrategy.replay No replay needed. core=collection1
[junit4:junit4]   2> 8589 T1388 C82 P36391 oasc.RecoveryStrategy.doRecovery Replication Recovery was successful - registering as Active. core=collection1
[junit4:junit4]   2> 8591 T1388 C82 P36391 oasc.RecoveryStrategy.doRecovery Finished recovery process. core=collection1
[junit4:junit4]   2> 8951 T1349 oascc.ZkStateReader.updateClusterState Updating cloud state from ZooKeeper... 
[junit4:junit4]   2> 8962 T1391 oascc.ZkStateReader$2.process A cluster state change has occurred - updating...
[junit4:junit4]   2> 8962 T1348 oascc.ZkStateReader$2.process A cluster state change has occurred - updating...
[junit4:junit4]   2> 8962 T1362 oascc.ZkStateReader$2.process A cluster state change has occurred - updating...
[junit4:junit4]   2> 8962 T1386 oascc.ZkStateReader$2.process A cluster state change has occurred - updating...
[junit4:junit4]   2> 8962 T1374 oascc.ZkStateReader$2.process A cluster state change has occurred - updating...
[junit4:junit4]   2> 9573 T1328 oascc.ZkStateReader.updateClusterState Updating cloud state from ZooKeeper... 
[junit4:junit4]   2> ASYNC  NEW_CORE C84 name=collection1 org.apache.solr.core.SolrCore@d22d39a0 url=http://127.0.0.1:46282/solr/collection1 node=127.0.0.1:46282_solr
[junit4:junit4]   2> 9579 T1340 C84 P46282 oasc.SolrDeletionPolicy.onInit SolrDeletionPolicy.onInit: commits:num=1
[junit4:junit4]   2> 		commit{dir=NRTCachingDirectory(org.apache.lucene.store.MMapDirectory@/mnt/ssd/jenkins/workspace/Lucene-Solr-4.x-Linux/solr/build/solr-core/test/J0/org.apache.solr.cloud.BasicDistributedZkTest-1348426825792/control/data/index lockFactory=org.apache.lucene.store.NativeFSLockFactory@54de0487; maxCacheMB=48.0 maxMergeSizeMB=4.0),segFN=segments_1,generation=1,filenames=[segments_1]
[junit4:junit4]   2> 9579 T1340 C84 P46282 oasc.SolrDeletionPolicy.updateCommits newest commit = 1
[junit4:junit4]   2> 9580 T1340 C84 P46282 oass.SolrIndexSearcher.<init> Opening Searcher@11a760cc realtime
[junit4:junit4]   2> 9581 T1340 C84 P46282 /update {version=2&wt=javabin} {deleteByQuery=*:* (-1413928017319690240)} 0 4
[junit4:junit4]   2> 9582 T1328 oaz.ZooKeeper.<init> Initiating client connection, connectString=127.0.0.1:41208/solr sessionTimeout=10000 watcher=org.apache.solr.common.cloud.ConnectionManager@c365d368
[junit4:junit4]   2> 9583 T1392 oaz.ClientCnxn$SendThread.startConnect Opening socket connection to server /127.0.0.1:41208
[junit4:junit4]   2> 9583 T1328 oascc.ConnectionManager.waitForConnected Waiting for client to connect to ZooKeeper
[junit4:junit4]   2> 9583 T1392 oaz.ClientCnxn$SendThread.primeConnection Socket connection established to localhost.localdomain/127.0.0.1:41208, initiating session
[junit4:junit4]   2> 9583 T1330 oazs.NIOServerCnxn$Factory.run Accepted socket connection from /127.0.0.1:53395
[junit4:junit4]   2> 9584 T1330 oazs.NIOServerCnxn.readConnectRequest Client attempting to establish new session at /127.0.0.1:53395
[junit4:junit4]   2> 9585 T1332 oazs.NIOServerCnxn.finishSessionInit Established session 0x139f48080430007 with negotiated timeout 10000 for client /127.0.0.1:53395
[junit4:junit4]   2> 9585 T1392 oaz.ClientCnxn$SendThread.readConnectResult Session establishment complete on server localhost.localdomain/127.0.0.1:41208, sessionid = 0x139f48080430007, negotiated timeout = 10000
[junit4:junit4]   2> 9585 T1393 oascc.ConnectionManager.process Watcher org.apache.solr.common.cloud.ConnectionManager@c365d368 name:ZooKeeperConnection Watcher:127.0.0.1:41208/solr got event WatchedEvent state:SyncConnected type:None path:null path:null type:None
[junit4:junit4]   2> 9585 T1328 oascc.ConnectionManager.waitForConnected Client is connected to ZooKeeper
[junit4:junit4]   2> 9586 T1328 oascc.ZkStateReader.createClusterStateWatchersAndUpdate Updating cluster state from ZooKeeper... 
[junit4:junit4]   2> 9589 T1358 C83 P46961 oass.SolrIndexSearcher.<init> Opening Searcher@a0f15762 realtime
[junit4:junit4]   2>  C82_STATE=coll:collection1 core:collection1 props:{base_url=http://127.0.0.1:36391/solr, state=active, node_name=127.0.0.1:36391_solr, roles=null, collection=collection1, shard=shard1, core=collection1}
[junit4:junit4]   2> 9594 T1378 C82 P36391 oass.SolrIndexSearcher.<init> Opening Searcher@2f57705a realtime
[junit4:junit4]   2> 9595 T1378 C82 P36391 REQ /update {update.distrib=FROMLEADER&_version_=-1413928017331224576&version=2&wt=javabin&update.from=http://127.0.0.1:46961/solr/collection1/} status=0 QTime=2 
[junit4:junit4]   2> ASYNC  NEW_CORE C85 name=collection1 org.apache.solr.core.SolrCore@c7cfa6e5 url=http://127.0.0.1:43076/solr/collection1 node=127.0.0.1:43076_solr
[junit4:junit4]   2> 9595 T1366 C85 P43076 oasc.SolrDeletionPolicy.onInit SolrDeletionPolicy.onInit: commits:num=1
[junit4:junit4]   2> 		commit{dir=NRTCachingDirectory(org.apache.lucene.store.MMapDirectory@/mnt/ssd/jenkins/workspace/Lucene-Solr-4.x-Linux/solr/build/solr-core/test/J0/org.apache.solr.cloud.BasicDistributedZkTest-1348426825792/jetty2/index lockFactory=org.apache.lucene.store.NativeFSLockFactory@c72d81af; maxCacheMB=48.0 maxMergeSizeMB=4.0),segFN=segments_1,generation=1,filenames=[segments_1]
[junit4:junit4]   2> 9595 T1366 C85 P43076 oasc.SolrDeletionPolicy.updateCommits newest commit = 1
[junit4:junit4]   2> 9596 T1366 C85 P43076 oass.SolrIndexSearcher.<init> Opening Searcher@7740b38e realtime
[junit4:junit4]   2> 9597 T1366 C85 P43076 REQ /update {update.distrib=TOLEADER&version=2&wt=javabin} status=0 QTime=4 
[junit4:junit4]   2> 9597 T1358 C83 P46961 /update {version=2&wt=javabin} {deleteByQuery=*:* (-1413928017331224576)} 0 9
[junit4:junit4]   2> 9601 T1340 C84 P46282 /update {version=2&wt=javabin} {add=[1 (1413928017343807488)]} 0 1
[junit4:junit4]   2> 9608 T1378 C82 P36391 REQ /update {update.distrib=FROMLEADER&distrib.from=http://127.0.0.1:46961/solr/collection1/&version=2&wt=javabin} status=0 QTime=1 
[junit4:junit4]   2> 9609 T1358 C83 P46961 /update {version=2&wt=javabin} {add=[1 (1413928017346953216)]} 0 6
[junit4:junit4]   2> 9612 T1340 C84 P46282 /update {version=2&wt=javabin} {add=[2 (1413928017355341824)]} 0 1
[junit4:junit4]   2> 9618 T1366 C85 P43076 REQ /update {update.distrib=TOLEADER&distrib.from=http://127.0.0.1:46961/solr/collection1/&version=2&wt=javabin} status=0 QTime=1 
[junit4:junit4]   2> 9619 T1358 C83 P46961 /update {version=2&wt=javabin} {add=[2]} 0 5
[junit4:junit4]   2> 9622 T1340 C84 P46282 /update {version=2&wt=javabin} {add=[3 (1413928017366876160)]} 0 1
[junit4:junit4]   2> 9632 T1367 C85 P43076 /update {version=2&wt=javabin} {add=[3 (1413928017376313344)]} 0 1
[junit4:junit4]   2> 9635 T1340 C84 P46282 /update {version=2&wt=javabin} {add=[4 (1413928017380507648)]} 0 1
[junit4:junit4]   2> 9643 T1378 C82 P36391 REQ /update {update.distrib=FROMLEADER&distrib.from=http://127.0.0.1:46961/solr/collection1/&version=2&wt=javabin} status=0 QTime=1 
[junit4:junit4]   2> 9643 T1359 C83 P46961 REQ /update {update.distrib=TOLEADER&distrib.from=http://127.0.0.1:43076/solr/collection1/&version=2&wt=javabin} status=0 QTime=4 
[junit4:junit4]   2> 9644 T1367 C85 P43076 /update {version=2&wt=javabin} {add=[4]} 0 6
[junit4:junit4]   2> 9647 T1340 C84 P46282 /update {version=2&wt=javabin} {add=[5 (1413928017393090560)]} 0 1
[junit4:junit4]   2> 9652 T1366 C85 P43076 REQ /update {update.distrib=TOLEADER&distrib.from=http://127.0.0.1:46961/solr/collection1/&version=2&wt=javabin} status=0 QTime=1 
[junit4:junit4]   2> 9653 T1358 C83 P46961 /update {version=2&wt=javabin} {add=[5]} 0 3
[junit4:junit4]   2> 9656 T1340 C84 P46282 /update {version=2&wt=javabin} {add=[6 (1413928017401479168)]} 0 1
[junit4:junit4]   2> 9661 T1366 C85 P43076 REQ /update {update.distrib=TOLEADER&distrib.from=http://127.0.0.1:46961/solr/collection1/&version=2&wt=javabin} status=0 QTime=1 
[junit4:junit4]   2> 9662 T1358 C83 P46961 /update {version=2&wt=javabin} {add=[6]} 0 4
[junit4:junit4]   2> 9665 T1340 C84 P46282 /update {version=2&wt=javabin} {add=[7 (1413928017410916352)]} 0 1
[junit4:junit4]   2> 9670 T1366 C85 P43076 REQ /update {update.distrib=TOLEADER&distrib.from=http://127.0.0.1:46961/solr/collection1/&version=2&wt=javabin} status=0 QTime=1 
[junit4:junit4]   2> 9671 T1358 C83 P46961 /update {version=2&wt=javabin} {add=[7]} 0 4
[junit4:junit4]   2> 9674 T1340 C84 P46282 /update {version=2&wt=javabin} {add=[8 (1413928017420353536)]} 0 1
[junit4:junit4]   2> 9682 T1378 C82 P36391 REQ /update {update.distrib=FROMLEADER&distrib.from=http://127.0.0.1:46961/solr/collection1/&version=2&wt=javabin} status=0 QTime=1 
[junit4:junit4]   2> 9682 T1359 C83 P46961 REQ /update {update.distrib=TOLEADER&distrib.from=http://127.0.0.1:43076/solr/collection1/&version=2&wt=javabin} status=0 QTime=4 
[junit4:junit4]   2> 9683 T1367 C85 P43076 /update {version=2&wt=javabin} {add=[8]} 0 6
[junit4:junit4]   2> 9686 T1340 C84 P46282 /update {version=2&wt=javabin} {add=[9 (1413928017433985024)]} 0 0
[junit4:junit4]   2> 9691 T1366 C85 P43076 REQ /update {update.distrib=TOLEADER&distrib.from=http://127.0.0.1:46961/solr/collection1/&version=2&wt=javabin} status=0 QTime=0 
[junit4:junit4]   2> 9692 T1358 C83 P46961 /update {version=2&wt=javabin} {add=[9]} 0 3
[junit4:junit4]   2> 9700 T1340 C84 P46282 /update {version=2&wt=javabin} {add=[10 (1413928017442373632)]} 0 6
[junit4:junit4]   2> 9708 T1378 C82 P36391 REQ /update {update.distrib=FROMLEADER&distrib.from=http://127.0.0.1:46961/solr/collection1/&version=2&wt=javabin} status=0 QTime=1 
[junit4:junit4]   2> 9709 T1359 C83 P46961 REQ /update {update.distrib=TOLEADER&distrib.from=http://127.0.0.1:43076/solr/collection1/&version=2&wt=javabin} status=0 QTime=4 
[junit4:junit4]   2> 9709 T1367 C85 P43076 /update {version=2&wt=javabin} {add=[10]} 0 6
[junit4:junit4]   2> 9713 T1340 C84 P46282 /update {version=2&wt=javabin} {add=[11 (1413928017461248000)]} 0 2
[junit4:junit4]   2> 9718 T1378 C82 P36391 REQ /update {update.distrib=FROMLEADER&distrib.from=http://127.0.0.1:46961/solr/collection1/&version=2&wt=javabin} status=0 QTime=1 
[junit4:junit4]   2> 9719 T1358 C83 P46961 /update {version=2&wt=javabin} {add=[11 (1413928017464393728)]} 0 4
[junit4:junit4]   2> 9722 T1340 C84 P46282 /update {version=2&wt=javabin} {add=[12 (1413928017471733760)]} 0 1
[junit4:junit4]   2> 9728 T1378 C82 P36391 REQ /update {update.distrib=FROMLEADER&distrib.from=http://127.0.0.1:46961/solr/collection1/&version=2&wt=javabin} status=0 QTime=1 
[junit4:junit4]   2> 9729 T1358 C83 P46961 /update {version=2&wt=javabin} {add=[12 (1413928017474879488)]} 0 4
[junit4:junit4]   2> 9732 T1340 C84 P46282 /update {version=2&wt=javabin} {add=[13 (1413928017481170944)]} 0 1
[junit4:junit4]   2> 9739 T1378 C82 P36391 REQ /update {update.distrib=FROMLEADER&distrib.from=http://127.0.0.1:46961/solr/collection1/&version=2&wt=javabin} status=0 QTime=0 
[junit4:junit4]   2> 9740 T1359 C83 P46961 REQ /update {update.distrib=TOLEADER&distrib.from=http://127.0.0.1:43076/solr/collection1/&version=2&wt=javabin} status=0 QTime=4 
[junit4:junit4]   2> 9741 T1367 C85 P43076 /update {version=2&wt=javabin} {add=[13]} 0 7
[junit4:junit4]   2> 9745 T1340 C84 P46282 /update {version=2&wt=javabin} {add=[14 (1413928017494802432)]} 0 2
[junit4:junit4]   2> 9750 T1378 C82 P36391 REQ /update {update.distrib=FROMLEADER&distrib.from=http://127.0.0.1:46961/solr/collection1/&version=2&wt=javabin} status=0 QTime=1 
[junit4:junit4]   2> 9751 T1358 C83 P46961 /update {version=2&wt=javabin} {add=[14 (1413928017497948160)]} 0 4
[junit4:junit4]   2> 9754 T1340 C84 P46282 /update {version=2&wt=javabin} {add=[15 (1413928017504239616)]} 0 1
[junit4:junit4]   2> 9760 T1378 C82 P36391 REQ /update {update.distrib=FROMLEADER&distrib.from=http://127.0.0.1:46961/solr/collection1/&version=2&wt=javabin} status=0 QTime=1 
[junit4:junit4]   2> 9760 T1358 C83 P46961 /update {version=2&wt=javabin} {add=[15 (1413928017508433920)]} 0 3
[junit4:junit4]   2> 9763 T1340 C84 P46282 /update {version=2&wt=javabin} {add=[16 (1413928017514725376)]} 0 0
[junit4:junit4]   2> 9781 T1378 C82 P36391 REQ /update {update.distrib=FROMLEADER&distrib.from=http://127.0.0.1:46961/solr/collection1/&version=2&wt=javabin} status=0 QTime=6 
[junit4:junit4]   2> 9782 T1358 C83 P46961 /update {version=2&wt=javabin} {add=[16 (1413928017517871104)]} 0 16
[junit4:junit4]   2> 9787 T1340 C84 P46282 /update {version=2&wt=javabin} {add=[17 (1413928017538842624)]} 0 2
[junit4:junit4]   2> 9795 T1366 C85 P43076 REQ /update {update.distrib=TOLEADER&distrib.from=http://127.0.0.1:46961/solr/collection1/&version=2&wt=javabin} status=0 QTime=3 
[junit4:junit4]   2> 9796 T1358 C83 P46961 /update {version=2&wt=javabin} {add=[17]} 0 6
[junit4:junit4]   2> 9799 T1340 C84 P46282 /update {version=2&wt=javabin} {add=[100 (1413928017551425536)]} 0 1
[junit4:junit4]   2> 9805 T1378 C82 P36391 REQ /update {update.distrib=FROMLEADER&distrib.from=http://127.0.0.1:46961/solr/collection1/&version=2&wt=javabin} status=0 QTime=1 
[junit4:junit4]   2> 9806 T1358 C83 P46961 /update {version=2&wt=javabin} {add=[100 (1413928017554571264)]} 0 5
[junit4:junit4]   2> 9809 T1340 C84 P46282 /update {version=2&wt=javabin} {add=[101 (1413928017562959872)]} 0 1
[junit4:junit4]   2> 9815 T1378 C82 P36391 REQ /update {update.distrib=FROMLEADER&distrib.from=http://127.0.0.1:46961/solr/collection1/&version=2&wt=javabin} status=0 QTime=1 
[junit4:junit4]   2> 9815 T1358 C83 P46961 /update {version=2&wt=javabin} {add=[101 (1413928017566105600)]} 0 4
[junit4:junit4]   2> 9824 T1340 C84 P46282 /update {version=2&wt=javabin} {add=[102 (1413928017572397056)]} 0 6
[junit4:junit4]   2> 9830 T1378 C82 P36391 REQ /update {update.distrib=FROMLEADER&distrib.from=http://127.0.0.1:46961/solr/collection1/&version=2&wt=javabin} status=0 QTime=1 
[junit4:junit4]   2> 9830 T1358 C83 P46961 /update {version=2&wt=javabin} {add=[102 (1413928017580785664)]} 0 4
[junit4:junit4]   2> 9834 T1340 C84 P46282 /update {version=2&wt=javabin} {add=[103 (1413928017588125696)]} 0 1
[junit4:junit4]   2> 9839 T1366 C85 P43076 REQ /update {update.distrib=TOLEADER&distrib.from=http://127.0.0.1:46961/solr/collection1/&version=2&wt=javabin} status=0 QTime=1 
[junit4:junit4]   2> 9840 T1358 C83 P46961 /update {version=2&wt=javabin} {add=[103]} 0 4
[junit4:junit4]   2> 9843 T1340 C84 P46282 /update {version=2&wt=javabin} {add=[104 (1413928017597562880)]} 0 1
[junit4:junit4]   2> 9846 T1367 C85 P43076 /update {version=2&wt=javabin} {add=[104 (1413928017600708608)]} 0 1
[junit4:junit4]   2> 9849 T1340 C84 P46282 /update {version=2&wt=javabin} {add=[105 (1413928017604902912)]} 0 1
[junit4:junit4]   2> 9859 T1366 C85 P43076 REQ /update {update.distrib=TOLEADER&distrib.from=http://127.0.0.1:46961/solr/collection1/&version=2&wt=javabin} status=0 QTime=6 
[junit4:junit4]   2> 9860 T1358 C83 P46961 /update {version=2&wt=javabin} {add=[105]} 0 9
[junit4:junit4]   2> 9863 T1340 C84 P46282 /update {version=2&wt=javabin} {add=[106 (1413928017619582976)]} 0 0
[junit4:junit4]   2> 9869 T1366 C85 P43076 REQ /update {update.distrib=TOLEADER&distrib.from=http://127.0.0.1:46961/solr/collection1/&version=2&wt=javabin} status=0 QTime=1 
[junit4:junit4]   2> 9870 T1358 C83 P46961 /update {version=2&wt=javabin} {add=[106]} 0 4
[junit4:junit4]   2> 9873 T1340 C84 P46282 /update {version=2&wt=javabin} {add=[107 (1413928017629020160)]} 0 1
[junit4:junit4]   2> 9879 T1378 C82 P36391 REQ /update {update.distrib=FROMLEADER&distrib.from=http://127.0.0.1:46961/solr/collection1/&version=2&wt=javabin} status=0 QTime=1 
[junit4:junit4]   2> 9880 T1358 C83 P46961 /update {version=2&wt=javabin} {add=[107 (1413928017633214464)]} 0 4
[junit4:junit4]   2> 9883 T1340 C84 P46282 /update {version=2&wt=javabin} {add=[108 (1413928017639505920)]} 0 1
[junit4:junit4]   2> 9888 T1378 C82 P36391 REQ /update {update.distrib=FROMLEADER&distrib.from=http://127.0.0.1:46961/solr/collection1/&version=2&wt=javabin} status=0 QTime=1 
[junit4:junit4]   2> 9889 T1358 C83 P46961 /update {version=2&wt=javabin} {add=[108 (1413928017642651648)]} 0 4
[junit4:junit4]   2> 9892 T1340 C84 P46282 /update {version=2&wt=javabin} {add=[109 (1413928017649991680)]} 0 1
[junit4:junit4]   2> 9898 T1378 C82 P36391 REQ /update {update.distrib=FROMLEADER&distrib.from=http://127.0.0.1:46961/solr/collection1/&version=2&wt=javabin} status=0 QTime=1 
[junit4:junit4]   2> 9899 T1358 C83 P46961 /update {version=2&wt=javabin} {add=[109 (1413928017653137408)]} 0 4
[junit4:junit4]   2> 9902 T1340 C84 P46282 /update {version=2&wt=javabin} {add=[110 (1413928017659428864)]} 0 1
[junit4:junit4]   2> 9911 T1378 C82 P36391 REQ /update {update.distrib=FROMLEADER&distrib.from=http://127.0.0.1:46961/solr/collection1/&version=2&wt=javabin} status=0 QTime=1 
[junit4:junit4]   2> 9912 T1359 C83 P46961 REQ /update {update.distrib=TOLEADER&distrib.from=http://127.0.0.1:43076/solr/collection1/&version=2&wt=javabin} status=0 QTime=5 
[junit4:junit4]   2> 9912 T1367 C85 P43076 /update {version=2&wt=javabin} {add=[110]} 0 7
[junit4:junit4]   2> 9916 T1340 C84 P46282 /update {version=2&wt=javabin} {add=[111 (1413928017674108928)]} 0 1
[junit4:junit4]   2> 9922 T1378 C82 P36391 REQ /update {update.distrib=FROMLEADER&distrib.from=http://127.0.0.1:46961/solr/collection1/&version=2&wt=javabin} status=0 QTime=1 
[junit4:junit4]   2> 9923 T1358 C83 P46961 /update {version=2&wt=javabin} {add=[111 (1413928017677254656)]} 0 5
[junit4:junit4]   2> 9934 T1340 C84 P46282 /update {version=2&wt=javabin} {add=[112 (1413928017685643264)]} 0 8
[junit4:junit4]   2> 9940 T1366 C85 P43076 REQ /update {update.distrib=TOLEADER&distrib.from=http://127.0.0.1:46961/solr/collection1/&version=2&wt=javabin} status=0 QTime=1 
[junit4:junit4]   2> 9941 T1358 C83 P46961 /update {version=2&wt=javabin} {add=[112]} 0 4
[junit4:junit4]   2> 9945 T1340 C84 P46282 /update {version=2&wt=javabin} {add=[113 (1413928017704517632)]} 0 1
[junit4:junit4]   2> 9953 T1378 C82 P36391 REQ /update {update.distrib=FROMLEADER&distrib.from=http://127.0.0.1:46961/solr/collection1/&version=2&wt=javabin} status=0 QTime=1 
[junit4:junit4]   2> 9954 T1359 C83 P46961 REQ /update {update.distrib=TOLEADER&distrib.from=http://127.0.0.1:43076/solr/collection1/&version=2&wt=javabin} status=0 QTime=4 
[junit4:junit4]   2> 9955 T1367 C85 P43076 /update {version=2&wt=javabin} {add=[113]} 0 7
[junit4:junit4]   2> 9959 T1340 C84 P46282 /update {version=2&wt=javabin} {add=[114 (1413928017719197696)]} 0 1
[junit4:junit4]   2> 9978 T1378 C82 P36391 REQ /update {update.distrib=FROMLEADER&distrib.from=http://127.0.0.1:46961/solr/collection1/&version=2&wt=javabin} status=0 QTime=8 
[junit4:junit4]   2> 9980 T1359 C83 P46961 REQ /update {update.distrib=TOLEADER&distrib.from=http://127.0.0.1:43076/solr/collection1/&version=2&wt=javabin} status=0 QTime=17 
[junit4:junit4]   2> 9980 T1367 C85 P43076 /update {version=2&wt=javabin} {add=[114]} 0 18
[junit4:junit4]   2> 9984 T1340 C84 P46282 /update {version=2&wt=javabin} {add=[115 (1413928017745412096)]} 0 1
[junit4:junit4]   2> 9987 T1367 C85 P43076 /update {version=2&wt=javabin} {add=[115 (1413928017749606400)]} 0 0
[junit4:junit4]   2> 9991 T1340 C84 P46282 /update {version=2&wt=javabin} {add=[116 (1413928017752752128)]} 0 1
[junit4:junit4]   2> 9996 T1366 C85 P43076 REQ /update {update.distrib=TOLEADER&distrib.from=http://127.0.0.1:46961/solr/collection1/&version=2&wt=javabin} status=0 QTime=1 
[junit4:junit4]   2> 9997 T1358 C83 P46961 /update {version=2&wt=javabin} {add=[116]} 0 4
[junit4:junit4]   2> 10000 T1340 C84 P46282 /update {version=2&wt=javabin} {add=[117 (1413928017762189312)]} 0 1
[junit4:junit4]   2> 10005 T1366 C85 P43076 REQ /update {update.distrib=TOLEADER&distrib.from=http://127.0.0.1:46961/solr/collection1/&version=2&wt=javabin} status=0 QTime=0 
[junit4:junit4]   2> 10006 T1358 C83 P46961 /update {version=2&wt=javabin} {add=[117]} 0 3
[junit4:junit4]   2> 10010 T1340 C84 P46282 /update {version=2&wt=javabin} {add=[118 (1413928017772675072)]} 0 1
[junit4:junit4]   2> 10019 T1378 C82 P36391 REQ /update {update.distrib=FROMLEADER&distrib.from=http://127.0.0.1:46961/solr/collection1/&version=2&wt=javabin} status=0 QTime=1 
[junit4:junit4]   2> 10020 T1359 C83 P46961 REQ /update {update.distrib=TOLEADER&distrib.from=http://127.0.0.1:43076/solr/collection1/&version=2&wt=javabin} status=0 QTime=6 
[junit4:junit4]   2> 10020 T1367 C85 P43076 /update {version=2&wt=javabin} {add=[118]} 0 7
[junit4:junit4]   2> 10024 T1340 C84 P46282 /update {version=2&wt=javabin} {add=[119 (1413928017787355136)]} 0 1
[junit4:junit4]   2> 10027 T1367 C85 P43076 /update {version=2&wt=javabin} {add=[119 (1413928017791549440)]} 0 0
[junit4:junit4]   2> 10031 T1340 C84 P46282 /update {version=2&wt=javabin} {add=[120 (1413928017794695168)]} 0 1
[junit4:junit4]   2> 10035 T1367 C85 P43076 /update {version=2&wt=javabin} {add=[120 (1413928017798889472)]} 0 1
[junit4:junit4]   2> 10038 T1340 C84 P46282 /update {version=2&wt=javabin} {add=[121 (1413928017802035200)]} 0 1
[junit4:junit4]   2> 10042 T1367 C85 P43076 /update {version=2&wt=javabin} {add=[121 (1413928017806229504)]} 0 1
[junit4:junit4]   2> 10053 T1340 C84 P46282 /update {version=2&wt=javabin} {add=[122 (1413928017810423808)]} 0 8
[junit4:junit4]   2> 10061 T1378 C82 P36391 REQ /update {update.distrib=FROMLEADER&distrib.from=http://127.0.0.1:46961/solr/collection1/&version=2&wt=javabin} status=0 QTime=1 
[junit4:junit4]   2> 10062 T1359 C83 P46961 REQ /update {update.distrib=TOLEADER&distrib.from=http://127.0.0.1:43076/solr/collection1/&version=2&wt=javabin} status=0 QTime=4 
[junit4:junit4]   2> 10063 T1367 C85 P43076 /update {version=2&wt=javabin} {add=[122]} 0 7
[junit4:junit4]   2> 10067 T1340 C84 P46282 /update {version=2&wt=javabin} {add=[123 (1413928017832443904)]} 0 1
[junit4:junit4]   2> 10075 T1378 C82 P36391 REQ /update {update.distrib=FROMLEADER&distrib.from=http://127.0.0.1:46961/solr/collection1/&version=2&wt=javabin} status=0 QTime=1 
[junit4:junit4]   2> 10076 T1359 C83 P46961 REQ /update {update.distrib=TOLEADER&distrib.from=http://127.0.0.1:43076/solr/collection1/&version=2&wt=javabin} status=0 QTime=4 
[junit4:junit4]   2> 10077 T1367 C85 P43076 /update {version=2&wt=javabin} {add=[123]} 0 7
[junit4:junit4]   2> 10081 T1340 C84 P46282 /update {version=2&wt=javabin} {add=[124 (1413928017847123968)]} 0 1
[junit4:junit4]   2> 10087 T1378 C82 P36391 REQ /update {update.distrib=FROMLEADER&distrib.from=http://127.0.0.1:46961/solr/collection1/&version=2&wt=javabin} status=0 QTime=0 
[junit4:junit4]   2> 10089 T1358 C83 P46961 /update {version=2&wt=javabin} {add=[124 (1413928017851318272)]} 0 5
[junit4:junit4]   2> 10092 T1340 C84 P46282 /update {version=2&wt=javabin} {add=[125 (1413928017858658304)]} 0 1
[junit4:junit4]   2> 10098 T1378 C82 P36391 REQ /update {update.distrib=FROMLEADER&distrib.from=http://127.0.0.1:46961/solr/collection1/&version=2&wt=javabin} status=0 QTime=1 
[junit4:junit4]   2> 10099 T1358 C83 P46961 /update {version=2&wt=javabin} {add=[125 (1413928017862852608)]} 0 4
[junit4:junit4]   2> 10102 T1340 C84 P46282 /update {version=2&wt=javabin} {add=[126 (1413928017870192640)]} 0 0
[junit4:junit4]   2> 10106 T1367 C85 P43076 /update {version=2&wt=javabin} {add=[126 (1413928017873338368)]} 0 1
[junit4:junit4]   2> 10109 T1340 C84 P46282 /update {version=2&wt=javabin} {add=[127 (1413928017876484096)]} 0 1
[junit4:junit4]   2> 10116 T1367 C85 P43076 /update {version=2&wt=javabin} {add=[127 (1413928017880678400)]} 0 4
[junit4:junit4]   2> 10120 T1340 C84 P46282 /update {version=2&wt=javabin} {add=[128 (1413928017888018432)]} 0 1
[junit4:junit4]   2> 10124 T1367 C85 P43076 /update {version=2&wt=javabin} {add=[128 (1413928017892212736)]} 0 1
[junit4:junit4]   2> 10128 T1340 C84 P46282 /update {version=2&wt=javabin} {add=[129 (1413928017896407040)]} 0 1
[junit4:junit4]   2> 10135 T1378 C82 P36391 REQ /update {update.distrib=FROMLEADER&distrib.from=http://127.0.0.1:46961/solr/collection1/&version=2&wt=javabin} status=0 QTime=1 
[junit4:junit4]   2> 10136 T1359 C83 P46961 REQ /update {update.distrib=TOLEADER&distrib.from=http://127.0.0.1:43076/solr/collection1/&version=2&wt=javabin} status=0 QTime=4 
[junit4:junit4]   2> 10137 T1367 C85 P43076 /update {version=2&wt=javabin} {add=[129]} 0 7
[junit4:junit4]   2> 10140 T1340 C84 P46282 /update {version=2&wt=javabin} {add=[130 (1413928017908989952)]} 0 1
[junit4:junit4]   2> 10143 T1367 C85 P43076 /update {version=2&wt=javabin} {add=[130 (1413928017913184256)]} 0 0
[junit4:junit4]   2> 10147 T1340 C84 P46282 /update {version=2&wt=javabin} {add=[131 (1413928017916329984)]} 0 1
[junit4:junit4]   2> 10150 T1367 C85 P43076 /update {version=2&wt=javabin} {add=[131 (1413928017919475712)]} 0 1
[junit4:junit4]   2> 10160 T1340 C84 P46282 /update {version=2&wt=javabin} {add=[132 (1413928017923670016)]} 0 8
[junit4:junit4]   2> 10166 T1378 C82 P36391 REQ /update {update.distrib=FROMLEADER&distrib.from=http://127.0.0.1:46961/solr/collection1/&version=2&wt=javabin} status=0 QTime=0 
[junit4:junit4]   2> 10167 T1358 C83 P46961 /update {version=2&wt=javabin} {add=[132 (1413928017934155776)]} 0 4
[junit4:junit4]   2> 10171 T1340 C84 P46282 /update {version=2&wt=javabin} {add=[133 (1413928017941495808)]} 0 2
[junit4:junit4]   2> 10178 T1378 C82 P36391 REQ /update {update.distrib=FROMLEADER&distrib.from=http://127.0.0.1:46961/solr/collection1/&version=2&wt=javabin} status=0 QTime=1 
[junit4:junit4]   2> 10179 T1358 C83 P46961 /update {version=2&wt=javabin} {add=[133 (1413928017945690112)]} 0 6
[junit4:junit4]   2> 10183 T1340 C84 P46282 /update {version=2&wt=javabin} {add=[134 (1413928017954078720)]} 0 1
[junit4:junit4]   2> 10188 T1366 C85 P43076 REQ /update {update.distrib=TOLEADER&distrib.from=http://127.0.0.1:46961/solr/collection1/&version=2&wt=javabin} status=0 QTime=0 
[junit4:junit4]   2> 10189 T1358 C83 P46961 /update {version=2&wt=javabin} {add=[134]} 0 3
[junit4:junit4]   2> 10192 T1340 C84 P46282 /update {version=2&wt=javabin} {add=[135 (1413928017964564480)]} 0 1
[junit4:junit4]   2> 10199 T1378 C82 P36391 REQ /update {update.distrib=FROMLEADER&distrib.from=http://127.0.0.1:46961/solr/collection1/&version=2&wt=javabin} status=0 QTime=1 
[junit4:junit4]   2> 10200 T1359 C83 P46961 REQ /update {update.distrib=TOLEADER&distrib.from=http://127.0.0.1:43076/solr/collection1/&version=2&wt=javabin} status=0 QTime=4 
[junit4:junit4]   2> 10201 T1367 C85 P43076 /update {version=2&wt=javabin} {add=[135]} 0 7
[junit4:junit4]   2> 10204 T1340 C84 P46282 /update {version=2&wt=javabin} {add=[136 (1413928017976098816)]} 0 1
[junit4:junit4]   2> 10208 T1366 C85 P43076 REQ /update {update.distrib=TOLEADER&distrib.from=http://127.0.0.1:46961/solr/collection1/&version=2&wt=javabin} status=0 QTime=0 
[junit4:junit4]   2> 10209 T1358 C83 P46961 /update {version=2&wt=javabin} {add=[136]} 0 3
[junit4:junit4]   2> 10212 T1340 C84 P46282 /update {version=2&wt=javabin} {add=[137 (1413928017985536000)]} 0 0
[junit4:junit4]   2> 10217 T1366 C85 P43076 REQ /update {update.distrib=TOLEADER&distrib.from=http://127.0.0.1:46961/solr/collection1/&version=2&wt=javabin} status=0 QTime=0 
[junit4:junit4]   2> 10218 T1358 C83 P46961 /update {version=2&wt=javabin} {add=[137]} 0 3
[junit4:junit4]   2> 10221 T1340 C84 P46282 /update {version=2&wt=javabin} {add=[138 (1413928017994973184)]} 0 0
[junit4:junit4]   2> 10239 T1378 C82 P36391 REQ /update {update.distrib=FROMLEADER&distrib.from=http://127.0.0.1:46961/solr/collection1/&version=2&wt=javabin} status=0 QTime=5 
[junit4:junit4]   2> 10240 T1358 C83 P46961 /update {version=2&wt=javabin} {add=[138 (1413928017997070336)]} 0 17
[junit4:junit4]   2> 10243 T1340 C84 P46282 /update {version=2&wt=javabin} {add=[139 (1413928018016993280)]} 0 1
[junit4:junit4]   2> 10248 T1366 C85 P43076 REQ /update {update.distrib=TOLEADER&distrib.from=http://127.0.0.1:46961/solr/collection1/&version=2&wt=javabin} status=0 QTime=1 
[junit4:junit4]   2> 10248 T1358 C83 P46961 /update {version=2&wt=javabin} {add=[139]} 0 3
[junit4:junit4]   2> 10252 T1340 C84 P46282 /update {version=2&wt=javabin} {add=[140 (1413928018026430464)]} 0 1
[junit4:junit4]   2> 10256 T1367 C85 P43076 /update {version=2&wt=javabin} {add=[140 (1413928018030624768)]} 0 1
[junit4:junit4]   2> 10259 T1340 C84 P46282 /update {version=2&wt=javabin} {add=[141 (1413928018033770496)]} 0 1
[junit4:junit4]   2> 10264 T1366 C85 P43076 REQ /update {update.distrib=TOLEADER&distrib.from=http://127.0.0.1:46961/solr/collection1/&version=2&wt=javabin} status=0 QTime=1 
[junit4:junit4]   2> 10265 T1358 C83 P46961 /update {version=2&wt=javabin} {add=[141]} 0 4
[junit4:junit4]   2> 10272 T1340 C84 P46282 /update {version=2&wt=javabin} {add=[142 (1413928018043207680)]} 0 5
[junit4:junit4]   2> 10281 T1366 C85 P43076 REQ /update {update.distrib=TOLEADER&distrib.from=http://127.0.0.1:46961/solr/collection1/&version=2&wt=javabin} status=0 QTime=4 
[junit4:junit4]   2> 10282 T1358 C83 P46961 /update {version=2&wt=javabin} {add=[142]} 0 7
[junit4:junit4]   2> 10286 T1340 C84 P46282 /update {version=2&wt=javabin} {add=[143 (1413928018062082048)]} 0 1
[junit4:junit4]   2> 10290 T1367 C85 P43076 /update {version=2&wt=javabin} {add=[143 (1413928018066276352)]} 0 1
[junit4:junit4]   2> 10294 T1340 C84 P46282 /update {version=2&wt=javabin} {add=[144 (1413928018070470656)]} 0 1
[junit4:junit4]   2> 10297 T1367 C85 P43076 /update {version=2&wt=javabin} {add=[144 (1413928018074664960)]} 0 0
[junit4:junit4]   2> 10301 T1340 C84 P46282 /update {version=2&wt=javabin} {add=[145 (1413928018077810688)]} 0 1
[junit4:junit4]   2> 10304 T1367 C85 P43076 /update {version=2&wt=javabin} {add=[145 (1413928018082004992)]} 0 0
[junit4:junit4]   2> 10308 T1340 C84 P46282 /update {version=2&wt=javabin} {add=[146 (1413928018085150720)]} 0 1
[junit4:junit4]   2> 10317 T1378 C82 P36391 REQ /update {update.distrib=FROMLEADER&distrib.from=http://127.0.0.1:46961/solr/collection1/&version=2&wt=javabin} status=0 QTime=1 
[junit4:junit4]   2> 10318 T1359 C83 P46961 REQ /update {update.distrib=TOLEADER&distrib.from=http://127.0.0.1:43076/solr/collection1/&version=2&wt=javabin} status=0 QTime=5 
[junit4:junit4]   2> 10319 T1367 C85 P43076 /update {version=2&wt=javabin} {add=[146]} 0 9
[junit4:junit4]   2> 10322 T1340 C84 P46282 /update {version=2&wt=javabin} {add=[147 (1413928018100879360)]} 0 1
[junit4:junit4]   2> 10328 T1366 C85 P43076 REQ /update {update.distrib=TOLEADER&distrib.from=http://127.0.0.1:46961/solr/collection1/&version=2&wt=javabin} status=0 QTime=1 
[junit4:junit4]   2> 10329 T1358 C83 P46961 /update {version=2&wt=javabin} {add=[147]} 0 4
[junit4:junit4]   2> 10332 T1340 C84 P46282 /update {version=2&wt=javabin} {add=[148 (1413928018111365120)]} 0 0
[junit4:junit4]   2> 10339 T1378 C82 P36391 REQ /update {update.distrib=FROMLEADER&distrib.from=http://127.0.0.1:46961/solr/collection1/&version=2&wt=javabin} status=0 QTime=1 
[junit4:junit4]   2> 10340 T1358 C83 P46961 /update {version=2&wt=javabin} {add=[148 (1413928018114510848)]} 0 5
[junit4:junit4]   2> 10343 T1340 C84 P46282 /update {version=2&wt=javabin} {add=[149 (1413928018122899456)]} 0 1
[junit4:junit4]   2> 10349 T1366 C85 P43076 REQ /update {update.distrib=TOLEADER&distrib.from=http://127.0.0.1:46961/solr/collection1/&version=2&wt=javabin} status=0 QTime=1 
[junit4:junit4]   2> 10349 T1358 C83 P46961 /update {version=2&wt=javabin} {add=[149]} 0 3
[junit4:junit4]   2> 10352 T1340 C84 P46282 oasu.DirectUpdateHandler2.commit start commit{flags=0,_version_=0,optimize=false,openSearcher=true,waitSearcher=true,expungeDeletes=false,softCommit=false}
[junit4:junit4]   2> 10462 T1340 C84 P46282 oasc.SolrDeletionPolicy.onCommit SolrDeletionPolicy.onCommit: commits:num=2
[junit4:junit4]   2> 		commit{dir=NRTCachingDirectory(org.apache.lucene.store.MMapDirectory@/mnt/ssd/jenkins/workspace/Lucene-Solr-4.x-Linux/solr/build/solr-core/test/J0/org.apache.solr.cloud.BasicDistributedZkTest-1348426825792/control/data/index lockFactory=org.apache.lucene.store.NativeFSLockFactory@54de0487; maxCacheMB=48.0 maxMergeSizeMB=4.0),segFN=segments_1,generation=1,filenames=[segments_1]
[junit4:junit4]   2> 		commit{dir=NRTCachingDirectory(org.apache.lucene.store.MMapDirectory@/mnt/ssd/jenkins/workspace/Lucene-Solr-4.x-Linux/solr/build/solr-core/test/J0/org.apache.solr.cloud.BasicDistributedZkTest-1348426825792/control/data/index lockFactory=org.apache.lucene.store.NativeFSLockFactory@54de0487; maxCacheMB=48.0 maxMergeSizeMB=4.0),segFN=segments_2,generation=2,filenames=[_5_MockVariableIntBlock_0.pos, _3_MockVariableIntBlock_0.skp, _0_MockVariableIntBlock_0.doc, _3_MockRandom_0.pos, _1.si, _0_MockRandom_0.prx, _0_Lucene40WithOrds_0.tib, _1_MockRandom_0.tim, _2_MockVariableIntBlock_0.pyl, _3_MockVariableIntBlock_0.frq, _1_MockRandom_0.tip, _0_Lucene40WithOrds_0.tii, _1_Lucene40WithOrds_0.prx, _5_MockRandom_0.frq, _2_MockRandom_0.pyl, _2_MockVariableIntBlock_0.tib, _6_MockVariableIntBlock_0.skp, _2_MockVariableIntBlock_0.tii, _0_MockVariableIntBlock_0.pos, _2_MockRandom_0.tib, _3_MockVariableIntBlock_0.doc, _4.si, _6_MockRandom_0.skp, _2_MockRandom_0.tii, _5_MockVariableIntBlock_0.pyl, _1_MockRandom_0.prx, _0_MockRandom_0.sd, _6_MockVariableIntBlock_0.frq, _1_MockRandom_0.sd, _2_MockRandom_0.sd, _3_MockRandom_0.sd, _4_MockRandom_0.sd, _5_MockRandom_0.sd, _6_MockRandom_0.sd, _1.fdt, _3.fdt, _6_MockRandom_0.frq, _5_MockVariableIntBlock_0.tib, _0_Lucene40WithOrds_0.prx, _5.fdt, _3_MockRandom_0.pyl, _1.fdx, _3.fdx, _5.fdx, _5_MockVariableIntBlock_0.tii, _3_MockVariableIntBlock_0.pos, _6_MockVariableIntBlock_0.doc, _1_MockVariableIntBlock_0.skp, _0_Pulsing40_0.frq, _1_Pulsing40_0.frq, _2_Pulsing40_0.frq, _3_Pulsing40_0.frq, _6_MockRandom_0.doc, _4_Pulsing40_0.frq, _5_Pulsing40_0.frq, _6_Pulsing40_0.frq, segments_2, _3_MockRandom_0.tim, _3_MockRandom_0.tip, _0_MockVariableIntBlock_0.pyl, _1_MockVariableIntBlock_0.frq, _0_MockVariableIntBlock_0.tib, _6_MockVariableIntBlock_0.pos, _4_MockRandom_0.tib, _4_MockVariableIntBlock_0.skp, _1.fnm, _0_MockVariableIntBlock_0.tii, _3.fnm, _6_MockRandom_0.pos, _1_MockVariableIntBlock_0.doc, _5.fnm, _2.si, _3_MockVariableIntBlock_0.pyl, _4_MockVariableIntBlock_0.frq, _4_MockRandom_0.tiv, _3_MockVariableIntBlock_0.tib, _0_MockRandom_0.frq, _3_MockVariableIntBlock_0.tii, _1_MockVariableIntBlock_0.pos, _4_MockVariableIntBlock_0.doc, _1_Lucene40WithOrds_0.frq, _5.si, _0_nrm.cfe, _4_MockRandom_0.prx, _1_nrm.cfe, _5_MockRandom_0.tim, _2_nrm.cfe, _6_MockVariableIntBlock_0.pyl, _3_nrm.cfe, _4_nrm.cfe, _5_MockRandom_0.tip, _5_nrm.cfe, _6_nrm.cfe, _6_MockRandom_0.pyl, _6_MockVariableIntBlock_0.tib, _0_nrm.cfs, _1_nrm.cfs, _2_nrm.cfs, _3_nrm.cfs, _4_nrm.cfs, _5_nrm.cfs, _1_MockRandom_0.frq, _6_MockVariableIntBlock_0.tii, _6_nrm.cfs, _4_MockVariableIntBlock_0.pos, _2_MockVariableIntBlock_0.skp, _0_Lucene40WithOrds_0.frq, _5_MockRandom_0.prx, _6_MockRandom_0.tim, _6_MockRandom_0.tip, _0.si, _2_MockRandom_0.skp, _1_MockVariableIntBlock_0.pyl, _2_MockVariableIntBlock_0.frq, _0.fdt, _2.fdt, _4.fdt, _0.fdx, _6.fdt, _0_Pulsing40_0.tim, _2.fdx, _1_Pulsing40_0.tim, _4.fdx, _1_MockVariableIntBlock_0.tib, _2_Pulsing40_0.tim, _2_MockRandom_0.frq, _0_Pulsing40_0.tip, _3_Pulsing40_0.tim, _6.fdx, _4_Pulsing40_0.tim, _1_Pulsing40_0.tip, _5_Pulsing40_0.tim, _2_Pulsing40_0.tip, _6_Pulsing40_0.tim, _3_Pulsing40_0.tip, _4_Pulsing40_0.tip, _5_Pulsing40_0.tip, _6_Pulsing40_0.tip, _5_MockVariableIntBlock_0.skp, _1_MockVariableIntBlock_0.tii, _2_MockVariableIntBlock_0.doc, _3.si, _3_MockRandom_0.skp, _4_MockVariableIntBlock_0.pyl, _2_MockRandom_0.doc, _5_MockVariableIntBlock_0.frq, _0_Pulsing40_0.prx, _4_MockVariableIntBlock_0.tib, _1_Pulsing40_0.prx, _2_Pulsing40_0.prx, _3_Pulsing40_0.prx, _3_MockRandom_0.frq, _4_Pulsing40_0.prx, _5_Pulsing40_0.prx, _6_Pulsing40_0.prx, _4_MockVariableIntBlock_0.tii, _2_MockVariableIntBlock_0.pos, _5_MockVariableIntBlock_0.doc, _0.fnm, _2.fnm, _0_MockRandom_0.tib, _4.fnm, _6.si, _0_MockVariableIntBlock_0.skp, _6.fnm, _2_MockRandom_0.pos, _3_MockRandom_0.doc, _1_Lucene40WithOrds_0.tib, _0_MockVariableIntBlock_0.frq, _1_Lucene40WithOrds_0.tii, _4_MockRandom_0.frq, _0_MockRandom_0.tiv]
[junit4:junit4]   2> 10463 T1340 C84 P46282 oasc.SolrDeletionPolicy.updateCommits newest commit = 2
[junit4:junit4]   2> 10469 T1340 C84 P46282 oass.SolrIndexSearcher.<init> Opening Searcher@496511f8 main
[junit4:junit4]   2> 10469 T1340 C84 P46282 oasu.DirectUpdateHandler2.commit end_commit_flush
[junit4:junit4]   2> 10471 T1351 oasc.SolrCore.registerSearcher [collection1] Registered new searcher Searcher@496511f8 main{StandardDirectoryReader(segments_2:15:nrt _0(4.1):C10 _1(4.1):C10 _2(4.1):C10 _3(4.1):C10 _4(4.1):C10 _5(4.1):C10 _6(4.1):C7)}
[junit4:junit4]   2> 10471 T1340 C84 P46282 /update {version=2&softCommit=false&waitSearcher=true&wt=javabin&commit=true} {commit=} 0 119
[junit4:junit4]   2> 10474 T1358 C83 P46961 oasu.DirectUpdateHandler2.commit start commit{flags=0,_version_=0,optimize=false,openSearcher=true,waitSearcher=true,expungeDeletes=false,softCommit=false}
[junit4:junit4]   2> 10612 T1358 C83 P46961 oasc.SolrDeletionPolicy.onCommit SolrDeletionPolicy.onCommit: commits:num=2
[junit4:junit4]   2> 		commit{dir=NRTCachingDirectory(org.apache.lucene.store.MMapDirectory@/mnt/ssd/jenkins/workspace/Lucene-Solr-4.x-Linux/solr/build/solr-core/test/J0/org.apache.solr.cloud.BasicDistributedZkTest-1348426825792/jetty1/index lockFactory=org.apache.lucene.store.NativeFSLockFactory@61637eab; maxCacheMB=48.0 maxMergeSizeMB=4.0),segFN=segments_1,generation=1,filenames=[segments_1]
[junit4:junit4]   2> 		commit{dir=NRTCachingDirectory(org.apache.lucene.store.MMapDirectory@/mnt/ssd/jenkins/workspace/Lucene-Solr-4.x-Linux/solr/build/solr-core/test/J0/org.apache.solr.cloud.BasicDistributedZkTest-1348426825792/jetty1/index lockFactory=org.apache.lucene.store.NativeFSLockFactory@61637eab; maxCacheMB=48.0 maxMergeSizeMB=4.0),segFN=segments_2,generation=2,filenames=[_3_MockVariableIntBlock_0.skp, _0_MockVariableIntBlock_0.doc, _1.si, _0_Lucene40WithOrds_0.tib, _1_MockRandom_0.tim, _2_MockVariableIntBlock_0.pyl, _3_MockVariableIntBlock_0.frq, _1_MockRandom_0.tip, _0_Lucene40WithOrds_0.tii, _2_MockRandom_0.pyl, _2_MockVariableIntBlock_0.tib, _2_MockVariableIntBlock_0.tii, _0_MockVariableIntBlock_0.pos, _2_MockRandom_0.tib, _3_MockVariableIntBlock_0.doc, _1_MockRandom_0.prx, _0_MockRandom_0.sd, _1_MockRandom_0.sd, _2_MockRandom_0.sd, _3_MockRandom_0.sd, _1.fdt, _3.fdt, _0_Lucene40WithOrds_0.prx, _2_MockRandom_0.tiv, _1.fdx, _3.fdx, _3_MockVariableIntBlock_0.pos, _1_MockVariableIntBlock_0.skp, _0_Pulsing40_0.frq, _1_Pulsing40_0.frq, _2_Pulsing40_0.frq, _3_Pulsing40_0.frq, segments_2, _3_MockRandom_0.tim, _3_MockRandom_0.tip, _0_MockVariableIntBlock_0.pyl, _1_MockVariableIntBlock_0.frq, _0_MockVariableIntBlock_0.tib, _1.fnm, _0_MockVariableIntBlock_0.tii, _3.fnm, _1_MockVariableIntBlock_0.doc, _2.si, _3_MockRandom_0.prx, _3_MockVariableIntBlock_0.pyl, _0_MockRandom_0.skp, _3_MockVariableIntBlock_0.tib, _0_MockRandom_0.frq, _3_MockVariableIntBlock_0.tii, _1_MockVariableIntBlock_0.pos, _0_nrm.cfe, _1_nrm.cfe, _2_nrm.cfe, _3_nrm.cfe, _0_MockRandom_0.doc, _0_nrm.cfs, _1_nrm.cfs, _2_nrm.cfs, _3_nrm.cfs, _1_MockRandom_0.frq, _2_MockVariableIntBlock_0.skp, _0_Lucene40WithOrds_0.frq, _0_MockRandom_0.pos, _0.si, _2_MockRandom_0.skp, _1_MockVariableIntBlock_0.pyl, _2_MockVariableIntBlock_0.frq, _0.fdt, _2.fdt, _0.fdx, _0_Pulsing40_0.tim, _2.fdx, _1_Pulsing40_0.tim, _1_MockVariableIntBlock_0.tib, _2_Pulsing40_0.tim, _2_MockRandom_0.frq, _0_Pulsing40_0.tip, _3_Pulsing40_0.tim, _1_Pulsing40_0.tip, _2_Pulsing40_0.tip, _3_Pulsing40_0.tip, _1_MockVariableIntBlock_0.tii, _2_MockVariableIntBlock_0.doc, _3.si, _2_MockRandom_0.doc, _0_Pulsing40_0.prx, _1_Pulsing40_0.prx, _2_Pulsing40_0.prx, _3_Pulsing40_0.prx, _3_MockRandom_0.frq, _0_MockRandom_0.pyl, _2_MockVariableIntBlock_0.pos, _0.fnm, _2.fnm, _0_MockRandom_0.tib, _0_MockVariableIntBlock_0.skp, _2_MockRandom_0.pos, _0_MockRandom_0.tii, _0_MockVariableIntBlock_0.frq]
[junit4:junit4]   2> 10613 T1358 C83 P46961 oasc.SolrDeletionPolicy.updateCommits newest commit = 2
[junit4:junit4]   2> 10617 T1358 C83 P46961 oass.SolrIndexSearcher.<init> Opening Searcher@f329b45f main
[junit4:junit4]   2> 10618 T1358 C83 P46961 oasu.DirectUpdateHandler2.commit end_commit_flush
[junit4:junit4]   2> 10619 T1363 oasc.SolrCore.registerSearcher [collection1] Registered new searcher Searcher@f329b45f main{StandardDirectoryReader(segments_2:9:nrt _0(4.1):C10 _1(4.1):C10 _2(4.1):C10 _3(4.1):C2)}
[junit4:junit4]   2> 10620 T1358 C83 P46961 oasu.SolrCmdDistributor.distribCommit Distrib commit to:[StdNode: http://127.0.0.1:36391/solr/collection1/, StdNode: http://127.0.0.1:43076/solr/collection1/]
[junit4:junit4]   2> 10622 T1366 C85 P43076 oasu.DirectUpdateHandler2.commit start commit{flags=0,_version_=0,optimize=false,openSearcher=true,waitSearcher=true,expungeDeletes=false,softCommit=false}
[junit4:junit4]   2> 10622 T1378 C82 P36391 oasu.DirectUpdateHandler2.commit start commit{flags=0,_version_=0,optimize=false,openSearcher=true,waitSearcher=true,expungeDeletes=false,softCommit=false}
[junit4:junit4]   2> 10712 T1366 C85 P43076 oasc.SolrDeletionPolicy.onCommit SolrDeletionPolicy.onCommit: commits:num=2
[junit4:junit4]   2> 		commit{dir=NRTCachingDirectory(org.apache.lucene.store.MMapDirectory@/mnt/ssd/jenkins/workspace/Lucene-Solr-4.x-Linux/solr/build/solr-core/test/J0/org.apache.solr.cloud.BasicDistributedZkTest-1348426825792/jetty2/index lockFactory=org.apache.lucene.store.NativeFSLockFactory@c72d81af; maxCacheMB=48.0 maxMergeSizeMB=4.0),segFN=segments_1,generation=1,filenames=[segments_1]
[junit4:junit4]   2> 		commit{dir=NRTCachingDirectory(org.apache.lucene.store.MMapDirectory@/mnt/ssd/jenkins/workspace/Lucene-Solr-4.x-Linux/solr/build/solr-core/test/J0/org.apache.solr.cloud.BasicDistributedZkTest-1348426825792/jetty2/index lockFactory=org.apache.lucene.store.NativeFSLockFactory@c72d81af; maxCacheMB=48.0 maxMergeSizeMB=4.0),segFN=segments_2,generation=2,filenames=[_1_MockRandom_0.tib, _3_MockVariableIntBlock_0.skp, _0_MockVariableIntBlock_0.doc, _3_MockRandom_0.pos, _1.si, _0_Lucene40WithOrds_0.tib, _2_MockVariableIntBlock_0.pyl, _3_MockVariableIntBlock_0.frq, _0_Lucene40WithOrds_0.tii, _1_MockRandom_0.tiv, _2_MockVariableIntBlock_0.tib, _2_MockVariableIntBlock_0.tii, _0_MockVariableIntBlock_0.pos, _3_MockVariableIntBlock_0.doc, _1_MockRandom_0.prx, _0_MockRandom_0.sd, _1_MockRandom_0.sd, _2_MockRandom_0.tim, _2_MockRandom_0.sd, _3_MockRandom_0.sd, _2_MockRandom_0.tip, _1.fdt, _3.fdt, _0_Lucene40WithOrds_0.prx, _3_MockRandom_0.pyl, _1.fdx, _3.fdx, _3_MockVariableIntBlock_0.pos, _1_MockVariableIntBlock_0.skp, _0_Pulsing40_0.frq, _1_Pulsing40_0.frq, _2_Pulsing40_0.frq, _3_Pulsing40_0.frq, _2_MockRandom_0.prx, segments_2, _3_MockRandom_0.tim, _3_MockRandom_0.tip, _0_MockVariableIntBlock_0.pyl, _1_MockVariableIntBlock_0.frq, _0_MockVariableIntBlock_0.tib, _1.fnm, _0_MockVariableIntBlock_0.tii, _3.fnm, _1_MockVariableIntBlock_0.doc, _2.si, _3_MockVariableIntBlock_0.pyl, _0_MockRandom_0.skp, _3_MockVariableIntBlock_0.tib, _0_MockRandom_0.frq, _3_MockVariableIntBlock_0.tii, _1_MockVariableIntBlock_0.pos, _0_nrm.cfe, _1_nrm.cfe, _2_nrm.cfe, _3_nrm.cfe, _0_MockRandom_0.doc, _0_nrm.cfs, _1_nrm.cfs, _2_nrm.cfs, _3_nrm.cfs, _1_MockRandom_0.frq, _2_MockVariableIntBlock_0.skp, _0_Lucene40WithOrds_0.frq, _0_MockRandom_0.pos, _0.si, _1_MockVariableIntBlock_0.pyl, _2_MockVariableIntBlock_0.frq, _0.fdt, _2.fdt, _0.fdx, _0_Pulsing40_0.tim, _2.fdx, _1_Pulsing40_0.tim, _1_MockVariableIntBlock_0.tib, _2_Pulsing40_0.tim, _2_MockRandom_0.frq, _0_Pulsing40_0.tip, _3_Pulsing40_0.tim, _1_Pulsing40_0.tip, _2_Pulsing40_0.tip, _3_Pulsing40_0.tip, _1_MockVariableIntBlock_0.tii, _2_MockVariableIntBlock_0.doc, _3.si, _3_MockRandom_0.skp, _0_Pulsing40_0.prx, _1_Pulsing40_0.prx, _2_Pulsing40_0.prx, _3_Pulsing40_0.prx, _3_MockRandom_0.frq, _0_MockRandom_0.pyl, _2_MockVariableIntBlock_0.pos, _0.fnm, _2.fnm, _0_MockRandom_0.tib, _0_MockVariableIntBlock_0.skp, _3_MockRandom_0.doc, _0_MockVariableIntBlock_0.frq, _0_MockRandom_0.tiv]
[junit4:junit4]   2> 10713 T1366 C85 P43076 oasc.SolrDeletionPolicy.updateCommits newest commit = 2
[junit4:junit4]   2> 10716 T1366 C85 P43076 oass.SolrIndexSearcher.<init> Opening Searcher@b3f77224 main
[junit4:junit4]   2> 10717 T1366 C85 P43076 oasu.DirectUpdateHandler2.commit end_commit_flush
[junit4:junit4]   2> 10717 T1375 oasc.SolrCore.registerSearcher [collection1] Registered new searcher Searcher@b3f77224 main{StandardDirectoryReader(segments_2:9:nrt _0(4.1):C10 _1(4.1):C10 _2(4.1):C10 _3(4.1):C5)}
[junit4:junit4]   2> 10718 T1366 C85 P43076 /update {softCommit=false&commit_end_point=true&expungeDeletes=false&commit=true&version=2&waitSearcher=true&wt=javabin} {commit=} 0 96
[junit4:junit4]   2> 10722 T1378 C82 P36391 oasc.SolrDeletionPolicy.onCommit SolrDeletionPolicy.onCommit: commits:num=2
[junit4:junit4]   2> 		commit{dir=NRTCachingDirectory(org.apache.lucene.store.MMapDirectory@/mnt/ssd/jenkins/workspace/Lucene-Solr-4.x-Linux/solr/build/solr-core/test/J0/org.apache.solr.cloud.BasicDistributedZkTest-1348426825792/jetty3/index lockFactory=org.apache.lucene.store.NativeFSLockFactory@a8d6a9b6; maxCacheMB=48.0 maxMergeSizeMB=4.0),segFN=segments_2,generation=2,filenames=[segments_2]
[junit4:junit4]   2> 		commit{dir=NRTCachingDirectory(org.apache.lucene.store.MMapDirectory@/mnt/ssd/jenkins/workspace/Lucene-Solr-4.x-Linux/solr/build/solr-core/test/J0/org.apache.solr.cloud.BasicDistributedZkTest-1348426825792/jetty3/index lockFactory=org.apache.lucene.store.NativeFSLockFactory@a8d6a9b6; maxCacheMB=48.0 maxMergeSizeMB=4.0),segFN=segments_3,generation=3,filenames=[_1_MockRandom_0.pyl, _3_MockVariableIntBlock_0.skp, _0_MockVariableIntBlock_0.doc, _1.si, _0_MockRandom_0.prx, _0_Lucene40WithOrds_0.tib, _1_MockRandom_0.tim, _2_MockVariableIntBlock_0.pyl, _3_MockVariableIntBlock_0.frq, _1_MockRandom_0.tip, _0_Lucene40WithOrds_0.tii, _2_MockRandom_0.pyl, _2_MockVariableIntBlock_0.tib, _2_MockVariableIntBlock_0.tii, _0_MockVariableIntBlock_0.pos, _2_MockRandom_0.tib, _3_MockVariableIntBlock_0.doc, _2_MockRandom_0.tii, _0_MockRandom_0.sd, _1_MockRandom_0.sd, _2_MockRandom_0.sd, _3_MockRandom_0.sd, _1.fdt, _3.fdt, _0_Lucene40WithOrds_0.prx, _1.fdx, _3.fdx, _3_MockVariableIntBlock_0.pos, _1_MockVariableIntBlock_0.skp, _0_Pulsing40_0.frq, _1_Pulsing40_0.frq, _2_Pulsing40_0.frq, _3_Pulsing40_0.frq, _3_MockRandom_0.tim, segments_3, _3_MockRandom_0.tip, _0_MockVariableIntBlock_0.pyl, _1_MockVariableIntBlock_0.frq, _0_MockVariableIntBlock_0.tib, _1.fnm, _0_MockVariableIntBlock_0.tii, _3.fnm, _1_MockVariableIntBlock_0.doc, _2.si, _3_MockRandom_0.prx, _3_MockVariableIntBlock_0.pyl, _3_MockVariableIntBlock_0.tib, _0_MockRandom_0.frq, _3_MockVariableIntBlock_0.tii, _1_MockVariableIntBlock_0.pos, _0_nrm.cfe, _1_nrm.cfe, _2_nrm.cfe, _3_nrm.cfe, _1_MockRandom_0.skp, _0_nrm.cfs, _1_nrm.cfs, _2_nrm.cfs, _3_nrm.cfs, _1_MockRandom_0.frq, _2_MockVariableIntBlock_0.skp, _0_Lucene40WithOrds_0.frq, _0.si, _2_MockRandom_0.skp, _1_MockRandom_0.doc, _1_MockVariableIntBlock_0.pyl, _2_MockVariableIntBlock_0.frq, _0.fdt, _2.fdt, _0.fdx, _0_Pulsing40_0.tim, _2.fdx, _1_Pulsing40_0.tim, _1_MockVariableIntBlock_0.tib, _2_Pulsing40_0.tim, _2_MockRandom_0.frq, _0_Pulsing40_0.tip, _3_Pulsing40_0.tim, _1_Pulsing40_0.tip, _2_Pulsing40_0.tip, _3_Pulsing40_0.tip, _1_MockVariableIntBlock_0.tii, _2_MockVariableIntBlock_0.doc, _3.si, _1_MockRandom_0.pos, _2_MockRandom_0.doc, _0_Pulsing40_0.prx, _1_Pulsing40_0.prx, _2_Pulsing40_0.prx, _3_Pulsing40_0.prx, _3_MockRandom_0.frq, _2_MockVariableIntBlock_0.pos, _0.fnm, _2.fnm, _0_MockVariableIntBlock_0.skp, _2_MockRandom_0.pos, _0_MockRandom_0.tim, _0_MockRandom_0.tip, _0_MockVariableIntBlock_0.frq]
[junit4:junit4]   2> 10723 T1378 C82 P36391 oasc.SolrDeletionPolicy.updateCommits newest commit = 3
[junit4:junit4]   2> 10726 T1378 C82 P36391 oass.SolrIndexSearcher.<init> Opening Searcher@78165ac4 main
[junit4:junit4]   2> 10726 T1378 C82 P36391 oasu.DirectUpdateHandler2.commit end_commit_flush
[junit4:junit4]   2> 10727 T1387 oasc.SolrCore.registerSearcher [collection1] Registered new searcher Searcher@78165ac4 main{StandardDirectoryReader(segments_3:10:nrt _0(4.1):C10 _1(4.1):C10 _2(4.1):C10 _3(4.1):C2)}
[junit4:junit4]   2> 10728 T1378 C82 P36391 /update {softCommit=false&commit_end_point=true&expungeDeletes=false&commit=true&version=2&waitSearcher=true&wt=javabin} {commit=} 0 106
[junit4:junit4]   2> 10728 T1358 C83 P46961 /update {version=2&softCommit=false&waitSearcher=true&wt=javabin&commit=true} {commit=} 0 254
[junit4:junit4]   2> 10731 T1340 C84 P46282 REQ /select {version=2&q=*:*&wt=javabin&distrib=false&sort=n_ti1+desc} hits=67 status=0 QTime=0 
[junit4:junit4]   2> 10733 T1328 oascsi.HttpClientUtil.createClient Creating new http client, config:
[junit4:junit4]   2> 10736 T1328 oaz.ZooKeeper.<init> Initiating client connection, connectString=127.0.0.1:41208/solr sessionTimeout=10000 watcher=org.apache.solr.common.cloud.ConnectionManager@952d36be
[junit4:junit4]   2> 10737 T1397 oaz.ClientCnxn$SendThread.startConnect Opening socket connection to server /127.0.0.1:41208
[junit4:junit4]   2> 10737 T1328 oascc.ConnectionManager.waitForConnected Waiting for client to connect to ZooKeeper
[junit4:junit4]   2> 10738 T1397 oaz.ClientCnxn$SendThread.primeConnection Socket connection established to localhost.localdomain/127.0.0.1:41208, initiating session
[junit4:junit4]   2> 10738 T1330 oazs.NIOServerCnxn$Factory.run Accepted socket connection from /127.0.0.1:53401
[junit4:junit4]   2> 10739 T1330 oazs.NIOServerCnxn.readConnectRequest Client attempting to establish new session at /127.0.0.1:53401
[junit4:junit4]   2> 10740 T1332 oazs.NIOServerCnxn.finishSessionInit Established session 0x139f48080430008 with negotiated timeout 10000 for client /127.0.0.1:53401
[junit4:junit4]   2> 10740 T1397 oaz.ClientCnxn$SendThread.readConnectResult Session establishment complete on server localhost.localdomain/127.0.0.1:41208, sessionid = 0x139f48080430008, negotiated timeout = 10000
[junit4:junit4]   2> 10741 T1398 oascc.ConnectionManager.process Watcher org.apache.solr.common.cloud.ConnectionManager@952d36be name:ZooKeeperConnection Watcher:127.0.0.1:41208/solr got event WatchedEvent state:SyncConnected type:None path:null path:null type:None
[junit4:junit4]   2> 10741 T1328 oascc.ConnectionManager.waitForConnected Client is connected to ZooKeeper
[junit4:junit4]   2> 10742 T1328 oascc.ZkStateReader.createClusterStateWatchersAndUpdate Updating cluster state from ZooKeeper... 
[junit4:junit4]   2> 10747 T1380 C82 P36391 REQ /select {start=0&distrib=false&fl=id&fsv=true&q=*:*&isShard=true&NOW=1348426836532&version=2&rows=10&wt=javabin&collection=collection1&sort=n_ti1+desc&shard.url=127.0.0.1:46961/solr/collection1/|127.0.0.1:36391/solr/collection1/} hits=32 status=0 QTime=1 
[junit4:junit4]   2> 10747 T1368 C85 P43076 REQ /select {start=0&distrib=false&fl=id&fsv=true&q=*:*&isShard=true&NOW=1348426836532&version=2&rows=10&wt=javabin&collection=collection1&sort=n_ti1+desc&shard.url=127.0.0.1:43076/solr/collection1/} hits=35 status=0 QTime=0 
[junit4:junit4]   2> 10752 T1380 C82 P36391 REQ /select {q=*:*&isShard=true&distrib=false&NOW=1348426836532&ids=11,113,10&version=2&wt=javabin&collection=collection1&shard.url=127.0.0.1:46961/solr/collection1/|127.0.0.1:36391/solr/collection1/} status=0 QTime=0 
[junit4:junit4]   2> 10752 T1368 C85 P43076 REQ /select {q=*:*&isShard=true&distrib=false&NOW=1348426836532&ids=145,3,126,5,127,9,141&version=2&wt=javabin&collection=collection1&shard.url=127.0.0.1:43076/solr/collection1/} status=0 QTime=0 
[junit4:junit4]   2> 10754 T1379 C82 P36391 REQ /select {version=2&q=*:*&wt=javabin&sort=n_ti1+desc&collection=collection1} hits=67 status=0 QTime=10 
[junit4:junit4]   2> 10759 T1340 C84 P46282 REQ /select {version=2&q=*:*&wt=javabin&distrib=false&sort=n_ti1+asc} hits=67 status=0 QTime=0 
[junit4:junit4]   2> 10765 T1369 C85 P43076 REQ /select {start=0&distrib=false&fl=id&fsv=true&q=*:*&isShard=true&NOW=1348426836550&version=2&rows=10&wt=javabin&sort=n_ti1+asc&shard.url=127.0.0.1:43076/solr/collection1/} hits=35 status=0 QTime=1 
[junit4:junit4]   2> 10765 T1381 C82 P36391 REQ /select {start=0&distrib=false&fl=id&fsv=true&q=*:*&isShard=true&NOW=1348426836550&version=2&rows=10&wt=javabin&sort=n_ti1+asc&shard.url=127.0.0.1:46961/solr/collection1/|127.0.0.1:36391/solr/collection1/} hits=32 status=0 QTime=1 
[junit4:junit4]   2> 10768 T1381 C82 P36391 REQ /select {q=*:*&isShard=true&distrib=false&NOW=1348426836550&ids=133,12,123,135,15,138&version=2&wt=javabin&shard.url=127.0.0.1:46961/solr/collection1/|127.0.0.1:36391/solr/collection1/} status=0 QTime=0 
[junit4:junit4]   2> 10768 T1369 C85 P43076 REQ /select {q=*:*&isShard=true&distrib=false&NOW=1348426836550&ids=143,121,149,131&version=2&wt=javabin&shard.url=127.0.0.1:43076/solr/collection1/} status=0 QTime=0 
[junit4:junit4]   2> 10770 T1367 C85 P43076 REQ /select {version=2&q=*:*&wt=javabin&sort=n_ti1+asc} hits=67 status=0 QTime=8 
[junit4:junit4]   2> 10775 T1340 C84 P46282 REQ /select {version=2&q=*:*&wt=javabin&distrib=false&sort=n_f1+desc} hits=67 status=0 QTime=1 
[junit4:junit4]   2> 10780 T1368 C85 P43076 REQ /select {start=0&distrib=false&fl=id&fsv=true&q=*:*&isShard=true&NOW=1348426836566&version=2&rows=10&wt=javabin&sort=n_f1+desc&shard.url=127.0.0.1:43076/solr/collection1/} hits=35 status=0 QTime=0 
[junit4:junit4]   2> 10780 T1380 C82 P36391 REQ /select {start=0&distrib=false&fl=id&fsv=true&q=*:*&isShard=true&NOW=1348426836566&version=2&rows=10&wt=javabin&sort=n_f1+desc&shard.url=127.0.0.1:46961/solr/collection1/|127.0.0.1:36391/solr/collection1/} hits=32 status=0 QTime=0 
[junit4:junit4]   2> 10784 T1368 C85 P43076 REQ /select {q=*:*&isShard=true&distrib=false&NOW=1348426836566&ids=112,103,139,106&version=2&wt=javabin&shard.url=127.0.0.1:43076/solr/collection1/} status=0 QTime=1 
[junit4:junit4]   2> 10784 T1380 C82 P36391 REQ /select {q=*:*&isShard=true&distrib=false&NOW=1348426836566&ids=11,14,146,4,107,118&version=2&wt=javabin&shard.url=127.0.0.1:46961/solr/collection1/|127.0.0.1:36391/solr/collection1/} status=0 QTime=1 
[junit4:junit4]   2> 10786 T1379 C82 P36391 REQ /select {version=2&q=*:*&wt=javabin&sort=n_f1+desc} hits=67 status=0 QTime=8 
[junit4:junit4]   2> 10790 T1340 C84 P46282 REQ /select {version=2&q=*:*&wt=javabin&distrib=false&sort=n_f1+asc} hits=67 status=0 QTime=1 
[junit4:junit4]   2> 10795 T1380 C82 P36391 REQ /select {start=0&distrib=false&fl=id&fsv=true&q=*:*&isShard=true&NOW=1348426836581&version=2&rows=10&wt=javabin&sort=n_f1+asc&shard.url=127.0.0.1:46961/solr/collection1/|127.0.0.1:36391/solr/collection1/} hits=32 status=0 QTime=0 
[junit4:junit4]   2> 10795 T1368 C85 P43076 REQ /select {start=0&distrib=false&fl=id&fsv=true&q=*:*&isShard=true&NOW=1348426836581&version=2&rows=10&wt=javabin&sort=n_f1+asc&shard.url=127.0.0.1:43076/solr/collection1/} hits=35 status=0 QTime=0 
[junit4:junit4]   2> 10798 T1380 C82 P36391 REQ /select {q=*:*&isShard=true&distrib=false&NOW=1348426836581&ids=138,8&version=2&wt=javabin&shard.url=127.0.0.1:46961/solr/collection1/|127.0.0.1:36391/solr/collection1/} status=0 QTime=0 
[junit4:junit4]   2> 10798 T1368 C85 P43076 REQ /select {q=*:*&isShard=true&distrib=false&NOW=1348426836581&ids=136,115,126,6,128,140,141,131&version=2&wt=javabin&shard.url=127.0.0.1:43076/solr/collection1/} status=0 QTime=0 
[junit4:junit4]   2> 10800 T1379 C82 P36391 REQ /select {version=2&q=*:*&wt=javabin&sort=n_f1+asc} hits=67 status=0 QTime=7 
[junit4:junit4]   2> 10804 T1340 C84 P46282 REQ /select {version=2&q=*:*&wt=javabin&distrib=false&sort=n_tf1+desc} hits=67 status=0 QTime=0 
[junit4:junit4]   2> 10809 T1370 C85 P43076 REQ /select {start=0&distrib=false&fl=id&fsv=true&q=*:*&isShard=true&NOW=1348426836595&version=2&rows=10&wt=javabin&sort=n_tf1+desc&shard.url=127.0.0.1:43076/solr/collection1/} hits=35 status=0 QTime=0 
[junit4:junit4]   2> 10809 T1360 C83 P46961 REQ /select {start=0&distrib=false&fl=id&fsv=true&q=*:*&isShard=true&NOW=1348426836595&version=2&rows=10&wt=javabin&sort=n_tf1+desc&shard.url=127.0.0.1:46961/solr/collection1/|127.0.0.1:36391/solr/collection1/} hits=32 status=0 QTime=0 
[junit4:junit4]   2> 10813 T1370 C85 P43076 REQ /select {q=*:*&isShard=true&distrib=false&NOW=1348426836595&ids=143,6,149,106,9&version=2&wt=javabin&shard.url=127.0.0.1:43076/solr/collection1/} status=0 QTime=0 
[junit4:junit4]   2> 10813 T1360 C83 P46961 REQ /select {q=*:*&isShard=true&distrib=false&NOW=1348426836595&ids=135,16,138,129,10&version=2&wt=javabin&shard.url=127.0.0.1:46961/solr/collection1/|127.0.0.1:36391/solr/collection1/} status=0 QTime=0 
[junit4:junit4]   2> 10815 T1358 C83 P46961 REQ /select {version=2&q=*:*&wt=javabin&sort=n_tf1+desc} hits=67 status=0 QTime=8 
[junit4:junit4]   2> 10819 T1340 C84 P46282 REQ /select {version=2&q=*:*&wt=javabin&distrib=false&sort=n_tf1+asc} hits=67 status=0 QTime=0 
[junit4:junit4]   2> 10825 T1370 C85 P43076 REQ /select {start=0&distrib=false&fl=id&fsv=true&q=*:*&isShard=true&NOW=1348426836611&version=2&rows=10&wt=javabin&sort=n_tf1+asc&shard.url=127.0.0.1:43076/solr/collection1/} hits=35 status=0 QTime=0 
[junit4:junit4]   2> 10825 T1360 C83 P46961 REQ /select {start=0&distrib=false&fl=id&fsv=true&q=*:*&isShard=true&NOW=1348426836611&version=2&rows=10&wt=javabin&sort=n_tf1+asc&shard.url=127.0.0.1:46961/solr/collection1/|127.0.0.1:36391/solr/collection1/} hits=32 status=0 QTime=0 
[junit4:junit4]   2> 10829 T1370 C85 P43076 REQ /select {q=*:*&isShard=true&distrib=false&NOW=1348426836611&ids=126,115,17,117,130&version=2&wt=javabin&shard.url=127.0.0.1:43076/solr/collection1/} status=0 QTime=0 
[junit4:junit4]   2> 10829 T1360 C83 P46961 REQ /select {q=*:*&isShard=true&distrib=false&NOW=1348426836611&ids=11,111,123,146,148&version=2&wt=javabin&shard.url=127.0.0.1:46961/solr/collection1/|127.0.0.1:36391/solr/collection1/} status=0 QTime=0 
[junit4:junit4]   2> 10832 T1358 C83 P46961 REQ /select {version=2&q=*:*&wt=javabin&sort=n_tf1+asc} hits=67 status=0 QTime=9 
[junit4:junit4]   2> 10837 T1340 C84 P46282 REQ /select {version=2&q=*:*&wt=javabin&distrib=false&sort=n_d1+desc} hits=67 status=0 QTime=1 
[junit4:junit4]   2> 10843 T1382 C82 P36391 REQ /select {start=0&distrib=false&fl=id&fsv=true&q=*:*&isShard=true&NOW=1348426836629&version=2&rows=10&wt=javabin&collection=collection1&sort=n_d1+desc&shard.url=127.0.0.1:46961/solr/collection1/|127.0.0.1:36391/solr/collection1/} hits=32 status=0 QTime=1 
[junit4:junit4]   2> 10843 T1370 C85 P43076 REQ /select {start=0&distrib=false&fl=id&fsv=true&q=*:*&isShard=true&NOW=1348426836629&version=2&rows=10&wt=javabin&collection=collection1&sort=n_d1+desc&shard.url=127.0.0.1:43076/solr/collection1/} hits=35 status=0 QTime=0 
[junit4:junit4]   2> 10847 T1370 C85 P43076 REQ /select {q=*:*&isShard=true&distrib=false&NOW=1348426836629&ids=104,5,105,7,141&version=2&wt=javabin&collection=collection1&shard.url=127.0.0.1:43076/solr/collection1/} status=0 QTime=0 
[junit4:junit4]   2> 10848 T1382 C82 P36391 REQ /select {q=*:*&isShard=true&distrib=false&NOW=1348426836629&ids=111,133,101,13,15&version=2&wt=javabin&collection=collection1&shard.url=127.0.0.1:46961/solr/collection1/|127.0.0.1:36391/solr/collection1/} status=0 QTime=1 
[junit4:junit4]   2> 10849 T1358 C83 P46961 REQ /select {version=2&q=*:*&wt=javabin&sort=n_d1+desc&collection=collection1} hits=67 status=0 QTime=8 
[junit4:junit4]   2> 10854 T1340 C84 P46282 REQ /select {version=2&q=*:*&wt=javabin&distrib=false&sort=n_d1+asc} hits=67 status=0 QTime=1 
[junit4:junit4]   2> 10860 T1355 C83 P46961 REQ /select {start=0&distrib=false&fl=id&fsv=true&q=*:*&isShard=true&NOW=1348426836646&version=2&rows=10&wt=javabin&collection=collection1&sort=n_d1+asc&shard.url=127.0.0.1:46961/solr/collection1/|127.0.0.1:36391/solr/collection1/} hits=32 status=0 QTime=0 
[junit4:junit4]   2> 10860 T1369 C85 P43076 REQ /select {start=0&distrib=false&fl=id&fsv=true&q=*:*&isShard=true&NOW=1348426836646&version=2&rows=10&wt=javabin&collection=collection1&sort=n_d1+asc&shard.url=127.0.0.1:43076/solr/collection1/} hits=35 status=0 QTime=0 
[junit4:junit4]   2> 10864 T1355 C83 P46961 REQ /select {q=*:*&isShard=true&distrib=false&NOW=1348426836646&ids=1,135,14,118,109&version=2&wt=javabin&collection=collection1&shard.url=127.0.0.1:46961/solr/collection1/|127.0.0.1:36391/solr/collection1/} status=0 QTime=0 
[junit4:junit4]   2> 10864 T1369 C85 P43076 REQ /select {q=*:*&isShard=true&distrib=false&NOW=1348426836646&ids=112,147,103,115,119&version=2&wt=javabin&collection=collection1&shard.url=127.0.0.1:43076/solr/collection1/} status=0 QTime=0 
[junit4:junit4]   2> 10866 T1367 C85 P43076 REQ /select {version=2&q=*:*&wt=javabin&sort=n_d1+asc&collection=collection1} hits=67 status=0 QTime=8 
[junit4:junit4]   2> 10872 T1340 C84 P46282 REQ /select {version=2&q=*:*&wt=javabin&distrib=false&sort=n_td1+desc} hits=67 status=0 QTime=1 
[junit4:junit4]   2> 10878 T1381 C82 P36391 REQ /select {start=0&distrib=false&fl=id&fsv=true&q=*:*&isShard=true&NOW=1348426836664&version=2&rows=10&wt=javabin&sort=n_td1+desc&shard.url=127.0.0.1:46961/solr/collection1/|127.0.0.1:36391/solr/collection1/} hits=32 status=0 QTime=0 
[junit4:junit4]   2> 10880 T1369 C85 P43076 REQ /select {start=0&distrib=false&fl=id&fsv=true&q=*:*&isShard=true&NOW=1348426836664&version=2&rows=10&wt=javabin&sort=n_td1+desc&shard.url=127.0.0.1:43076/solr/collection1/} hits=35 status=0 QTime=0 
[junit4:junit4]   2> 10884 T1381 C82 P36391 REQ /select {q=*:*&isShard=true&distrib=false&NOW=1348426836664&ids=113,15,8,107&version=2&wt=javabin&shard.url=127.0.0.1:46961/solr/collection1/|127.0.0.1:36391/solr/collection1/} status=0 QTime=1 
[junit4:junit4]   2> 10884 T1369 C85 P43076 REQ /select {q=*:*&isShard=true&distrib=false&NOW=1348426836664&ids=144,103,147,127,119,140&version=2&wt=javabin&shard.url=127.0.0.1:43076/solr/collection1/} status=0 QTime=1 
[junit4:junit4]   2> 10886 T1371 C85 P43076 REQ /select {version=2&q=*:*&wt=javabin&sort=n_td1+desc} hits=67 status=0 QTime=10 
[junit4:junit4]   2> 10890 T1340 C84 P46282 REQ /select {version=2&q=*:*&wt=javabin&distrib=false&sort=n_td1+asc} hits=67 status=0 QTime=0 
[junit4:junit4]   2> 10897 T1369 C85 P43076 REQ /select {start=0&distrib=false&fl=id&fsv=true&q=*:*&isShard=true&NOW=1348426836683&version=2&rows=10&wt=javabin&sort=n_td1+asc&collection=collection1&shard.url=127.0.0.1:43076/solr/collection1/} hits=35 status=0 QTime=0 
[junit4:junit4]   2> 10897 T1355 C83 P46961 REQ /select {start=0&distrib=false&fl=id&fsv=true&q=*:*&isShard=true&NOW=1348426836683&version=2&rows=10&wt=javabin&sort=n_td1+asc&collection=collection1&shard.url=127.0.0.1:46961/solr/collection1/|127.0.0.1:36391/solr/collection1/} hits=32 status=0 QTime=0 
[junit4:junit4]   2> 10901 T1355 C83 P46961 REQ /select {q=*:*&isShard=true&distrib=false&NOW=1348426836683&ids=110,100,148,108&version=2&wt=javabin&collection=collection1&shard.url=127.0.0.1:46961/solr/collection1/|127.0.0.1:36391/solr/collection1/} status=0 QTime=0 
[junit4:junit4]   2> 10901 T1369 C85 P43076 REQ /select {q=*:*&isShard=true&distrib=false&NOW=1348426836683&ids=134,3,136,104,115,105&version=2&wt=javabin&collection=collection1&shard.url=127.0.0.1:43076/solr/collection1/} status=0 QTime=0 
[junit4:junit4]   2> 10903 T1371 C85 P43076 REQ /select {version=2&q=*:*&wt=javabin&sort=n_td1+asc&collection=collection1} hits=67 status=0 QTime=8 
[junit4:junit4]   2> 10908 T1340 C84 P46282 REQ /select {version=2&q=*:*&wt=javabin&distrib=false&sort=n_l1+desc} hits=67 status=0 QTime=1 
[junit4:junit4]   2> 10914 T1355 C83 P46961 REQ /select {start=0&distrib=false&fl=id&fsv=true&q=*:*&isShard=true&NOW=1348426836699&version=2&rows=10&wt=javabin&sort=n_l1+desc&collection=collection1&shard.url=127.0.0.1:46961/solr/collection1/|127.0.0.1:36391/solr/collection1/} hits=32 status=0 QTime=1 
[junit4:junit4]   2> 10914 T1369 C85 P43076 REQ /select {start=0&distrib=false&fl=id&fsv=true&q=*:*&isShard=true&NOW=1348426836699&version=2&rows=10&wt=javabin&sort=n_l1+desc&collection=collection1&shard.url=127.0.0.1:43076/solr/collection1/} hits=35 status=0 QTime=1 
[junit4:junit4]   2> 10917 T1355 C83 P46961 REQ /select {q=*:*&isShard=true&distrib=false&NOW=1348426836699&ids=111,129,109&version=2&wt=javabin&collection=collection1&shard.url=127.0.0.1:46961/solr/collection1/|127.0.0.1:36391/solr/collection1/} status=0 QTime=0 
[junit4:junit4]   2> 10918 T1369 C85 P43076 REQ /select {q=*:*&isShard=true&distrib=false&NOW=1348426836699&ids=2,134,3,147,126,119,141&version=2&wt=javabin&collection=collection1&shard.url=127.0.0.1:43076/solr/collection1/} status=0 QTime=1 
[junit4:junit4]   2> 10920 T1367 C85 P43076 REQ /select {version=2&q=*:*&wt=javabin&sort=n_l1+desc&collection=collection1} hits=67 status=0 QTime=9 
[junit4:junit4]   2> 10924 T1340 C84 P46282 REQ /select {version=2&q=*:*&wt=javabin&distrib=false&sort=n_l1+asc} hits=67 status=0 QTime=0 
[junit4:junit4]   2> 10930 T1370 C85 P43076 REQ /select {start=0&distrib=false&fl=id&fsv=true&q=*:*&isShard=true&NOW=1348426836715&version=2&rows=10&wt=javabin&sort=n_l1+asc&collection=collection1&shard.url=127.0.0.1:43076/solr/collection1/} hits=35 status=0 QTime=0 
[junit4:junit4]   2> 10930 T1360 C83 P46961 REQ /select {start=0&distrib=false&fl=id&fsv=true&q=*:*&isShard=true&NOW=1348426836715&version=2&rows=10&wt=javabin&collection=collection1&sort=n_l1+asc&shard.url=127.0.0.1:46961/solr/collection1/|127.0.0.1:36391/solr/collection1/} hits=32 status=0 QTime=0 
[junit4:junit4]   2> 10934 T1370 C85 P43076 REQ /select {q=*:*&isShard=true&distrib=false&NOW=1348426836715&ids=144,6,106,7,140,130&version=2&wt=javabin&collection=collection1&shard.url=127.0.0.1:43076/solr/collection1/} status=0 QTime=0 
[junit4:junit4]   2> 10934 T1360 C83 P46961 REQ /select {q=*:*&isShard=true&distrib=false&NOW=1348426836715&ids=1,135,125,15&version=2&wt=javabin&collection=collection1&shard.url=127.0.0.1:46961/solr/collection1/|127.0.0.1:36391/solr/collection1/} status=0 QTime=0 
[junit4:junit4]   2> 10936 T1356 C83 P46961 REQ /select {version=2&q=*:*&wt=javabin&sort=n_l1+asc&collection=collection1} hits=67 status=0 QTime=9 
[junit4:junit4]   2> 10941 T1340 C84 P46282 REQ /select {version=2&q=*:*&wt=javabin&distrib=false&sort=n_tl1+desc} hits=67 status=0 QTime=1 
[junit4:junit4]   2> 10947 T1368 C85 P43076 REQ /select {start=0&distrib=false&fl=id&fsv=true&q=*:*&isShard=true&NOW=1348426836732&version=2&rows=10&wt=javabin&sort=n_tl1+desc&collection=collection1&shard.url=127.0.0.1:43076/solr/collection1/} hits=35 status=0 QTime=1 
[junit4:junit4]   2> 10947 T1380 C82 P36391 REQ /select {start=0&distrib=false&fl=id&fsv=true&q=*:*&isShard=true&NOW=1348426836732&version=2&rows=10&wt=javabin&sort=n_tl1+desc&collection=collection1&shard.url=127.0.0.1:46961/solr/collection1/|127.0.0.1:36391/solr/collection1/} hits=32 status=0 QTime=1 
[junit4:junit4]   2> 10951 T1380 C82 P36391 REQ /select {q=*:*&isShard=true&distrib=false&NOW=1348426836732&ids=132,1,113,108&version=2&wt=javabin&collection=collection1&shard.url=127.0.0.1:46961/solr/collection1/|127.0.0.1:36391/solr/collection1/} status=0 QTime=0 
[junit4:junit4]   2> 10951 T1368 C85 P43076 REQ /select {q=*:*&isShard=true&distrib=false&NOW=1348426836732&ids=143,134,3,5,105,128&version=2&wt=javabin&collection=collection1&shard.url=127.0.0.1:43076/solr/collection1/} status=0 QTime=0 
[junit4:junit4]   2> 10953 T1379 C82 P36391 REQ /select {version=2&q=*:*&wt=javabin&sort=n_tl1+desc&collection=collection1} hits=67 status=0 QTime=9 
[junit4:junit4]   2> 10957 T1340 C84 P46282 REQ /select {version=2&q=*:*&wt=javabin&distrib=false&sort=n_tl1+asc} hits=67 status=0 QTime=1 
[junit4:junit4]   2> 10963 T1369 C85 P43076 REQ /select {start=0&distrib=false&fl=id&fsv=true&q=*:*&isShard=true&NOW=1348426836748&version=2&rows=10&wt=javabin&sort=n_tl1+asc&shard.url=127.0.0.1:43076/solr/collection1/} hits=35 status=0 QTime=1 
[junit4:junit4]   2> 10963 T1355 C83 P46961 REQ /select {start=0&distrib=false&fl=id&fsv=true&q=*:*&isShard=true&NOW=1348426836748&version=2&rows=10&wt=javabin&sort=n_tl1+asc&shard.url=127.0.0.1:46961/solr/collection1/|127.0.0.1:36391/solr/collection1/} hits=32 status=0 QTime=1 
[junit4:junit4]   2> 10967 T1355 C83 P46961 REQ /select {q=*:*&isShard=true&distrib=false&NOW=1348426836748&ids=15,125,8,109&version=2&wt=javabin&shard.url=127.0.0.1:46961/solr/collection1/|127.0.0.1:36391/solr/collection1/} status=0 QTime=1 
[junit4:junit4]   2> 10967 T1369 C85 P43076 REQ /select {q=*:*&isShard=true&distrib=false&NOW=1348426836748&ids=136,137,127,106,9,142&version=2&wt=javabin&shard.url=127.0.0.1:43076/solr/collection1/} status=0 QTime=1 
[junit4:junit4]   2> 10969 T1371 C85 P43076 REQ /select {version=2&q=*:*&wt=javabin&sort=n_tl1+asc} hits=67 status=0 QTime=9 
[junit4:junit4]   2> 10974 T1340 C84 P46282 REQ /select {version=2&q=*:*&wt=javabin&distrib=false&sort=n_dt1+desc} hits=67 status=0 QTime=1 
[junit4:junit4]   2> 10980 T1382 C82 P36391 REQ /select {start=0&distrib=false&fl=id&fsv=true&q=*:*&isShard=true&NOW=1348426836766&version=2&rows=10&wt=javabin&sort=n_dt1+desc&shard.url=127.0.0.1:46961/solr/collection1/|127.0.0.1:36391/solr/collection1/} hits=32 status=0 QTime=0 
[junit4:junit4]   2> 10980 T1370 C85 P43076 REQ /select {start=0&distrib=false&fl=id&fsv=true&q=*:*&isShard=true&NOW=1348426836766&version=2&rows=10&wt=javabin&sort=n_dt1+desc&shard.url=127.0.0.1:43076/solr/collection1/} hits=35 status=0 QTime=0 
[junit4:junit4]   2> 10984 T1382 C82 P36391 REQ /select {q=*:*&isShard=true&distrib=false&NOW=1348426836766&ids=135,16,8,107,109&version=2&wt=javabin&shard.url=127.0.0.1:46961/solr/collection1/|127.0.0.1:36391/solr/collection1/} status=0 QTime=0 
[junit4:junit4]   2> 10984 T1370 C85 P43076 REQ /select {q=*:*&isShard=true&distrib=false&NOW=1348426836766&ids=144,147,139,128,119&version=2&wt=javabin&shard.url=127.0.0.1:43076/solr/collection1/} status=0 QTime=0 
[junit4:junit4]   2> 10986 T1356 C83 P46961 REQ /select {version=2&q=*:*&wt=javabin&sort=n_dt1+desc} hits=67 status=0 QTime=8 
[junit4:junit4]   2> 10991 T1340 C84 P46282 REQ /select {version=2&q=*:*&wt=javabin&distrib=false&sort=n_dt1+asc} hits=67 status=0 QTime=1 
[junit4:junit4]   2> 10997 T1370 C85 P43076 REQ /select {start=0&distrib=false&fl=id&fsv=true&q=*:*&isShard=true&NOW=1348426836782&version=2&rows=10&wt=javabin&sort=n_dt1+asc&shard.url=127.0.0.1:43076/solr/collection1/} hits=35 status=0 QTime=0 
[junit4:junit4]   2> 10997 T1382 C82 P36391 REQ /select {start=0&distrib=false&fl=id&fsv=true&q=*:*&isShard=true&NOW=1348426836782&version=2&rows=10&wt=javabin&sort=n_dt1+asc&shard.url=127.0.0.1:46961/solr/collection1/|127.0.0.1:36391/solr/collection1/} hits=32 status=0 QTime=0 
[junit4:junit4]   2> 11001 T1370 C85 P43076 REQ /select {q=*:*&isShard=true&distrib=false&NOW=1348426836782&ids=103,115,117,140,142&version=2&wt=javabin&shard.url=127.0.0.1:43076/solr/collection1/} status=0 QTime=1 
[junit4:junit4]   2> 11001 T1382 C82 P36391 REQ /select {q=*:*&isShard=true&distrib=false&NOW=1348426836782&ids=111,12,1,100,114&version=2&wt=javabin&shard.url=127.0.0.1:46961/solr/collection1/|127.0.0.1:36391/solr/collection1/} status=0 QTime=1 
[junit4:junit4]   2> 11003 T1356 C83 P46961 REQ /select {version=2&q=*:*&wt=javabin&sort=n_dt1+asc} hits=67 status=0 QTime=9 
[junit4:junit4]   2> 11008 T1340 C84 P46282 REQ /select {version=2&q=*:*&wt=javabin&distrib=false&sort=n_tdt1+desc} hits=67 status=0 QTime=1 
[junit4:junit4]   2> 11014 T1369 C85 P43076 REQ /select {start=0&distrib=false&fl=id&fsv=true&q=*:*&isShard=true&NOW=1348426836800&version=2&rows=10&wt=javabin&sort=n_tdt1+desc&collection=collection1&shard.url=127.0.0.1:43076/solr/collection1/} hits=35 status=0 QTime=0 
[junit4:junit4]   2> 11014 T1381 C82 P36391 REQ /select {start=0&distrib=false&fl=id&fsv=true&q=*:*&isShard=true&NOW=1348426836800&version=2&rows=10&wt=javabin&collection=collection1&sort=n_tdt1+desc&shard.url=127.0.0.1:46961/solr/collection1/|127.0.0.1:36391/solr/collection1/} hits=32 status=0 QTime=0 
[junit4:junit4]   2> 11018 T1369 C85 P43076 REQ /select {q=*:*&isShard=true&distrib=false&NOW=1348426836800&ids=112,2,141,120&version=2&wt=javabin&collection=collection1&shard.url=127.0.0.1:43076/solr/collection1/} status=0 QTime=0 
[junit4:junit4]   2> 11018 T1381 C82 P36391 REQ /select {q=*:*&isShard=true&distrib=false&NOW=1348426836800&ids=100,111,122,123,124,4&version=2&wt=javabin&collection=collection1&shard.url=127.0.0.1:46961/solr/collection1/|127.0.0.1:36391/solr/collection1/} status=0 QTime=0 
[junit4:junit4]   2> 11021 T1367 C85 P43076 REQ /select {version=2&q=*:*&wt=javabin&sort=n_tdt1+desc&collection=collection1} hits=67 status=0 QTime=9 
[junit4:junit4]   2> 11025 T1340 C84 P46282 REQ /select {version=2&q=*:*&wt=javabin&distrib=false&sort=n_tdt1+asc} hits=67 status=0 QTime=1 
[junit4:junit4]   2> 11031 T1369 C85 P43076 REQ /select {start=0&distrib=false&fl=id&fsv=true&q=*:*&isShard=true&NOW=1348426836817&version=2&rows=10&wt=javabin&sort=n_tdt1+asc&collection=collection1&shard.url=127.0.0.1:43076/solr/collection1/} hits=35 status=0 QTime=0 
[junit4:junit4]   2> 11031 T1355 C83 P46961 REQ /select {start=0&distrib=false&fl=id&fsv=true&q=*:*&isShard=true&NOW=1348426836817&version=2&rows=10&wt=javabin&sort=n_tdt1+asc&collection=collection1&shard.url=127.0.0.1:46961/solr/collection1/|127.0.0.1:36391/solr/collection1/} hits=32 status=0 QTime=0 
[junit4:junit4]   2> 11035 T1369 C85 P43076 REQ /select {q=*:*&isShard=true&distrib=false&NOW=1348426836817&ids=116,149,117,106&version=2&wt=javabin&collection=collection1&shard.url=127.0.0.1:43076/solr/collection1/} status=0 QTime=1 
[junit4:junit4]   2> 11035 T1355 C83 P46961 REQ /select {q=*:*&isShard=true&distrib=false&NOW=1348426836817&ids=101,102,125,148,8,108&version=2&wt=javabin&collection=collection1&shard.url=127.0.0.1:46961/solr/collection1/|127.0.0.1:36391/solr/collection1/} status=0 QTime=0 
[junit4:junit4]   2> 11037 T1367 C85 P43076 REQ /select {version=2&q=*:*&wt=javabin&sort=n_tdt1+asc&collection=collection1} hits=67 status=0 QTime=8 
[junit4:junit4]   2> 11040 T1340 C84 P46282 REQ /select {version=2&q=*:*&wt=javabin&distrib=false&sort=a_si+desc} hits=67 status=0 QTime=0 
[junit4:junit4]   2> 11046 T1370 C85 P43076 REQ /select {start=0&distrib=false&fl=id&fsv=true&q=*:*&isShard=true&NOW=1348426836831&version=2&rows=10&wt=javabin&sort=a_si+desc&shard.url=127.0.0.1:43076/solr/collection1/} hits=35 status=0 QTime=0 
[junit4:junit4]   2> 11046 T1360 C83 P46961 REQ /select {start=0&distrib=false&fl=id&fsv=true&q=*:*&isShard=true&NOW=1348426836831&version=2&rows=10&wt=javabin&sort=a_si+desc&shard.url=127.0.0.1:46961/solr/collection1/|127.0.0.1:36391/solr/collection1/} hits=32 status=0 QTime=0 
[junit4:junit4]   2> 11050 T1370 C85 P43076 REQ /select {q=*:*&isShard=true&distrib=false&NOW=1348426836831&ids=2,3,5,7,9&version=2&wt=javabin&shard.url=127.0.0.1:43076/solr/collection1/} status=0 QTime=0 
[junit4:junit4]   2> 11050 T1360 C83 P46961 REQ /select {q=*:*&isShard=true&distrib=false&NOW=1348426836831&ids=12,1,13,8,10&version=2&wt=javabin&shard.url=127.0.0.1:46961/solr/collection1/|127.0.0.1:36391/solr/collection1/} status=0 QTime=0 
[junit4:junit4]   2> 11057 T1356 C83 P46961 REQ /select {version=2&q=*:*&wt=javabin&sort=a_si+desc} hits=67 status=0 QTime=14 
[junit4:junit4]   2> 11065 T1340 C84 P46282 REQ /select {version=2&q=*:*&wt=javabin&distrib=false&sort=a_si+asc} hits=67 status=0 QTime=4 
[junit4:junit4]   2> 11072 T1380 C82 P36391 REQ /select {start=0&distrib=false&fl=id&fsv=true&q=*:*&isShard=true&NOW=1348426836857&version=2&rows=10&wt=javabin&sort=a_si+asc&collection=collection1&shard.url=127.0.0.1:46961/solr/collection1/|127.0.0.1:36391/solr/collection1/} hits=32 status=0 QTime=0 
[junit4:junit4]   2> 11072 T1368 C85 P43076 REQ /select {start=0&distrib=false&fl=id&fsv=true&q=*:*&isShard=true&NOW=1348426836857&version=2&rows=10&wt=javabin&sort=a_si+asc&collection=collection1&shard.url=127.0.0.1:43076/solr/collection1/} hits=35 status=0 QTime=0 
[junit4:junit4]   2> 11077 T1380 C82 P36391 REQ /select {q=*:*&isShard=true&distrib=false&NOW=1348426836857&ids=11,1,12,13,4&version=2&wt=javabin&collection=collection1&shard.url=127.0.0.1:46961/solr/collection1/|127.0.0.1:36391/solr/collection1/} status=0 QTime=1 
[junit4:junit4]   2> 11077 T1368 C85 P43076 REQ /select {q=*:*&isShard=true&distrib=false&NOW=1348426836857&ids=2,3,6,7,9&version=2&wt=javabin&collection=collection1&shard.url=127.0.0.1:43076/solr/collection1/} status=0 QTime=1 
[junit4:junit4]   2> 11079 T1379 C82 P36391 REQ /select {version=2&q=*:*&wt=javabin&sort=a_si+asc&collection=collection1} hits=67 status=0 QTime=10 
[junit4:junit4]   2> 11083 T1340 C84 P46282 REQ /select {q=*:*&distrib=false&fl=*,score&version=2&wt=javabin&sort=a_si+desc} hits=67 status=0 QTime=1 
[junit4:junit4]   2> 11089 T1360 C83 P46961 REQ /select {start=0&distrib=false&fl=id,score&fsv=true&q=*:*&isShard=true&NOW=1348426836874&version=2&rows=10&wt=javabin&sort=a_si+desc&collection=collection1&shard.url=127.0.0.1:46961/solr/collection1/|127.0.0.1:36391/solr/collection1/} hits=32 status=0 QTime=1 
[junit4:junit4]   2> 11089 T1370 C85 P43076 REQ /select {start=0&distrib=false&fl=id,score&fsv=true&q=*:*&isShard=true&NOW=1348426836874&version=2&rows=10&wt=javabin&sort=a_si+desc&collection=collection1&shard.url=127.0.0.1:43076/solr/collection1/} hits=35 status=0 QTime=1 
[junit4:junit4]   2> 11092 T1360 C83 P46961 REQ /select {q=*:*&isShard=true&distrib=false&NOW=1348426836874&fl=*,score&ids=12,1,13,8,10&version=2&wt=javabin&collection=collection1&shard.url=127.0.0.1:46961/solr/collection1/|127.0.0.1:36391/solr/collection1/} status=0 QTime=0 
[junit4:junit4]   2> 11092 T1370 C85 P43076 REQ /select {q=*:*&isShard=true&distrib=false&NOW=1348426836874&fl=*,score&ids=2,3,5,7,9&version=2&wt=javabin&collection=collection1&shard.url=127.0.0.1:43076/solr/collection1/} status=0 QTime=0 
[junit4:junit4]   2> 11094 T1356 C83 P46961 REQ /select {q=*:*&fl=*,score&version=2&wt=javabin&sort=a_si+desc&collection=collection1} hits=67 status=0 QTime=8 
[junit4:junit4]   2> 11098 T1340 C84 P46282 REQ /select {q=*:*&distrib=false&fl=*,score&version=2&wt=javabin&sort=n_tl1+asc} hits=67 status=0 QTime=0 
[junit4:junit4]   2> 11104 T1382 C82 P36391 REQ /select {start=0&distrib=false&fl=id,score&fsv=true&q=*:*&isShard=true&NOW=1348426836890&version=2&rows=10&wt=javabin&sort=n_tl1+asc&collection=collection1&shard.url=127.0.0.1:46961/solr/collection1/|127.0.0.1:36391/solr/collection1/} hits=32 status=0 QTime=0 
[junit4:junit4]   2> 11104 T1370 C85 P43076 REQ /select {start=0&distrib=false&fl=id,score&fsv=true&q=*:*&isShard=true&NOW=1348426836890&version=2&rows=10&wt=javabin&sort=n_tl1+asc&collection=collection1&shard.url=127.0.0.1:43076/solr/collection1/} hits=35 status=0 QTime=0 
[junit4:junit4]   2> 11108 T1382 C82 P36391 REQ /select {q=*:*&isShard=true&distrib=false&NOW=1348426836890&fl=*,score&ids=15,125,8,109&version=2&wt=javabin&collection=collection1&shard.url=127.0.0.1:46961/solr/collection1/|127.0.0.1:36391/solr/collection1/} status=0 QTime=0 
[junit4:junit4]   2> 11108 T1370 C85 P43076 REQ /select {q=*:*&isShard=true&distrib=false&NOW=1348426836890&fl=*,score&ids=136,137,127,106,9,142&version=2&wt=javabin&collection=collection1&shard.url=127.0.0.1:43076/solr/collection1/} status=0 QTime=0 
[junit4:junit4]   2> 11110 T1358 C83 P46961 REQ /select {q=*:*&fl=*,score&version=2&wt=javabin&sort=n_tl1+asc&collection=collection1} hits=67 status=0 QTime=8 
[junit4:junit4]   2> 11113 T1340 C84 P46282 REQ /select {version=2&q=*:*&wt=javabin&distrib=false&sort=n_tl1+desc} hits=67 status=0 QTime=0 
[junit4:junit4]   2> 11119 T1380 C82 P36391 REQ /select {start=0&distrib=false&fl=id&fsv=true&q=*:*&isShard=true&NOW=1348426836905&version=2&rows=10&wt=javabin&sort=n_tl1+desc&collection=collection1&shard.url=127.0.0.1:46961/solr/collection1/|127.0.0.1:36391/solr/collection1/} hits=32 status=0 QTime=0 
[junit4:junit4]   2> 11119 T1368 C85 P43076 REQ /select {start=0&distrib=false&fl=id&fsv=true&q=*:*&isShard=true&NOW=1348426836905&version=2&rows=10&wt=javabin&sort=n_tl1+desc&collection=collection1&shard.url=127.0.0.1:43076/solr/collection1/} hits=35 status=0 QTime=0 
[junit4:junit4]   2> 11122 T1380 C82 P36391 REQ /select {q=*:*&isShard=true&distrib=false&NOW=1348426836905&ids=132,1,113,108&version=2&wt=javabin&collection=collection1&shard.url=127.0.0.1:46961/solr/collection1/|127.0.0.1:36391/solr/collection1/} status=0 QTime=0 
[junit4:junit4]   2> 11122 T1368 C85 P43076 REQ /select {q=*:*&isShard=true&distrib=false&NOW=1348426836905&ids=143,134,3,5,105,128&version=2&wt=javabin&collection=collection1&shard.url=127.0.0.1:43076/solr/collection1/} status=0 QTime=0 
[junit4:junit4]   2> 11124 T1379 C82 P36391 REQ /select {version=2&q=*:*&wt=javabin&sort=n_tl1+desc&collection=collection1} hits=67 status=0 QTime=7 
[junit4:junit4]   2> 11129 T1340 C84 P46282 REQ /select {version=2&q={!func}a_si&wt=javabin&distrib=false} hits=67 status=0 QTime=2 
[junit4:junit4]   2> 11134 T1382 C82 P36391 REQ /select {q={!func}a_si&start=0&isShard=true&distrib=false&NOW=1348426836920&fl=id,score&version=2&rows=10&fsv=true&wt=javabin&shard.url=127.0.0.1:46961/solr/collection1/|127.0.0.1:36391/solr/collection1/} hits=32 status=0 QTime=0 
[junit4:junit4]   2> 11134 T1370 C85 P43076 REQ /select {q={!func}a_si&start=0&isShard=true&distrib=false&NOW=1348426836920&fl=id,score&version=2&rows=10&fsv=true&wt=javabin&shard.url=127.0.0.1:43076/solr/collection1/} hits=35 status=0 QTime=0 
[junit4:junit4]   2> 11137 T1382 C82 P36391 REQ /select {q={!func}a_si&isShard=true&distrib=false&NOW=1348426836920&ids=12,1,13,8,10&version=2&wt=javabin&shard.url=127.0.0.1:46961/solr/collection1/|127.0.0.1:36391/solr/collection1/} status=0 QTime=0 
[junit4:junit4]   2> 11137 T1370 C85 P43076 REQ /select {q={!func}a_si&isShard=true&distrib=false&NOW=1348426836920&ids=2,3,5,7,9&version=2&wt=javabin&shard.url=127.0.0.1:43076/solr/collection1/} status=0 QTime=0 
[junit4:junit4]   2> 11139 T1356 C83 P46961 REQ /select {version=2&wt=javabin&q={!func}a_si} hits=67 status=0 QTime=7 
[junit4:junit4]   2> 11142 T1340 C84 P46282 REQ /select {version=2&q={!func}a_si&wt=javabin&distrib=false&fl=*,score} hits=67 status=0 QTime=0 
[junit4:junit4]   2> 11147 T1382 C82 P36391 REQ /select {q={!func}a_si&start=0&isShard=true&distrib=false&NOW=1348426836933&fl=id,score&version=2&rows=10&fsv=true&wt=javabin&shard.url=127.0.0.1:46961/solr/collection1/|127.0.0.1:36391/solr/collection1/} hits=32 status=0 QTime=0 
[junit4:junit4]   2> 11147 T1370 C85 P43076 REQ /select {q={!func}a_si&start=0&isShard=true&distrib=false&NOW=1348426836933&fl=id,score&version=2&rows=10&fsv=true&wt=javabin&shard.url=127.0.0.1:43076/solr/collection1/} hits=35 status=0 QTime=0 
[junit4:junit4]   2> 11151 T1370 C85 P43076 REQ /select {q={!func}a_si&isShard=true&distrib=false&NOW=1348426836933&fl=*,score&ids=2,3,5,7,9&version=2&wt=javabin&shard.url=127.0.0.1:43076/solr/collection1/} status=0 QTime=0 
[junit4:junit4]   2> 11151 T1382 C82 P36391 REQ /select {q={!func}a_si&isShard=true&distrib=false&NOW=1348426836933&fl=*,score&ids=12,1,13,8,10&version=2&wt=javabin&shard.url=127.0.0.1:46961/solr/collection1/|127.0.0.1:36391/solr/collection1/} status=0 QTime=0 
[junit4:junit4]   2> 11153 T1358 C83 P46961 REQ /select {version=2&q={!func}a_si&wt=javabin&fl=*,score} hits=67 status=0 QTime=8 
[junit4:junit4]   2> 11156 T1340 C84 P46282 REQ /select {version=2&q=quick&wt=javabin&distrib=false} hits=2 status=0 QTime=0 
[junit4:junit4]   2> 11161 T1369 C85 P43076 REQ /select {q=quick&start=0&isShard=true&distrib=false&NOW=1348426836947&fl=id,score&version=2&rows=10&fsv=true&wt=javabin&shard.url=127.0.0.1:43076/solr/collection1/} hits=1 status=0 QTime=0 
[junit4:junit4]   2> 11161 T1381 C82 P36391 REQ /select {q=quick&start=0&isShard=true&distrib=false&NOW=1348426836947&fl=id,score&version=2&rows=10&fsv=true&wt=javabin&shard.url=127.0.0.1:46961/solr/collection1/|127.0.0.1:36391/solr/collection1/}

[...truncated too long message...]

1720 oasu.DefaultSolrCoreState.decref Closing SolrCoreState - canceling any ongoing recovery
[junit4:junit4]   2> 1585 T1720 oejsh.ContextHandler.doStop stopped o.e.j.s.ServletContextHandler{/solr,null}
[junit4:junit4]   2> 1638 T1720 oas.SolrTestCaseJ4.tearDown ###Ending testDistribSearch
[junit4:junit4]   2> NOTE: reproduce with: ant test  -Dtestcase=DistributedQueryElevationComponentTest -Dtests.method=testDistribSearch -Dtests.seed=E46A8309362DEB31 -Dtests.multiplier=3 -Dtests.slow=true -Dtests.locale=es_GT -Dtests.timezone=America/Goose_Bay -Dtests.file.encoding=UTF-8
[junit4:junit4] ERROR   1.65s J0 | DistributedQueryElevationComponentTest.testDistribSearch <<<
[junit4:junit4]    > Throwable #1: org.apache.solr.common.SolrException: Server at http://127.0.0.1:34515/solr returned non ok status:500, message:Server Error
[junit4:junit4]    > 	at __randomizedtesting.SeedInfo.seed([E46A8309362DEB31:658C0D1141728B0D]:0)
[junit4:junit4]    > 	at org.apache.solr.client.solrj.impl.HttpSolrServer.request(HttpSolrServer.java:373)
[junit4:junit4]    > 	at org.apache.solr.client.solrj.impl.HttpSolrServer.request(HttpSolrServer.java:182)
[junit4:junit4]    > 	at org.apache.solr.client.solrj.request.QueryRequest.process(QueryRequest.java:90)
[junit4:junit4]    > 	at org.apache.solr.client.solrj.SolrServer.query(SolrServer.java:324)
[junit4:junit4]    > 	at org.apache.solr.BaseDistributedSearchTestCase.queryServer(BaseDistributedSearchTestCase.java:371)
[junit4:junit4]    > 	at org.apache.solr.BaseDistributedSearchTestCase.query(BaseDistributedSearchTestCase.java:394)
[junit4:junit4]    > 	at org.apache.solr.BaseDistributedSearchTestCase.query(BaseDistributedSearchTestCase.java:376)
[junit4:junit4]    > 	at org.apache.solr.handler.component.DistributedQueryElevationComponentTest.doTest(DistributedQueryElevationComponentTest.java:83)
[junit4:junit4]    > 	at org.apache.solr.BaseDistributedSearchTestCase.testDistribSearch(BaseDistributedSearchTestCase.java:695)
[junit4:junit4]    > 	at sun.reflect.NativeMethodAccessorImpl.invoke0(Native Method)
[junit4:junit4]    > 	at sun.reflect.NativeMethodAccessorImpl.invoke(NativeMethodAccessorImpl.java:88)
[junit4:junit4]    > 	at sun.reflect.DelegatingMethodAccessorImpl.invoke(DelegatingMethodAccessorImpl.java:55)
[junit4:junit4]    > 	at java.lang.reflect.Method.invoke(Method.java:613)
[junit4:junit4]    > 	at com.carrotsearch.randomizedtesting.RandomizedRunner.invoke(RandomizedRunner.java:1559)
[junit4:junit4]    > 	at com.carrotsearch.randomizedtesting.RandomizedRunner.access$600(RandomizedRunner.java:79)
[junit4:junit4]    > 	at com.carrotsearch.randomizedtesting.RandomizedRunner$6.evaluate(RandomizedRunner.java:737)
[junit4:junit4]    > 	at com.carrotsearch.randomizedtesting.RandomizedRunner$7.evaluate(RandomizedRunner.java:773)
[junit4:junit4]    > 	at com.carrotsearch.randomizedtesting.RandomizedRunner$8.evaluate(RandomizedRunner.java:787)
[junit4:junit4]    > 	at com.carrotsearch.randomizedtesting.rules.SystemPropertiesRestoreRule$1.evaluate(SystemPropertiesRestoreRule.java:53)
[junit4:junit4]    > 	at org.apache.lucene.util.TestRuleSetupTeardownChained$1.evaluate(TestRuleSetupTeardownChained.java:50)
[junit4:junit4]    > 	at org.apache.lucene.util.TestRuleFieldCacheSanity$1.evaluate(TestRuleFieldCacheSanity.java:51)
[junit4:junit4]    > 	at org.apache.lucene.util.AbstractBeforeAfterRule$1.evaluate(AbstractBeforeAfterRule.java:45)
[junit4:junit4]    > 	at com.carrotsearch.randomizedtesting.rules.SystemPropertiesInvariantRule$1.evaluate(SystemPropertiesInvariantRule.java:55)
[junit4:junit4]    > 	at org.apache.lucene.util.TestRuleThreadAndTestName$1.evaluate(TestRuleThreadAndTestName.java:48)
[junit4:junit4]    > 	at org.apache.lucene.util.TestRuleIgnoreAfterMaxFailures$1.evaluate(TestRuleIgnoreAfterMaxFailures.java:70)
[junit4:junit4]    > 	at org.apache.lucene.util.TestRuleMarkFailure$1.evaluate(TestRuleMarkFailure.java:48)
[junit4:junit4]    > 	at com.carrotsearch.randomizedtesting.rules.StatementAdapter.evaluate(StatementAdapter.java:36)
[junit4:junit4]    > 	at com.carrotsearch.randomizedtesting.ThreadLeakControl$StatementRunner.run(ThreadLeakControl.java:358)
[junit4:junit4]    > 	at com.carrotsearch.randomizedtesting.ThreadLeakControl.forkTimeoutingTask(ThreadLeakControl.java:782)
[junit4:junit4]    > 	at com.carrotsearch.randomizedtesting.ThreadLeakControl$3.evaluate(ThreadLeakControl.java:442)
[junit4:junit4]    > 	at com.carrotsearch.randomizedtesting.RandomizedRunner.runSingleTest(RandomizedRunner.java:746)
[junit4:junit4]    > 	at com.carrotsearch.randomizedtesting.RandomizedRunner$3.evaluate(RandomizedRunner.java:648)
[junit4:junit4]    > 	at com.carrotsearch.randomizedtesting.RandomizedRunner$4.evaluate(RandomizedRunner.java:682)
[junit4:junit4]    > 	at com.carrotsearch.randomizedtesting.RandomizedRunner$5.evaluate(RandomizedRunner.java:693)
[junit4:junit4]    > 	at com.carrotsearch.randomizedtesting.rules.StatementAdapter.evaluate(StatementAdapter.java:36)
[junit4:junit4]    > 	at com.carrotsearch.randomizedtesting.rules.SystemPropertiesRestoreRule$1.evaluate(SystemPropertiesRestoreRule.java:53)
[junit4:junit4]    > 	at org.apache.lucene.util.AbstractBeforeAfterRule$1.evaluate(AbstractBeforeAfterRule.java:45)
[junit4:junit4]    > 	at org.apache.lucene.util.TestRuleStoreClassName$1.evaluate(TestRuleStoreClassName.java:42)
[junit4:junit4]    > 	at com.carrotsearch.randomizedtesting.rules.SystemPropertiesInvariantRule$1.evaluate(SystemPropertiesInvariantRule.java:55)
[junit4:junit4]    > 	at com.carrotsearch.randomizedtesting.rules.NoShadowingOrOverridesOnMethodsRule$1.evaluate(NoShadowingOrOverridesOnMethodsRule.java:39)
[junit4:junit4]    > 	at com.carrotsearch.randomizedtesting.rules.NoShadowingOrOverridesOnMethodsRule$1.evaluate(NoShadowingOrOverridesOnMethodsRule.java:39)
[junit4:junit4]    > 	at com.carrotsearch.randomizedtesting.rules.StatementAdapter.evaluate(StatementAdapter.java:36)
[junit4:junit4]    > 	at org.apache.lucene.util.TestRuleAssertionsRequired$1.evaluate(TestRuleAssertionsRequired.java:43)
[junit4:junit4]    > 	at org.apache.lucene.util.TestRuleMarkFailure$1.evaluate(TestRuleMarkFailure.java:48)
[junit4:junit4]    > 	at org.apache.lucene.util.TestRuleIgnoreAfterMaxFailures$1.evaluate(TestRuleIgnoreAfterMaxFailures.java:70)
[junit4:junit4]    > 	at org.apache.lucene.util.TestRuleIgnoreTestSuites$1.evaluate(TestRuleIgnoreTestSuites.java:55)
[junit4:junit4]    > 	at com.carrotsearch.randomizedtesting.rules.StatementAdapter.evaluate(StatementAdapter.java:36)
[junit4:junit4]    > 	at com.carrotsearch.randomizedtesting.ThreadLeakControl$StatementRunner.run(ThreadLeakControl.java:358)
[junit4:junit4]    > 	at java.lang.Thread.run(Thread.java:777)
[junit4:junit4]   2> 1646 T1720 oas.SolrTestCaseJ4.deleteCore ###deleteCore
[junit4:junit4]   2> NOTE: test params are: codec=Lucene3x, sim=RandomSimilarityProvider(queryNorm=false,coord=no): {}, locale=es_GT, timezone=America/Goose_Bay
[junit4:junit4]   2> NOTE: Linux 3.2.0-31-generic amd64/IBM Corporation 1.7.0 (64-bit)/cpus=8,threads=1,free=122887648,total=177995776
[junit4:junit4]   2> NOTE: All tests run in this JVM: [TestQuerySenderNoQuery, TestBinaryResponseWriter, AnalysisAfterCoreReloadTest, TestFiltering, TestReload, CopyFieldTest, TestNumberUtils, TestCharFilters, SimpleFacetsTest, FieldAnalysisRequestHandlerTest, ZkControllerTest, MinimalSchemaTest, TestRandomFaceting, TestCollationField, LeaderElectionIntegrationTest, CacheHeaderTest, DateMathParserTest, SolrCmdDistributorTest, TestDefaultSimilarityFactory, SpellCheckComponentTest, TestPerFieldSimilarity, StatelessScriptUpdateProcessorFactoryTest, TestStressReorder, NoCacheHeaderTest, SortByFunctionTest, SyncSliceTest, TestLuceneMatchVersion, PathHierarchyTokenizerFactoryTest, BadComponentTest, TestFaceting, SpatialFilterTest, PluginInfoTest, UpdateRequestProcessorFactoryTest, DirectUpdateHandlerOptimizeTest, TestIndexingPerformance, DistributedTermsComponentTest, DateFieldTest, TestStressVersions, IndexBasedSpellCheckerTest, TermsComponentTest, TestLMJelinekMercerSimilarityFactory, UniqFieldsUpdateProcessorFactoryTest, SpellCheckCollatorTest, LoggingHandlerTest, DirectSolrConnectionTest, SolrCoreCheckLockOnStartupTest, SolrPluginUtilsTest, TestFastLRUCache, TestSearchPerf, TestSolr4Spatial, SampleTest, AlternateDirectoryTest, BasicDistributedZkTest, TestGroupingSearch, TestJmxMonitoredMap, TermVectorComponentDistributedTest, TestRangeQuery, TestCoreContainer, TestSort, FileBasedSpellCheckerTest, PeerSyncTest, QueryElevationComponentTest, SignatureUpdateProcessorFactoryTest, TestJmxIntegration, TestIndexSearcher, CoreAdminHandlerTest, TestTrie, SolrRequestParserTest, QueryEqualityTest, TestWordDelimiterFilterFactory, TestCSVLoader, TestCSVResponseWriter, MoreLikeThisHandlerTest, DocumentBuilderTest, MBeansHandlerTest, DistributedQueryElevationComponentTest]
[junit4:junit4] Completed on J0 in 1.66s, 1 test, 1 error <<< FAILURES!

[...truncated 263 lines...]
BUILD FAILED
/mnt/ssd/jenkins/workspace/Lucene-Solr-4.x-Linux/build.xml:32: The following error occurred while executing this line:
/mnt/ssd/jenkins/workspace/Lucene-Solr-4.x-Linux/solr/build.xml:179: The following error occurred while executing this line:
/mnt/ssd/jenkins/workspace/Lucene-Solr-4.x-Linux/lucene/module-build.xml:63: The following error occurred while executing this line:
/mnt/ssd/jenkins/workspace/Lucene-Solr-4.x-Linux/lucene/common-build.xml:1141: The following error occurred while executing this line:
/mnt/ssd/jenkins/workspace/Lucene-Solr-4.x-Linux/lucene/common-build.xml:814: There were test failures: 231 suites, 954 tests, 1 error, 1 failure, 7 ignored (2 assumptions)

Total time: 23 minutes 53 seconds
Build step 'Invoke Ant' marked build as failure
Recording test results
Description set: Java: 64bit/ibm-j9-jdk7 -Xjit:exclude={org/apache/lucene/util/fst/FST.pack(IIF)Lorg/apache/lucene/util/fst/FST;}
Email was triggered for: Failure
Sending email for trigger: Failure



Mime
View raw message