lucene-dev mailing list archives

Site index · List index
Message view « Date » · « Thread »
Top « Date » · « Thread »
From Apache Jenkins Server <jenk...@builds.apache.org>
Subject [JENKINS] Lucene-Solr-Tests-trunk-java7 - Build # 3237 - Still Failing
Date Fri, 21 Sep 2012 07:48:52 GMT
Build: https://builds.apache.org/job/Lucene-Solr-Tests-trunk-java7/3237/

2 tests failed.
FAILED:  org.apache.solr.cloud.SyncSliceTest.testDistribSearch

Error Message:
There are still nodes recoverying

Stack Trace:
java.lang.AssertionError: There are still nodes recoverying
	at __randomizedtesting.SeedInfo.seed([3E8D350BD7B20797:BF6BBB13A0ED67AB]:0)
	at org.junit.Assert.fail(Assert.java:93)
	at org.apache.solr.cloud.AbstractDistribZkTestBase.waitForRecoveriesToFinish(AbstractDistribZkTestBase.java:154)
	at org.apache.solr.cloud.AbstractFullDistribZkTestBase.waitForRecoveriesToFinish(AbstractFullDistribZkTestBase.java:560)
	at org.apache.solr.cloud.AbstractFullDistribZkTestBase.waitForThingsToLevelOut(AbstractFullDistribZkTestBase.java:1135)
	at org.apache.solr.cloud.SyncSliceTest.doTest(SyncSliceTest.java:162)
	at org.apache.solr.BaseDistributedSearchTestCase.testDistribSearch(BaseDistributedSearchTestCase.java:695)
	at sun.reflect.NativeMethodAccessorImpl.invoke0(Native Method)
	at sun.reflect.NativeMethodAccessorImpl.invoke(NativeMethodAccessorImpl.java:57)
	at sun.reflect.DelegatingMethodAccessorImpl.invoke(DelegatingMethodAccessorImpl.java:43)
	at java.lang.reflect.Method.invoke(Method.java:601)
	at com.carrotsearch.randomizedtesting.RandomizedRunner.invoke(RandomizedRunner.java:1559)
	at com.carrotsearch.randomizedtesting.RandomizedRunner.access$600(RandomizedRunner.java:79)
	at com.carrotsearch.randomizedtesting.RandomizedRunner$6.evaluate(RandomizedRunner.java:737)
	at com.carrotsearch.randomizedtesting.RandomizedRunner$7.evaluate(RandomizedRunner.java:773)
	at com.carrotsearch.randomizedtesting.RandomizedRunner$8.evaluate(RandomizedRunner.java:787)
	at com.carrotsearch.randomizedtesting.rules.SystemPropertiesRestoreRule$1.evaluate(SystemPropertiesRestoreRule.java:53)
	at org.apache.lucene.util.TestRuleSetupTeardownChained$1.evaluate(TestRuleSetupTeardownChained.java:50)
	at org.apache.lucene.util.TestRuleFieldCacheSanity$1.evaluate(TestRuleFieldCacheSanity.java:51)
	at org.apache.lucene.util.AbstractBeforeAfterRule$1.evaluate(AbstractBeforeAfterRule.java:45)
	at com.carrotsearch.randomizedtesting.rules.SystemPropertiesInvariantRule$1.evaluate(SystemPropertiesInvariantRule.java:55)
	at org.apache.lucene.util.TestRuleThreadAndTestName$1.evaluate(TestRuleThreadAndTestName.java:48)
	at org.apache.lucene.util.TestRuleIgnoreAfterMaxFailures$1.evaluate(TestRuleIgnoreAfterMaxFailures.java:70)
	at org.apache.lucene.util.TestRuleMarkFailure$1.evaluate(TestRuleMarkFailure.java:48)
	at com.carrotsearch.randomizedtesting.rules.StatementAdapter.evaluate(StatementAdapter.java:36)
	at com.carrotsearch.randomizedtesting.ThreadLeakControl$StatementRunner.run(ThreadLeakControl.java:358)
	at com.carrotsearch.randomizedtesting.ThreadLeakControl.forkTimeoutingTask(ThreadLeakControl.java:782)
	at com.carrotsearch.randomizedtesting.ThreadLeakControl$3.evaluate(ThreadLeakControl.java:442)
	at com.carrotsearch.randomizedtesting.RandomizedRunner.runSingleTest(RandomizedRunner.java:746)
	at com.carrotsearch.randomizedtesting.RandomizedRunner$3.evaluate(RandomizedRunner.java:648)
	at com.carrotsearch.randomizedtesting.RandomizedRunner$4.evaluate(RandomizedRunner.java:682)
	at com.carrotsearch.randomizedtesting.RandomizedRunner$5.evaluate(RandomizedRunner.java:693)
	at com.carrotsearch.randomizedtesting.rules.StatementAdapter.evaluate(StatementAdapter.java:36)
	at com.carrotsearch.randomizedtesting.rules.SystemPropertiesRestoreRule$1.evaluate(SystemPropertiesRestoreRule.java:53)
	at org.apache.lucene.util.AbstractBeforeAfterRule$1.evaluate(AbstractBeforeAfterRule.java:45)
	at org.apache.lucene.util.TestRuleStoreClassName$1.evaluate(TestRuleStoreClassName.java:42)
	at com.carrotsearch.randomizedtesting.rules.SystemPropertiesInvariantRule$1.evaluate(SystemPropertiesInvariantRule.java:55)
	at com.carrotsearch.randomizedtesting.rules.NoShadowingOrOverridesOnMethodsRule$1.evaluate(NoShadowingOrOverridesOnMethodsRule.java:39)
	at com.carrotsearch.randomizedtesting.rules.NoShadowingOrOverridesOnMethodsRule$1.evaluate(NoShadowingOrOverridesOnMethodsRule.java:39)
	at com.carrotsearch.randomizedtesting.rules.StatementAdapter.evaluate(StatementAdapter.java:36)
	at org.apache.lucene.util.TestRuleAssertionsRequired$1.evaluate(TestRuleAssertionsRequired.java:43)
	at org.apache.lucene.util.TestRuleMarkFailure$1.evaluate(TestRuleMarkFailure.java:48)
	at org.apache.lucene.util.TestRuleIgnoreAfterMaxFailures$1.evaluate(TestRuleIgnoreAfterMaxFailures.java:70)
	at org.apache.lucene.util.TestRuleIgnoreTestSuites$1.evaluate(TestRuleIgnoreTestSuites.java:55)
	at com.carrotsearch.randomizedtesting.rules.StatementAdapter.evaluate(StatementAdapter.java:36)
	at com.carrotsearch.randomizedtesting.ThreadLeakControl$StatementRunner.run(ThreadLeakControl.java:358)
	at java.lang.Thread.run(Thread.java:722)


FAILED:  org.apache.solr.cloud.BasicDistributedZk2Test.testDistribSearch

Error Message:
Shard still reported as live in zk

Stack Trace:
java.lang.AssertionError: Shard still reported as live in zk
	at __randomizedtesting.SeedInfo.seed([3E8D350BD7B20797:BF6BBB13A0ED67AB]:0)
	at org.junit.Assert.fail(Assert.java:93)
	at org.apache.solr.cloud.AbstractFullDistribZkTestBase.waitToSeeNotLive(AbstractFullDistribZkTestBase.java:1220)
	at org.apache.solr.cloud.BasicDistributedZk2Test.brindDownShardIndexSomeDocsAndRecover(BasicDistributedZk2Test.java:190)
	at org.apache.solr.cloud.BasicDistributedZk2Test.doTest(BasicDistributedZk2Test.java:83)
	at org.apache.solr.BaseDistributedSearchTestCase.testDistribSearch(BaseDistributedSearchTestCase.java:695)
	at sun.reflect.NativeMethodAccessorImpl.invoke0(Native Method)
	at sun.reflect.NativeMethodAccessorImpl.invoke(NativeMethodAccessorImpl.java:57)
	at sun.reflect.DelegatingMethodAccessorImpl.invoke(DelegatingMethodAccessorImpl.java:43)
	at java.lang.reflect.Method.invoke(Method.java:601)
	at com.carrotsearch.randomizedtesting.RandomizedRunner.invoke(RandomizedRunner.java:1559)
	at com.carrotsearch.randomizedtesting.RandomizedRunner.access$600(RandomizedRunner.java:79)
	at com.carrotsearch.randomizedtesting.RandomizedRunner$6.evaluate(RandomizedRunner.java:737)
	at com.carrotsearch.randomizedtesting.RandomizedRunner$7.evaluate(RandomizedRunner.java:773)
	at com.carrotsearch.randomizedtesting.RandomizedRunner$8.evaluate(RandomizedRunner.java:787)
	at com.carrotsearch.randomizedtesting.rules.SystemPropertiesRestoreRule$1.evaluate(SystemPropertiesRestoreRule.java:53)
	at org.apache.lucene.util.TestRuleSetupTeardownChained$1.evaluate(TestRuleSetupTeardownChained.java:50)
	at org.apache.lucene.util.TestRuleFieldCacheSanity$1.evaluate(TestRuleFieldCacheSanity.java:51)
	at org.apache.lucene.util.AbstractBeforeAfterRule$1.evaluate(AbstractBeforeAfterRule.java:45)
	at com.carrotsearch.randomizedtesting.rules.SystemPropertiesInvariantRule$1.evaluate(SystemPropertiesInvariantRule.java:55)
	at org.apache.lucene.util.TestRuleThreadAndTestName$1.evaluate(TestRuleThreadAndTestName.java:48)
	at org.apache.lucene.util.TestRuleIgnoreAfterMaxFailures$1.evaluate(TestRuleIgnoreAfterMaxFailures.java:70)
	at org.apache.lucene.util.TestRuleMarkFailure$1.evaluate(TestRuleMarkFailure.java:48)
	at com.carrotsearch.randomizedtesting.rules.StatementAdapter.evaluate(StatementAdapter.java:36)
	at com.carrotsearch.randomizedtesting.ThreadLeakControl$StatementRunner.run(ThreadLeakControl.java:358)
	at com.carrotsearch.randomizedtesting.ThreadLeakControl.forkTimeoutingTask(ThreadLeakControl.java:782)
	at com.carrotsearch.randomizedtesting.ThreadLeakControl$3.evaluate(ThreadLeakControl.java:442)
	at com.carrotsearch.randomizedtesting.RandomizedRunner.runSingleTest(RandomizedRunner.java:746)
	at com.carrotsearch.randomizedtesting.RandomizedRunner$3.evaluate(RandomizedRunner.java:648)
	at com.carrotsearch.randomizedtesting.RandomizedRunner$4.evaluate(RandomizedRunner.java:682)
	at com.carrotsearch.randomizedtesting.RandomizedRunner$5.evaluate(RandomizedRunner.java:693)
	at com.carrotsearch.randomizedtesting.rules.StatementAdapter.evaluate(StatementAdapter.java:36)
	at com.carrotsearch.randomizedtesting.rules.SystemPropertiesRestoreRule$1.evaluate(SystemPropertiesRestoreRule.java:53)
	at org.apache.lucene.util.AbstractBeforeAfterRule$1.evaluate(AbstractBeforeAfterRule.java:45)
	at org.apache.lucene.util.TestRuleStoreClassName$1.evaluate(TestRuleStoreClassName.java:42)
	at com.carrotsearch.randomizedtesting.rules.SystemPropertiesInvariantRule$1.evaluate(SystemPropertiesInvariantRule.java:55)
	at com.carrotsearch.randomizedtesting.rules.NoShadowingOrOverridesOnMethodsRule$1.evaluate(NoShadowingOrOverridesOnMethodsRule.java:39)
	at com.carrotsearch.randomizedtesting.rules.NoShadowingOrOverridesOnMethodsRule$1.evaluate(NoShadowingOrOverridesOnMethodsRule.java:39)
	at com.carrotsearch.randomizedtesting.rules.StatementAdapter.evaluate(StatementAdapter.java:36)
	at org.apache.lucene.util.TestRuleAssertionsRequired$1.evaluate(TestRuleAssertionsRequired.java:43)
	at org.apache.lucene.util.TestRuleMarkFailure$1.evaluate(TestRuleMarkFailure.java:48)
	at org.apache.lucene.util.TestRuleIgnoreAfterMaxFailures$1.evaluate(TestRuleIgnoreAfterMaxFailures.java:70)
	at org.apache.lucene.util.TestRuleIgnoreTestSuites$1.evaluate(TestRuleIgnoreTestSuites.java:55)
	at com.carrotsearch.randomizedtesting.rules.StatementAdapter.evaluate(StatementAdapter.java:36)
	at com.carrotsearch.randomizedtesting.ThreadLeakControl$StatementRunner.run(ThreadLeakControl.java:358)
	at java.lang.Thread.run(Thread.java:722)




Build Log:
[...truncated 8014 lines...]
[junit4:junit4] Suite: org.apache.solr.cloud.BasicDistributedZk2Test
[junit4:junit4]   2> 5 T1068 oas.SolrTestCaseJ4.setUp ###Starting testDistribSearch
[junit4:junit4]   2> Creating dataDir: /usr/home/hudson/hudson-slave/workspace/Lucene-Solr-Tests-trunk-java7/solr/build/solr-core/test/J1/./solrtest-BasicDistributedZk2Test-1348213203779
[junit4:junit4]   2> 6 T1068 oasc.ZkTestServer.run STARTING ZK TEST SERVER
[junit4:junit4]   2> 10 T1069 oazs.ZooKeeperServer.setTickTime tickTime set to 1000
[junit4:junit4]   2> 10 T1069 oazs.NIOServerCnxn$Factory.<init> binding to port 0.0.0.0/0.0.0.0:0
[junit4:junit4]   2> 11 T1069 oazsp.FileTxnSnapLog.save Snapshotting: 0
[junit4:junit4]   2> 108 T1068 oasc.ZkTestServer.run start zk server on port:62924
[junit4:junit4]   2> 108 T1068 oaz.ZooKeeper.<init> Initiating client connection, connectString=127.0.0.1:62924 sessionTimeout=10000 watcher=org.apache.solr.common.cloud.ConnectionManager@22321810
[junit4:junit4]   2> 109 T1074 oaz.ClientCnxn$SendThread.startConnect Opening socket connection to server /127.0.0.1:62924
[junit4:junit4]   2> 110 T1074 oaz.ClientCnxn$SendThread.primeConnection Socket connection established to localhost/127.0.0.1:62924, initiating session
[junit4:junit4]   2> 110 T1070 oazs.NIOServerCnxn$Factory.run Accepted socket connection from /140.211.11.196:62925
[junit4:junit4]   2> 111 T1070 oazs.NIOServerCnxn.readConnectRequest Client attempting to establish new session at /140.211.11.196:62925
[junit4:junit4]   2> 125 T1072 oazsp.FileTxnLog.append Creating new log file: log.1
[junit4:junit4]   2> 125 T1068 oascc.ConnectionManager.waitForConnected Waiting for client to connect to ZooKeeper
[junit4:junit4]   2> 180 T1072 oazs.NIOServerCnxn.finishSessionInit Established session 0x139e7c4e3490000 with negotiated timeout 10000 for client /140.211.11.196:62925
[junit4:junit4]   2> 180 T1074 oaz.ClientCnxn$SendThread.readConnectResult Session establishment complete on server localhost/127.0.0.1:62924, sessionid = 0x139e7c4e3490000, negotiated timeout = 10000
[junit4:junit4]   2> 180 T1075 oascc.ConnectionManager.process Watcher org.apache.solr.common.cloud.ConnectionManager@22321810 name:ZooKeeperConnection Watcher:127.0.0.1:62924 got event WatchedEvent state:SyncConnected type:None path:null path:null type:None
[junit4:junit4]   2> 180 T1068 oascc.ConnectionManager.waitForConnected Client is connected to ZooKeeper
[junit4:junit4]   2> 181 T1068 oascc.SolrZkClient.makePath makePath: /solr
[junit4:junit4]   2> 185 T1073 oazs.PrepRequestProcessor.pRequest Processed session termination for sessionid: 0x139e7c4e3490000
[junit4:junit4]   2> 186 T1075 oaz.ClientCnxn$EventThread.run EventThread shut down
[junit4:junit4]   2> 186 T1068 oaz.ZooKeeper.close Session: 0x139e7c4e3490000 closed
[junit4:junit4]   2> 187 T1070 oazs.NIOServerCnxn.closeSock Closed socket connection for client /140.211.11.196:62925 which had sessionid 0x139e7c4e3490000
[junit4:junit4]   2> 187 T1068 oaz.ZooKeeper.<init> Initiating client connection, connectString=127.0.0.1:62924/solr sessionTimeout=10000 watcher=org.apache.solr.common.cloud.ConnectionManager@5c7599ea
[junit4:junit4]   2> 188 T1076 oaz.ClientCnxn$SendThread.startConnect Opening socket connection to server /127.0.0.1:62924
[junit4:junit4]   2> 188 T1068 oascc.ConnectionManager.waitForConnected Waiting for client to connect to ZooKeeper
[junit4:junit4]   2> 189 T1076 oaz.ClientCnxn$SendThread.primeConnection Socket connection established to localhost/127.0.0.1:62924, initiating session
[junit4:junit4]   2> 189 T1070 oazs.NIOServerCnxn$Factory.run Accepted socket connection from /140.211.11.196:62927
[junit4:junit4]   2> 189 T1070 oazs.NIOServerCnxn.readConnectRequest Client attempting to establish new session at /140.211.11.196:62927
[junit4:junit4]   2> 192 T1072 oazs.NIOServerCnxn.finishSessionInit Established session 0x139e7c4e3490001 with negotiated timeout 10000 for client /140.211.11.196:62927
[junit4:junit4]   2> 192 T1076 oaz.ClientCnxn$SendThread.readConnectResult Session establishment complete on server localhost/127.0.0.1:62924, sessionid = 0x139e7c4e3490001, negotiated timeout = 10000
[junit4:junit4]   2> 193 T1077 oascc.ConnectionManager.process Watcher org.apache.solr.common.cloud.ConnectionManager@5c7599ea name:ZooKeeperConnection Watcher:127.0.0.1:62924/solr got event WatchedEvent state:SyncConnected type:None path:null path:null type:None
[junit4:junit4]   2> 193 T1068 oascc.ConnectionManager.waitForConnected Client is connected to ZooKeeper
[junit4:junit4]   2> 193 T1068 oascc.SolrZkClient.makePath makePath: /collections/collection1
[junit4:junit4]   2> 205 T1068 oascc.SolrZkClient.makePath makePath: /collections/collection1/shards
[junit4:junit4]   2> 209 T1068 oascc.SolrZkClient.makePath makePath: /collections/control_collection
[junit4:junit4]   2> 212 T1068 oascc.SolrZkClient.makePath makePath: /collections/control_collection/shards
[junit4:junit4]   2> 216 T1068 oasc.AbstractZkTestCase.putConfig put /usr/home/hudson/hudson-slave/workspace/Lucene-Solr-Tests-trunk-java7/solr/build/solr-core/test-files/solr/collection1/conf/solrconfig.xml to /configs/conf1/solrconfig.xml
[junit4:junit4]   2> 217 T1068 oascc.SolrZkClient.makePath makePath: /configs/conf1/solrconfig.xml
[junit4:junit4]   2> 231 T1068 oasc.AbstractZkTestCase.putConfig put /usr/home/hudson/hudson-slave/workspace/Lucene-Solr-Tests-trunk-java7/solr/build/solr-core/test-files/solr/collection1/conf/schema.xml to /configs/conf1/schema.xml
[junit4:junit4]   2> 232 T1068 oascc.SolrZkClient.makePath makePath: /configs/conf1/schema.xml
[junit4:junit4]   2> 338 T1068 oasc.AbstractZkTestCase.putConfig put /usr/home/hudson/hudson-slave/workspace/Lucene-Solr-Tests-trunk-java7/solr/build/solr-core/test-files/solr/collection1/conf/solrconfig.xml to /configs/conf1/solrconfig.xml
[junit4:junit4]   2> 339 T1068 oascc.SolrZkClient.makePath makePath: /configs/conf1/solrconfig.xml
[junit4:junit4]   2> 343 T1068 oasc.AbstractZkTestCase.putConfig put /usr/home/hudson/hudson-slave/workspace/Lucene-Solr-Tests-trunk-java7/solr/build/solr-core/test-files/solr/collection1/conf/stopwords.txt to /configs/conf1/stopwords.txt
[junit4:junit4]   2> 344 T1068 oascc.SolrZkClient.makePath makePath: /configs/conf1/stopwords.txt
[junit4:junit4]   2> 347 T1068 oasc.AbstractZkTestCase.putConfig put /usr/home/hudson/hudson-slave/workspace/Lucene-Solr-Tests-trunk-java7/solr/build/solr-core/test-files/solr/collection1/conf/protwords.txt to /configs/conf1/protwords.txt
[junit4:junit4]   2> 348 T1068 oascc.SolrZkClient.makePath makePath: /configs/conf1/protwords.txt
[junit4:junit4]   2> 351 T1068 oasc.AbstractZkTestCase.putConfig put /usr/home/hudson/hudson-slave/workspace/Lucene-Solr-Tests-trunk-java7/solr/build/solr-core/test-files/solr/collection1/conf/currency.xml to /configs/conf1/currency.xml
[junit4:junit4]   2> 352 T1068 oascc.SolrZkClient.makePath makePath: /configs/conf1/currency.xml
[junit4:junit4]   2> 355 T1068 oasc.AbstractZkTestCase.putConfig put /usr/home/hudson/hudson-slave/workspace/Lucene-Solr-Tests-trunk-java7/solr/build/solr-core/test-files/solr/collection1/conf/open-exchange-rates.json to /configs/conf1/open-exchange-rates.json
[junit4:junit4]   2> 356 T1068 oascc.SolrZkClient.makePath makePath: /configs/conf1/open-exchange-rates.json
[junit4:junit4]   2> 359 T1068 oasc.AbstractZkTestCase.putConfig put /usr/home/hudson/hudson-slave/workspace/Lucene-Solr-Tests-trunk-java7/solr/build/solr-core/test-files/solr/collection1/conf/mapping-ISOLatin1Accent.txt to /configs/conf1/mapping-ISOLatin1Accent.txt
[junit4:junit4]   2> 361 T1068 oascc.SolrZkClient.makePath makePath: /configs/conf1/mapping-ISOLatin1Accent.txt
[junit4:junit4]   2> 364 T1068 oasc.AbstractZkTestCase.putConfig put /usr/home/hudson/hudson-slave/workspace/Lucene-Solr-Tests-trunk-java7/solr/build/solr-core/test-files/solr/collection1/conf/old_synonyms.txt to /configs/conf1/old_synonyms.txt
[junit4:junit4]   2> 364 T1068 oascc.SolrZkClient.makePath makePath: /configs/conf1/old_synonyms.txt
[junit4:junit4]   2> 368 T1068 oasc.AbstractZkTestCase.putConfig put /usr/home/hudson/hudson-slave/workspace/Lucene-Solr-Tests-trunk-java7/solr/build/solr-core/test-files/solr/collection1/conf/synonyms.txt to /configs/conf1/synonyms.txt
[junit4:junit4]   2> 368 T1068 oascc.SolrZkClient.makePath makePath: /configs/conf1/synonyms.txt
[junit4:junit4]   2> 371 T1073 oazs.PrepRequestProcessor.pRequest Processed session termination for sessionid: 0x139e7c4e3490001
[junit4:junit4]   2> 379 T1077 oaz.ClientCnxn$EventThread.run EventThread shut down
[junit4:junit4]   2> 379 T1068 oaz.ZooKeeper.close Session: 0x139e7c4e3490001 closed
[junit4:junit4]   2> 379 T1070 oazs.NIOServerCnxn.closeSock Closed socket connection for client /140.211.11.196:62927 which had sessionid 0x139e7c4e3490001
[junit4:junit4]   2> 382 T1068 oejs.Server.doStart jetty-8.1.2.v20120308
[junit4:junit4]   2> 385 T1068 oejs.AbstractConnector.doStart Started SocketConnector@0.0.0.0:62928
[junit4:junit4]   2> 386 T1068 oasc.SolrResourceLoader.locateSolrHome JNDI not configured for solr (NoInitialContextEx)
[junit4:junit4]   2> 386 T1068 oasc.SolrResourceLoader.locateSolrHome using system property solr.solr.home: /usr/home/hudson/hudson-slave/workspace/Lucene-Solr-Tests-trunk-java7/solr/build/solr-core/test-files/solr
[junit4:junit4]   2> 387 T1068 oasc.SolrResourceLoader.<init> new SolrResourceLoader for deduced Solr Home: '/usr/home/hudson/hudson-slave/workspace/Lucene-Solr-Tests-trunk-java7/solr/build/solr-core/test-files/solr/'
[junit4:junit4]   2> 429 T1068 oass.SolrDispatchFilter.init SolrDispatchFilter.init()
[junit4:junit4]   2> 430 T1068 oasc.SolrResourceLoader.locateSolrHome JNDI not configured for solr (NoInitialContextEx)
[junit4:junit4]   2> 430 T1068 oasc.SolrResourceLoader.locateSolrHome using system property solr.solr.home: /usr/home/hudson/hudson-slave/workspace/Lucene-Solr-Tests-trunk-java7/solr/build/solr-core/test-files/solr
[junit4:junit4]   2> 430 T1068 oasc.CoreContainer$Initializer.initialize looking for solr.xml: /usr/home/hudson/hudson-slave/workspace/Lucene-Solr-Tests-trunk-java7/solr/build/solr-core/test-files/solr/solr.xml
[junit4:junit4]   2> 431 T1068 oasc.CoreContainer.<init> New CoreContainer 1154887850
[junit4:junit4]   2> 432 T1068 oasc.CoreContainer.load Loading CoreContainer using Solr Home: '/usr/home/hudson/hudson-slave/workspace/Lucene-Solr-Tests-trunk-java7/solr/build/solr-core/test-files/solr/'
[junit4:junit4]   2> 432 T1068 oasc.SolrResourceLoader.<init> new SolrResourceLoader for directory: '/usr/home/hudson/hudson-slave/workspace/Lucene-Solr-Tests-trunk-java7/solr/build/solr-core/test-files/solr/'
[junit4:junit4]   2> 465 T1068 oasc.CoreContainer.load Registering Log Listener
[junit4:junit4]   2> 495 T1068 oasc.CoreContainer.initZooKeeper Zookeeper client=127.0.0.1:62924/solr
[junit4:junit4]   2> 496 T1068 oaz.ZooKeeper.<init> Initiating client connection, connectString=127.0.0.1:62924/solr sessionTimeout=5000 watcher=org.apache.solr.common.cloud.ConnectionManager@7e726187
[junit4:junit4]   2> 497 T1087 oaz.ClientCnxn$SendThread.startConnect Opening socket connection to server /127.0.0.1:62924
[junit4:junit4]   2> 497 T1068 oascc.ConnectionManager.waitForConnected Waiting for client to connect to ZooKeeper
[junit4:junit4]   2> 498 T1087 oaz.ClientCnxn$SendThread.primeConnection Socket connection established to localhost/127.0.0.1:62924, initiating session
[junit4:junit4]   2> 498 T1070 oazs.NIOServerCnxn$Factory.run Accepted socket connection from /140.211.11.196:62929
[junit4:junit4]   2> 498 T1070 oazs.NIOServerCnxn.readConnectRequest Client attempting to establish new session at /140.211.11.196:62929
[junit4:junit4]   2> 500 T1072 oazs.NIOServerCnxn.finishSessionInit Established session 0x139e7c4e3490002 with negotiated timeout 5000 for client /140.211.11.196:62929
[junit4:junit4]   2> 500 T1087 oaz.ClientCnxn$SendThread.readConnectResult Session establishment complete on server localhost/127.0.0.1:62924, sessionid = 0x139e7c4e3490002, negotiated timeout = 5000
[junit4:junit4]   2> 501 T1088 oascc.ConnectionManager.process Watcher org.apache.solr.common.cloud.ConnectionManager@7e726187 name:ZooKeeperConnection Watcher:127.0.0.1:62924/solr got event WatchedEvent state:SyncConnected type:None path:null path:null type:None
[junit4:junit4]   2> 501 T1068 oascc.ConnectionManager.waitForConnected Client is connected to ZooKeeper
[junit4:junit4]   2> 503 T1073 oazs.PrepRequestProcessor.pRequest Got user-level KeeperException when processing sessionid:0x139e7c4e3490002 type:create cxid:0x2 zxid:0xfffffffffffffffe txntype:unknown reqpath:n/a Error Path:/solr/overseer Error:KeeperErrorCode = NodeExists for /solr/overseer
[junit4:junit4]   2> 504 T1068 oascc.SolrZkClient.makePath makePath: /live_nodes
[junit4:junit4]   2> 514 T1068 oasc.ZkController.createEphemeralLiveNode Register node as live in ZooKeeper:/live_nodes/127.0.0.1:62928_solr
[junit4:junit4]   2> 514 T1073 oazs.PrepRequestProcessor.pRequest Got user-level KeeperException when processing sessionid:0x139e7c4e3490002 type:delete cxid:0x7 zxid:0xfffffffffffffffe txntype:unknown reqpath:n/a Error Path:/solr/live_nodes/127.0.0.1:62928_solr Error:KeeperErrorCode = NoNode for /solr/live_nodes/127.0.0.1:62928_solr
[junit4:junit4]   2> 515 T1068 oascc.SolrZkClient.makePath makePath: /live_nodes/127.0.0.1:62928_solr
[junit4:junit4]   2> 519 T1068 oashc.HttpShardHandlerFactory.getParameter Setting socketTimeout to: 0
[junit4:junit4]   2> 519 T1068 oashc.HttpShardHandlerFactory.getParameter Setting urlScheme to: http://
[junit4:junit4]   2> 520 T1068 oashc.HttpShardHandlerFactory.getParameter Setting connTimeout to: 0
[junit4:junit4]   2> 520 T1068 oashc.HttpShardHandlerFactory.getParameter Setting maxConnectionsPerHost to: 20
[junit4:junit4]   2> 521 T1068 oashc.HttpShardHandlerFactory.getParameter Setting corePoolSize to: 0
[junit4:junit4]   2> 521 T1068 oashc.HttpShardHandlerFactory.getParameter Setting maximumPoolSize to: 2147483647
[junit4:junit4]   2> 522 T1068 oashc.HttpShardHandlerFactory.getParameter Setting maxThreadIdleTime to: 5
[junit4:junit4]   2> 522 T1068 oashc.HttpShardHandlerFactory.getParameter Setting sizeOfQueue to: -1
[junit4:junit4]   2> 523 T1068 oashc.HttpShardHandlerFactory.getParameter Setting fairnessPolicy to: false
[junit4:junit4]   2> 523 T1068 oascsi.HttpClientUtil.createClient Creating new http client, config:maxConnectionsPerHost=20&maxConnections=10000&socketTimeout=0&connTimeout=0&retry=false
[junit4:junit4]   2> 539 T1068 oascc.SolrZkClient.makePath makePath: /overseer_elect/election
[junit4:junit4]   2> 545 T1073 oazs.PrepRequestProcessor.pRequest Got user-level KeeperException when processing sessionid:0x139e7c4e3490002 type:delete cxid:0x15 zxid:0xfffffffffffffffe txntype:unknown reqpath:n/a Error Path:/solr/overseer_elect/leader Error:KeeperErrorCode = NoNode for /solr/overseer_elect/leader
[junit4:junit4]   2> 556 T1068 oascc.SolrZkClient.makePath makePath: /overseer_elect/leader
[junit4:junit4]   2> 559 T1068 oasc.Overseer.start Overseer (id=88356500523253762-127.0.0.1:62928_solr-n_0000000000) starting
[junit4:junit4]   2> 560 T1073 oazs.PrepRequestProcessor.pRequest Got user-level KeeperException when processing sessionid:0x139e7c4e3490002 type:create cxid:0x1a zxid:0xfffffffffffffffe txntype:unknown reqpath:n/a Error Path:/solr/overseer Error:KeeperErrorCode = NodeExists for /solr/overseer
[junit4:junit4]   2> 561 T1073 oazs.PrepRequestProcessor.pRequest Got user-level KeeperException when processing sessionid:0x139e7c4e3490002 type:create cxid:0x1b zxid:0xfffffffffffffffe txntype:unknown reqpath:n/a Error Path:/solr/overseer Error:KeeperErrorCode = NodeExists for /solr/overseer
[junit4:junit4]   2> 563 T1073 oazs.PrepRequestProcessor.pRequest Got user-level KeeperException when processing sessionid:0x139e7c4e3490002 type:create cxid:0x1c zxid:0xfffffffffffffffe txntype:unknown reqpath:n/a Error Path:/solr/overseer Error:KeeperErrorCode = NodeExists for /solr/overseer
[junit4:junit4]   2> 572 T1073 oazs.PrepRequestProcessor.pRequest Got user-level KeeperException when processing sessionid:0x139e7c4e3490002 type:create cxid:0x1d zxid:0xfffffffffffffffe txntype:unknown reqpath:n/a Error Path:/solr/overseer Error:KeeperErrorCode = NodeExists for /solr/overseer
[junit4:junit4]   2> 574 T1090 oasc.OverseerCollectionProcessor.run Process current queue of collection creations
[junit4:junit4]   2> 574 T1068 oascc.SolrZkClient.makePath makePath: /clusterstate.json
[junit4:junit4]   2> 584 T1068 oascc.ZkStateReader.createClusterStateWatchersAndUpdate Updating cluster state from ZooKeeper... 
[junit4:junit4]   2> 587 T1089 oasc.Overseer$ClusterStateUpdater.run Starting to work on the main queue
[junit4:junit4]   2> 592 T1068 oasc.CoreContainer.create Creating SolrCore 'collection1' using instanceDir: /usr/home/hudson/hudson-slave/workspace/Lucene-Solr-Tests-trunk-java7/solr/build/solr-core/test-files/solr/collection1
[junit4:junit4]   2> 592 T1068 oasc.ZkController.createCollectionZkNode Check for collection zkNode:control_collection
[junit4:junit4]   2> 593 T1068 oasc.ZkController.createCollectionZkNode Collection zkNode exists
[junit4:junit4]   2> 593 T1068 oasc.ZkController.readConfigName Load collection config from:/collections/control_collection
[junit4:junit4]   2> 595 T1068 oasc.SolrResourceLoader.<init> new SolrResourceLoader for directory: '/usr/home/hudson/hudson-slave/workspace/Lucene-Solr-Tests-trunk-java7/solr/build/solr-core/test-files/solr/collection1/'
[junit4:junit4]   2> 596 T1068 oasc.SolrResourceLoader.replaceClassLoader Adding 'file:/usr/home/hudson/hudson-slave/workspace/Lucene-Solr-Tests-trunk-java7/solr/build/solr-core/test-files/solr/collection1/lib/README' to classloader
[junit4:junit4]   2> 597 T1068 oasc.SolrResourceLoader.replaceClassLoader Adding 'file:/usr/home/hudson/hudson-slave/workspace/Lucene-Solr-Tests-trunk-java7/solr/build/solr-core/test-files/solr/collection1/lib/classes/' to classloader
[junit4:junit4]   2> 649 T1068 oasc.SolrConfig.<init> Using Lucene MatchVersion: LUCENE_50
[junit4:junit4]   2> 721 T1068 oasc.SolrConfig.<init> Loaded SolrConfig: solrconfig.xml
[junit4:junit4]   2> 822 T1068 oass.IndexSchema.readSchema Reading Solr Schema
[junit4:junit4]   2> 831 T1068 oass.IndexSchema.readSchema Schema name=test
[junit4:junit4]   2> 1445 T1068 oass.OpenExchangeRatesOrgProvider.init Initialized with rates=open-exchange-rates.json, refreshInterval=1440.
[junit4:junit4]   2> 1452 T1068 oass.IndexSchema.readSchema default search field in schema is text
[junit4:junit4]   2> 1455 T1068 oass.IndexSchema.readSchema unique key field: id
[junit4:junit4]   2> 1468 T1068 oass.FileExchangeRateProvider.reload Reloading exchange rates from file currency.xml
[junit4:junit4]   2> 1472 T1068 oass.FileExchangeRateProvider.reload Reloading exchange rates from file currency.xml
[junit4:junit4]   2> 1475 T1068 oass.OpenExchangeRatesOrgProvider.reload Reloading exchange rates from open-exchange-rates.json
[junit4:junit4]   2> 1476 T1068 oass.OpenExchangeRatesOrgProvider.reload Reloading exchange rates from open-exchange-rates.json
[junit4:junit4]   2> 1477 T1068 oasc.SolrCore.<init> [collection1] Opening new SolrCore at /usr/home/hudson/hudson-slave/workspace/Lucene-Solr-Tests-trunk-java7/solr/build/solr-core/test-files/solr/collection1/, dataDir=./org.apache.solr.cloud.BasicDistributedZk2Test-1348213203779/control/data/
[junit4:junit4]   2> 1478 T1068 oasc.JmxMonitoredMap.<init> JMX monitoring is enabled. Adding Solr mbeans to JMX Server: com.sun.jmx.mbeanserver.JmxMBeanServer@614a962e
[junit4:junit4]   2> 1479 T1068 oasc.SolrCore.getNewIndexDir WARNING New index directory detected: old=null new=./org.apache.solr.cloud.BasicDistributedZk2Test-1348213203779/control/data/index/
[junit4:junit4]   2> 1480 T1068 oasc.SolrCore.initIndex WARNING [collection1] Solr index directory './org.apache.solr.cloud.BasicDistributedZk2Test-1348213203779/control/data/index' doesn't exist. Creating new index...
[junit4:junit4]   2> 1481 T1068 oasc.CachingDirectoryFactory.get return new directory for /usr/home/hudson/hudson-slave/workspace/Lucene-Solr-Tests-trunk-java7/solr/build/solr-core/test/J1/./org.apache.solr.cloud.BasicDistributedZk2Test-1348213203779/control/data/index forceNew:false
[junit4:junit4]   2> 1486 T1068 oasc.SolrDeletionPolicy.onCommit SolrDeletionPolicy.onCommit: commits:num=1
[junit4:junit4]   2> 		commit{dir=NRTCachingDirectory(org.apache.lucene.store.NIOFSDirectory@/usr/home/hudson/hudson-slave/workspace/Lucene-Solr-Tests-trunk-java7/solr/build/solr-core/test/J1/org.apache.solr.cloud.BasicDistributedZk2Test-1348213203779/control/data/index lockFactory=org.apache.lucene.store.NativeFSLockFactory@75750677; maxCacheMB=48.0 maxMergeSizeMB=4.0),segFN=segments_1,generation=1,filenames=[segments_1]
[junit4:junit4]   2> 1486 T1068 oasc.SolrDeletionPolicy.updateCommits newest commit = 1
[junit4:junit4]   2> 1487 T1068 oasc.SolrCore.initWriters created xml: solr.XMLResponseWriter
[junit4:junit4]   2> 1489 T1068 oasup.UpdateRequestProcessorChain.init inserting DistributedUpdateProcessorFactory into updateRequestProcessorChain "dedupe"
[junit4:junit4]   2> 1489 T1068 oasup.UpdateRequestProcessorChain.init inserting DistributedUpdateProcessorFactory into updateRequestProcessorChain "dedupe-allfields"
[junit4:junit4]   2> 1490 T1068 oasup.UpdateRequestProcessorChain.init inserting DistributedUpdateProcessorFactory into updateRequestProcessorChain "stored_sig"
[junit4:junit4]   2> 1490 T1068 oasup.UpdateRequestProcessorChain.init inserting DistributedUpdateProcessorFactory into updateRequestProcessorChain "uniq-fields"
[junit4:junit4]   2> 1491 T1068 oasup.UpdateRequestProcessorChain.init inserting DistributedUpdateProcessorFactory into updateRequestProcessorChain "distrib-dup-test-chain-implicit"
[junit4:junit4]   2> 1491 T1068 oasc.RequestHandlers.initHandlersFromConfig adding lazy requestHandler: solr.ReplicationHandler
[junit4:junit4]   2> 1491 T1068 oasc.RequestHandlers.initHandlersFromConfig created /replication: solr.ReplicationHandler
[junit4:junit4]   2> 1492 T1068 oasc.RequestHandlers.initHandlersFromConfig created standard: solr.StandardRequestHandler
[junit4:junit4]   2> 1492 T1068 oasc.RequestHandlers.initHandlersFromConfig created /get: solr.RealTimeGetHandler
[junit4:junit4]   2> 1493 T1068 oasc.RequestHandlers.initHandlersFromConfig created dismax: solr.SearchHandler
[junit4:junit4]   2> 1493 T1068 oasc.RequestHandlers.initHandlersFromConfig created mock: org.apache.solr.core.MockQuerySenderListenerReqHandler
[junit4:junit4]   2> 1494 T1068 oasc.RequestHandlers.initHandlersFromConfig created /admin/: org.apache.solr.handler.admin.AdminHandlers
[junit4:junit4]   2> 1494 T1068 oasc.RequestHandlers.initHandlersFromConfig created defaults: solr.StandardRequestHandler
[junit4:junit4]   2> 1495 T1068 oasc.RequestHandlers.initHandlersFromConfig adding lazy requestHandler: solr.StandardRequestHandler
[junit4:junit4]   2> 1495 T1068 oasc.RequestHandlers.initHandlersFromConfig created lazy: solr.StandardRequestHandler
[junit4:junit4]   2> 1495 T1068 oasc.RequestHandlers.initHandlersFromConfig created /update: solr.UpdateRequestHandler
[junit4:junit4]   2> 1496 T1068 oasc.RequestHandlers.initHandlersFromConfig created /terms: org.apache.solr.handler.component.SearchHandler
[junit4:junit4]   2> 1496 T1068 oasc.RequestHandlers.initHandlersFromConfig created spellCheckCompRH: org.apache.solr.handler.component.SearchHandler
[junit4:junit4]   2> 1497 T1068 oasc.RequestHandlers.initHandlersFromConfig created spellCheckCompRH_Direct: org.apache.solr.handler.component.SearchHandler
[junit4:junit4]   2> 1497 T1068 oasc.RequestHandlers.initHandlersFromConfig created spellCheckWithWordbreak: org.apache.solr.handler.component.SearchHandler
[junit4:junit4]   2> 1498 T1068 oasc.RequestHandlers.initHandlersFromConfig created spellCheckWithWordbreak_Direct: org.apache.solr.handler.component.SearchHandler
[junit4:junit4]   2> 1498 T1068 oasc.RequestHandlers.initHandlersFromConfig created spellCheckCompRH1: org.apache.solr.handler.component.SearchHandler
[junit4:junit4]   2> 1499 T1068 oasc.RequestHandlers.initHandlersFromConfig created tvrh: org.apache.solr.handler.component.SearchHandler
[junit4:junit4]   2> 1499 T1068 oasc.RequestHandlers.initHandlersFromConfig created /mlt: solr.MoreLikeThisHandler
[junit4:junit4]   2> 1499 T1068 oasc.RequestHandlers.initHandlersFromConfig created /debug/dump: solr.DumpRequestHandler
[junit4:junit4]   2> 1502 T1068 oashl.XMLLoader.init xsltCacheLifetimeSeconds=60
[junit4:junit4]   2> 1505 T1068 oasc.SolrCore.initDeprecatedSupport WARNING solrconfig.xml uses deprecated <admin/gettableFiles>, Please update your config to use the ShowFileRequestHandler.
[junit4:junit4]   2> 1506 T1068 oasc.SolrCore.initDeprecatedSupport WARNING adding ShowFileRequestHandler with hidden files: [SCHEMA.XML, OLD_SYNONYMS.TXT, STOPWORDS.TXT, PROTWORDS.TXT, OPEN-EXCHANGE-RATES.JSON, SYNONYMS.TXT, CURRENCY.XML, MAPPING-ISOLATIN1ACCENT.TXT]
[junit4:junit4]   2> 1509 T1068 oass.SolrIndexSearcher.<init> Opening Searcher@4d74d5f9 main
[junit4:junit4]   2> 1510 T1068 oasu.CommitTracker.<init> Hard AutoCommit: disabled
[junit4:junit4]   2> 1511 T1068 oasu.CommitTracker.<init> Soft AutoCommit: disabled
[junit4:junit4]   2> 1511 T1068 oashc.SpellCheckComponent.inform Initializing spell checkers
[junit4:junit4]   2> 1527 T1068 oass.DirectSolrSpellChecker.init init: {name=direct,classname=DirectSolrSpellChecker,field=lowerfilt,minQueryLength=3}
[junit4:junit4]   2> 1574 T1091 oasc.SolrCore.registerSearcher [collection1] Registered new searcher Searcher@4d74d5f9 main{StandardDirectoryReader(segments_1:1)}
[junit4:junit4]   2> 1578 T1073 oazs.PrepRequestProcessor.pRequest Got user-level KeeperException when processing sessionid:0x139e7c4e3490002 type:create cxid:0x53 zxid:0xfffffffffffffffe txntype:unknown reqpath:n/a Error Path:/solr/overseer/queue Error:KeeperErrorCode = NoNode for /solr/overseer/queue
[junit4:junit4]   2> 1589 T1068 oasc.CoreContainer.register registering core: collection1
[junit4:junit4]   2> 1590 T1068 oasc.ZkController.register Register shard - core:collection1 address:http://127.0.0.1:62928/solr shardId:control_shard
[junit4:junit4]   2> 1590 T1068 oascc.SolrZkClient.makePath makePath: /collections/control_collection/leader_elect/control_shard/election
[junit4:junit4]   2> 1592 T1089 oascc.ZkStateReader.updateClusterState Updating cloud state from ZooKeeper... 
[junit4:junit4]   2> 1593 T1073 oazs.PrepRequestProcessor.pRequest Got user-level KeeperException when processing sessionid:0x139e7c4e3490002 type:create cxid:0x61 zxid:0xfffffffffffffffe txntype:unknown reqpath:n/a Error Path:/solr/overseer/queue-work Error:KeeperErrorCode = NoNode for /solr/overseer/queue-work
[junit4:junit4]   2> 1620 T1073 oazs.PrepRequestProcessor.pRequest Got user-level KeeperException when processing sessionid:0x139e7c4e3490002 type:delete cxid:0x6e zxid:0xfffffffffffffffe txntype:unknown reqpath:n/a Error Path:/solr/collections/control_collection/leaders Error:KeeperErrorCode = NoNode for /solr/collections/control_collection/leaders
[junit4:junit4]   2> 1620 T1088 oascc.ZkStateReader$2.process A cluster state change has occurred - updating...
[junit4:junit4]   2> 1620 T1068 oasc.ShardLeaderElectionContext.runLeaderProcess Running the leader process.
[junit4:junit4]   2> 1621 T1073 oazs.PrepRequestProcessor.pRequest Got user-level KeeperException when processing sessionid:0x139e7c4e3490002 type:create cxid:0x72 zxid:0xfffffffffffffffe txntype:unknown reqpath:n/a Error Path:/solr/overseer Error:KeeperErrorCode = NodeExists for /solr/overseer
[junit4:junit4]   2> 2124 T1068 oasc.ShardLeaderElectionContext.waitForReplicasToComeUp Enough replicas found to continue.
[junit4:junit4]   2> 2125 T1068 oasc.ShardLeaderElectionContext.runLeaderProcess I may be the new leader - try and sync
[junit4:junit4]   2> 2125 T1089 oascc.ZkStateReader.updateClusterState Updating cloud state from ZooKeeper... 
[junit4:junit4]   2> 2125 T1068 oasc.SyncStrategy.sync Sync replicas to http://127.0.0.1:62928/solr/collection1/
[junit4:junit4]   2> 2126 T1068 oasc.SyncStrategy.syncReplicas Sync Success - now sync replicas to me
[junit4:junit4]   2> 2126 T1068 oasc.SyncStrategy.syncToMe http://127.0.0.1:62928/solr/collection1/ has no replicas
[junit4:junit4]   2> 2127 T1068 oasc.ShardLeaderElectionContext.runLeaderProcess I am the new leader: http://127.0.0.1:62928/solr/collection1/
[junit4:junit4]   2> 2127 T1068 oascc.SolrZkClient.makePath makePath: /collections/control_collection/leaders/control_shard
[junit4:junit4]   2> 2141 T1088 oascc.ZkStateReader$2.process A cluster state change has occurred - updating...
[junit4:junit4]   2> 2143 T1073 oazs.PrepRequestProcessor.pRequest Got user-level KeeperException when processing sessionid:0x139e7c4e3490002 type:create cxid:0x8e zxid:0xfffffffffffffffe txntype:unknown reqpath:n/a Error Path:/solr/overseer Error:KeeperErrorCode = NodeExists for /solr/overseer
[junit4:junit4]   2> 2646 T1089 oascc.ZkStateReader.updateClusterState Updating cloud state from ZooKeeper... 
[junit4:junit4]   2> 2693 T1088 oascc.ZkStateReader$2.process A cluster state change has occurred - updating...
[junit4:junit4]   2> 2715 T1068 oasc.ZkController.register We are http://127.0.0.1:62928/solr/collection1/ and leader is http://127.0.0.1:62928/solr/collection1/
[junit4:junit4]   2> 2715 T1068 oasc.ZkController.register No LogReplay needed for core=collection1 baseURL=http://127.0.0.1:62928/solr
[junit4:junit4]   2> 2716 T1068 oasc.ZkController.checkRecovery I am the leader, no recovery necessary
[junit4:junit4]   2> 2718 T1068 oascc.ZkStateReader.updateClusterState Updating cloud state from ZooKeeper... 
[junit4:junit4]   2> 2719 T1068 oass.SolrDispatchFilter.init user.dir=/usr/home/hudson/hudson-slave/workspace/Lucene-Solr-Tests-trunk-java7/solr/build/solr-core/test/J1
[junit4:junit4]   2> 2719 T1068 oass.SolrDispatchFilter.init SolrDispatchFilter.init() done
[junit4:junit4]   2> 2720 T1068 oascsi.HttpClientUtil.createClient Creating new http client, config:maxConnections=128&maxConnectionsPerHost=32&followRedirects=false
[junit4:junit4]   2> 3157 T1068 oejs.Server.doStart jetty-8.1.2.v20120308
[junit4:junit4]   2> 3160 T1068 oejs.AbstractConnector.doStart Started SocketConnector@0.0.0.0:62930
[junit4:junit4]   2> 3161 T1068 oasc.SolrResourceLoader.locateSolrHome JNDI not configured for solr (NoInitialContextEx)
[junit4:junit4]   2> 3161 T1068 oasc.SolrResourceLoader.locateSolrHome using system property solr.solr.home: /usr/home/hudson/hudson-slave/workspace/Lucene-Solr-Tests-trunk-java7/solr/build/solr-core/test/J1/./solrtest-jetty1-1348213206507
[junit4:junit4]   2> 3162 T1068 oasc.SolrResourceLoader.<init> new SolrResourceLoader for deduced Solr Home: '/usr/home/hudson/hudson-slave/workspace/Lucene-Solr-Tests-trunk-java7/solr/build/solr-core/test/J1/./solrtest-jetty1-1348213206507/'
[junit4:junit4]   2> 3202 T1089 oascc.ZkStateReader.updateClusterState Updating cloud state from ZooKeeper... 
[junit4:junit4]   2> 3204 T1068 oass.SolrDispatchFilter.init SolrDispatchFilter.init()
[junit4:junit4]   2> 3205 T1068 oasc.SolrResourceLoader.locateSolrHome JNDI not configured for solr (NoInitialContextEx)
[junit4:junit4]   2> 3206 T1068 oasc.SolrResourceLoader.locateSolrHome using system property solr.solr.home: /usr/home/hudson/hudson-slave/workspace/Lucene-Solr-Tests-trunk-java7/solr/build/solr-core/test/J1/./solrtest-jetty1-1348213206507
[junit4:junit4]   2> 3206 T1068 oasc.CoreContainer$Initializer.initialize looking for solr.xml: /usr/home/hudson/hudson-slave/workspace/Lucene-Solr-Tests-trunk-java7/solr/build/solr-core/test/J1/./solrtest-jetty1-1348213206507/solr.xml
[junit4:junit4]   2> 3206 T1068 oasc.CoreContainer.<init> New CoreContainer 158630789
[junit4:junit4]   2> 3207 T1068 oasc.CoreContainer.load Loading CoreContainer using Solr Home: '/usr/home/hudson/hudson-slave/workspace/Lucene-Solr-Tests-trunk-java7/solr/build/solr-core/test/J1/./solrtest-jetty1-1348213206507/'
[junit4:junit4]   2> 3208 T1068 oasc.SolrResourceLoader.<init> new SolrResourceLoader for directory: '/usr/home/hudson/hudson-slave/workspace/Lucene-Solr-Tests-trunk-java7/solr/build/solr-core/test/J1/./solrtest-jetty1-1348213206507/'
[junit4:junit4]   2> 3240 T1068 oasc.CoreContainer.load Registering Log Listener
[junit4:junit4]   2> 3254 T1088 oascc.ZkStateReader$2.process A cluster state change has occurred - updating...
[junit4:junit4]   2> 3257 T1068 oasc.CoreContainer.initZooKeeper Zookeeper client=127.0.0.1:62924/solr
[junit4:junit4]   2> 3258 T1068 oaz.ZooKeeper.<init> Initiating client connection, connectString=127.0.0.1:62924/solr sessionTimeout=5000 watcher=org.apache.solr.common.cloud.ConnectionManager@7023df88
[junit4:junit4]   2> 3259 T1101 oaz.ClientCnxn$SendThread.startConnect Opening socket connection to server /127.0.0.1:62924
[junit4:junit4]   2> 3259 T1068 oascc.ConnectionManager.waitForConnected Waiting for client to connect to ZooKeeper
[junit4:junit4]   2> 3260 T1101 oaz.ClientCnxn$SendThread.primeConnection Socket connection established to localhost/127.0.0.1:62924, initiating session
[junit4:junit4]   2> 3260 T1070 oazs.NIOServerCnxn$Factory.run Accepted socket connection from /140.211.11.196:62931
[junit4:junit4]   2> 3260 T1070 oazs.NIOServerCnxn.readConnectRequest Client attempting to establish new session at /140.211.11.196:62931
[junit4:junit4]   2> 3262 T1072 oazs.NIOServerCnxn.finishSessionInit Established session 0x139e7c4e3490003 with negotiated timeout 5000 for client /140.211.11.196:62931
[junit4:junit4]   2> 3262 T1101 oaz.ClientCnxn$SendThread.readConnectResult Session establishment complete on server localhost/127.0.0.1:62924, sessionid = 0x139e7c4e3490003, negotiated timeout = 5000
[junit4:junit4]   2> 3262 T1102 oascc.ConnectionManager.process Watcher org.apache.solr.common.cloud.ConnectionManager@7023df88 name:ZooKeeperConnection Watcher:127.0.0.1:62924/solr got event WatchedEvent state:SyncConnected type:None path:null path:null type:None
[junit4:junit4]   2> 3262 T1068 oascc.ConnectionManager.waitForConnected Client is connected to ZooKeeper
[junit4:junit4]   2> 3263 T1073 oazs.PrepRequestProcessor.pRequest Got user-level KeeperException when processing sessionid:0x139e7c4e3490003 type:create cxid:0x1 zxid:0xfffffffffffffffe txntype:unknown reqpath:n/a Error Path:/solr/overseer Error:KeeperErrorCode = NodeExists for /solr/overseer
[junit4:junit4]   2> 3265 T1073 oazs.PrepRequestProcessor.pRequest Got user-level KeeperException when processing sessionid:0x139e7c4e3490003 type:create cxid:0x2 zxid:0xfffffffffffffffe txntype:unknown reqpath:n/a Error Path:/solr/overseer Error:KeeperErrorCode = NodeExists for /solr/overseer
[junit4:junit4]   2> 3273 T1068 oasc.ZkController.createEphemeralLiveNode Register node as live in ZooKeeper:/live_nodes/127.0.0.1:62930_solr
[junit4:junit4]   2> 3274 T1073 oazs.PrepRequestProcessor.pRequest Got user-level KeeperException when processing sessionid:0x139e7c4e3490003 type:delete cxid:0x4 zxid:0xfffffffffffffffe txntype:unknown reqpath:n/a Error Path:/solr/live_nodes/127.0.0.1:62930_solr Error:KeeperErrorCode = NoNode for /solr/live_nodes/127.0.0.1:62930_solr
[junit4:junit4]   2> 3276 T1068 oascc.SolrZkClient.makePath makePath: /live_nodes/127.0.0.1:62930_solr
[junit4:junit4]   2> 3279 T1088 oascc.ZkStateReader$3.process Updating live nodes
[junit4:junit4]   2> 3280 T1068 oashc.HttpShardHandlerFactory.getParameter Setting socketTimeout to: 0
[junit4:junit4]   2> 3280 T1068 oashc.HttpShardHandlerFactory.getParameter Setting urlScheme to: http://
[junit4:junit4]   2> 3281 T1068 oashc.HttpShardHandlerFactory.getParameter Setting connTimeout to: 0
[junit4:junit4]   2> 3281 T1068 oashc.HttpShardHandlerFactory.getParameter Setting maxConnectionsPerHost to: 20
[junit4:junit4]   2> 3282 T1068 oashc.HttpShardHandlerFactory.getParameter Setting corePoolSize to: 0
[junit4:junit4]   2> 3282 T1068 oashc.HttpShardHandlerFactory.getParameter Setting maximumPoolSize to: 2147483647
[junit4:junit4]   2> 3283 T1068 oashc.HttpShardHandlerFactory.getParameter Setting maxThreadIdleTime to: 5
[junit4:junit4]   2> 3283 T1068 oashc.HttpShardHandlerFactory.getParameter Setting sizeOfQueue to: -1
[junit4:junit4]   2> 3284 T1068 oashc.HttpShardHandlerFactory.getParameter Setting fairnessPolicy to: false
[junit4:junit4]   2> 3284 T1068 oascsi.HttpClientUtil.createClient Creating new http client, config:maxConnectionsPerHost=20&maxConnections=10000&socketTimeout=0&connTimeout=0&retry=false
[junit4:junit4]   2> 3302 T1068 oascc.ZkStateReader.createClusterStateWatchersAndUpdate Updating cluster state from ZooKeeper... 
[junit4:junit4]   2> 3309 T1068 oasc.CoreContainer.create Creating SolrCore 'collection1' using instanceDir: /usr/home/hudson/hudson-slave/workspace/Lucene-Solr-Tests-trunk-java7/solr/build/solr-core/test/J1/./solrtest-jetty1-1348213206507/collection1
[junit4:junit4]   2> 3309 T1068 oasc.ZkController.createCollectionZkNode Check for collection zkNode:collection1
[junit4:junit4]   2> 3310 T1068 oasc.ZkController.createCollectionZkNode Collection zkNode exists
[junit4:junit4]   2> 3310 T1068 oasc.ZkController.readConfigName Load collection config from:/collections/collection1
[junit4:junit4]   2> 3312 T1068 oasc.SolrResourceLoader.<init> new SolrResourceLoader for directory: '/usr/home/hudson/hudson-slave/workspace/Lucene-Solr-Tests-trunk-java7/solr/build/solr-core/test/J1/./solrtest-jetty1-1348213206507/collection1/'
[junit4:junit4]   2> 3313 T1068 oasc.SolrResourceLoader.replaceClassLoader Adding 'file:/usr/home/hudson/hudson-slave/workspace/Lucene-Solr-Tests-trunk-java7/solr/build/solr-core/test/J1/solrtest-jetty1-1348213206507/collection1/lib/README' to classloader
[junit4:junit4]   2> 3314 T1068 oasc.SolrResourceLoader.replaceClassLoader Adding 'file:/usr/home/hudson/hudson-slave/workspace/Lucene-Solr-Tests-trunk-java7/solr/build/solr-core/test/J1/solrtest-jetty1-1348213206507/collection1/lib/classes/' to classloader
[junit4:junit4]   2> 3368 T1068 oasc.SolrConfig.<init> Using Lucene MatchVersion: LUCENE_50
[junit4:junit4]   2> 3441 T1068 oasc.SolrConfig.<init> Loaded SolrConfig: solrconfig.xml
[junit4:junit4]   2> 3542 T1068 oass.IndexSchema.readSchema Reading Solr Schema
[junit4:junit4]   2> 3550 T1068 oass.IndexSchema.readSchema Schema name=test
[junit4:junit4]   2> 4208 T1068 oass.OpenExchangeRatesOrgProvider.init Initialized with rates=open-exchange-rates.json, refreshInterval=1440.
[junit4:junit4]   2> 4220 T1068 oass.IndexSchema.readSchema default search field in schema is text
[junit4:junit4]   2> 4224 T1068 oass.IndexSchema.readSchema unique key field: id
[junit4:junit4]   2> 4239 T1068 oass.FileExchangeRateProvider.reload Reloading exchange rates from file currency.xml
[junit4:junit4]   2> 4245 T1068 oass.FileExchangeRateProvider.reload Reloading exchange rates from file currency.xml
[junit4:junit4]   2> 4250 T1068 oass.OpenExchangeRatesOrgProvider.reload Reloading exchange rates from open-exchange-rates.json
[junit4:junit4]   2> 4251 T1068 oass.OpenExchangeRatesOrgProvider.reload Reloading exchange rates from open-exchange-rates.json
[junit4:junit4]   2> 4253 T1068 oasc.SolrCore.<init> [collection1] Opening new SolrCore at /usr/home/hudson/hudson-slave/workspace/Lucene-Solr-Tests-trunk-java7/solr/build/solr-core/test/J1/./solrtest-jetty1-1348213206507/collection1/, dataDir=./org.apache.solr.cloud.BasicDistributedZk2Test-1348213203779/jetty1/
[junit4:junit4]   2> 4253 T1068 oasc.JmxMonitoredMap.<init> JMX monitoring is enabled. Adding Solr mbeans to JMX Server: com.sun.jmx.mbeanserver.JmxMBeanServer@614a962e
[junit4:junit4]   2> 4255 T1068 oasc.SolrCore.getNewIndexDir WARNING New index directory detected: old=null new=./org.apache.solr.cloud.BasicDistributedZk2Test-1348213203779/jetty1/index/
[junit4:junit4]   2> 4256 T1068 oasc.SolrCore.initIndex WARNING [collection1] Solr index directory './org.apache.solr.cloud.BasicDistributedZk2Test-1348213203779/jetty1/index' doesn't exist. Creating new index...
[junit4:junit4]   2> 4256 T1068 oasc.CachingDirectoryFactory.get return new directory for /usr/home/hudson/hudson-slave/workspace/Lucene-Solr-Tests-trunk-java7/solr/build/solr-core/test/J1/./org.apache.solr.cloud.BasicDistributedZk2Test-1348213203779/jetty1/index forceNew:false
[junit4:junit4]   2> 4264 T1068 oasc.SolrDeletionPolicy.onCommit SolrDeletionPolicy.onCommit: commits:num=1
[junit4:junit4]   2> 		commit{dir=NRTCachingDirectory(org.apache.lucene.store.NIOFSDirectory@/usr/home/hudson/hudson-slave/workspace/Lucene-Solr-Tests-trunk-java7/solr/build/solr-core/test/J1/org.apache.solr.cloud.BasicDistributedZk2Test-1348213203779/jetty1/index lockFactory=org.apache.lucene.store.NativeFSLockFactory@4b038860; maxCacheMB=48.0 maxMergeSizeMB=4.0),segFN=segments_1,generation=1,filenames=[segments_1]
[junit4:junit4]   2> 4265 T1068 oasc.SolrDeletionPolicy.updateCommits newest commit = 1
[junit4:junit4]   2> 4266 T1068 oasc.SolrCore.initWriters created xml: solr.XMLResponseWriter
[junit4:junit4]   2> 4269 T1068 oasup.UpdateRequestProcessorChain.init inserting DistributedUpdateProcessorFactory into updateRequestProcessorChain "dedupe"
[junit4:junit4]   2> 4269 T1068 oasup.UpdateRequestProcessorChain.init inserting DistributedUpdateProcessorFactory into updateRequestProcessorChain "dedupe-allfields"
[junit4:junit4]   2> 4270 T1068 oasup.UpdateRequestProcessorChain.init inserting DistributedUpdateProcessorFactory into updateRequestProcessorChain "stored_sig"
[junit4:junit4]   2> 4270 T1068 oasup.UpdateRequestProcessorChain.init inserting DistributedUpdateProcessorFactory into updateRequestProcessorChain "uniq-fields"
[junit4:junit4]   2> 4271 T1068 oasup.UpdateRequestProcessorChain.init inserting DistributedUpdateProcessorFactory into updateRequestProcessorChain "distrib-dup-test-chain-implicit"
[junit4:junit4]   2> 4272 T1068 oasc.RequestHandlers.initHandlersFromConfig adding lazy requestHandler: solr.ReplicationHandler
[junit4:junit4]   2> 4273 T1068 oasc.RequestHandlers.initHandlersFromConfig created /replication: solr.ReplicationHandler
[junit4:junit4]   2> 4273 T1068 oasc.RequestHandlers.initHandlersFromConfig created standard: solr.StandardRequestHandler
[junit4:junit4]   2> 4274 T1068 oasc.RequestHandlers.initHandlersFromConfig created /get: solr.RealTimeGetHandler
[junit4:junit4]   2> 4275 T1068 oasc.RequestHandlers.initHandlersFromConfig created dismax: solr.SearchHandler
[junit4:junit4]   2> 4276 T1068 oasc.RequestHandlers.initHandlersFromConfig created mock: org.apache.solr.core.MockQuerySenderListenerReqHandler
[junit4:junit4]   2> 4276 T1068 oasc.RequestHandlers.initHandlersFromConfig created /admin/: org.apache.solr.handler.admin.AdminHandlers
[junit4:junit4]   2> 4277 T1068 oasc.RequestHandlers.initHandlersFromConfig created defaults: solr.StandardRequestHandler
[junit4:junit4]   2> 4278 T1068 oasc.RequestHandlers.initHandlersFromConfig adding lazy requestHandler: solr.StandardRequestHandler
[junit4:junit4]   2> 4278 T1068 oasc.RequestHandlers.initHandlersFromConfig created lazy: solr.StandardRequestHandler
[junit4:junit4]   2> 4279 T1068 oasc.RequestHandlers.initHandlersFromConfig created /update: solr.UpdateRequestHandler
[junit4:junit4]   2> 4280 T1068 oasc.RequestHandlers.initHandlersFromConfig created /terms: org.apache.solr.handler.component.SearchHandler
[junit4:junit4]   2> 4281 T1068 oasc.RequestHandlers.initHandlersFromConfig created spellCheckCompRH: org.apache.solr.handler.component.SearchHandler
[junit4:junit4]   2> 4281 T1068 oasc.RequestHandlers.initHandlersFromConfig created spellCheckCompRH_Direct: org.apache.solr.handler.component.SearchHandler
[junit4:junit4]   2> 4282 T1068 oasc.RequestHandlers.initHandlersFromConfig created spellCheckWithWordbreak: org.apache.solr.handler.component.SearchHandler
[junit4:junit4]   2> 4283 T1068 oasc.RequestHandlers.initHandlersFromConfig created spellCheckWithWordbreak_Direct: org.apache.solr.handler.component.SearchHandler
[junit4:junit4]   2> 4284 T1068 oasc.RequestHandlers.initHandlersFromConfig created spellCheckCompRH1: org.apache.solr.handler.component.SearchHandler
[junit4:junit4]   2> 4284 T1068 oasc.RequestHandlers.initHandlersFromConfig created tvrh: org.apache.solr.handler.component.SearchHandler
[junit4:junit4]   2> 4285 T1068 oasc.RequestHandlers.initHandlersFromConfig created /mlt: solr.MoreLikeThisHandler
[junit4:junit4]   2> 4286 T1068 oasc.RequestHandlers.initHandlersFromConfig created /debug/dump: solr.DumpRequestHandler
[junit4:junit4]   2> 4290 T1068 oashl.XMLLoader.init xsltCacheLifetimeSeconds=60
[junit4:junit4]   2> 4295 T1068 oasc.SolrCore.initDeprecatedSupport WARNING solrconfig.xml uses deprecated <admin/gettableFiles>, Please update your config to use the ShowFileRequestHandler.
[junit4:junit4]   2> 4296 T1068 oasc.SolrCore.initDeprecatedSupport WARNING adding ShowFileRequestHandler with hidden files: [SCHEMA.XML, OLD_SYNONYMS.TXT, STOPWORDS.TXT, PROTWORDS.TXT, OPEN-EXCHANGE-RATES.JSON, SYNONYMS.TXT, CURRENCY.XML, MAPPING-ISOLATIN1ACCENT.TXT]
[junit4:junit4]   2> 4300 T1068 oass.SolrIndexSearcher.<init> Opening Searcher@34fea8be main
[junit4:junit4]   2> 4302 T1068 oasu.CommitTracker.<init> Hard AutoCommit: disabled
[junit4:junit4]   2> 4302 T1068 oasu.CommitTracker.<init> Soft AutoCommit: disabled
[junit4:junit4]   2> 4303 T1068 oashc.SpellCheckComponent.inform Initializing spell checkers
[junit4:junit4]   2> 4311 T1068 oass.DirectSolrSpellChecker.init init: {name=direct,classname=DirectSolrSpellChecker,field=lowerfilt,minQueryLength=3}
[junit4:junit4]   2> 4366 T1103 oasc.SolrCore.registerSearcher [collection1] Registered new searcher Searcher@34fea8be main{StandardDirectoryReader(segments_1:1)}
[junit4:junit4]   2> 4764 T1089 oascc.ZkStateReader.updateClusterState Updating cloud state from ZooKeeper... 
[junit4:junit4]   2> 4769 T1102 oascc.ZkStateReader$2.process A cluster state change has occurred - updating...
[junit4:junit4]   2> 4769 T1088 oascc.ZkStateReader$2.process A cluster state change has occurred - updating...
[junit4:junit4]   2> 4875 T1068 oasc.CoreContainer.register registering core: collection1
[junit4:junit4]   2> 4875 T1068 oasc.ZkController.register Register shard - core:collection1 address:http://127.0.0.1:62930/solr shardId:shard1
[junit4:junit4]   2> 4876 T1068 oascc.SolrZkClient.makePath makePath: /collections/collection1/leader_elect/shard1/election
[junit4:junit4]   2> 4892 T1073 oazs.PrepRequestProcessor.pRequest Got user-level KeeperException when processing sessionid:0x139e7c4e3490003 type:delete cxid:0x42 zxid:0xfffffffffffffffe txntype:unknown reqpath:n/a Error Path:/solr/collections/collection1/leaders Error:KeeperErrorCode = NoNode for /solr/collections/collection1/leaders
[junit4:junit4]   2> 4893 T1068 oasc.ShardLeaderElectionContext.runLeaderProcess Running the leader process.
[junit4:junit4]   2> 4894 T1073 oazs.PrepRequestProcessor.pRequest Got user-level KeeperException when processing sessionid:0x139e7c4e3490003 type:create cxid:0x43 zxid:0xfffffffffffffffe txntype:unknown reqpath:n/a Error Path:/solr/overseer Error:KeeperErrorCode = NodeExists for /solr/overseer
[junit4:junit4]   2> 4896 T1068 oasc.ShardLeaderElectionContext.waitForReplicasToComeUp Enough replicas found to continue.
[junit4:junit4]   2> 4897 T1068 oasc.ShardLeaderElectionContext.runLeaderProcess I may be the new leader - try and sync
[junit4:junit4]   2> 4897 T1068 oasc.SyncStrategy.sync Sync replicas to http://127.0.0.1:62930/solr/collection1/
[junit4:junit4]   2> 4898 T1068 oasc.SyncStrategy.syncReplicas Sync Success - now sync replicas to me
[junit4:junit4]   2> 4898 T1068 oasc.SyncStrategy.syncToMe http://127.0.0.1:62930/solr/collection1/ has no replicas
[junit4:junit4]   2> 4899 T1068 oasc.ShardLeaderElectionContext.runLeaderProcess I am the new leader: http://127.0.0.1:62930/solr/collection1/
[junit4:junit4]   2> 4899 T1068 oascc.SolrZkClient.makePath makePath: /collections/collection1/leaders/shard1
[junit4:junit4]   2> 4910 T1073 oazs.PrepRequestProcessor.pRequest Got user-level KeeperException when processing sessionid:0x139e7c4e3490003 type:create cxid:0x4d zxid:0xfffffffffffffffe txntype:unknown reqpath:n/a Error Path:/solr/overseer Error:KeeperErrorCode = NodeExists for /solr/overseer
[junit4:junit4]   2> 5283 T1089 oascc.ZkStateReader.updateClusterState Updating cloud state from ZooKeeper... 
[junit4:junit4]   2> 5302 T1102 oascc.ZkStateReader$2.process A cluster state change has occurred - updating...
[junit4:junit4]   2> 5302 T1088 oascc.ZkStateReader$2.process A cluster state change has occurred - updating...
[junit4:junit4]   2> 5320 T1068 oasc.ZkController.register We are http://127.0.0.1:62930/solr/collection1/ and leader is http://127.0.0.1:62930/solr/collection1/
[junit4:junit4]   2> 5320 T1068 oasc.ZkController.register No LogReplay needed for core=collection1 baseURL=http://127.0.0.1:62930/solr
[junit4:junit4]   2> 5321 T1068 oasc.ZkController.checkRecovery I am the leader, no recovery necessary
[junit4:junit4]   2> 5323 T1068 oascc.ZkStateReader.updateClusterState Updating cloud state from ZooKeeper... 
[junit4:junit4]   2> 5324 T1068 oass.SolrDispatchFilter.init user.dir=/usr/home/hudson/hudson-slave/workspace/Lucene-Solr-Tests-trunk-java7/solr/build/solr-core/test/J1
[junit4:junit4]   2> 5324 T1068 oass.SolrDispatchFilter.init SolrDispatchFilter.init() done
[junit4:junit4]   2> 5325 T1068 oascsi.HttpClientUtil.createClient Creating new http client, config:maxConnections=128&maxConnectionsPerHost=32&followRedirects=false
[junit4:junit4]   2> 5753 T1068 oejs.Server.doStart jetty-8.1.2.v20120308
[junit4:junit4]   2> 5756 T1068 oejs.AbstractConnector.doStart Started SocketConnector@0.0.0.0:62934
[junit4:junit4]   2> 5757 T1068 oasc.SolrResourceLoader.locateSolrHome JNDI not configured for solr (NoInitialContextEx)
[junit4:junit4]   2> 5758 T1068 oasc.SolrResourceLoader.locateSolrHome using system property solr.solr.home: /usr/home/hudson/hudson-slave/workspace/Lucene-Solr-Tests-trunk-java7/solr/build/solr-core/test/J1/./solrtest-jetty2-1348213209112
[junit4:junit4]   2> 5758 T1068 oasc.SolrResourceLoader.<init> new SolrResourceLoader for deduced Solr Home: '/usr/home/hudson/hudson-slave/workspace/Lucene-Solr-Tests-trunk-java7/solr/build/solr-core/test/J1/./solrtest-jetty2-1348213209112/'
[junit4:junit4]   2> 5801 T1068 oass.SolrDispatchFilter.init SolrDispatchFilter.init()
[junit4:junit4]   2> 5802 T1068 oasc.SolrResourceLoader.locateSolrHome JNDI not configured for solr (NoInitialContextEx)
[junit4:junit4]   2> 5803 T1068 oasc.SolrResourceLoader.locateSolrHome using system property solr.solr.home: /usr/home/hudson/hudson-slave/workspace/Lucene-Solr-Tests-trunk-java7/solr/build/solr-core/test/J1/./solrtest-jetty2-1348213209112
[junit4:junit4]   2> 5803 T1068 oasc.CoreContainer$Initializer.initialize looking for solr.xml: /usr/home/hudson/hudson-slave/workspace/Lucene-Solr-Tests-trunk-java7/solr/build/solr-core/test/J1/./solrtest-jetty2-1348213209112/solr.xml
[junit4:junit4]   2> 5804 T1068 oasc.CoreContainer.<init> New CoreContainer 728561407
[junit4:junit4]   2> 5804 T1068 oasc.CoreContainer.load Loading CoreContainer using Solr Home: '/usr/home/hudson/hudson-slave/workspace/Lucene-Solr-Tests-trunk-java7/solr/build/solr-core/test/J1/./solrtest-jetty2-1348213209112/'
[junit4:junit4]   2> 5805 T1068 oasc.SolrResourceLoader.<init> new SolrResourceLoader for directory: '/usr/home/hudson/hudson-slave/workspace/Lucene-Solr-Tests-trunk-java7/solr/build/solr-core/test/J1/./solrtest-jetty2-1348213209112/'
[junit4:junit4]   2> 5809 T1089 oascc.ZkStateReader.updateClusterState Updating cloud state from ZooKeeper... 
[junit4:junit4]   2> 5826 T1102 oascc.ZkStateReader$2.process A cluster state change has occurred - updating...
[junit4:junit4]   2> 5826 T1088 oascc.ZkStateReader$2.process A cluster state change has occurred - updating...
[junit4:junit4]   2> 5843 T1068 oasc.CoreContainer.load Registering Log Listener
[junit4:junit4]   2> 5860 T1068 oasc.CoreContainer.initZooKeeper Zookeeper client=127.0.0.1:62924/solr
[junit4:junit4]   2> 5861 T1068 oaz.ZooKeeper.<init> Initiating client connection, connectString=127.0.0.1:62924/solr sessionTimeout=5000 watcher=org.apache.solr.common.cloud.ConnectionManager@127cf247
[junit4:junit4]   2> 5862 T1113 oaz.ClientCnxn$SendThread.startConnect Opening socket connection to server /127.0.0.1:62924
[junit4:junit4]   2> 5862 T1068 oascc.ConnectionManager.waitForConnected Waiting for client to connect to ZooKeeper
[junit4:junit4]   2> 5863 T1113 oaz.ClientCnxn$SendThread.primeConnection Socket connection established to localhost/127.0.0.1:62924, initiating session
[junit4:junit4]   2> 5864 T1070 oazs.NIOServerCnxn$Factory.run Accepted socket connection from /140.211.11.196:62935
[junit4:junit4]   2> 5864 T1070 oazs.NIOServerCnxn.readConnectRequest Client attempting to establish new session at /140.211.11.196:62935
[junit4:junit4]   2> 5867 T1072 oazs.NIOServerCnxn.finishSessionInit Established session 0x139e7c4e3490004 with negotiated timeout 5000 for client /140.211.11.196:62935
[junit4:junit4]   2> 5867 T1113 oaz.ClientCnxn$SendThread.readConnectResult Session establishment complete on server localhost/127.0.0.1:62924, sessionid = 0x139e7c4e3490004, negotiated timeout = 5000
[junit4:junit4]   2> 5867 T1114 oascc.ConnectionManager.process Watcher org.apache.solr.common.cloud.ConnectionManager@127cf247 name:ZooKeeperConnection Watcher:127.0.0.1:62924/solr got event WatchedEvent state:SyncConnected type:None path:null path:null type:None
[junit4:junit4]   2> 5868 T1068 oascc.ConnectionManager.waitForConnected Client is connected to ZooKeeper
[junit4:junit4]   2> 5869 T1073 oazs.PrepRequestProcessor.pRequest Got user-level KeeperException when processing sessionid:0x139e7c4e3490004 type:create cxid:0x1 zxid:0xfffffffffffffffe txntype:unknown reqpath:n/a Error Path:/solr/overseer Error:KeeperErrorCode = NodeExists for /solr/overseer
[junit4:junit4]   2> 5870 T1073 oazs.PrepRequestProcessor.pRequest Got user-level KeeperException when processing sessionid:0x139e7c4e3490004 type:create cxid:0x2 zxid:0xfffffffffffffffe txntype:unknown reqpath:n/a Error Path:/solr/overseer Error:KeeperErrorCode = NodeExists for /solr/overseer
[junit4:junit4]   2> 5872 T1068 oasc.ZkController.createEphemeralLiveNode Register node as live in ZooKeeper:/live_nodes/127.0.0.1:62934_solr
[junit4:junit4]   2> 5873 T1073 oazs.PrepRequestProcessor.pRequest Got user-level KeeperException when processing sessionid:0x139e7c4e3490004 type:delete cxid:0x4 zxid:0xfffffffffffffffe txntype:unknown reqpath:n/a Error Path:/solr/live_nodes/127.0.0.1:62934_solr Error:KeeperErrorCode = NoNode for /solr/live_nodes/127.0.0.1:62934_solr
[junit4:junit4]   2> 5881 T1068 oascc.SolrZkClient.makePath makePath: /live_nodes/127.0.0.1:62934_solr
[junit4:junit4]   2> 5884 T1102 oascc.ZkStateReader$3.process Updating live nodes
[junit4:junit4]   2> 5884 T1088 oascc.ZkStateReader$3.process Updating live nodes
[junit4:junit4]   2> 5885 T1068 oashc.HttpShardHandlerFactory.getParameter Setting socketTimeout to: 0
[junit4:junit4]   2> 5885 T1068 oashc.HttpShardHandlerFactory.getParameter Setting urlScheme to: http://
[junit4:junit4]   2> 5886 T1068 oashc.HttpShardHandlerFactory.getParameter Setting connTimeout to: 0
[junit4:junit4]   2> 5886 T1068 oashc.HttpShardHandlerFactory.getParameter Setting maxConnectionsPerHost to: 20
[junit4:junit4]   2> 5886 T1068 oashc.HttpShardHandlerFactory.getParameter Setting corePoolSize to: 0
[junit4:junit4]   2> 5887 T1068 oashc.HttpShardHandlerFactory.getParameter Setting maximumPoolSize to: 2147483647
[junit4:junit4]   2> 5887 T1068 oashc.HttpShardHandlerFactory.getParameter Setting maxThreadIdleTime to: 5
[junit4:junit4]   2> 5888 T1068 oashc.HttpShardHandlerFactory.getParameter Setting sizeOfQueue to: -1
[junit4:junit4]   2> 5888 T1068 oashc.HttpShardHandlerFactory.getParameter Setting fairnessPolicy to: false
[junit4:junit4]   2> 5889 T1068 oascsi.HttpClientUtil.createClient Creating new http client, config:maxConnectionsPerHost=20&maxConnections=10000&socketTimeout=0&connTimeout=0&retry=false
[junit4:junit4]   2> 5908 T1068 oascc.ZkStateReader.createClusterStateWatchersAndUpdate Updating cluster state from ZooKeeper... 
[junit4:junit4]   2> 5916 T1068 oasc.CoreContainer.create Creating SolrCore 'collection1' using instanceDir: /usr/home/hudson/hudson-slave/workspace/Lucene-Solr-Tests-trunk-java7/solr/build/solr-core/test/J1/./solrtest-jetty2-1348213209112/collection1
[junit4:junit4]   2> 5917 T1068 oasc.ZkController.createCollectionZkNode Check for collection zkNode:collection1
[junit4:junit4]   2> 5918 T1068 oasc.ZkController.createCollectionZkNode Collection zkNode exists
[junit4:junit4]   2> 5918 T1068 oasc.ZkController.readConfigName Load collection config from:/collections/collection1
[junit4:junit4]   2> 5920 T1068 oasc.SolrResourceLoader.<init> new SolrResourceLoader for directory: '/usr/home/hudson/hudson-slave/workspace/Lucene-Solr-Tests-trunk-java7/solr/build/solr-core/test/J1/./solrtest-jetty2-1348213209112/collection1/'
[junit4:junit4]   2> 5922 T1068 oasc.SolrResourceLoader.replaceClassLoader Adding 'file:/usr/home/hudson/hudson-slave/workspace/Lucene-Solr-Tests-trunk-java7/solr/build/solr-core/test/J1/solrtest-jetty2-1348213209112/collection1/lib/README' to classloader
[junit4:junit4]   2> 5923 T1068 oasc.SolrResourceLoader.replaceClassLoader Adding 'file:/usr/home/hudson/hudson-slave/workspace/Lucene-Solr-Tests-trunk-java7/solr/build/solr-core/test/J1/solrtest-jetty2-1348213209112/collection1/lib/classes/' to classloader
[junit4:junit4]   2> 5993 T1068 oasc.SolrConfig.<init> Using Lucene MatchVersion: LUCENE_50
[junit4:junit4]   2> 6066 T1068 oasc.SolrConfig.<init> Loaded SolrConfig: solrconfig.xml
[junit4:junit4]   2> 6168 T1068 oass.IndexSchema.readSchema Reading Solr Schema
[junit4:junit4]   2> 6176 T1068 oass.IndexSchema.readSchema Schema name=test
[junit4:junit4]   2> 6838 T1068 oass.OpenExchangeRatesOrgProvider.init Initialized with rates=open-exchange-rates.json, refreshInterval=1440.
[junit4:junit4]   2> 6850 T1068 oass.IndexSchema.readSchema default search field in schema is text
[junit4:junit4]   2> 6855 T1068 oass.IndexSchema.readSchema unique key field: id
[junit4:junit4]   2> 6869 T1068 oass.FileExchangeRateProvider.reload Reloading exchange rates from file currency.xml
[junit4:junit4]   2> 6874 T1068 oass.FileExchangeRateProvider.reload Reloading exchange rates from file currency.xml
[junit4:junit4]   2> 6879 T1068 oass.OpenExchangeRatesOrgProvider.reload Reloading exchange rates from open-exchange-rates.json
[junit4:junit4]   2> 6881 T1068 oass.OpenExchangeRatesOrgProvider.reload Reloading exchange rates from open-exchange-rates.json
[junit4:junit4]   2> 6882 T1068 oasc.SolrCore.<init> [collection1] Opening new SolrCore at /usr/home/hudson/hudson-slave/workspace/Lucene-Solr-Tests-trunk-java7/solr/build/solr-core/test/J1/./solrtest-jetty2-1348213209112/collection1/, dataDir=./org.apache.solr.cloud.BasicDistributedZk2Test-1348213203779/jetty2/
[junit4:junit4]   2> 6882 T1068 oasc.JmxMonitoredMap.<init> JMX monitoring is enabled. Adding Solr mbeans to JMX Server: com.sun.jmx.mbeanserver.JmxMBeanServer@614a962e
[junit4:junit4]   2> 6884 T1068 oasc.SolrCore.getNewIndexDir WARNING New index directory detected: old=null new=./org.apache.solr.cloud.BasicDistributedZk2Test-1348213203779/jetty2/index/
[junit4:junit4]   2> 6885 T1068 oasc.SolrCore.initIndex WARNING [collection1] Solr index directory './org.apache.solr.cloud.BasicDistributedZk2Test-1348213203779/jetty2/index' doesn't exist. Creating new index...
[junit4:junit4]   2> 6886 T1068 oasc.CachingDirectoryFactory.get return new directory for /usr/home/hudson/hudson-slave/workspace/Lucene-Solr-Tests-trunk-java7/solr/build/solr-core/test/J1/./org.apache.solr.cloud.BasicDistributedZk2Test-1348213203779/jetty2/index forceNew:false
[junit4:junit4]   2> 6894 T1068 oasc.SolrDeletionPolicy.onCommit SolrDeletionPolicy.onCommit: commits:num=1
[junit4:junit4]   2> 		commit{dir=NRTCachingDirectory(org.apache.lucene.store.NIOFSDirectory@/usr/home/hudson/hudson-slave/workspace/Lucene-Solr-Tests-trunk-java7/solr/build/solr-core/test/J1/org.apache.solr.cloud.BasicDistributedZk2Test-1348213203779/jetty2/index lockFactory=org.apache.lucene.store.NativeFSLockFactory@4918f485; maxCacheMB=48.0 maxMergeSizeMB=4.0),segFN=segments_1,generation=1,filenames=[segments_1]
[junit4:junit4]   2> 6895 T1068 oasc.SolrDeletionPolicy.updateCommits newest commit = 1
[junit4:junit4]   2> 6896 T1068 oasc.SolrCore.initWriters created xml: solr.XMLResponseWriter
[junit4:junit4]   2> 6898 T1068 oasup.UpdateRequestProcessorChain.init inserting DistributedUpdateProcessorFactory into updateRequestProcessorChain "dedupe"
[junit4:junit4]   2> 6899 T1068 oasup.UpdateRequestProcessorChain.init inserting DistributedUpdateProcessorFactory into updateRequestProcessorChain "dedupe-allfields"
[junit4:junit4]   2> 6900 T1068 oasup.UpdateRequestProcessorChain.init inserting DistributedUpdateProcessorFactory into updateRequestProcessorChain "stored_sig"
[junit4:junit4]   2> 6900 T1068 oasup.UpdateRequestProcessorChain.init inserting DistributedUpdateProcessorFactory into updateRequestProcessorChain "uniq-fields"
[junit4:junit4]   2> 6901 T1068 oasup.UpdateRequestProcessorChain.init inserting DistributedUpdateProcessorFactory into updateRequestProcessorChain "distrib-dup-test-chain-implicit"
[junit4:junit4]   2> 6901 T1068 oasc.RequestHandlers.initHandlersFromConfig adding lazy requestHandler: solr.ReplicationHandler
[junit4:junit4]   2> 6902 T1068 oasc.RequestHandlers.initHandlersFromConfig created /replication: solr.ReplicationHandler
[junit4:junit4]   2> 6903 T1068 oasc.RequestHandlers.initHandlersFromConfig created standard: solr.StandardRequestHandler
[junit4:junit4]   2> 6904 T1068 oasc.RequestHandlers.initHandlersFromConfig created /get: solr.RealTimeGetHandler
[junit4:junit4]   2> 6904 T1068 oasc.RequestHandlers.initHandlersFromConfig created dismax: solr.SearchHandler
[junit4:junit4]   2> 6905 T1068 oasc.RequestHandlers.initHandlersFromConfig created mock: org.apache.solr.core.MockQuerySenderListenerReqHandler
[junit4:junit4]   2> 6906 T1068 oasc.RequestHandlers.initHandlersFromConfig created /admin/: org.apache.solr.handler.admin.AdminHandlers
[junit4:junit4]   2> 6907 T1068 oasc.RequestHandlers.initHandlersFromConfig created defaults: solr.StandardRequestHandler
[junit4:junit4]   2> 6907 T1068 oasc.RequestHandlers.initHandlersFromConfig adding lazy requestHandler: solr.StandardRequestHandler
[junit4:junit4]   2> 6908 T1068 oasc.RequestHandlers.initHandlersFromConfig created lazy: solr.StandardRequestHandler
[junit4:junit4]   2> 6908 T1068 oasc.RequestHandlers.initHandlersFromConfig created /update: solr.UpdateRequestHandler
[junit4:junit4]   2> 6909 T1068 oasc.RequestHandlers.initHandlersFromConfig created /terms: org.apache.solr.handler.component.SearchHandler
[junit4:junit4]   2> 6910 T1068 oasc.RequestHandlers.initHandlersFromConfig created spellCheckCompRH: org.apache.solr.handler.component.SearchHandler
[junit4:junit4]   2> 6910 T1068 oasc.RequestHandlers.initHandlersFromConfig created spellCheckCompRH_Direct: org.apache.solr.handler.component.SearchHandler
[junit4:junit4]   2> 6911 T1068 oasc.RequestHandlers.initHandlersFromConfig created spellCheckWithWordbreak: org.apache.solr.handler.component.SearchHandler
[junit4:junit4]   2> 6912 T1068 oasc.RequestHandlers.initHandlersFromConfig created spellCheckWithWordbreak_Direct: org.apache.solr.handler.component.SearchHandler
[junit4:junit4]   2> 6913 T1068 oasc.RequestHandlers.initHandlersFromConfig created spellCheckCompRH1: org.apache.solr.handler.component.SearchHandler
[junit4:junit4]   2> 6913 T1068 oasc.RequestHandlers.initHandlersFromConfig created tvrh: org.apache.solr.handler.component.SearchHandler
[junit4:junit4]   2> 6914 T1068 oasc.RequestHandlers.initHandlersFromConfig created /mlt: solr.MoreLikeThisHandler
[junit4:junit4]   2> 6915 T1068 oasc.RequestHandlers.initHandlersFromConfig created /debug/dump: solr.DumpRequestHandler
[junit4:junit4]   2> 6918 T1068 oashl.XMLLoader.init xsltCacheLifetimeSeconds=60
[junit4:junit4]   2> 6923 T1068 oasc.SolrCore.initDeprecatedSupport WARNING solrconfig.xml uses deprecated <admin/gettableFiles>, Please update your config to use the ShowFileRequestHandler.
[junit4:junit4]   2> 6924 T1068 oasc.SolrCore.initDeprecatedSupport WARNING adding ShowFileRequestHandler with hidden files: [SCHEMA.XML, OLD_SYNONYMS.TXT, STOPWORDS.TXT, PROTWORDS.TXT, OPEN-EXCHANGE-RATES.JSON, SYNONYMS.TXT, CURRENCY.XML, MAPPING-ISOLATIN1ACCENT.TXT]
[junit4:junit4]   2> 6929 T1068 oass.SolrIndexSearcher.<init> Opening Searcher@3f0d664c main
[junit4:junit4]   2> 6931 T1068 oasu.CommitTracker.<init> Hard AutoCommit: disabled
[junit4:junit4]   2> 6931 T1068 oasu.CommitTracker.<init> Soft AutoCommit: disabled
[junit4:junit4]   2> 6932 T1068 oashc.SpellCheckComponent.inform Initializing spell checkers
[junit4:junit4]   2> 6940 T1068 oass.DirectSolrSpellChecker.init init: {name=direct,classname=DirectSolrSpellChecker,field=lowerfilt,minQueryLength=3}
[junit4:junit4]   2> 6999 T1115 oasc.SolrCore.registerSearcher [collection1] Registered new searcher Searcher@3f0d664c main{StandardDirectoryReader(segments_1:1)}
[junit4:junit4]   2> 7337 T1089 oascc.ZkStateReader.updateClusterState Updating cloud state from ZooKeeper... 
[junit4:junit4]   2> 7415 T1102 oascc.ZkStateReader$2.process A cluster state change has occurred - updating...
[junit4:junit4]   2> 7415 T1088 oascc.ZkStateReader$2.process A cluster state change has occurred - updating...
[junit4:junit4]   2> 7415 T1114 oascc.ZkStateReader$2.process A cluster state change has occurred - updating...
[junit4:junit4]   2> 7507 T1068 oasc.CoreContainer.register registering core: collection1
[junit4:junit4]   2> 7507 T1068 oasc.ZkController.register Register shard - core:collection1 address:http://127.0.0.1:62934/solr shardId:shard2
[junit4:junit4]   2> 7509 T1068 oascc.SolrZkClient.makePath makePath: /collections/collection1/leader_elect/shard2/election
[junit4:junit4]   2> 7548 T1073 oazs.PrepRequestProcessor.pRequest Got user-level KeeperException when processing sessionid:0x139e7c4e3490004 type:delete cxid:0x41 zxid:0xfffffffffffffffe txntype:unknown reqpath:n/a Error Path:/solr/collections/collection1/leaders/shard2 Error:KeeperErrorCode = NoNode for /solr/collections/collection1/leaders/shard2
[junit4:junit4]   2> 7585 T1068 oasc.ShardLeaderElectionContext.runLeaderProcess Running the leader process.
[junit4:junit4]   2> 7586 T1073 oazs.PrepRequestProcessor.pRequest Got user-level KeeperException when processing sessionid:0x139e7c4e3490004 type:create cxid:0x42 zxid:0xfffffffffffffffe txntype:unknown reqpath:n/a Error Path:/solr/overseer Error:KeeperErrorCode = NodeExists for /solr/overseer
[junit4:junit4]   2> 7613 T1068 oasc.ShardLeaderElectionContext.waitForReplicasToComeUp Enough replicas found to continue.
[junit4:junit4]   2> 7614 T1068 oasc.ShardLeaderElectionContext.runLeaderProcess I may be the new leader - try and sync
[junit4:junit4]   2> 7614 T1068 oasc.SyncStrategy.sync Sync replicas to http://127.0.0.1:62934/solr/collection1/
[junit4:junit4]   2> 7615 T1068 oasc.SyncStrategy.syncReplicas Sync Success - now sync replicas to me
[junit4:junit4]   2> 7615 T1068 oasc.SyncStrategy.syncToMe http://127.0.0.1:62934/solr/collection1/ has no replicas
[junit4:junit4]   2> 7616 T1068 oasc.ShardLeaderElectionContext.runLeaderProcess I am the new leader: http://127.0.0.1:62934/solr/collection1/
[junit4:junit4]   2> 7616 T1068 oascc.SolrZkClient.makePath makePath: /collections/collection1/leaders/shard2
[junit4:junit4]   2> 7638 T1073 oazs.PrepRequestProcessor.pRequest Got user-level KeeperException when processing sessionid:0x139e7c4e3490004 type:create cxid:0x4b zxid:0xfffffffffffffffe txntype:unknown reqpath:n/a Error Path:/solr/overseer Error:KeeperErrorCode = NodeExists for /solr/overseer
[junit4:junit4]   2> 7920 T1089 oascc.ZkStateReader.updateClusterState Updating cloud state from ZooKeeper... 
[junit4:junit4]   2> 7993 T1102 oascc.ZkStateReader$2.process A cluster state change has occurred - updating...
[junit4:junit4]   2> 7993 T1114 oascc.ZkStateReader$2.process A cluster state change has occurred - updating...
[junit4:junit4]   2> 7993 T1088 oascc.ZkStateReader$2.process A cluster state change has occurred - updating...
[junit4:junit4]   2> 8002 T1068 oasc.ZkController.register We are http://127.0.0.1:62934/solr/collection1/ and leader is http://127.0.0.1:62934/solr/collection1/
[junit4:junit4]   2> 8002 T1068 oasc.ZkController.register No LogReplay needed for core=collection1 baseURL=http://127.0.0.1:62934/solr
[junit4:junit4]   2> 8003 T1068 oasc.ZkController.checkRecovery I am the leader, no recovery necessary
[junit4:junit4]   2> 8006 T1068 oascc.ZkStateReader.updateClusterState Updating cloud state from ZooKeeper... 
[junit4:junit4]   2> 8007 T1068 oass.SolrDispatchFilter.init user.dir=/usr/home/hudson/hudson-slave/workspace/Lucene-Solr-Tests-trunk-java7/solr/build/solr-core/test/J1
[junit4:junit4]   2> 8007 T1068 oass.SolrDispatchFilter.init SolrDispatchFilter.init() done
[junit4:junit4]   2> 8008 T1068 oascsi.HttpClientUtil.createClient Creating new http client, config:maxConnections=128&maxConnectionsPerHost=32&followRedirects=false
[junit4:junit4]   2> 8433 T1068 oejs.Server.doStart jetty-8.1.2.v20120308
[junit4:junit4]   2> 8436 T1068 oejs.AbstractConnector.doStart Started SocketConnector@0.0.0.0:62937
[junit4:junit4]   2> 8437 T1068 oasc.SolrResourceLoader.locateSolrHome JNDI not configured for solr (NoInitialContextEx)
[junit4:junit4]   2> 8437 T1068 oasc.SolrResourceLoader.locateSolrHome using system property solr.solr.home: /usr/home/hudson/hudson-slave/workspace/Lucene-Solr-Tests-trunk-java7/solr/build/solr-core/test/J1/./solrtest-jetty3-1348213211795
[junit4:junit4]   2> 8438 T1068 oasc.SolrResourceLoader.<init> new SolrResourceLoader for deduced Solr Home: '/usr/home/hudson/hudson-slave/workspace/Lucene-Solr-Tests-trunk-java7/solr/build/solr-core/test/J1/./solrtest-jetty3-1348213211795/'
[junit4:junit4]   2> 8481 T1068 oass.SolrDispatchFilter.init SolrDispatchFilter.init()
[junit4:junit4]   2> 8481 T1068 oasc.SolrResourceLoader.locateSolrHome JNDI not configured for solr (NoInitialContextEx)
[junit4:junit4]   2> 8482 T1068 oasc.SolrResourceLoader.locateSolrHome using system property solr.solr.home: /usr/home/hudson/hudson-slave/workspace/Lucene-Solr-Tests-trunk-java7/solr/build/solr-core/test/J1/./solrtest-jetty3-1348213211795
[junit4:junit4]   2> 8482 T1068 oasc.CoreContainer$Initializer.initialize looking for solr.xml: /usr/home/hudson/hudson-slave/workspace/Lucene-Solr-Tests-trunk-java7/solr/build/solr-core/test/J1/./solrtest-jetty3-1348213211795/solr.xml
[junit4:junit4]   2> 8482 T1068 oasc.CoreContainer.<init> New CoreContainer 1638427091
[junit4:junit4]   2> 8483 T1068 oasc.CoreContainer.load Loading CoreContainer using Solr Home: '/usr/home/hudson/hudson-slave/workspace/Lucene-Solr-Tests-trunk-java7/solr/build/solr-core/test/J1/./solrtest-jetty3-1348213211795/'
[junit4:junit4]   2> 8484 T1068 oasc.SolrResourceLoader.<init> new SolrResourceLoader for directory: '/usr/home/hudson/hudson-slave/workspace/Lucene-Solr-Tests-trunk-java7/solr/build/solr-core/test/J1/./solrtest-jetty3-1348213211795/'
[junit4:junit4]   2> 8507 T1089 oascc.ZkStateReader.updateClusterState Updating cloud state from ZooKeeper... 
[junit4:junit4]   2> 8518 T1068 oasc.CoreContainer.load Registering Log Listener
[junit4:junit4]   2> 8528 T1102 oascc.ZkStateReader$2.process A cluster state change has occurred - updating...
[junit4:junit4]   2> 8528 T1088 oascc.ZkStateReader$2.process A cluster state change has occurred - updating...
[junit4:junit4]   2> 8528 T1114 oascc.ZkStateReader$2.process A cluster state change has occurred - updating...
[junit4:junit4]   2> 8535 T1068 oasc.CoreContainer.initZooKeeper Zookeeper client=127.0.0.1:62924/solr
[junit4:junit4]   2> 8535 T1068 oaz.ZooKeeper.<init> Initiating client connection, connectString=127.0.0.1:62924/solr sessionTimeout=5000 watcher=org.apache.solr.common.cloud.ConnectionManager@27b51b05
[junit4:junit4]   2> 8536 T1125 oaz.ClientCnxn$SendThread.startConnect Opening socket connection to server /127.0.0.1:62924
[junit4:junit4]   2> 8536 T1068 oascc.ConnectionManager.waitForConnected Waiting for client to connect to ZooKeeper
[junit4:junit4]   2> 8537 T1125 oaz.ClientCnxn$SendThread.primeConnection Socket connection established to localhost/127.0.0.1:62924, initiating session
[junit4:junit4]   2> 8537 T1070 oazs.NIOServerCnxn$Factory.run Accepted socket connection from /140.211.11.196:62939
[junit4:junit4]   2> 8538 T1070 oazs.NIOServerCnxn.readConnectRequest Client attempting to establish new session at /140.211.11.196:62939
[junit4:junit4]   2> 8539 T1072 oazs.NIOServerCnxn.finishSessionInit Established session 0x139e7c4e3490005 with negotiated timeout 5000 for client /140.211.11.196:62939
[junit4:junit4]   2> 8539 T1125 oaz.ClientCnxn$SendThread.readConnectResult Session establishment complete on server localhost/127.0.0.1:62924, sessionid = 0x139e7c4e3490005, negotiated timeout = 5000
[junit4:junit4]   2> 8540 T1126 oascc.ConnectionManager.process Watcher org.apache.solr.common.cloud.ConnectionManager@27b51b05 name:ZooKeeperConnection Watcher:127.0.0.1:62924/solr got event WatchedEvent state:SyncConnected type:None path:null path:null type:None
[junit4:junit4]   2> 8540 T1068 oascc.ConnectionManager.waitForConnected Client is connected to ZooKeeper
[junit4:junit4]   2> 8541 T1073 oazs.PrepRequestProcessor.pRequest Got user-level KeeperException when processing sessionid:0x139e7c4e3490005 type:create cxid:0x1 zxid:0xfffffffffffffffe txntype:unknown reqpath:n/a Error Path:/solr/overseer Error:KeeperErrorCode = NodeExists for /solr/overseer
[junit4:junit4]   2> 8542 T1073 oazs.PrepRequestProcessor.pRequest Got user-level KeeperException when processing sessionid:0x139e7c4e3490005 type:create cxid:0x2 zxid:0xfffffffffffffffe txntype:unknown reqpath:n/a Error Path:/solr/overseer Error:KeeperErrorCode = NodeExists for /solr/overseer
[junit4:junit4]   2> 8543 T1068 oasc.ZkController.createEphemeralLiveNode Register node as live in ZooKeeper:/live_nodes/127.0.0.1:62937_solr
[junit4:junit4]   2> 8544 T1073 oazs.PrepRequestProcessor.pRequest Got user-level KeeperException when processing sessionid:0x139e7c4e3490005 type:delete cxid:0x4 zxid:0xfffffffffffffffe txntype:unknown reqpath:n/a Error Path:/solr/live_nodes/127.0.0.1:62937_solr Error:KeeperErrorCode = NoNode for /solr/live_nodes/127.0.0.1:62937_solr
[junit4:junit4]   2> 8546 T1068 oascc.SolrZkClient.makePath makePath: /live_nodes/127.0.0.1:62937_solr
[junit4:junit4]   2> 8548 T1102 oascc.ZkStateReader$3.process Updating live nodes
[junit4:junit4]   2> 8548 T1088 oascc.ZkStateReader$3.process Updating live nodes
[junit4:junit4]   2> 8548 T1114 oascc.ZkStateReader$3.process Updating live nodes
[junit4:junit4]   2> 8550 T1068 oashc.HttpShardHandlerFactory.getParameter Setting socketTimeout to: 0
[junit4:junit4]   2> 8550 T1068 oashc.HttpShardHandlerFactory.getParameter Setting urlScheme to: http://
[junit4:junit4]   2> 8550 T1068 oashc.HttpShardHandlerFactory.getParameter Setting connTimeout to: 0
[junit4:junit4]   2> 8551 T1068 oashc.HttpShardHandlerFactory.getParameter Setting maxConnectionsPerHost to: 20
[junit4:junit4]   2> 8551 T1068 oashc.HttpShardHandlerFactory.getParameter Setting corePoolSize to: 0
[junit4:junit4]   2> 8552 T1068 oashc.HttpShardHandlerFactory.getParameter Setting maximumPoolSize to: 2147483647
[junit4:junit4]   2> 8552 T1068 oashc.HttpShardHandlerFactory.getParameter Setting maxThreadIdleTime to: 5
[junit4:junit4]   2> 8553 T1068 oashc.HttpShardHandlerFactory.getParameter Setting sizeOfQueue to: -1
[junit4:junit4]   2> 8553 T1068 oashc.HttpShardHandlerFactory.getParameter Setting fairnessPolicy to: false
[junit4:junit4]   2> 8554 T1068 oascsi.HttpClientUtil.createClient Creating new http client, config:maxConnectionsPerHost=20&maxConnections=10000&socketTimeout=0&connTimeout=0&retry=false
[junit4:junit4]   2> 8574 T1068 oascc.ZkStateReader.createClusterStateWatchersAndUpdate Updating cluster state from ZooKeeper... 
[junit4:junit4]   2> 8584 T1068 oasc.CoreContainer.create Creating SolrCore 'collection1' using instanceDir: /usr/home/hudson/hudson-slave/workspace/Lucene-Solr-Tests-trunk-java7/solr/build/solr-core/test/J1/./solrtest-jetty3-1348213211795/collection1
[junit4:junit4]   2> 8585 T1068 oasc.ZkController.createCollectionZkNode Check for collection zkNode:collection1
[junit4:junit4]   2> 8586 T1068 oasc.ZkController.createCollectionZkNode Collection zkNode exists
[junit4:junit4]   2> 8587 T1068 oasc.ZkController.readConfigName Load collection config from:/collections/collection1
[junit4:junit4]   2> 8589 T1068 oasc.SolrResourceLoader.<init> new SolrResourceLoader for directory: '/usr/home/hudson/hudson-slave/workspace/Lucene-Solr-Tests-trunk-java7/solr/build/solr-core/test/J1/./solrtest-jetty3-1348213211795/collection1/'
[junit4:junit4]   2> 8591 T1068 oasc.SolrResourceLoader.replaceClassLoader Adding 'file:/usr/home/hudson/hudson-slave/workspace/Lucene-Solr-Tests-trunk-java7/solr/build/solr-core/test/J1/solrtest-jetty3-1348213211795/collection1/lib/README' to classloader
[junit4:junit4]   2> 8592 T1068 oasc.SolrResourceLoader.replaceClassLoader Adding 'file:/usr/home/hudson/hudson-slave/workspace/Lucene-Solr-Tests-trunk-java7/solr/build/solr-core/test/J1/solrtest-jetty3-1348213211795/collection1/lib/classes/' to classloader
[junit4:junit4]   2> 8650 T1068 oasc.SolrConfig.<init> Using Lucene MatchVersion: LUCENE_50
[junit4:junit4]   2> 8722 T1068 oasc.SolrConfig.<init> Loaded SolrConfig: solrconfig.xml
[junit4:junit4]   2> 8824 T1068 oass.IndexSchema.readSchema Reading Solr Schema
[junit4:junit4]   2> 8832 T1068 oass.IndexSchema.readSchema Schema name=test
[junit4:junit4]   2> 9545 T1068 oass.OpenExchangeRatesOrgProvider.init Initialized with rates=open-exchange-rates.json, refreshInterval=1440.
[junit4:junit4]   2> 9556 T1068 oass.IndexSchema.readSchema default search field in schema is text
[junit4:junit4]   2> 9561 T1068 oass.IndexSchema.readSchema unique key field: id
[junit4:junit4]   2> 9575 T1068 oass.FileExchangeRateProvider.reload Reloading exchange rates from file currency.xml
[junit4:junit4]   2> 9581 T1068 oass.FileExchangeRateProvider.reload Reloading exchange rates from file currency.xml
[junit4:junit4]   2> 9587 T1068 oass.OpenExchangeRatesOrgProvider.reload Reloading exchange rates from open-exchange-rates.json
[junit4:junit4]   2> 9589 T1068 oass.OpenExchangeRatesOrgProvider.reload Reloading exchange rates from open-exchange-rates.json
[junit4:junit4]   2> 9590 T1068 oasc.SolrCore.<init> [collection1] Opening new SolrCore at /usr/home/hudson/hudson-slave/workspace/Lucene-Solr-Tests-trunk-java7/solr/build/solr-core/test/J1/./solrtest-jetty3-1348213211795/collection1/, dataDir=./org.apache.solr.cloud.BasicDistributedZk2Test-1348213203779/jetty3/
[junit4:junit4]   2> 9591 T1068 oasc.JmxMonitoredMap.<init> JMX monitoring is enabled. Adding Solr mbeans to JMX Server: com.sun.jmx.mbeanserver.JmxMBeanServer@614a962e
[junit4:junit4]   2> 9593 T1068 oasc.SolrCore.getNewIndexDir WARNING New index directory detected: old=null new=./org.apache.solr.cloud.BasicDistributedZk2Test-1348213203779/jetty3/index/
[junit4:junit4]   2> 9594 T1068 oasc.SolrCore.initIndex WARNING [collection1] Solr index directory './org.apache.solr.cloud.BasicDistributedZk2Test-1348213203779/jetty3/index' doesn't exist. Creating new index...
[junit4:junit4]   2> 9594 T1068 oasc.CachingDirectoryFactory.get return new directory for /usr/home/hudson/hudson-slave/workspace/Lucene-Solr-Tests-trunk-java7/solr/build/solr-core/test/J1/./org.apache.solr.cloud.BasicDistributedZk2Test-1348213203779/jetty3/index forceNew:false
[junit4:junit4]   2> 9628 T1068 oasc.SolrDeletionPolicy.onCommit SolrDeletionPolicy.onCommit: commits:num=1
[junit4:junit4]   2> 		commit{dir=NRTCachingDirectory(org.apache.lucene.store.NIOFSDirectory@/usr/home/hudson/hudson-slave/workspace/Lucene-Solr-Tests-trunk-java7/solr/build/solr-core/test/J1/org.apache.solr.cloud.BasicDistributedZk2Test-1348213203779/jetty3/index lockFactory=org.apache.lucene.store.NativeFSLockFactory@53bda6ee; maxCacheMB=48.0 maxMergeSizeMB=4.0),segFN=segments_1,generation=1,filenames=[segments_1]
[junit4:junit4]   2> 9628 T1068 oasc.SolrDeletionPolicy.updateCommits newest commit = 1
[junit4:junit4]   2> 9630 T1068 oasc.SolrCore.initWriters created xml: solr.XMLResponseWriter
[junit4:junit4]   2> 9632 T1068 oasup.UpdateRequestProcessorChain.init inserting DistributedUpdateProcessorFactory into updateRequestProcessorChain "dedupe"
[junit4:junit4]   2> 9633 T1068 oasup.UpdateRequestProcessorChain.init inserting DistributedUpdateProcessorFactory into updateRequestProcessorChain "dedupe-allfields"
[junit4:junit4]   2> 9633 T1068 oasup.UpdateRequestProcessorChain.init inserting DistributedUpdateProcessorFactory into updateRequestProcessorChain "stored_sig"
[junit4:junit4]   2> 9634 T1068 oasup.UpdateRequestProcessorChain.init inserting DistributedUpdateProcessorFactory into updateRequestProcessorChain "uniq-fields"
[junit4:junit4]   2> 9635 T1068 oasup.UpdateRequestProcessorChain.init inserting DistributedUpdateProcessorFactory into updateRequestProcessorChain "distrib-dup-test-chain-implicit"
[junit4:junit4]   2> 9636 T1068 oasc.RequestHandlers.initHandlersFromConfig adding lazy requestHandler: solr.ReplicationHandler
[junit4:junit4]   2> 9636 T1068 oasc.RequestHandlers.initHandlersFromConfig created /replication: solr.ReplicationHandler
[junit4:junit4]   2> 9637 T1068 oasc.RequestHandlers.initHandlersFromConfig created standard: solr.StandardRequestHandler
[junit4:junit4]   2> 9638 T1068 oasc.RequestHandlers.initHandlersFromConfig created /get: solr.RealTimeGetHandler
[junit4:junit4]   2> 9639 T1068 oasc.RequestHandlers.initHandlersFromConfig created dismax: solr.SearchHandler
[junit4:junit4]   2> 9639 T1068 oasc.RequestHandlers.initHandlersFromConfig created mock: org.apache.solr.core.MockQuerySenderListenerReqHandler
[junit4:junit4]   2> 9640 T1068 oasc.RequestHandlers.initHandlersFromConfig created /admin/: org.apache.solr.handler.admin.AdminHandlers
[junit4:junit4]   2> 9641 T1068 oasc.RequestHandlers.initHandlersFromConfig created defaults: solr.StandardRequestHandler
[junit4:junit4]   2> 9641 T1068 oasc.RequestHandlers.initHandlersFromConfig adding lazy requestHandler: solr.StandardRequestHandler
[junit4:junit4]   2> 9642 T1068 oasc.RequestHandlers.initHandlersFromConfig created lazy: solr.StandardRequestHandler
[junit4:junit4]   2> 9643 T1068 oasc.RequestHandlers.initHandlersFromConfig created /update: solr.UpdateRequestHandler
[junit4:junit4]   2> 9644 T1068 oasc.RequestHandlers.initHandlersFromConfig created /terms: org.apache.solr.handler.component.SearchHandler
[junit4:junit4]   2> 9644 T1068 oasc.RequestHandlers.initHandlersFromConfig created spellCheckCompRH: org.apache.solr.handler.component.SearchHandler
[junit4:junit4]   2> 9645 T1068 oasc.RequestHandlers.initHandlersFromConfig created spellCheckCompRH_Direct: org.apache.solr.handler.component.SearchHandler
[junit4:junit4]   2> 9646 T1068 oasc.RequestHandlers.initHandlersFromConfig created spellCheckWithWordbreak: org.apache.solr.handler.component.SearchHandler
[junit4:junit4]   2> 9647 T1068 oasc.RequestHandlers.initHandlersFromConfig created spellCheckWithWordbreak_Direct: org.apache.solr.handler.component.SearchHandler
[junit4:junit4]   2> 9647 T1068 oasc.RequestHandlers.initHandlersFromConfig created spellCheckCompRH1: org.apache.solr.handler.component.SearchHandler
[junit4:junit4]   2> 9648 T1068 oasc.RequestHandlers.initHandlersFromConfig created tvrh: org.apache.solr.handler.component.SearchHandler
[junit4:junit4]   2> 9649 T1068 oasc.RequestHandlers.initHandlersFromConfig created /mlt: solr.MoreLikeThisHandler
[junit4:junit4]   2> 9650 T1068 oasc.RequestHandlers.initHandlersFromConfig created /debug/dump: solr.DumpRequestHandler
[junit4:junit4]   2> 9654 T1068 oashl.XMLLoader.init xsltCacheLifetimeSeconds=60
[junit4:junit4]   2> 9659 T1068 oasc.SolrCore.initDeprecatedSupport WARNING solrconfig.xml uses deprecated <admin/gettableFiles>, Please update your config to use the ShowFileRequestHandler.
[junit4:junit4]   2> 9660 T1068 oasc.SolrCore.initDeprecatedSupport WARNING adding ShowFileRequestHandler with hidden files: [SCHEMA.XML, OLD_SYNONYMS.TXT, STOPWORDS.TXT, PROTWORDS.TXT, OPEN-EXCHANGE-RATES.JSON, SYNONYMS.TXT, CURRENCY.XML, MAPPING-ISOLATIN1ACCENT.TXT]
[junit4:junit4]   2> 9664 T1068 oass.SolrIndexSearcher.<init> Opening Searcher@11fb36b main
[junit4:junit4]   2> 9666 T1068 oasu.CommitTracker.<init> Hard AutoCommit: disabled
[junit4:junit4]   2> 9666 T1068 oasu.CommitTracker.<init> Soft AutoCommit: disabled
[junit4:junit4]   2> 9667 T1068 oashc.SpellCheckComponent.inform Initializing spell checkers
[junit4:junit4]   2> 9675 T1068 oass.DirectSolrSpellChecker.init init: {name=direct,classname=DirectSolrSpellChecker,field=lowerfilt,minQueryLength=3}
[junit4:junit4]   2> 9737 T1127 oasc.SolrCore.registerSearcher [collection1] Registered new searcher Searcher@11fb36b main{StandardDirectoryReader(segments_1:1)}
[junit4:junit4]   2> 10036 T1089 oascc.ZkStateReader.updateClusterState Updating cloud state from ZooKeeper... 
[junit4:junit4]   2> 10051 T1102 oascc.ZkStateReader$2.process A cluster state change has occurred - updating...
[junit4:junit4]   2> 10051 T1126 oascc.ZkStateReader$2.process A cluster state change has occurred - updating...
[junit4:junit4]   2> 10051 T1088 oascc.ZkStateReader$2.process A cluster state change has occurred - updating...
[junit4:junit4]   2> 10051 T1114 oascc.ZkStateReader$2.process A cluster state change has occurred - updating...
[junit4:junit4]   2> 10246 T1068 oasc.CoreContainer.register registering core: collection1
[junit4:junit4]   2> 10246 T1068 oasc.ZkController.register Register shard - core:collection1 address:http://127.0.0.1:62937/solr shardId:shard1
[junit4:junit4]   2> 10250 T1068 oasc.ZkController.register We are http://127.0.0.1:62937/solr/collection1/ and leader is http://127.0.0.1:62930/solr/collection1/
[junit4:junit4]   2> 10250 T1068 oasc.ZkController.register No LogReplay needed for core=collection1 baseURL=http://127.0.0.1:62937/solr
[junit4:junit4]   2> 10251 T1068 oasc.ZkController.checkRecovery Core needs to recover:collection1
[junit4:junit4]   2> 10251 T1068 oasu.DefaultSolrCoreState.doRecovery Running recovery - first canceling any ongoing recovery
[junit4:junit4]   2> ASYNC  NEW_CORE C64 name=collection1 org.apache.solr.core.SolrCore@482c1da url=http://127.0.0.1:62937/solr/collection1 node=127.0.0.1:62937_solr
[junit4:junit4]   2> 10252 T1128 C64 P62937 oasc.RecoveryStrategy.run Starting recovery process.  core=collection1 recoveringAfterStartup=true
[junit4:junit4]   2> 10252 T1128 C64 P62937 oasc.RecoveryStrategy.doRecovery ###### startupVersions=[]
[junit4:junit4]   2> 10252 T1068 oascc.ZkStateReader.updateClusterState Updating cloud state from ZooKeeper... 
[junit4:junit4]   2> 10254 T1128 C64 P62937 oasc.RecoveryStrategy.doRecovery Attempting to PeerSync from http://127.0.0.1:62930/solr/collection1/ core=collection1 - recoveringAfterStartup=true
[junit4:junit4]   2> 10254 T1128 C64 P62937 oasu.PeerSync.sync PeerSync: core=collection1 url=http://127.0.0.1:62937/solr START replicas=[http://127.0.0.1:62930/solr/collection1/] nUpdates=100
[junit4:junit4]   2> 10254 T1068 oass.SolrDispatchFilter.init user.dir=/usr/home/hudson/hudson-slave/workspace/Lucene-Solr-Tests-trunk-java7/solr/build/solr-core/test/J1
[junit4:junit4]   2> 10254 T1128 C64 P62937 oasu.PeerSync.sync WARNING no frame of reference to tell of we've missed updates
[junit4:junit4]   2> 10255 T1068 oass.SolrDispatchFilter.init SolrDispatchFilter.init() done
[junit4:junit4]   2> 10255 T1128 C64 P62937 oasc.RecoveryStrategy.doRecovery PeerSync Recovery was not successful - trying replication. core=collection1
[junit4:junit4]   2> 10256 T1128 C64 P62937 oasc.RecoveryStrategy.doRecovery Starting Replication Recovery. core=collection1
[junit4:junit4]   2> 10256 T1068 oascsi.HttpClientUtil.createClient Creating new http client, config:maxConnections=128&maxConnectionsPerHost=32&followRedirects=false
[junit4:junit4]   2> 10256 T1128 C64 P62937 oascsi.HttpClientUtil.createClient Creating new http client, config:maxConnections=128&maxConnectionsPerHost=32&followRedirects=false
[junit4:junit4]   2> ASYNC  NEW_CORE C65 name=collection1 org.apache.solr.core.SolrCore@7c7e6992 url=http://127.0.0.1:62930/solr/collection1 node=127.0.0.1:62930_solr
[junit4:junit4]   2> 10265 T1094 C65 P62930 REQ /get {distrib=false&qt=/get&wt=javabin&version=2&getVersions=100} status=0 QTime=0 
[junit4:junit4]   2> 10557 T1089 oascc.ZkStateReader.updateClusterState Updating cloud state from ZooKeeper... 
[junit4:junit4]   2> 10576 T1088 oascc.ZkStateReader$2.process A cluster state change has occurred - updating...
[junit4:junit4]   2> 10576 T1114 oascc.ZkStateReader$2.process A cluster state change has occurred - updating...
[junit4:junit4]   2> 10576 T1126 oascc.ZkStateReader$2.process A cluster state change has occurred - updating...
[junit4:junit4]   2> 10576 T1102 oascc.ZkStateReader$2.process A cluster state change has occurred - updating...
[junit4:junit4]   2> 10688 T1068 oejs.Server.doStart jetty-8.1.2.v20120308
[junit4:junit4]   2> 10691 T1068 oejs.AbstractConnector.doStart Started SocketConnector@0.0.0.0:62944
[junit4:junit4]   2> 10692 T1068 oasc.SolrResourceLoader.locateSolrHome JNDI not configured for solr (NoInitialContextEx)
[junit4:junit4]   2> 10692 T1068 oasc.SolrResourceLoader.locateSolrHome using system property solr.solr.home: /usr/home/hudson/hudson-slave/workspace/Lucene-Solr-Tests-trunk-java7/solr/build/solr-core/test/J1/./solrtest-jetty4-1348213214051
[junit4:junit4]   2> 10693 T1068 oasc.SolrResourceLoader.<init> new SolrResourceLoader for deduced Solr Home: '/usr/home/hudson/hudson-slave/workspace/Lucene-Solr-Tests-trunk-java7/solr/build/solr-core/test/J1/./solrtest-jetty4-1348213214051/'
[junit4:junit4]   2> 10735 T1068 oass.SolrDispatchFilter.init SolrDispatchFilter.init()
[junit4:junit4]   2> 10735 T1068 oasc.SolrResourceLoader.locateSolrHome JNDI not configured for solr (NoInitialContextEx)
[junit4:junit4]   2> 10736 T1068 oasc.SolrResourceLoader.locateSolrHome using system property solr.solr.home: /usr/home/hudson/hudson-slave/workspace/Lucene-Solr-Tests-trunk-java7/solr/build/solr-core/test/J1/./solrtest-jetty4-1348213214051
[junit4:junit4]   2> 10736 T1068 oasc.CoreContainer$Initializer.initialize looking for solr.xml: /usr/home/hudson/hudson-slave/workspace/Lucene-Solr-Tests-trunk-java7/solr/build/solr-core/test/J1/./solrtest-jetty4-1348213214051/solr.xml
[junit4:junit4]   2> 10737 T1068 oasc.CoreContainer.<init> New CoreContainer 730099483
[junit4:junit4]   2> 10737 T1068 oasc.CoreContainer.load Loading CoreContainer using Solr Home: '/usr/home/hudson/hudson-slave/workspace/Lucene-Solr-Tests-trunk-java7/solr/build/solr-core/test/J1/./solrtest-jetty4-1348213214051/'
[junit4:junit4]   2> 10738 T1068 oasc.SolrResourceLoader.<init> new SolrResourceLoader for directory: '/usr/home/hudson/hudson-slave/workspace/Lucene-Solr-Tests-trunk-java7/solr/build/solr-core/test/J1/./solrtest-jetty4-1348213214051/'
[junit4:junit4]   2> 10771 T1068 oasc.CoreContainer.load Registering Log Listener
[junit4:junit4]   2> 10788 T1068 oasc.CoreContainer.initZooKeeper Zookeeper client=127.0.0.1:62924/solr
[junit4:junit4]   2> 10788 T1068 oaz.ZooKeeper.<init> Initiating client connection, connectString=127.0.0.1:62924/solr sessionTimeout=5000 watcher=org.apache.solr.common.cloud.ConnectionManager@2645b48a
[junit4:junit4]   2> 10789 T1139 oaz.ClientCnxn$SendThread.startConnect Opening socket connection to server /127.0.0.1:62924
[junit4:junit4]   2> 10789 T1068 oascc.ConnectionManager.waitForConnected Waiting for client to connect to ZooKeeper
[junit4:junit4]   2> 10791 T1139 oaz.ClientCnxn$SendThread.primeConnection Socket connection established to localhost/127.0.0.1:62924, initiating session
[junit4:junit4]   2> 10791 T1070 oazs.NIOServerCnxn$Factory.run Accepted socket connection from /140.211.11.196:62945
[junit4:junit4]   2> 10791 T1070 oazs.NIOServerCnxn.readConnectRequest Client attempting to establish new session at /140.211.11.196:62945
[junit4:junit4]   2> 10794 T1072 oazs.NIOServerCnxn.finishSessionInit Established session 0x139e7c4e3490006 with negotiated timeout 5000 for client /140.211.11.196:62945
[junit4:junit4]   2> 10794 T1139 oaz.ClientCnxn$SendThread.readConnectResult Session establishment complete on server localhost/127.0.0.1:62924, sessionid = 0x139e7c4e3490006, negotiated timeout = 5000
[junit4:junit4]   2> 10794 T1140 oascc.ConnectionManager.process Watcher org.apache.solr.common.cloud.ConnectionManager@2645b48a name:ZooKeeperConnection Watcher:127.0.0.1:62924/solr got event WatchedEvent state:SyncConnected type:None path:null path:null type:None
[junit4:junit4]   2> 10794 T1068 oascc.ConnectionManager.waitForConnected Client is connected to ZooKeeper
[junit4:junit4]   2> 10795 T1073 oazs.PrepRequestProcessor.pRequest Got user-level KeeperException when processing sessionid:0x139e7c4e3490006 type:create cxid:0x1 zxid:0xfffffffffffffffe txntype:unknown reqpath:n/a Error Path:/solr/overseer Error:KeeperErrorCode = NodeExists for /solr/overseer
[junit4:junit4]   2> 10797 T1073 oazs.PrepRequestProcessor.pRequest Got user-level KeeperException when processing sessionid:0x139e7c4e3490006 type:create cxid:0x2 zxid:0xfffffffffffffffe txntype:unknown reqpath:n/a Error Path:/solr/overseer Error:KeeperErrorCode = NodeExists for /solr/overseer
[junit4:junit4]   2> 10806 T1068 oasc.ZkController.createEphemeralLiveNode Register node as live in ZooKeeper:/live_nodes/127.0.0.1:62944_solr
[junit4:junit4]   2> 10807 T1073 oazs.PrepRequestProcessor.pRequest Got user-level KeeperException when processing sessionid:0x139e7c4e3490006 type:delete cxid:0x4 zxid:0xfffffffffffffffe txntype:unknown reqpath:n/a Error Path:/solr/live_nodes/127.0.0.1:62944_solr Error:KeeperErrorCode = NoNode for /solr/live_nodes/127.0.0.1:62944_solr
[junit4:junit4]   2> 10808 T1068 oascc.SolrZkClient.makePath makePath: /live_nodes/127.0.0.1:62944_solr
[junit4:junit4]   2> 10810 T1126 oascc.ZkStateReader$3.process Updating live nodes
[junit4:junit4]   2> 10810 T1102 oascc.ZkStateReader$3.process Updating live nodes
[junit4:junit4]   2> 10810 T1114 oascc.ZkStateReader$3.process Updating live nodes
[junit4:junit4]   2> 10810 T1088 oascc.ZkStateReader$3.process Updating live nodes
[junit4:junit4]   2> 10811 T1068 oashc.HttpShardHandlerFactory.getParameter Setting socketTimeout to: 0
[junit4:junit4]   2> 10812 T1068 oashc.HttpShardHandlerFactory.getParameter Setting urlScheme to: http://
[junit4:junit4]   2> 10812 T1068 oashc.HttpShardHandlerFactory.getParameter Setting connTimeout to: 0
[junit4:junit4]   2> 10813 T1068 oashc.HttpShardHandlerFactory.getParameter Setting maxConnectionsPerHost to: 20
[junit4:junit4]   2> 10813 T1068 oashc.HttpShardHandlerFactory.getParameter Setting corePoolSize to: 0
[junit4:junit4]   2> 10814 T1068 oashc.HttpShardHandlerFactory.getParameter Setting maximumPoolSize to: 2147483647
[junit4:junit4]   2> 10814 T1068 oashc.HttpShardHandlerFactory.getParameter Setting maxThreadIdleTime to: 5
[junit4:junit4]   2> 10815 T1068 oashc.HttpShardHandlerFactory.getParameter Setting sizeOfQueue to: -1
[junit4:junit4]   2> 10815 T1068 oashc.HttpShardHandlerFactory.getParameter Setting fairnessPolicy to: false
[junit4:junit4]   2> 10816 T1068 oascsi.HttpClientUtil.createClient Creating new http client, config:maxConnectionsPerHost=20&maxConnections=10000&socketTimeout=0&connTimeout=0&retry=false
[junit4:junit4]   2> 10835 T1068 oascc.ZkStateReader.createClusterStateWatchersAndUpdate Updating cluster state from ZooKeeper... 
[junit4:junit4]   2> 10842 T1068 oasc.CoreContainer.create Creating SolrCore 'collection1' using instanceDir: /usr/home/hudson/hudson-slave/workspace/Lucene-Solr-Tests-trunk-java7/solr/build/solr-core/test/J1/./solrtest-jetty4-1348213214051/collection1
[junit4:junit4]   2> 10842 T1068 oasc.ZkController.createCollectionZkNode Check for collection zkNode:collection1
[junit4:junit4]   2> 10843 T1068 oasc.ZkController.createCollectionZkNode Collection zkNode exists
[junit4:junit4]   2> 10844 T1068 oasc.ZkController.readConfigName Load collection config from:/collections/collection1
[junit4:junit4]   2> 10845 T1068 oasc.SolrResourceLoader.<init> new SolrResourceLoader for directory: '/usr/home/hudson/hudson-slave/workspace/Lucene-Solr-Tests-trunk-java7/solr/build/solr-core/test/J1/./solrtest-jetty4-1348213214051/collection1/'
[junit4:junit4]   2> 10847 T1068 oasc.SolrResourceLoader.replaceClassLoader Adding 'file:/usr/home/hudson/hudson-slave/workspace/Lucene-Solr-Tests-trunk-java7/solr/build/solr-core/test/J1/solrtest-jetty4-1348213214051/collection1/lib/classes/' to classloader
[junit4:junit4]   2> 10848 T1068 oasc.SolrResourceLoader.replaceClassLoader Adding 'file:/usr/home/hudson/hudson-slave/workspace/Lucene-Solr-Tests-trunk-java7/solr/build/solr-core/test/J1/solrtest-jetty4-1348213214051/collection1/lib/README' to classloader
[junit4:junit4]   2> 10901 T1068 oasc.SolrConfig.<init> Using Lucene MatchVersion: LUCENE_50
[junit4:junit4]   2> 10974 T1068 oasc.SolrConfig.<init> Loaded SolrConfig: solrconfig.xml
[junit4:junit4]   2> 11075 T1068 oass.IndexSchema.readSchema Reading Solr Schema
[junit4:junit4]   2> 11085 T1068 oass.IndexSchema.readSchema Schema name=test
[junit4:junit4]   2> 11781 T1068 oass.OpenExchangeRatesOrgProvider.init Initialized with rates=open-exchange-rates.json, refreshInterval=1440.
[junit4:junit4]   2> 11792 T1068 oass.IndexSchema.readSchema default search field in schema is text
[junit4:junit4]   2> 11797 T1068 oass.IndexSchema.readSchema unique key field: id
[junit4:junit4]   2> 11811 T1068 oass.FileExchangeRateProvider.reload Reloading exchange rates from file currency.xml
[junit4:junit4]   2> 11817 T1068 oass.FileExchangeRateProvider.reload Reloading exchange rates from file currency.xml
[junit4:junit4]   2> 11822 T1068 oass.OpenExchangeRatesOrgProvider.reload Reloading exchange rates from open-exchange-rates.json
[junit4:junit4]   2> 11823 T1068 oass.OpenExchangeRatesOrgProvider.reload Reloading exchange rates from open-exchange-rates.json
[junit4:junit4]   2> 11825 T1068 oasc.SolrCore.<init> [collection1] Opening new SolrCore at /usr/home/hudson/hudson-slave/workspace/Lucene-Solr-Tests-trunk-java7/solr/build/solr-core/test/J1/./solrtest-jetty4-1348213214051/collection1/, dataDir=./org.apache.solr.cloud.BasicDistributedZk2Test-1348213203779/jetty4/
[junit4:junit4]   2> 11825 T1068 oasc.JmxMonitoredMap.<init> JMX monitoring is enabled. Adding Solr mbeans to JMX Server: com.sun.jmx.mbeanserver.JmxMBeanServer@614a962e
[junit4:junit4]   2> 11827 T1068 oasc.SolrCore.getNewIndexDir WARNING New index directory detected: old=null new=./org.apache.solr.cloud.BasicDistributedZk2Test-1348213203779/jetty4/index/
[junit4:junit4]   2> 11828 T1068 oasc.SolrCore.initIndex WARNING [collection1] Solr index directory './org.apache.solr.cloud.BasicDistributedZk2Test-1348213203779/jetty4/index' doesn't exist. Creating new index...
[junit4:junit4]   2> 11829 T1068 oasc.CachingDirectoryFactory.get return new directory for /usr/home/hudson/hudson-slave/workspace/Lucene-Solr-Tests-trunk-java7/solr/build/solr-core/test/J1/./org.apache.solr.cloud.BasicDistributedZk2Test-1348213203779/jetty4/index forceNew:false
[junit4:junit4]   2> 11836 T1068 oasc.SolrDeletionPolicy.onCommit SolrDeletionPolicy.onCommit: commits:num=1
[junit4:junit4]   2> 		commit{dir=NRTCachingDirectory(org.apache.lucene.store.NIOFSDirectory@/usr/home/hudson/hudson-slave/workspace/Lucene-Solr-Tests-trunk-java7/solr/build/solr-core/test/J1/org.apache.solr.cloud.BasicDistributedZk2Test-1348213203779/jetty4/index lockFactory=org.apache.lucene.store.NativeFSLockFactory@16a7fd5; maxCacheMB=48.0 maxMergeSizeMB=4.0),segFN=segments_1,generation=1,filenames=[segments_1]
[junit4:junit4]   2> 11837 T1068 oasc.SolrDeletionPolicy.updateCommits newest commit = 1
[junit4:junit4]   2> 11838 T1068 oasc.SolrCore.initWriters created xml: solr.XMLResponseWriter
[junit4:junit4]   2> 11841 T1068 oasup.UpdateRequestProcessorChain.init inserting DistributedUpdateProcessorFactory into updateRequestProcessorChain "dedupe"
[junit4:junit4]   2> 11841 T1068 oasup.UpdateRequestProcessorChain.init inserting DistributedUpdateProcessorFactory into updateRequestProcessorChain "dedupe-allfields"
[junit4:junit4]   2> 11842 T1068 oasup.UpdateRequestProcessorChain.init inserting DistributedUpdateProcessorFactory into updateRequestProcessorChain "stored_sig"
[junit4:junit4]   2> 11842 T1068 oasup.UpdateRequestProcessorChain.init inserting DistributedUpdateProcessorFactory into updateRequestProcessorChain "uniq-fields"
[junit4:junit4]   2> 11843 T1068 oasup.UpdateRequestProcessorChain.init inserting DistributedUpdateProcessorFactory into updateRequestProcessorChain "distrib-dup-test-chain-implicit"
[junit4:junit4]   2> 11844 T1068 oasc.RequestHandlers.initHandlersFromConfig adding lazy requestHandler: solr.ReplicationHandler
[junit4:junit4]   2> 11844 T1068 oasc.RequestHandlers.initHandlersFromConfig created /replication: solr.ReplicationHandler
[junit4:junit4]   2> 11845 T1068 oasc.RequestHandlers.initHandlersFromConfig created standard: solr.StandardRequestHandler
[junit4:junit4]   2> 11846 T1068 oasc.RequestHandlers.initHandlersFromConfig created /get: solr.RealTimeGetHandler
[junit4:junit4]   2> 11847 T1068 oasc.RequestHandlers.initHandlersFromConfig created dismax: solr.SearchHandler
[junit4:junit4]   2> 11848 T1068 oasc.RequestHandlers.initHandlersFromConfig created mock: org.apache.solr.core.MockQuerySenderListenerReqHandler
[junit4:junit4]   2> 11848 T1068 oasc.RequestHandlers.initHandlersFromConfig created /admin/: org.apache.solr.handler.admin.AdminHandlers
[junit4:junit4]   2> 11849 T1068 oasc.RequestHandlers.initHandlersFromConfig created defaults: solr.StandardRequestHandler
[junit4:junit4]   2> 11850 T1068 oasc.RequestHandlers.initHandlersFromConfig adding lazy requestHandler: solr.StandardRequestHandler
[junit4:junit4]   2> 11850 T1068 oasc.RequestHandlers.initHandlersFromConfig created lazy: solr.StandardRequestHandler
[junit4:junit4]   2> 11851 T1068 oasc.RequestHandlers.initHandlersFromConfig created /update: solr.UpdateRequestHandler
[junit4:junit4]   2> 11852 T1068 oasc.RequestHandlers.initHandlersFromConfig created /terms: org.apache.solr.handler.component.SearchHandler
[junit4:junit4]   2> 11853 T1068 oasc.RequestHandlers.initHandlersFromConfig created spellCheckCompRH: org.apache.solr.handler.component.SearchHandler
[junit4:junit4]   2> 11853 T1068 oasc.RequestHandlers.initHandlersFromConfig created spellCheckCompRH_Direct: org.apache.solr.handler.component.SearchHandler
[junit4:junit4]   2> 11854 T1068 oasc.RequestHandlers.initHandlersFromConfig created spellCheckWithWordbreak: org.apache.solr.handler.component.SearchHandler
[junit4:junit4]   2> 11855 T1068 oasc.RequestHandlers.initHandlersFromConfig created spellCheckWithWordbreak_Direct: org.apache.solr.handler.component.SearchHandler
[junit4:junit4]   2> 11856 T1068 oasc.RequestHandlers.initHandlersFromConfig created spellCheckCompRH1: org.apache.solr.handler.component.SearchHandler
[junit4:junit4]   2> 11856 T1068 oasc.RequestHandlers.initHandlersFromConfig created tvrh: org.apache.solr.handler.component.SearchHandler
[junit4:junit4]   2> 11857 T1068 oasc.RequestHandlers.initHandlersFromConfig created /mlt: solr.MoreLikeThisHandler
[junit4:junit4]   2> 11858 T1068 oasc.RequestHandlers.initHandlersFromConfig created /debug/dump: solr.DumpRequestHandler
[junit4:junit4]   2> 11862 T1068 oashl.XMLLoader.init xsltCacheLifetimeSeconds=60
[junit4:junit4]   2> 11867 T1068 oasc.SolrCore.initDeprecatedSupport WARNING solrconfig.xml uses deprecated <admin/gettableFiles>, Please update your config to use the ShowFileRequestHandler.
[junit4:junit4]   2> 11868 T1068 oasc.SolrCore.initDeprecatedSupport WARNING adding ShowFileRequestHandler with hidden files: [SCHEMA.XML, OLD_SYNONYMS.TXT, STOPWORDS.TXT, PROTWORDS.TXT, OPEN-EXCHANGE-RATES.JSON, SYNONYMS.TXT, CURRENCY.XML, MAPPING-ISOLATIN1ACCENT.TXT]
[junit4:junit4]   2> 11872 T1068 oass.SolrIndexSearcher.<init> Opening Searcher@767437bf main
[junit4:junit4]   2> 11874 T1068 oasu.CommitTracker.<init> Hard AutoCommit: disabled
[junit4:junit4]   2> 11874 T1068 oasu.CommitTracker.<init> Soft AutoCommit: disabled
[junit4:junit4]   2> 11875 T1068 oashc.SpellCheckComponent.inform Initializing spell checkers
[junit4:junit4]   2> 11883 T1068 oass.DirectSolrSpellChecker.init init: {name=direct,classname=DirectSolrSpellChecker,field=lowerfilt,minQueryLength=3}
[junit4:junit4]   2> 11946 T1141 oasc.SolrCore.registerSearcher [collection1] Registered new searcher Searcher@767437bf main{StandardDirectoryReader(segments_1:1)}
[junit4:junit4]   2> 12084 T1089 oascc.ZkStateReader.updateClusterState Updating cloud state from ZooKeeper... 
[junit4:junit4]   2> 12099 T1102 oascc.ZkStateReader$2.process A cluster state change has occurred - updating...
[junit4:junit4]   2> 12099 T1140 oascc.ZkStateReader$2.process A cluster state change has occurred - updating...
[junit4:junit4]   2> 12099 T1126 oascc.ZkStateReader$2.process A cluster state change has occurred - updating...
[junit4:junit4]   2> 12099 T1114 oascc.ZkStateReader$2.process A cluster state change has occurred - updating...
[junit4:junit4]   2> 12099 T1088 oascc.ZkStateReader$2.process A cluster state change has occurred - updating...
[junit4:junit4]   2> 12454 T1068 oasc.CoreContainer.register registering core: collection1
[junit4:junit4]   2> 12454 T1068 oasc.ZkController.register Register shard - core:collection1 address:http://127.0.0.1:62944/solr shardId:shard2
[junit4:junit4]   2> 12460 T1068 oasc.ZkController.register We are http://127.0.0.1:62944/solr/collection1/ and leader is http://127.0.0.1:62934/solr/collection1/
[junit4:junit4]   2> 12461 T1068 oasc.ZkController.register No LogReplay needed for core=collection1 baseURL=http://127.0.0.1:62944/solr
[junit4:junit4]   2> 12461 T1068 oasc.ZkController.checkRecovery Core needs to recover:collection1
[junit4:junit4]   2> 12462 T1068 oasu.DefaultSolrCoreState.doRecovery Running recovery - first canceling any ongoing recovery
[junit4:junit4]   2> ASYNC  NEW_CORE C66 name=collection1 org.apache.solr.core.SolrCore@77937fb7 url=http://127.0.0.1:62944/solr/collection1 node=127.0.0.1:62944_solr
[junit4:junit4]   2> 12463 T1142 C66 P62944 oasc.RecoveryStrategy.run Starting recovery process.  core=collection1 recoveringAfterStartup=true
[junit4:junit4]   2> 12463 T1142 C66 P62944 oasc.RecoveryStrategy.doRecovery ###### startupVersions=[]
[junit4:junit4]   2> 12463 T1068 oascc.ZkStateReader.updateClusterState Updating cloud state from ZooKeeper... 
[junit4:junit4]   2> 12465 T1142 C66 P62944 oasc.RecoveryStrategy.doRecovery Attempting to PeerSync from http://127.0.0.1:62934/solr/collection1/ core=collection1 - recoveringAfterStartup=true
[junit4:junit4]   2> 12465 T1142 C66 P62944 oasu.PeerSync.sync PeerSync: core=collection1 url=http://127.0.0.1:62944/solr START replicas=[http://127.0.0.1:62934/solr/collection1/] nUpdates=100
[junit4:junit4]   2> 12465 T1068 oass.SolrDispatchFilter.init user.dir=/usr/home/hudson/hudson-slave/workspace/Lucene-Solr-Tests-trunk-java7/solr/build/solr-core/test/J1
[junit4:junit4]   2> 12465 T1142 C66 P62944 oasu.PeerSync.sync WARNING no frame of reference to tell of we've missed updates
[junit4:junit4]   2> 12466 T1142 C66 P62944 oasc.RecoveryStrategy.doRecovery PeerSync Recovery was not successful - trying replication. core=collection1
[junit4:junit4]   2> 12466 T1068 oass.SolrDispatchFilter.init SolrDispatchFilter.init() done
[junit4:junit4]   2> 12467 T1142 C66 P62944 oasc.RecoveryStrategy.doRecovery Starting Replication Recovery. core=collection1
[junit4:junit4]   2> 12467 T1142 C66 P62944 oascsi.HttpClientUtil.createClient Creating new http client, config:maxConnections=128&maxConnectionsPerHost=32&followRedirects=false
[junit4:junit4]   2> 12467 T1068 oascsi.HttpClientUtil.createClient Creating new http client, config:maxConnections=128&maxConnectionsPerHost=32&followRedirects=false
[junit4:junit4]   2> ASYNC  NEW_CORE C67 name=collection1 org.apache.solr.core.SolrCore@178cc463 url=http://127.0.0.1:62934/solr/collection1 node=127.0.0.1:62934_solr
[junit4:junit4]   2> 12476 T1106 C67 P62934 REQ /get {distrib=false&qt=/get&wt=javabin&version=2&getVersions=100} status=0 QTime=1 
[junit4:junit4]   2> 12490 T1068 oaz.ZooKeeper.<init> Initiating client connection, connectString=127.0.0.1:62924/solr sessionTimeout=10000 watcher=org.apache.solr.common.cloud.ConnectionManager@7dc91368
[junit4:junit4]   2> 12491 T1144 oaz.ClientCnxn$SendThread.startConnect Opening socket connection to server /127.0.0.1:62924
[junit4:junit4]   2> 12491 T1068 oascc.ConnectionManager.waitForConnected Waiting for client to connect to ZooKeeper
[junit4:junit4]   2> 12492 T1144 oaz.ClientCnxn$SendThread.primeConnection Socket connection established to localhost/127.0.0.1:62924, initiating session
[junit4:junit4]   2> 12492 T1070 oazs.NIOServerCnxn$Factory.run Accepted socket connection from /140.211.11.196:62948
[junit4:junit4]   2> 12492 T1070 oazs.NIOServerCnxn.readConnectRequest Client attempting to establish new session at /140.211.11.196:62948
[junit4:junit4]   2> 12494 T1072 oazs.NIOServerCnxn.finishSessionInit Established session 0x139e7c4e3490007 with negotiated timeout 10000 for client /140.211.11.196:62948
[junit4:junit4]   2> 12494 T1144 oaz.ClientCnxn$SendThread.readConnectResult Session establishment complete on server localhost/127.0.0.1:62924, sessionid = 0x139e7c4e3490007, negotiated timeout = 10000
[junit4:junit4]   2> 12494 T1145 oascc.ConnectionManager.process Watcher org.apache.solr.common.cloud.ConnectionManager@7dc91368 name:ZooKeeperConnection Watcher:127.0.0.1:62924/solr got event WatchedEvent state:SyncConnected type:None path:null path:null type:None
[junit4:junit4]   2> 12494 T1068 oascc.ConnectionManager.waitForConnected Client is connected to ZooKeeper
[junit4:junit4]   2> 12495 T1068 oascc.ZkStateReader.createClusterStateWatchersAndUpdate Updating cluster state from ZooKeeper... 
[junit4:junit4]   2> 12497 T1068 oasc.ChaosMonkey.monkeyLog monkey: init - expire sessions:true cause connection loss:true
[junit4:junit4]   2> 12498 T1068 oascsi.HttpClientUtil.createClient Creating new http client, config:
[junit4:junit4]   2> 12509 T1068 oascc.ZkStateReader.updateClusterState Updating cloud state from ZooKeeper... 
[junit4:junit4]   2> ASYNC  NEW_CORE C68 name=collection1 org.apache.solr.core.SolrCore@1afceba3 url=http://127.0.0.1:62928/solr/collection1 node=127.0.0.1:62928_solr
[junit4:junit4]   2> 12522 T1080 C68 P62928 oasc.SolrDeletionPolicy.onInit SolrDeletionPolicy.onInit: commits:num=1
[junit4:junit4]   2> 		commit{dir=NRTCachingDirectory(org.apache.lucene.store.NIOFSDirectory@/usr/home/hudson/hudson-slave/workspace/Lucene-Solr-Tests-trunk-java7/solr/build/solr-core/test/J1/org.apache.solr.cloud.BasicDistributedZk2Test-1348213203779/control/data/index lockFactory=org.apache.lucene.store.NativeFSLockFactory@75750677; maxCacheMB=48.0 maxMergeSizeMB=4.0),segFN=segments_1,generation=1,filenames=[segments_1]
[junit4:junit4]   2> 12523 T1080 C68 P62928 oasc.SolrDeletionPolicy.updateCommits newest commit = 1
[junit4:junit4]   2> 12527 T1080 C68 P62928 /update {wt=javabin&version=2} {add=[1 (1413704021485551616)]} 0 9
[junit4:junit4]   2> 12528 T1068 oaz.ZooKeeper.<init> Initiating client connection, connectString=127.0.0.1:62924/solr sessionTimeout=10000 watcher=org.apache.solr.common.cloud.ConnectionManager@736abf74
[junit4:junit4]   2> 12529 T1146 oaz.ClientCnxn$SendThread.startConnect Opening socket connection to server /127.0.0.1:62924
[junit4:junit4]   2> 12529 T1068 oascc.ConnectionManager.waitForConnected Waiting for client to connect to ZooKeeper
[junit4:junit4]   2> 12530 T1146 oaz.ClientCnxn$SendThread.primeConnection Socket connection established to localhost/127.0.0.1:62924, initiating session
[junit4:junit4]   2> 12530 T1070 oazs.NIOServerCnxn$Factory.run Accepted socket connection from /140.211.11.196:62950
[junit4:junit4]   2> 12530 T1070 oazs.NIOServerCnxn.readConnectRequest Client attempting to establish new session at /140.211.11.196:62950
[junit4:junit4]   2> 12531 T1072 oazs.NIOServerCnxn.finishSessionInit Established session 0x139e7c4e3490008 with negotiated timeout 10000 for client /140.211.11.196:62950
[junit4:junit4]   2> 12531 T1146 oaz.ClientCnxn$SendThread.readConnectResult Session establishment complete on server localhost/127.0.0.1:62924, sessionid = 0x139e7c4e3490008, negotiated timeout = 10000
[junit4:junit4]   2> 12532 T1147 oascc.ConnectionManager.process Watcher org.apache.solr.common.cloud.ConnectionManager@736abf74 name:ZooKeeperConnection Watcher:127.0.0.1:62924/solr got event WatchedEvent state:SyncConnected type:None path:null path:null type:None
[junit4:junit4]   2> 12532 T1068 oascc.ConnectionManager.waitForConnected Client is connected to ZooKeeper
[junit4:junit4]   2> 12533 T1068 oascc.ZkStateReader.createClusterStateWatchersAndUpdate Updating cluster state from ZooKeeper... 
[junit4:junit4]   2> 12542 T1096 C65 P62930 oasc.SolrDeletionPolicy.onInit SolrDeletionPolicy.onInit: commits:num=1
[junit4:junit4]   2> 		commit{dir=NRTCachingDirectory(org.apache.lucene.store.NIOFSDirectory@/usr/home/hudson/hudson-slave/workspace/Lucene-Solr-Tests-trunk-java7/solr/build/solr-core/test/J1/org.apache.solr.cloud.BasicDistributedZk2Test-1348213203779/jetty1/index lockFactory=org.apache.lucene.store.NativeFSLockFactory@4b038860; maxCacheMB=48.0 maxMergeSizeMB=4.0),segFN=segments_1,generation=1,filenames=[segments_1]
[junit4:junit4]   2> 12543 T1096 C65 P62930 oasc.SolrDeletionPolicy.updateCommits newest commit = 1
[junit4:junit4]   2>  C64_STATE=coll:collection1 core:collection1 props:{shard=shard1, roles=null, state=recovering, core=collection1, collection=collection1, node_name=127.0.0.1:62937_solr, base_url=http://127.0.0.1:62937/solr}
[junit4:junit4]   2> 12560 T1118 C64 P62937 oasc.SolrDeletionPolicy.onInit SolrDeletionPolicy.onInit: commits:num=1
[junit4:junit4]   2> 		commit{dir=NRTCachingDirectory(org.apache.lucene.store.NIOFSDirectory@/usr/home/hudson/hudson-slave/workspace/Lucene-Solr-Tests-trunk-java7/solr/build/solr-core/test/J1/org.apache.solr.cloud.BasicDistributedZk2Test-1348213203779/jetty3/index lockFactory=org.apache.lucene.store.NativeFSLockFactory@53bda6ee; maxCacheMB=48.0 maxMergeSizeMB=4.0),segFN=segments_1,generation=1,filenames=[segments_1]
[junit4:junit4]   2> 12561 T1118 C64 P62937 oasc.SolrDeletionPolicy.updateCommits newest commit = 1
[junit4:junit4]   2> 12564 T1118 C64 P62937 REQ /update {update.distrib=FROMLEADER&distrib.from=http://127.0.0.1:62930/solr/collection1/&wt=javabin&version=2} status=0 QTime=8 
[junit4:junit4]   2> 12565 T1096 C65 P62930 REQ /update {distrib.from=http://127.0.0.1:62934/solr/collection1/&update.distrib=TOLEADER&wt=javabin&version=2} status=0 QTime=27 
[junit4:junit4]   2> 12566 T1108 C67 P62934 /update {wt=javabin&version=2} {add=[1]} 0 30
[junit4:junit4]   2> 12566 T1068 oasc.AbstractDistribZkTestBase.waitForRecoveriesToFinish Wait for recoveries to finish - collection: collection1 failOnTimeout:true timeout (sec):1800
[junit4:junit4]   2> 12567 T1068 oascc.ZkStateReader.updateClusterState Updating cloud state from ZooKeeper... 
[junit4:junit4]   2> 12604 T1089 oascc.ZkStateReader.updateClusterState Updating cloud state from ZooKeeper... 
[junit4:junit4]   2> 12669 T1102 oascc.ZkStateReader$2.process A cluster state change has occurred - updating...
[junit4:junit4]   2> 12670 T1114 oascc.ZkStateReader$2.process A cluster state change has occurred - updating...
[junit4:junit4]   2> 12670 T1088 oascc.ZkStateReader$2.process A cluster state change has occurred - updating...
[junit4:junit4]   2> 12670 T1140 oascc.ZkStateReader$2.process A cluster state change has occurred - updating...
[junit4:junit4]   2> 12670 T1126 oascc.ZkStateReader$2.process A cluster state change has occurred - updating...
[junit4:junit4]   2> 12670 T1147 oascc.ZkStateReader$2.process A cluster state change has occurred - updating...
[junit4:junit4]   2> 12670 T1145 oascc.ZkStateReader$2.process A cluster state change has occurred - updating...
[junit4:junit4]   2> 13282 T1128 C64 P62937 oasc.RecoveryStrategy.doRecovery Begin buffering updates. core=collection1
[junit4:junit4]   2> 13282 T1128 C64 P62937 oasu.UpdateLog.bufferUpdates Starting to buffer updates. FSUpdateLog{state=ACTIVE, tlog=tlog{file=./org.apache.solr.cloud.BasicDistributedZk2Test-1348213203779/jetty3/tlog/tlog.0000000000000000000 refcount=1}}
[junit4:junit4]   2> 13283 T1128 C64 P62937 oasc.RecoveryStrategy.replicate Attempting to replicate from http://127.0.0.1:62930/solr/collection1/. core=collection1
[junit4:junit4]   2> 13283 T1128 C64 P62937 oascsi.HttpClientUtil.createClient Creating new http client, config:maxConnections=128&maxConnectionsPerHost=32&followRedirects=false
[junit4:junit4]   2> 13301 T1097 C65 P62930 oasu.DirectUpdateHandler2.commit start commit{flags=0,_version_=0,optimize=false,openSearcher=true,waitSearcher=true,expungeDeletes=false,softCommit=false}
[junit4:junit4]   2> 13348 T1097 C65 P62930 oasc.SolrDeletionPolicy.onCommit SolrDeletionPolicy.onCommit: commits:num=2
[junit4:junit4]   2> 		commit{dir=NRTCachingDirectory(org.apache.lucene.store.NIOFSDirectory@/usr/home/hudson/hudson-slave/workspace/Lucene-Solr-Tests-trunk-java7/solr/build/solr-core/test/J1/org.apache.solr.cloud.BasicDistributedZk2Test-1348213203779/jetty1/index lockFactory=org.apache.lucene.store.NativeFSLockFactory@4b038860; maxCacheMB=48.0 maxMergeSizeMB=4.0),segFN=segments_1,generation=1,filenames=[segments_1]
[junit4:junit4]   2> 		commit{dir=NRTCachingDirectory(org.apache.lucene.store.NIOFSDirectory@/usr/home/hudson/hudson-slave/workspace/Lucene-Solr-Tests-trunk-java7/solr/build/solr-core/test/J1/org.apache.solr.cloud.BasicDistributedZk2Test-1348213203779/jetty1/index lockFactory=org.apache.lucene.store.NativeFSLockFactory@4b038860; maxCacheMB=48.0 maxMergeSizeMB=4.0),segFN=segments_2,generation=2,filenames=[_0_Asserting_0.tim, _0_Lucene40_0.tim, _0.fnm, _0_Asserting_0.tip, _0_Memory_0.ram, _0_NestedPulsing_0.frq, _0_nrm.cfs, _0_Lucene40_0.prx, _0_NestedPulsing_0.tip, _0_NestedPulsing_0.prx, _0_NestedPulsing_0.tim, _0_Lucene40_0.tip, _0_Asserting_0.prx, _0_Asserting_0.frq, _0_Lucene40_0.frq, _0_nrm.cfe, segments_2, _0.fdx, _0.si, _0.fdt]
[junit4:junit4]   2> 13349 T1097 C65 P62930 oasc.SolrDeletionPolicy.updateCommits newest commit = 2
[junit4:junit4]   2> 13362 T1097 C65 P62930 oass.SolrIndexSearcher.<init> Opening Searcher@4510da92 main
[junit4:junit4]   2> 13363 T1097 C65 P62930 oasu.DirectUpdateHandler2.commit end_commit_flush
[junit4:junit4]   2> 13365 T1103 oasc.SolrCore.registerSearcher [collection1] Registered new searcher Searcher@4510da92 main{StandardDirectoryReader(segments_2:3 _0(5.0):C1)}
[junit4:junit4]   2> 13366 T1097 C65 P62930 /update {waitSearcher=true&commit=true&commit_end_point=true&wt=javabin&softCommit=false&version=2} {commit=} 0 65
[junit4:junit4]   2> 13367 T1128 C64 P62937 oash.ReplicationHandler.inform Commits will be reserved for  10000
[junit4:junit4]   2> 13367 T1128 C64 P62937 oash.SnapPuller.<init>  No value set for 'pollInterval'. Timer Task not started.
[junit4:junit4]   2> 13370 T1098 C65 P62930 oash.ReplicationHandler.inform Commits will be reserved for  10000
[junit4:junit4]   2> 13370 T1098 C65 P62930 REQ /replication {command=indexversion&wt=javabin&qt=/replication&version=2} status=0 QTime=2 
[junit4:junit4]   2> 13371 T1128 C64 P62937 oash.SnapPuller.fetchLatestIndex Master's generation: 2
[junit4:junit4]   2> 13371 T1128 C64 P62937 oash.SnapPuller.fetchLatestIndex Slave's generation: 1
[junit4:junit4]   2> 13371 T1128 C64 P62937 oash.SnapPuller.fetchLatestIndex Starting replication process
[junit4:junit4]   2> 13375 T1098 C65 P62930 REQ /replication {command=filelist&generation=2&wt=javabin&qt=/replication&version=2} status=0 QTime=2 
[junit4:junit4]   2> 13376 T1128 C64 P62937 oash.SnapPuller.fetchLatestIndex Number of files in latest index in master: 20
[junit4:junit4]   2> 13382 T1128 C64 P62937 oash.SnapPuller.fetchLatestIndex Starting download to ./org.apache.solr.cloud.BasicDistributedZk2Test-1348213203779/jetty3/index.20120921104017149 fullCopy=true
[junit4:junit4]   2> 13385 T1098 C65 P62930 REQ /replication {file=_0_Asserting_0.tim&command=filecontent&checksum=true&generation=2&qt=/replication&wt=filestream} status=0 QTime=0 
[junit4:junit4]   2> 13390 T1098 C65 P62930 REQ /replication {file=_0_Lucene40_0.tim&command=filecontent&checksum=true&generation=2&qt=/replication&wt=filestream} status=0 QTime=0 
[junit4:junit4]   2> 13394 T1098 C65 P62930 REQ /replication {file=_0.fnm&command=filecontent&checksum=true&generation=2&qt=/replication&wt=filestream} status=0 QTime=0 
[junit4:junit4]   2> 13398 T1098 C65 P62930 REQ /replication {file=_0_Asserting_0.tip&command=filecontent&checksum=true&generation=2&qt=/replication&wt=filestream} status=0 QTime=0 
[junit4:junit4]   2> 13402 T1098 C65 P62930 REQ /replication {file=_0_Memory_0.ram&command=filecontent&checksum=true&generation=2&qt=/replication&wt=filestream} status=0 QTime=0 
[junit4:junit4]   2> 13406 T1098 C65 P62930 REQ /replication {file=_0_NestedPulsing_0.frq&command=filecontent&checksum=true&generation=2&qt=/replication&wt=filestream} status=0 QTime=0 
[junit4:junit4]   2> 13410 T1098 C65 P62930 REQ /replication {file=_0_nrm.cfs&command=filecontent&checksum=true&generation=2&qt=/replication&wt=filestream} status=0 QTime=0 
[junit4:junit4]   2> 13414 T1098 C65 P62930 REQ /replication {file=_0_NestedPulsing_0.tip&command=filecontent&checksum=true&generation=2&qt=/replication&wt=filestream} status=0 QTime=0 
[junit4:junit4]   2> 13418 T1098 C65 P62930 REQ /replication {file=_0_Lucene40_0.prx&command=filecontent&checksum=true&generation=2&qt=/replication&wt=filestream} status=0 QTime=0 
[junit4:junit4]   2> 13422 T1098 C65 P62930 REQ /replication {file=_0_NestedPulsing_0.prx&command=filecontent&checksum=true&generation=2&qt=/replication&wt=filestream} status=0 QTime=0 
[junit4:junit4]   2> 13426 T1098 C65 P62930 REQ /replication {file=_0_Lucene40_0.tip&command=filecontent&checksum=true&generation=2&qt=/replication&wt=filestream} status=0 QTime=0 
[junit4:junit4]   2> 13430 T1098 C65 P62930 REQ /replication {file=_0_NestedPulsing_0.tim&command=filecontent&checksum=true&generation=2&qt=/replication&wt=filestream} status=0 QTime=0 
[junit4:junit4]   2> 13434 T1098 C65 P62930 REQ /replication {file=_0_Asserting_0.prx&command=filecontent&checksum=true&generation=2&qt=/replication&wt=filestream} status=0 QTime=0 
[junit4:junit4]   2> 13438 T1098 C65 P62930 REQ /replication {file=_0_Asserting_0.frq&command=filecontent&checksum=true&generation=2&qt=/replication&wt=filestream} status=0 QTime=0 
[junit4:junit4]   2> 13442 T1098 C65 P62930 REQ /replication {file=_0_Lucene40_0.frq&command=filecontent&checksum=true&generation=2&qt=/replication&wt=filestream} status=0 QTime=0 
[junit4:junit4]   2> 13446 T1098 C65 P62930 REQ /replication {file=_0_nrm.cfe&command=filecontent&checksum=true&generation=2&qt=/replication&wt=filestream} status=0 QTime=0 
[junit4:junit4]   2> 13450 T1098 C65 P62930 REQ /replication {file=segments_2&command=filecontent&checksum=true&generation=2&qt=/replication&wt=filestream} status=0 QTime=0 
[junit4:junit4]   2> 13454 T1098 C65 P62930 REQ /replication {file=_0.fdx&command=filecontent&checksum=true&generation=2&qt=/replication&wt=filestream} status=0 QTime=0 
[junit4:junit4]   2> 13458 T1098 C65 P62930 REQ /replication {file=_0.si&command=filecontent&checksum=true&generation=2&qt=/replication&wt=filestream} status=0 QTime=0 
[junit4:junit4]   2> 13462 T1098 C65 P62930 REQ /replication {file=_0.fdt&command=filecontent&checksum=true&generation=2&qt=/replication&wt=filestream} status=0 QTime=0 
[junit4:junit4]   2> 13463 T1128 C64 P62937 oash.SnapPuller.fetchLatestIndex Total time taken for download : 0 secs
[junit4:junit4]   2> 13464 T1128 C64 P62937 oash.SnapPuller.modifyIndexProps New index installed. Updating index properties... index=index.20120921104017149
[junit4:junit4]   2> 13465 T1128 C64 P62937 oasu.DefaultSolrCoreState.newIndexWriter Creating new IndexWriter...
[junit4:junit4]   2> 13466 T1128 C64 P62937 oasu.DefaultSolrCoreState.newIndexWriter Waiting until IndexWriter is unused... core=collection1
[junit4:junit4]   2> 13466 T1128 C64 P62937 oasu.DefaultSolrCoreState.newIndexWriter Rollback old IndexWriter... core=collection1
[junit4:junit4]   2> 13470 T1128 C64 P62937 oasc.SolrCore.getNewIndexDir WARNING New index directory detected: old=./org.apache.solr.cloud.BasicDistributedZk2Test-1348213203779/jetty3/index/ new=./org.apache.solr.cloud.BasicDistributedZk2Test-1348213203779/jetty3/index.20120921104017149
[junit4:junit4]   2> 13471 T1128 C64 P62937 oasc.CachingDirectoryFactory.get return new directory for /usr/home/hudson/hudson-slave/workspace/Lucene-Solr-Tests-trunk-java7/solr/build/solr-core/test/J1/./org.apache.solr.cloud.BasicDistributedZk2Test-1348213203779/jetty3/index.20120921104017149 forceNew:true
[junit4:junit4]   2> 13481 T1128 C64 P62937 oasc.SolrDeletionPolicy.onInit SolrDeletionPolicy.onInit: commits:num=1
[junit4:junit4]   2> 		commit{dir=NRTCachingDirectory(org.apache.lucene.store.NIOFSDirectory@/usr/home/hudson/hudson-slave/workspace/Lucene-Solr-Tests-trunk-java7/solr/build/solr-core/test/J1/org.apache.solr.cloud.BasicDistributedZk2Test-1348213203779/jetty3/index.20120921104017149 lockFactory=org.apache.lucene.store.NativeFSLockFactory@1bf4743a; maxCacheMB=48.0 maxMergeSizeMB=4.0),segFN=segments_2,generation=2,filenames=[_0_Asserting_0.tim, _0_Lucene40_0.tim, _0.fnm, _0_Asserting_0.tip, _0_Memory_0.ram, _0_NestedPulsing_0.frq, _0_nrm.cfs, _0_Lucene40_0.prx, _0_NestedPulsing_0.tip, _0_NestedPulsing_0.prx, _0_NestedPulsing_0.tim, _0_Lucene40_0.tip, _0_Asserting_0.prx, _0_Asserting_0.frq, _0_Lucene40_0.frq, _0_nrm.cfe, segments_2, _0.fdx, _0.si, _0.fdt]
[junit4:junit4]   2> 13481 T1128 C64 P62937 oasc.SolrDeletionPolicy.updateCommits newest commit = 2
[junit4:junit4]   2> 13481 T1128 C64 P62937 oasu.DefaultSolrCoreState.newIndexWriter New IndexWriter is ready to be used.
[junit4:junit4]   2> 13485 T1128 C64 P62937 oass.SolrIndexSearcher.<init> Opening Searcher@69621882 main
[junit4:junit4]   2> 13487 T1127 oasc.SolrCore.registerSearcher [collection1] Registered new searcher Searcher@69621882 main{StandardDirectoryReader(segments_2:3:nrt _0(5.0):C1)}
[junit4:junit4]   2> 13487 T1127 oasc.CachingDirectoryFactory.close Closing directory:/usr/home/hudson/hudson-slave/workspace/Lucene-Solr-Tests-trunk-java7/solr/build/solr-core/test/J1/./org.apache.solr.cloud.BasicDistributedZk2Test-1348213203779/jetty3/index
[junit4:junit4]   2> 13488 T1127 oash.SnapPuller$2.onClose removing old index directory ./org.apache.solr.cloud.BasicDistributedZk2Test-1348213203779/jetty3/index
[junit4:junit4]   2> 13489 T1128 C64 P62937 oasu.DirectUpdateHandler2.commit start commit{flags=0,_version_=0,optimize=false,openSearcher=false,waitSearcher=false,expungeDeletes=false,softCommit=false}
[junit4:junit4]   2> 13490 T1128 C64 P62937 oasu.DirectUpdateHandler2.commit end_commit_flush
[junit4:junit4]   2> 13491 T1128 C64 P62937 oasc.RecoveryStrategy.replay Replaying buffered documents. core=collection1
[junit4:junit4]   2> 13491 T1151 C64 P62937 oasu.UpdateLog$LogReplayer.doReplay WARNING Starting log replay tlog{file=./org.apache.solr.cloud.BasicDistributedZk2Test-1348213203779/jetty3/tlog/tlog.0000000000000000000 refcount=2} active=true starting pos=434
[junit4:junit4]   2> 13491 T1151 C64 P62937 oasu.DirectUpdateHandler2.commit start commit{flags=2,_version_=0,optimize=false,openSearcher=true,waitSearcher=true,expungeDeletes=false,softCommit=false}
[junit4:junit4]   2> 13493 T1151 C64 P62937 oass.SolrIndexSearcher.<init> Opening Searcher@2b650780 main
[junit4:junit4]   2> 13494 T1151 C64 P62937 oasu.DirectUpdateHandler2.commit end_commit_flush
[junit4:junit4]   2> 13495 T1127 oasc.SolrCore.registerSearcher [collection1] Registered new searcher Searcher@2b650780 main{StandardDirectoryReader(segments_2:3:nrt _0(5.0):C1)}
[junit4:junit4]   2> 13496 T1151 C64 P62937 oasu.UpdateLog$LogReplayer.run WARNING Log replay finished. recoveryInfo=RecoveryInfo{adds=0 deletes=0 deleteByQuery=0 errors=0 positionOfStart=434}
[junit4:junit4]   2> 13496 T1128 C64 P62937 oasc.RecoveryStrategy.doRecovery Replication Recovery was successful - registering as Active. core=collection1
[junit4:junit4]   2> 13498 T1128 C64 P62937 oasc.RecoveryStrategy.doRecovery Finished recovery process. core=collection1
[junit4:junit4]   2> 13569 T1068 oascc.ZkStateReader.updateClusterState Updating cloud state from ZooKeeper... 
[junit4:junit4]   2> 13678 T1089 oascc.ZkStateReader.updateClusterState Updating cloud state from ZooKeeper... 
[junit4:junit4]   2> 13692 T1102 oascc.ZkStateReader$2.process A cluster state change has occurred - updating...
[junit4:junit4]   2> 13692 T1126 oascc.ZkStateReader$2.process A cluster state change has occurred - updating...
[junit4:junit4]   2> 13692 T1145 oascc.ZkStateReader$2.process A cluster state change has occurred - updating...
[junit4:junit4]   2> 13692 T1140 oascc.ZkStateReader$2.process A cluster state change has occurred - updating...
[junit4:junit4]   2> 13692 T1147 oascc.ZkStateReader$2.process A cluster state change has occurred - updating...
[junit4:junit4]   2> 13692 T1114 oascc.ZkStateReader$2.process A cluster state change has occurred - updating...
[junit4:junit4]   2> 13692 T1088 oascc.ZkStateReader$2.process A cluster state change has occurred - updating...
[junit4:junit4]   2> 14571 T1068 oascc.ZkStateReader.updateClusterState Updating cloud state from ZooKeeper... 
[junit4:junit4]   2>  C66_STATE=coll:collection1 core:collection1 props:{shard=shard2, roles=null, state=recovering, core=collection1, collection=collection1, node_name=127.0.0.1:62944_solr, base_url=http://127.0.0.1:62944/solr}
[junit4:junit4]   2> 15493 T1142 C66 P62944 oasc.RecoveryStrategy.doRecovery Begin buffering updates. core=collection1
[junit4:junit4]   2> 15493 T1142 C66 P62944 oasu.UpdateLog.bufferUpdates Starting to buffer updates. FSUpdateLog{state=ACTIVE, tlog=null}
[junit4:junit4]   2> 15493 T1142 C66 P62944 oasc.RecoveryStrategy.replicate Attempting to replicate from http://127.0.0.1:62934/solr/collection1/. core=collection1
[junit4:junit4]   2> 15493 T1142 C66 P62944 oascsi.HttpClientUtil.createClient Creating new http client, config:maxConnections=128&maxConnectionsPerHost=32&followRedirects=false
[junit4:junit4]   2> 15509 T1109 C67 P62934 oasu.DirectUpdateHandler2.commit start commit{flags=0,_version_=0,optimize=false,openSearcher=true,waitSearcher=true,expungeDeletes=false,softCommit=false}
[junit4:junit4]   2> 15514 T1109 C67 P62934 oasc.SolrDeletionPolicy.onInit SolrDeletionPolicy.onInit: commits:num=1
[junit4:junit4]   2> 		commit{dir=NRTCachingDirectory(org.apache.lucene.store.NIOFSDirectory@/usr/home/hudson/hudson-slave/workspace/Lucene-Solr-Tests-trunk-java7/solr/build/solr-core/test/J1/org.apache.solr.cloud.BasicDistributedZk2Test-1348213203779/jetty2/index lockFactory=org.apache.lucene.store.NativeFSLockFactory@4918f485; maxCacheMB=48.0 maxMergeSizeMB=4.0),segFN=segments_1,generation=1,filenames=[segments_1]
[junit4:junit4]   2> 15515 T1109 C67 P62934 oasc.SolrDeletionPolicy.updateCommits newest commit = 1
[junit4:junit4]   2> 15516 T1109 C67 P62934 oass.SolrIndexSearcher.<init> Opening Searcher@4ed7b3b1 main
[junit4:junit4]   2> 15516 T1109 C67 P62934 oasu.DirectUpdateHandler2.commit end_commit_flush
[junit4:junit4]   2> 15518 T1115 oasc.SolrCore.registerSearcher [collection1] Registered new searcher Searcher@4ed7b3b1 main{StandardDirectoryReader(segments_1:1)}
[junit4:junit4]   2> 15519 T1109 C67 P62934 /update {waitSearcher=true&commit=true&commit_end_point=true&wt=javabin&softCommit=false&version=2} {commit=} 0 10
[junit4:junit4]   2> 15520 T1142 C66 P62944 oash.ReplicationHandler.inform Commits will be reserved for  10000
[junit4:junit4]   2> 15520 T1142 C66 P62944 oash.SnapPuller.<init>  No value set for 'pollInterval'. Timer Task not started.
[junit4:junit4]   2> 15521 T1110 C67 P62934 oash.ReplicationHandler.inform Commits will be reserved for  10000
[junit4:junit4]   2> 15522 T1110 C67 P62934 REQ /replication {command=indexversion&wt=javabin&qt=/replication&version=2} status=0 QTime=1 
[junit4:junit4]   2> 15526 T1142 C66 P62944 oasc.SolrDeletionPolicy.onInit SolrDeletionPolicy.onInit: commits:num=1
[junit4:junit4]   2> 		commit{dir=NRTCachingDirectory(org.apache.lucene.store.NIOFSDirectory@/usr/home/hudson/hudson-slave/workspace/Lucene-Solr-Tests-trunk-java7/solr/build/solr-core/test/J1/org.apache.solr.cloud.BasicDistributedZk2Test-1348213203779/jetty4/index lockFactory=org.apache.lucene.store.NativeFSLockFactory@16a7fd5; maxCacheMB=48.0 maxMergeSizeMB=4.0),segFN=segments_1,generation=1,filenames=[segments_1]
[junit4:junit4]   2> 15527 T1142 C66 P62944 oasc.SolrDeletionPolicy.updateCommits newest commit = 1
[junit4:junit4]   2> 15527 T1142 C66 P62944 oasu.DirectUpdateHandler2.commit start commit{flags=0,_version_=0,optimize=false,openSearcher=true,waitSearcher=true,expungeDeletes=false,softCommit=false}
[junit4:junit4]   2> 15531 T1142 C66 P62944 oasc.SolrDeletionPolicy.onCommit SolrDeletionPolicy.onCommit: commits:num=2
[junit4:junit4]   2> 		commit{dir=NRTCachingDirectory(org.apache.lucene.store.NIOFSDirectory@/usr/home/hudson/hudson-slave/workspace/Lucene-Solr-Tests-trunk-java7/solr/build/solr-core/test/J1/org.apache.solr.cloud.BasicDistributedZk2Test-1348213203779/jetty4/index lockFactory=org.apache.lucene.store.NativeFSLockFactory@16a7fd5; maxCacheMB=48.0 maxMergeSizeMB=4.0),segFN=segments_1,generation=1,filenames=[segments_1]
[junit4:junit4]   2> 		commit{dir=NRTCachingDirectory(org.apache.lucene.store.NIOFSDirectory@/usr/home/hudson/hudson-slave/workspace/Lucene-Solr-Tests-trunk-java7/solr/build/solr-core/test/J1/org.apache.solr.cloud.BasicDistributedZk2Test-1348213203779/jetty4/index lockFactory=org.apache.lucene.store.NativeFSLockFactory@16a7fd5; maxCacheMB=48.0 maxMergeSizeMB=4.0),segFN=segments_2,generation=2,filenames=[segments_2]
[junit4:junit4]   2> 15531 T1142 C66 P62944 oasc.SolrDeletionPolicy.updateCommits newest commit = 2
[junit4:junit4]   2> 15534 T1142 C66 P62944 oass.SolrIndexSearcher.<init> Opening Searcher@57d6542d main
[junit4:junit4]   2> 15535 T1142 C66 P62944 oasu.DirectUpdateHandler2.commit end_commit_flush
[junit4:junit4]   2> 15536 T1141 oasc.SolrCore.registerSearcher [collection1] Registered new searcher Searcher@57d6542d main{StandardDirectoryReader(segments_2:2)}
[junit4:junit4]   2> 15537 T1142 C66 P62944 oasc.RecoveryStrategy.replay No replay needed. core=collection1
[junit4:junit4]   2> 15537 T1142 C66 P62944 oasc.RecoveryStrategy.doRecovery Replication Recovery was successful - registering as Active. core=collection1
[junit4:junit4]   2> 15546 T1142 C66 P62944 oasc.RecoveryStrategy.doRecovery Finished recovery process. core=collection1
[junit4:junit4]   2> 15573 T1068 oascc.ZkStateReader.updateClusterState Updating cloud state from ZooKeeper... 
[junit4:junit4]   2> 15702 T1089 oascc.ZkStateReader.updateClusterState Updating cloud state from ZooKeeper... 
[junit4:junit4]   2> 15718 T1145 oascc.ZkStateReader$2.process A cluster state change has occurred - updating...
[junit4:junit4]   2> 15718 T1102 oascc.ZkStateReader$2.process A cluster state change has occurred - updating...
[junit4:junit4]   2> 15718 T1140 oascc.ZkStateReader$2.process A cluster state change has occurred - updating...
[junit4:junit4]   2> 15718 T1114 oascc.ZkStateReader$2.process A cluster state change has occurred - updating...
[junit4:junit4]   2> 15718 T1126 oascc.ZkStateReader$2.process A cluster state change has occurred - updating...
[junit4:junit4]   2> 15718 T1088 oascc.ZkStateReader$2.process A cluster state change has occurred - updating...
[junit4:junit4]   2> 15718 T1147 oascc.ZkStateReader$2.process A cluster state change has occurred - updating...
[junit4:junit4]   2> 16575 T1068 oascc.ZkStateReader.updateClusterState Updating cloud state from ZooKeeper... 
[junit4:junit4]   2> 16578 T1080 C68 P62928 oasu.DirectUpdateHandler2.commit start commit{flags=0,_version_=0,optimize=false,openSearcher=true,waitSearcher=true,expungeDeletes=false,softCommit=false}
[junit4:junit4]   2> 16623 T1080 C68 P62928 oasc.SolrDeletionPolicy.onCommit SolrDeletionPolicy.onCommit: commits:num=2
[junit4:junit4]   2> 		commit{dir=NRTCachingDirectory(org.apache.lucene.store.NIOFSDirectory@/usr/home/hudson/hudson-slave/workspace/Lucene-Solr-Tests-trunk-java7/solr/build/solr-core/test/J1/org.apache.solr.cloud.BasicDistributedZk2Test-1348213203779/control/data/index lockFactory=org.apache.lucene.store.NativeFSLockFactory@75750677; maxCacheMB=48.0 maxMergeSizeMB=4.0),segFN=segments_1,generation=1,filenames=[segments_1]
[junit4:junit4]   2> 		commit{dir=NRTCachingDirectory(org.apache.lucene.store.NIOFSDirectory@/usr/home/hudson/hudson-slave/workspace/Lucene-Solr-Tests-trunk-java7/solr/build/solr-core/test/J1/org.apache.solr.cloud.BasicDistributedZk2Test-1348213203779/control/data/index lockFactory=org.apache.lucene.store.NativeFSLockFactory@75750677; maxCacheMB=48.0 maxMergeSizeMB=4.0),segFN=segments_2,generation=2,filenames=[_0_Asserting_0.tim, _0_Lucene40_0.tim, _0.fnm, _0_Asserting_0.tip, _0_Memory_0.ram, _0_NestedPulsing_0.frq, _0_nrm.cfs, _0_Lucene40_0.prx, _0_NestedPulsing_0.tip, _0_NestedPulsing_0.prx, _0_NestedPulsing_0.tim, _0_Lucene40_0.tip, _0_Asserting_0.prx, _0_Asserting_0.frq, _0_Lucene40_0.frq, _0_nrm.cfe, segments_2, _0.fdx, _0.si, _0.fdt]
[junit4:junit4]   2> 16624 T1080 C68 P62928 oasc.SolrDeletionPolicy.updateCommits newest commit = 2
[junit4:junit4]   2> 16638 T1080 C68 P62928 oass.SolrIndexSearcher.<init> Opening Searcher@2081aed0 main
[junit4:junit4]   2> 16638 T1080 C68 P62928 oasu.DirectUpdateHandler2.commit end_commit_flush
[junit4:junit4]   2> 16640 T1091 oasc.SolrCore.registerSearcher [collection1] Registered new searcher Searcher@2081aed0 main{StandardDirectoryReader(segments_2:3 _0(5.0):C1)}
[junit4:junit4]   2> 16641 T1080 C68 P62928 /update {waitSearcher=true&wt=javabin&commit=true&softCommit=false&version=2} {commit=} 0 63
[junit4:junit4]   2> 16644 T1108 C67 P62934 oasu.DirectUpdateHandler2.commit start commit{flags=0,_version_=0,optimize=false,openSearcher=true,waitSearcher=true,expungeDeletes=false,softCommit=false}
[junit4:junit4]   2> 16647 T1108 C67 P62934 oass.SolrIndexSearcher.<init> Opening Searcher@25f20e60 main
[junit4:junit4]   2> 16648 T1108 C67 P62934 oasu.DirectUpdateHandler2.commit end_commit_flush
[junit4:junit4]   2> 16650 T1115 oasc.SolrCore.registerSearcher [collection1] Registered new searcher Searcher@25f20e60 main{StandardDirectoryReader(segments_1:1)}
[junit4:junit4]   2> 16650 T1108 C67 P62934 oasu.SolrCmdDistributor.distribCommit Distrib commit to:[StdNode: http://127.0.0.1:62930/solr/collection1/, StdNode: http://127.0.0.1:62937/solr/collection1/, StdNode: http://127.0.0.1:62944/solr/collection1/]
[junit4:junit4]   2>  C64_STATE=coll:collection1 core:collection1 props:{shard=shard1, roles=null, state=active, core=collection1, collection=collection1, node_name=127.0.0.1:62937_solr, base_url=http://127.0.0.1:62937/solr}
[junit4:junit4]   2> 16653 T1118 C64 P62937 oasu.DirectUpdateHandler2.commit start commit{flags=0,_version_=0,optimize=false,openSearcher=true,waitSearcher=true,expungeDeletes=false,softCommit=false}
[junit4:junit4]   2> 16653 T1096 C65 P62930 oasu.DirectUpdateHandler2.commit start commit{flags=0,_version_=0,optimize=false,openSearcher=true,waitSearcher=true,expungeDeletes=false,softCommit=false}
[junit4:junit4]   2> 16656 T1118 C64 P62937 oass.SolrIndexSearcher.<init> Opening Searcher@45722108 main
[junit4:junit4]   2> 16656 T1118 C64 P62937 oasu.DirectUpdateHandler2.commit end_commit_flush
[junit4:junit4]   2> 16658 T1127 oasc.SolrCore.registerSearcher [collection1] Registered new searcher Searcher@45722108 main{StandardDirectoryReader(segments_2:3:nrt _0(5.0):C1)}
[junit4:junit4]   2> 16659 T1118 C64 P62937 /update {waitSearcher=true&commit=true&wt=javabin&commit_end_point=true&expungeDeletes=false&softCommit=false&version=2} {commit=} 0 6
[junit4:junit4]   2>  C66_STATE=coll:collection1 core:collection1 props:{shard=shard2, roles=null, state=active, core=collection1, collection=collection1, node_name=127.0.0.1:62944_solr, base_url=http://127.0.0.1:62944/solr}
[junit4:junit4]   2> 16682 T1132 C66 P62944 oasu.DirectUpdateHandler2.commit start commit{flags=0,_version_=0,optimize=false,openSearcher=true,waitSearcher=true,expungeDeletes=false,softCommit=false}
[junit4:junit4]   2> 16683 T1096 C65 P62930 oass.SolrIndexSearcher.<init> Opening Searcher@143a94d main
[junit4:junit4]   2> 16684 T1096 C65 P62930 oasu.DirectUpdateHandler2.commit end_commit_flush
[junit4:junit4]   2> 16687 T1103 oasc.SolrCore.registerSearcher [collection1] Registered new searcher Searcher@143a94d main{StandardDirectoryReader(segments_2:3 _0(5.0):C1)}
[junit4:junit4]   2> 16687 T1132 C66 P62944 oass.SolrIndexSearcher.<init> Opening Searcher@669d818c main
[junit4:junit4]   2> 16688 T1096 C65 P62930 /update {waitSearcher=true&commit=true&wt=javabin&commit_end_point=true&expungeDeletes=false&softCommit=false&version=2} {commit=} 0 35
[junit4:junit4]   2> 16688 T1132 C66 P62944 oasu.DirectUpdateHandler2.commit end_commit_flush
[junit4:junit4]   2> 16689 T1141 oasc.SolrCore.registerSearcher [collection1] Registered new searcher Searcher@669d818c main{StandardDirectoryReader(segments_2:2)}
[junit4:junit4]   2> 16690 T1132 C66 P62944 /update {waitSearcher=true&commit=true&wt=javabin&commit_end_point=true&expungeDeletes=false&softCommit=false&version=2} {commit=} 0 8
[junit4:junit4]   2> 16691 T1108 C67 P62934 /update {waitSearcher=true&wt=javabin&commit=true&softCommit=false&version=2} {commit=} 0 47
[junit4:junit4]   2> 16696 T1081 C68 P62928 REQ /select {fl=id,score&shard.url=127.0.0.1:62928/solr/collection1/&NOW=1348213220466&start=0&q=*:*&distrib=false&isShard=true&wt=javabin&fsv=true&rows=10&version=2} hits=1 status=0 QTime=1 
[junit4:junit4]   2> 16699 T1081 C68 P62928 REQ /select {shard.url=127.0.0.1:62928/solr/collection1/&NOW=1348213220466&q=*:*&ids=1&distrib=false&isShard=true&wt=javabin&version=2} status=0 QTime=0 
[junit4:junit4]   2> 16700 T1080 C68 P62928 REQ /select {wt=javabin&q=*:*&version=2} hits=1 status=0 QTime=7 
[junit4:junit4]   2> 16701 T1068 oaz.ZooKeeper.<init> Initiating client connection, connectString=127.0.0.1:62924/solr sessionTimeout=10000 watcher=org.apache.solr.common.cloud.ConnectionManager@450012cd
[junit4:junit4]   2> 16702 T1155 oaz.ClientCnxn$SendThread.startConnect Opening socket connection to server /127.0.0.1:62924
[junit4:junit4]   2> 16702 T1068 oascc.ConnectionManager.waitForConnected Waiting for client to connect to ZooKeeper
[junit4:junit4]   2> 16703 T1155 oaz.ClientCnxn$SendThread.primeConnection Socket connection established to localhost/127.0.0.1:62924, initiating session
[junit4:junit4]   2> 16703 T1070 oazs.NIOServerCnxn$Factory.run Accepted socket connection from /140.211.11.196:62962
[junit4:junit4]   2> 16703 T1070 oazs.NIOServerCnxn.readConnectRequest Client attempting to establish new session at /140.211.11.196:62962
[junit4:junit4]   2> 16705 T1072 oazs.NIOServerCnxn.finishSessionInit Established session 0x139e7c4e3490009 with negotiated timeout 10000 for client /140.211.11.196:62962
[junit4:junit4]   2> 16705 T1155 oaz.ClientCnxn$SendThread.readConnectResult Session establishment complete on server localhost/127.0.0.1:62924, sessionid = 0x139e7c4e3490009, negotiated timeout = 10000
[junit4:junit4]   2> 16706 T1156 oascc.ConnectionManager.process Watcher org.apache.solr.common.cloud.ConnectionManager@450012cd name:ZooKeeperConnection Watcher:127.0.0.1:62924/solr got event WatchedEvent state:SyncConnected type:None path:null path:null type:None
[junit4:junit4]   2> 16706 T1068 oascc.ConnectionManager.waitForConnected Client is connected to ZooKeeper
[junit4:junit4]   2> 16707 T1068 oascc.ZkStateReader.createClusterStateWatchersAndUpdate Updating cluster state from ZooKeeper... 
[junit4:junit4]   2> 16709 T1073 oazs.PrepRequestProcessor.pRequest Processed session termination for sessionid: 0x139e7c4e3490009
[junit4:junit4]   2> 16716 T1156 oaz.ClientCnxn$EventThread.run EventThread shut down
[junit4:junit4]   2> 16716 T1070 oazs.NIOServerCnxn.closeSock Closed socket connection for client /140.211.11.196:62962 which had sessionid 0x139e7c4e3490009
[junit4:junit4]   2> 16716 T1068 oaz.ZooKeeper.close Session: 0x139e7c4e3490009 closed
[junit4:junit4]   2> 16718 T1099 C65 P62930 REQ /select {distrib=false&wt=javabin&q=*:*&version=2} hits=1 status=0 QTime=1 
[junit4:junit4]   2> 16720 T1111 C67 P62934 REQ /select {distrib=false&wt=javabin&q=*:*&version=2} hits=0 status=0 QTime=0 
[junit4:junit4]   2> 16724 T1100 C65 P62930 REQ /select {fl=id,score&shard.url=127.0.0.1:62930/solr/collection1/|127.0.0.1:62937/solr/collection1/&NOW=1348213220494&start=0&q=*:*&distrib=false&isShard=true&wt=javabin&fsv=true&rows=10&version=2} hits=1 status=0 QTime=0 
[junit4:junit4]   2> 16724 T1133 C66 P62944 REQ /select {fl=id,score&shard.url=127.0.0.1:62934/solr/collection1/|127.0.0.1:62944/solr/collection1/&NOW=1348213220494&start=0&q=*:*&distrib=false&isShard=true&wt=javabin&fsv=true&rows=10&version=2} hits=0 status=0 QTime=0 
[junit4:junit4]   2> 16727 T1100 C65 P62930 REQ /select {shard.url=127.0.0.1:62930/solr/collection1/|127.0.0.1:62937/solr/collection1/&NOW=1348213220494&q=*:*&ids=1&distrib=false&isShard=true&wt=javabin&version=2} status=0 QTime=0 
[junit4:junit4]   2> 16728 T1119 C64 P62937 REQ /select {wt=javabin&q=*:*&version=2} hits=1 status=0 QTime=7 
[junit4:junit4]   2> 16734 T1080 C68 P62928 /update {wt=javabin&version=2} {add=[2 (1413704025903202304)]} 0 3
[junit4:junit4]   2> 16746 T1132 C66 P62944 REQ /update {update.distrib=FROMLEADER&distrib.from=http://127.0.0.1:62934/solr/collection1/&wt=javabin&version=2} status=0 QTime=3 
[junit4:junit4]   2> 16747 T1112 C67 P62934 REQ /update {distrib.from=http://127.0.0.1:62930/solr/collection1/&update.distrib=TOLEADER&wt=javabin&version=2} status=0 QTime=9 
[junit4:junit4]   2> 16748 T1095 C65 P62930 /update {wt=javabin&version=2} {add=[2]} 0 12
[junit4:junit4]   2> 16752 T1080 C68 P62928 /update {wt=javabin&version=2} {add=[3 (1413704025924173824)]} 0 1
[junit4:junit4]   2> 16760 T1132 C66 P62944 REQ /update {distrib.from=http://127.0.0.1:62934/solr/collection1/&update.distrib=FROMLEADER&wt=javabin&version=2} status=0 QTime=1 
[junit4:junit4]   2> 16761 T1108 C67 P62934 /update {wt=javabin&version=2} {add=[3 (1413704025928368128)]} 0 6
[junit4:junit4]   2> 16765 T1080 C68 P62928 /update {wt=javabin&version=2} {add=[4 (1413704025937805312)]} 0 2
[junit4:junit4]   2> 16778 T1118 C64 P62937 REQ /update {update.distrib=FROMLEADER&distrib.from=http://127.0.0.1:62930/solr/collection1/&wt=javabin&version=2} status=0 QTime=3 
[junit4:junit4]   2> 16779 T1096 C65 P62930 REQ /update {distrib.from=http://127.0.0.1:62934/solr/collection1/&update.distrib=TOLEADER&wt=javabin&version=2} status=0 QTime=9 
[junit4:junit4]   2> 16779 T1108 C67 P62934 /update {wt=javabin&version=2} {add=[4]} 0 11
[junit4:junit4]   2> 16783 T1080 C68 P62928 /update {wt=javabin&version=2} {add=[5 (1413704025956679680)]} 0 1
[junit4:junit4]   2> 16790 T1132 C66 P62944 REQ /update {distrib.from=http://127.0.0.1:62934/solr/collection1/&update.distrib=FROMLEADER&wt=javabin&version=2} status=0 QTime=1 
[junit4:junit4]   2> 16791 T1108 C67 P62934 /update {wt=javabin&version=2} {add=[5 (1413704025960873984)]} 0 5
[junit4:junit4]   2> 16794 T1080 C68 P62928 /update {wt=javabin&version=2} {add=[6 (1413704025968214016)]} 0 1
[junit4:junit4]   2> 16803 T1132 C66 P62944 REQ /update {update.distrib=FROMLEADER&distrib.from=http://127.0.0.1:62934/solr/collection1/&wt=javabin&version=2} status=0 QTime=1 
[junit4:junit4]   2> 16804 T1112 C67 P62934 REQ /update {distrib.from=http://127.0.0.1:62930/solr/collection1/&update.distrib=TOLEADER&wt=javabin&version=2} status=0 QTime=5 
[junit4:junit4]   2> 16804 T1095 C65 P62930 /update {wt=javabin&version=2} {add=[6]} 0 7
[junit4:junit4]   2> 16808 T1080 C68 P62928 /update {wt=javabin&version=2} {add=[7 (1413704025982894080)]} 0 1
[junit4:junit4]   2> 16815 T1132 C66 P62944 REQ /update {distrib.from=http://127.0.0.1:62934/solr/collection1/&update.distrib=FROMLEADER&wt=javabin&version=2} status=0 QTime=1 
[junit4:junit4]   2> 16816 T1108 C67 P62934 /update {wt=javabin&version=2} {add=[7 (1413704025987088384)]} 0 5
[junit4:junit4]   2> 16819 T1080 C68 P62928 /update {wt=javabin&version=2} {add=[8 (1413704025994428416)]} 0 1
[junit4:junit4]   2> 16828 T1118 C64 P62937 REQ /update {update.distrib=FROMLEADER&distrib.from=http://127.0.0.1:62930/solr/collection1/&wt=javabin&version=2} status=0 QTime=1 
[junit4:junit4]   2> 16829 T1096 C65 P62930 REQ /update {distrib.from=http://127.0.0.1:62934/solr/collection1/&update.distrib=TOLEADER&wt=javabin&version=2} status=0 QTime=5 
[junit4:junit4]   2> 16829 T1108 C67 P62934 /update {wt=javabin&version=2} {add=[8]} 0 7
[junit4:junit4]   2> 16833 T1080 C68 P62928 /update {wt=javabin&version=2} {add=[9 (1413704026009108480)]} 0 1
[junit4:junit4]   2> 16842 T1132 C66 P62944 REQ /update {update.distrib=FROMLEADER&distrib.from=http://127.0.0.1:62934/solr/collection1/&wt=javabin&version=2} status=0 QTime=1 
[junit4:junit4]   2> 16843 T1112 C67 P62934 REQ /update {distrib.from=http://127.0.0.1:62930/solr/collection1/&update.distrib=TOLEADER&wt=javabin&version=2} status=0 QTime=5 
[junit4:junit4]   2> 16843 T1095 C65 P62930 /update {wt=javabin&version=2} {add=[9]} 0 7
[junit4:junit4]   2> 16847 T1080 C68 P62928 /update {wt=javabin&version=2} {add=[10 (1413704026023788544)]} 0 1
[junit4:junit4]   2> 16855 T1118 C64 P62937 REQ /update {distrib.from=http://127.0.0.1:62930/solr/collection1/&update.distrib=FROMLEADER&wt=javabin&version=2} status=0 QTime=1 
[junit4:junit4]   2> 16856 T1095 C65 P62930 /update {wt=javabin&version=2} {add=[10 (1413704026027982848)]} 0 6
[junit4:junit4]   2> 16873 T1080 C68 P62928 /update {wt=javabin&version=2} {add=[11 (1413704026037420032)]} 0 14
[junit4:junit4]   2> 16881 T1118 C64 P62937 REQ /update {update.distrib=FROMLEADER&distrib.from=http://127.0.0.1:62930/solr/collection1/&wt=javabin&version=2} status=0 QTime=1 
[junit4:junit4]   2> 16882 T1096 C65 P62930 REQ /update {distrib.from=http://127.0.0.1:62934/solr/collection1/&update.distrib=TOLEADER&wt=javabin&version=2} status=0 QTime=5 
[junit4:junit4]   2> 16882 T1108 C67 P62934 /update {wt=javabin&version=2} {add=[11]} 0 7
[junit4:junit4]   2> 16887 T1080 C68 P62928 /update {wt=javabin&version=2} {add=[12 (1413704026064683008)]} 0 2
[junit4:junit4]   2> 16896 T1118 C64 P62937 REQ /update {update.distrib=FROMLEADER&distrib.from=http://127.0.0.1:62930/solr/collection1/&wt=javabin&version=2} status=0 QTime=1 
[junit4:junit4]   2> 16897 T1096 C65 P62930 REQ /update {distrib.from=http://127.0.0.1:62934/solr/collection1/&update.distrib=TOLEADER&wt=javabin&version=2} status=0 QTime=5 
[junit4:junit4]   2> 16897 T1108 C67 P62934 /update {wt=javabin&version=2} {add=[12]} 0 7
[junit4:junit4]   2> 16901 T1080 C68 P62928 /update {wt=javabin&version=2} {add=[13 (1413704026080411648)]} 0 1
[junit4:junit4]   2> 16910 T1118 C64 P62937 REQ /update {update.distrib=FROMLEADER&distrib.from=http://127.0.0.1:62930/solr/collection1/&wt=javabin&version=2} status=0 QTime=1 
[junit4:junit4]   2> 16911 T1096 C65 P62930 REQ /update {distrib.from=http://127.0.0.1:62934/solr/collection1/&update.distrib=TOLEADER&wt=javabin&version=2} status=0 QTime=5 
[junit4:junit4]   2> 16911 T1108 C67 P62934 /update {wt=javabin&version=2} {add=[13]} 0 7
[junit4:junit4]   2> 16915 T1080 C68 P62928 /update {wt=javabin&version=2} {add=[14 (1413704026095091712)]} 0 1
[junit4:junit4]   2> 16922 T1118 C64 P62937 REQ /update {distrib.from=http://127.0.0.1:62930/solr/collection1/&update.distrib=FROMLEADER&wt=javabin&version=2} status=0 QTime=1 
[junit4:junit4]   2> 16923 T1095 C65 P62930 /update {wt=javabin&version=2} {add=[14 (1413704026099286016)]} 0 5
[junit4:junit4]   2> 16926 T1080 C68 P62928 /update {wt=javabin&version=2} {add=[15 (1413704026106626048)]} 0 1
[junit4:junit4]   2> 16935 T1118 C64 P62937 REQ /update {update.distrib=FROMLEADER&distrib.from=http://127.0.0.1:62930/solr/collection1/&wt=javabin&version=2} status=0 QTime=1 
[junit4:junit4]   2> 16936 T1096 C65 P62930 REQ /update {distrib.from=http://127.0.0.1:62934/solr/collection1/&update.distrib=TOLEADER&wt=javabin&version=2} status=0 QTime=5 
[junit4:junit4]   2> 16936 T1108 C67 P62934 /update {wt=javabin&version=2} {add=[15]} 0 7
[junit4:junit4]   2> 16940 T1080 C68 P62928 /update {wt=javabin&version=2} {add=[16 (1413704026121306112)]} 0 1
[junit4:junit4]   2> 16949 T1118 C64 P62937 REQ /update {update.distrib=FROMLEADER&distrib.from=http://127.0.0.1:62930/solr/collection1/&wt=javabin&version=2} status=0 QTime=1 
[junit4:junit4]   2> 16950 T1096 C65 P62930 REQ /update {distrib.from=http://127.0.0.1:62934/solr/collection1/&update.distrib=TOLEADER&wt=javabin&version=2} status=0 QTime=5 
[junit4:junit4]   2> 16951 T1108 C67 P62934 /update {wt=javabin&version=2} {add=[16]} 0 8
[junit4:junit4]   2> 16957 T1080 C68 P62928 /update {wt=javabin&version=2} {add=[17 (1413704026138083328)]} 0 4
[junit4:junit4]   2> 16969 T1132 C66 P62944 REQ /update {distrib.from=http://127.0.0.1:62934/solr/collection1/&update.distrib=FROMLEADER&wt=javabin&version=2} status=0 QTime=4 
[junit4:junit4]   2> 16969 T1108 C67 P62934 /update {wt=javabin&version=2} {add=[17 (1413704026144374784)]} 0 10
[junit4:junit4]   2> 16974 T1080 C68 P62928 /update {wt=javabin&version=2} {add=[100 (1413704026156957696)]} 0 2
[junit4:junit4]   2> 17014 T1118 C64 P62937 REQ /update {update.distrib=FROMLEADER&distrib.from=http://127.0.0.1:62930/solr/collection1/&wt=javabin&version=2} status=0 QTime=13 
[junit4:junit4]   2> 17015 T1096 C65 P62930 REQ /update {distrib.from=http://127.0.0.1:62934/solr/collection1/&update.distrib=TOLEADER&wt=javabin&version=2} status=0 QTime=35 
[junit4:junit4]   2> 17015 T1108 C67 P62934 /update {wt=javabin&version=2} {add=[100]} 0 38
[junit4:junit4]   2> 17019 T1080 C68 P62928 /update {wt=javabin&version=2} {add=[101 (1413704026204143616)]} 0 1
[junit4:junit4]   2> 17028 T1118 C64 P62937 REQ /update {distrib.from=http://127.0.0.1:62930/solr/collection1/&update.distrib=FROMLEADER&wt=javabin&version=2} status=0 QTime=2 
[junit4:junit4]   2> 17029 T1095 C65 P62930 /update {wt=javabin&version=2} {add=[101 (1413704026208337920)]} 0 7
[junit4:junit4]   2> 17032 T1080 C68 P62928 /update {wt=javabin&version=2} {add=[102 (1413704026217775104)]} 0 1
[junit4:junit4]   2> 17039 T1118 C64 P62937 REQ /update {distrib.from=http://127.0.0.1:62930/solr/collection1/&update.distrib=FROMLEADER&wt=javabin&version=2} status=0 QTime=1 
[junit4:junit4]   2> 17040 T1095 C65 P62930 /update {wt=javabin&version=2} {add=[102 (1413704026221969408)]} 0 5
[junit4:junit4]   2> 17055 T1080 C68 P62928 /update {wt=javabin&version=2} {add=[103 (1413704026229309440)]} 0 13
[junit4:junit4]   2> 17064 T1132 C66 P62944 REQ /update {update.distrib=FROMLEADER&distrib.from=http://127.0.0.1:62934/solr/collection1/&wt=javabin&version=2} status=0 QTime=1 
[junit4:junit4]   2> 17065 T1112 C67 P62934 REQ /update {distrib.from=http://127.0.0.1:62930/solr/collection1/&update.distrib=TOLEADER&wt=javabin&version=2} status=0 QTime=5 
[junit4:junit4]   2> 17065 T1095 C65 P62930 /update {wt=javabin&version=2} {add=[103]} 0 7
[junit4:junit4]   2> 17070 T1080 C68 P62928 /update {wt=javabin&version=2} {add=[104 (1413704026256572416)]} 0 2
[junit4:junit4]   2> 17077 T1132 C66 P62944 REQ /update {distrib.from=http://127.0.0.1:62934/solr/collection1/&update.distrib=FROMLEADER&wt=javabin&version=2} status=0 QTime=1 
[junit4:junit4]   2> 17077 T1108 C67 P62934 /update {wt=javabin&version=2} {add=[104 (1413704026261815296)]} 0 4
[junit4:junit4]   2> 17081 T1080 C68 P62928 /update {wt=javabin&version=2} {add=[105 (1413704026269155328)]} 0 1
[junit4:junit4]   2> 17114 T1132 C66 P62944 REQ /update {update.distrib=FROMLEADER&distrib.from=http://127.0.0.1:62934/solr/collection1/&wt=javabin&version=2} status=0 QTime=13 
[junit4:junit4]   2> 17114 T1112 C67 P62934 REQ /update {distrib.from=http://127.0.0.1:62930/solr/collection1/&update.distrib=TOLEADER&wt=javabin&version=2} status=0 QTime=28 
[junit4:junit4]   2> 17115 T1095 C65 P62930 /update {wt=javabin&version=2} {add=[105]} 0 31
[junit4:junit4]   2> 17119 T1080 C68 P62928 /update {wt=javabin&version=2} {add=[106 (1413704026309001216)]} 0 1
[junit4:junit4]   2> 17130 T1132 C66 P62944 REQ /update {update.distrib=FROMLEADER&distrib.from=http://127.0.0.1:62934/solr/collection1/&wt=javabin&version=2} status=0 QTime=2 
[junit4:junit4]   2> 17131 T1112 C67 P62934 REQ /update {distrib.from=http://127.0.0.1:62930/solr/collection1/&update.distrib=TOLEADER&wt=javabin&version=2} status=0 QTime=7 
[junit4:junit4]   2> 17131 T1095 C65 P62930 /update {wt=javabin&version=2} {add=[106]} 0 9
[junit4:junit4]   2> 17135 T1080 C68 P62928 /update {wt=javabin&version=2} {add=[107 (1413704026325778432)]} 0 1
[junit4:junit4]   2> 17144 T1118 C64 P62937 REQ /update {update.distrib=FROMLEADER&distrib.from=http://127.0.0.1:62930/solr/collection1/&wt=javabin&version=2} status=0 QTime=1 
[junit4:junit4]   2> 17145 T1096 C65 P62930 REQ /update {distrib.from=http://127.0.0.1:62934/solr/collection1/&update.distrib=TOLEADER&wt=javabin&version=2} status=0 QTime=5 
[junit4:junit4]   2> 17145 T1108 C67 P62934 /update {wt=javabin&version=2} {add=[107]} 0 7
[junit4:junit4]   2> 17149 T1080 C68 P62928 /update {wt=javabin&version=2} {add=[108 (1413704026340458496)]} 0 1
[junit4:junit4]   2> 17158 T1118 C64 P62937 REQ /update {update.distrib=FROMLEADER&distrib.from=http://127.0.0.1:62930/solr/collection1/&wt=javabin&version=2} status=0 QTime=1 
[junit4:junit4]   2> 17158 T1096 C65 P62930 REQ /update {distrib.from=http://127.0.0.1:62934/solr/collection1/&update.distrib=TOLEADER&wt=javabin&version=2} status=0 QTime=4 
[junit4:junit4]   2> 17159 T1108 C67 P62934 /update {wt=javabin&version=2} {add=[108]} 0 7
[junit4:junit4]   2> 17163 T1080 C68 P62928 /update {wt=javabin&version=2} {add=[109 (1413704026355138560)]} 0 1
[junit4:junit4]   2> 17170 T1118 C64 P62937 REQ /update {distrib.from=http://127.0.0.1:62930/solr/collection1/&update.distrib=FROMLEADER&wt=javabin&version=2} status=0 QTime=1 
[junit4:junit4]   2> 17171 T1095 C65 P62930 /update {wt=javabin&version=2} {add=[109 (1413704026359332864)]} 0 5
[junit4:junit4]   2> 17174 T1080 C68 P62928 /update {wt=javabin&version=2} {add=[110 (1413704026366672896)]} 0 1
[junit4:junit4]   2> 17181 T1118 C64 P62937 REQ /update {distrib.from=http://127.0.0.1:62930/solr/collection1/&update.distrib=FROMLEADER&wt=javabin&version=2} status=0 QTime=1 
[junit4:junit4]   2> 17182 T1095 C65 P62930 /update {wt=javabin&version=2} {add=[110 (1413704026370867200)]} 0 5
[junit4:junit4]   2> 17185 T1080 C68 P62928 /update {wt=javabin&version=2} {add=[111 (1413704026378207232)]} 0 1
[junit4:junit4]   2> 17192 T1118 C64 P62937 REQ /update {distrib.from=http://127.0.0.1:62930/solr/collection1/&update.distrib=FROMLEADER&wt=javabin&version=2} status=0 QTime=1 
[junit4:junit4]   2> 17193 T1095 C65 P62930 /update {wt=javabin&version=2} {add=[111 (1413704026382401536)]} 0 5
[junit4:junit4]   2> 17196 T1080 C68 P62928 /update {wt=javabin&version=2} {add=[112 (1413704026389741568)]} 0 1
[junit4:junit4]   2> 17203 T1132 C66 P62944 REQ /update {distrib.from=http://127.0.0.1:62934/solr/collection1/&update.distrib=FROMLEADER&wt=javabin&version=2} status=0 QTime=1 
[junit4:junit4]   2> 17203 T1108 C67 P62934 /update {wt=javabin&version=2} {add=[112 (1413704026393935872)]} 0 4
[junit4:junit4]   2> 17218 T1080 C68 P62928 /update {wt=javabin&version=2} {add=[113 (1413704026401275904)]} 0 12
[junit4:junit4]   2> 17227 T1118 C64 P62937 REQ /update {update.distrib=FROMLEADER&distrib.from=http://127.0.0.1:62930/solr/collection1/&wt=javabin&version=2} status=0 QTime=1 
[junit4:junit4]   2> 17228 T1096 C65 P62930 REQ /update {distrib.from=http://127.0.0.1:62934/solr/collection1/&update.distrib=TOLEADER&wt=javabin&version=2} status=0 QTime=5 
[junit4:junit4]   2> 17228 T1108 C67 P62934 /update {wt=javabin&version=2} {add=[113]} 0 7
[junit4:junit4]   2> 17233 T1080 C68 P62928 /update {wt=javabin&version=2} {add=[114 (1413704026427490304)]} 0 2
[junit4:junit4]   2> 17240 T1118 C64 P62937 REQ /update {distrib.from=http://127.0.0.1:62930/solr/collection1/&update.distrib=FROMLEADER&wt=javabin&version=2} status=0 QTime=1 
[junit4:junit4]   2> 17241 T1095 C65 P62930 /update {wt=javabin&version=2} {add=[114 (1413704026432733184)]} 0 5
[junit4:junit4]   2> 17244 T1080 C68 P62928 /update {wt=javabin&version=2} {add=[115 (1413704026440073216)]} 0 1
[junit4:junit4]   2> 17251 T1132 C66 P62944 REQ /update {distrib.from=http://127.0.0.1:62934/solr/collection1/&update.distrib=FROMLEADER&wt=javabin&version=2} status=0 QTime=1 
[junit4:junit4]   2> 17251 T1108 C67 P62934 /update {wt=javabin&version=2} {add=[115 (1413704026444267520)]} 0 4
[junit4:junit4]   2> 17255 T1080 C68 P62928 /update {wt=javabin&version=2} {add=[116 (1413704026451607552)]} 0 1
[junit4:junit4]   2> 17262 T1132 C66 P62944 REQ /update {distrib.from=http://127.0.0.1:62934/solr/collection1/&update.distrib=FROMLEADER&wt=javabin&version=2} status=0 QTime=1 
[junit4:junit4]   2> 17262 T1108 C67 P62934 /update {wt=javabin&version=2} {add=[116 (1413704026455801856)]} 0 4
[junit4:junit4]   2> 17266 T1080 C68 P62928 /update {wt=javabin&version=2} {add=[117 (1413704026463141888)]} 0 1
[junit4:junit4]   2> 17273 T1132 C66 P62944 REQ /update {distrib.from=http://127.0.0.1:62934/solr/collection1/&update.distrib=FROMLEADER&wt=javabin&version=2} status=0 QTime=1 
[junit4:junit4]   2> 17273 T1108 C67 P62934 /update {wt=javabin&version=2} {add=[117 (1413704026467336192)]} 0 4
[junit4:junit4]   2> 17277 T1080 C68 P62928 /update {wt=javabin&version=2} {add=[118 (1413704026474676224)]} 0 1
[junit4:junit4]   2> 17306 T1118 C64 P62937 REQ /update {distrib.from=http://127.0.0.1:62930/solr/collection1/&update.distrib=FROMLEADER&wt=javabin&version=2} status=0 QTime=12 
[junit4:junit4]   2> 17306 T1095 C65 P62930 /update {wt=javabin&version=2} {add=[118 (1413704026478870528)]} 0 26
[junit4:junit4]   2> 17310 T1080 C68 P62928 /update {wt=javabin&version=2} {add=[119 (1413704026509279232)]} 0 1
[junit4:junit4]   2> 17317 T1132 C66 P62944 REQ /update {distrib.from=http://127.0.0.1:62934/solr/collection1/&update.distrib=FROMLEADER&wt=javabin&version=2} status=0 QTime=1 
[junit4:junit4]   2> 17317 T1108 C67 P62934 /update {wt=javabin&version=2} {add=[119 (1413704026513473536)]} 0 4
[junit4:junit4]   2> 17321 T1080 C68 P62928 /update {wt=javabin&version=2} {add=[120 (1413704026520813568)]} 0 1
[junit4:junit4]   2> 17332 T1132 C66 P62944 REQ /update {update.distrib=FROMLEADER&distrib.from=http://127.0.0.1:62934/solr/collection1/&wt=javabin&version=2} status=0 QTime=1 
[junit4:junit4]   2> 17333 T1112 C67 P62934 REQ /update {distrib.from=http://127.0.0.1:62930/solr/collection1/&update.distrib=TOLEADER&wt=javabin&version=2} status=0 QTime=6 
[junit4:junit4]   2> 17333 T1095 C65 P62930 /update {wt=javabin&version=2} {add=[120]} 0 9
[junit4:junit4]   2> 17337 T1080 C68 P62928 /update {wt=javabin&version=2} {add=[121 (1413704026537590784)]} 0 1
[junit4:junit4]   2> 17346 T1132 C66 P62944 REQ /update {update.distrib=FROMLEADER&distrib.from=http://127.0.0.1:62934/solr/collection1/&wt=javabin&version=2} status=0 QTime=1 
[junit4:junit4]   2> 17346 T1112 C67 P62934 REQ /update {distrib.from=http://127.0.0.1:62930/solr/collection1/&update.distrib=TOLEADER&wt=javabin&version=2} status=0 QTime=4 
[junit4:junit4]   2> 17347 T1095 C65 P62930 /update {wt=javabin&version=2} {add=[121]} 0 7
[junit4:junit4]   2> 17351 T1080 C68 P62928 /update {wt=javabin&version=2} {add=[122 (1413704026552270848)]} 0 1
[junit4:junit4]   2> 17362 T1118 C64 P62937 REQ /update {update.distrib=FROMLEADER&distrib.from=http://127.0.0.1:62930/solr/collection1/&wt=javabin&version=2} status=0 QTime=2 
[junit4:junit4]   2> 17363 T1096 C65 P62930 REQ /update {distrib.from=http://127.0.0.1:62934/solr/collection1/&update.distrib=TOLEADER&wt=javabin&version=2} status=0 QTime=7 
[junit4:junit4]   2> 17363 T1108 C67 P62934 /update {wt=javabin&version=2} {add=[122]} 0 9
[junit4:junit4]   2> 17379 T1080 C68 P62928 /update {wt=javabin&version=2} {add=[123 (1413704026569048064)]} 0 13
[junit4:junit4]   2> 17386 T1118 C64 P62937 REQ /update {distrib.from=http://127.0.0.1:62930/solr/collection1/&update.distrib=FROMLEADER&wt=javabin&version=2} status=0 QTime=1 
[junit4:junit4]   2> 17387 T1095 C65 P62930 /update {wt=javabin&version=2} {add=[123 (1413704026585825280)]} 0 5
[junit4:junit4]   2> 17391 T1080 C68 P62928 /update {wt=javabin&version=2} {add=[124 (1413704026593165312)]} 0 2
[junit4:junit4]   2> 17400 T1118 C64 P62937 REQ /update {update.distrib=FROMLEADER&distrib.from=http://127.0.0.1:62930/solr/collection1/&wt=javabin&version=2} status=0 QTime=1 
[junit4:junit4]   2> 17401 T1096 C65 P62930 REQ /update {distrib.from=http://127.0.0.1:62934/solr/collection1/&update.distrib=TOLEADER&wt=javabin&version=2} status=0 QTime=5 
[junit4:junit4]   2> 17401 T1108 C67 P62934 /update {wt=javabin&version=2} {add=[124]} 0 7
[junit4:junit4]   2> 17405 T1080 C68 P62928 /update {wt=javabin&version=2} {add=[125 (1413704026608893952)]} 0 1
[junit4:junit4]   2> 17412 T1118 C64 P62937 REQ /update {distrib.from=http://127.0.0.1:62930/solr/collection1/&update.distrib=FROMLEADER&wt=javabin&version=2} status=0 QTime=1 
[junit4:junit4]   2> 17413 T1095 C65 P62930 /update {wt=javabin&version=2} {add=[125 (1413704026613088256)]} 0 5
[junit4:junit4]   2> 17416 T1080 C68 P62928 /update {wt=javabin&version=2} {add=[126 (1413704026620428288)]} 0 1
[junit4:junit4]   2> 17425 T1132 C66 P62944 REQ /update {update.distrib=FROMLEADER&distrib.from=http://127.0.0.1:62934/solr/collection1/&wt=javabin&version=2} status=0 QTime=1 
[junit4:junit4]   2> 17425 T1112 C67 P62934 REQ /update {distrib.from=http://127.0.0.1:62930/solr/collection1/&update.distrib=TOLEADER&wt=javabin&version=2} status=0 QTime=4 
[junit4:junit4]   2> 17426 T1095 C65 P62930 /update {wt=javabin&version=2} {add=[126]} 0 7
[junit4:junit4]   2> 17430 T1080 C68 P62928 /update {wt=javabin&version=2} {add=[127 (1413704026635108352)]} 0 1
[junit4:junit4]   2> 17460 T1132 C66 P62944 REQ /update {distrib.from=http://127.0.0.1:62934/solr/collection1/&update.distrib=FROMLEADER&wt=javabin&version=2} status=0 QTime=12 
[junit4:junit4]   2> 17460 T1108 C67 P62934 /update {wt=javabin&version=2} {add=[127 (1413704026639302656)]} 0 27
[junit4:junit4]   2> 17464 T1080 C68 P62928 /update {wt=javabin&version=2} {add=[128 (1413704026670759936)]} 0 1
[junit4:junit4]   2> 17475 T1132 C66 P62944 REQ /update {update.distrib=FROMLEADER&distrib.from=http://127.0.0.1:62934/solr/collection1/&wt=javabin&version=2} status=0 QTime=2 
[junit4:junit4]   2> 17476 T1112 C67 P62934 REQ /update {distrib.from=http://127.0.0.1:62930/solr/collection1/&update.distrib=TOLEADER&wt=javabin&version=2} status=0 QTime=7 
[junit4:junit4]   2> 17476 T1095 C65 P62930 /update {wt=javabin&version=2} {add=[128]} 0 9
[junit4:junit4]   2> 17480 T1080 C68 P62928 /update {wt=javabin&version=2} {add=[129 (1413704026687537152)]} 0 1
[junit4:junit4]   2> 17489 T1118 C64 P62937 REQ /update {update.distrib=FROMLEADER&distrib.from=http://127.0.0.1:62930/solr/collection1/&wt=javabin&version=2} status=0 QTime=1 
[junit4:junit4]   2> 17490 T1096 C65 P62930 REQ /update {distrib.from=http://127.0.0.1:62934/solr/collection1/&update.distrib=TOLEADER&wt=javabin&version=2} status=0 QTime=5 
[junit4:junit4]   2> 17490 T1108 C67 P62934 /update {wt=javabin&version=2} {add=[129]} 0 7
[junit4:junit4]   2> 17494 T1080 C68 P62928 /update {wt=javabin&version=2} {add=[130 (1413704026702217216)]} 0 1
[junit4:junit4]   2> 17503 T1132 C66 P62944 REQ /update {update.distrib=FROMLEADER&distrib.from=http://127.0.0.1:62934/solr/collection1/&wt=javabin&version=2} status=0 QTime=1 
[junit4:junit4]   2> 17504 T1112 C67 P62934 REQ /update {distrib.from=http://127.0.0.1:62930/solr/collection1/&update.distrib=TOLEADER&wt=javabin&version=2} status=0 QTime=5 
[junit4:junit4]   2> 17504 T1095 C65 P62930 /update {wt=javabin&version=2} {add=[130]} 0 7
[junit4:junit4]   2> 17508 T1080 C68 P62928 /update {wt=javabin&version=2} {add=[131 (1413704026716897280)]} 0 1
[junit4:junit4]   2> 17517 T1132 C66 P62944 REQ /update {update.distrib=FROMLEADER&distrib.from=http://127.0.0.1:62934/solr/collection1/&wt=javabin&version=2} status=0 QTime=1 
[junit4:junit4]   2> 17517 T1112 C67 P62934 REQ /update {distrib.from=http://127.0.0.1:62930/solr/collection1/&update.distrib=TOLEADER&wt=javabin&version=2} status=0 QTime=4 
[junit4:junit4]   2> 17518 T1095 C65 P62930 /update {wt=javabin&version=2} {add=[131]} 0 7
[junit4:junit4]   2> 17522 T1080 C68 P62928 /update {wt=javabin&version=2} {add=[132 (1413704026731577344)]} 0 1
[junit4:junit4]   2> 17531 T1118 C64 P62937 REQ /update {update.distrib=FROMLEADER&distrib.from=http://127.0.0.1:62930/solr/collection1/&wt=javabin&version=2} status=0 QTime=1 
[junit4:junit4]   2> 17532 T1096 C65 P62930 REQ /update {distrib.from=http://127.0.0.1:62934/solr/collection1/&update.distrib=TOLEADER&wt=javabin&version=2} status=0 QTime=4 
[junit4:junit4]   2> 17532 T1108 C67 P62934 /update {wt=javabin&version=2} {add=[132]} 0 7
[junit4:junit4]   2> 17548 T1080 C68 P62928 /update {wt=javabin&version=2} {add=[133 (1413704026746257408)]} 0 13
[junit4:junit4]   2> 17556 T1118 C64 P62937 REQ /update {update.distrib=FROMLEADER&distrib.from=http://127.0.0.1:62930/solr/collection1/&wt=javabin&version=2} status=0 QTime=1 
[junit4:junit4]   2> 17557 T1096 C65 P62930 REQ /update {distrib.from=http://127.0.0.1:62934/solr/collection1/&update.distrib=TOLEADER&wt=javabin&version=2} status=0 QTime=5 
[junit4:junit4]   2> 17557 T1108 C67 P62934 /update {wt=javabin&version=2} {add=[133]} 0 7
[junit4:junit4]   2> 17562 T1080 C68 P62928 /update {wt=javabin&version=2} {add=[134 (1413704026772471808)]} 0 2
[junit4:junit4]   2> 17571 T1132 C66 P62944 REQ /update {update.distrib=FROMLEADER&distrib.from=http://127.0.0.1:62934/solr/collection1/&wt=javabin&version=2} status=0 QTime=1 
[junit4:junit4]   2> 17572 T1112 C67 P62934 REQ /update {distrib.from=http://127.0.0.1:62930/solr/collection1/&update.distrib=TOLEADER&wt=javabin&version=2} status=0 QTime=5 
[junit4:junit4]   2> 17572 T1095 C65 P62930 /update {wt=javabin&version=2} {add=[134]} 0 7
[junit4:junit4]   2> 17576 T1080 C68 P62928 /update {wt=javabin&version=2} {add=[135 (1413704026788200448)]} 0 1
[junit4:junit4]   2> 17582 T1118 C64 P62937 REQ /update {distrib.from=http://127.0.0.1:62930/solr/collection1/&update.distrib=FROMLEADER&wt=javabin&version=2} status=0 QTime=1 
[junit4:junit4]   2> 17582 T1095 C65 P62930 /update {wt=javabin&version=2} {add=[135 (1413704026791346176)]} 0 4
[junit4:junit4]   2> 17586 T1080 C68 P62928 /update {wt=javabin&version=2} {add=[136 (1413704026798686208)]} 0 1
[junit4:junit4]   2> 17593 T1132 C66 P62944 REQ /update {distrib.from=http://127.0.0.1:62934/solr/collection1/&update.distrib=FROMLEADER&wt=javabin&version=2} status=0 QTime=1 
[junit4:junit4]   2> 17593 T1108 C67 P62934 /update {wt=javabin&version=2} {add=[136 (1413704026802880512)]} 0 4
[junit4:junit4]   2> 17597 T1080 C68 P62928 /update {wt=javabin&version=2} {add=[137 (1413704026810220544)]} 0 1
[junit4:junit4]   2> 17603 T1132 C66 P62944 REQ /update {distrib.from=http://127.0.0.1:62934/solr/collection1/&update.distrib=FROMLEADER&wt=javabin&version=2} status=0 QTime=1 
[junit4:junit4]   2> 17604 T1108 C67 P62934 /update {wt=javabin&version=2} {add=[137 (1413704026813366272)]} 0 5
[junit4:junit4]   2> 17607 T1080 C68 P62928 /update {wt=javabin&version=2} {add=[138 (1413704026820706304)]} 0 1
[junit4:junit4]   2> 17614 T1118 C64 P62937 REQ /update {distrib.from=http://127.0.0.1:62930/solr/collection1/&update.distrib=FROMLEADER&wt=javabin&version=2} status=0 QTime=1 
[junit4:junit4]   2> 17615 T1095 C65 P62930 /update {wt=javabin&version=2} {add=[138 (1413704026824900608)]} 0 5
[junit4:junit4]   2> 17618 T1080 C68 P62928 /update {wt=javabin&version=2} {add=[139 (1413704026832240640)]} 0 1
[junit4:junit4]   2> 17626 T1132 C66 P62944 REQ /update {update.distrib=FROMLEADER&distrib.from=http://127.0.0.1:62934/solr/collection1/&wt=javabin&version=2} status=0 QTime=1 
[junit4:junit4]   2> 17627 T1112 C67 P62934 REQ /update {distrib.from=http://127.0.0.1:62930/solr/collection1/&update.distrib=TOLEADER&wt=javabin&version=2} status=0 QTime=5 
[junit4:junit4]   2> 17627 T1095 C65 P62930 /update {wt=javabin&version=2} {add=[139]} 0 7
[junit4:junit4]   2> 17631 T1080 C68 P62928 /update {wt=javabin&version=2} {add=[140 (1413704026845872128)]} 0 1
[junit4:junit4]   2> 17640 T1132 C66 P62944 REQ /update {update.distrib=FROMLEADER&distrib.from=http://127.0.0.1:62934/solr/collection1/&wt=javabin&version=2} status=0 QTime=1 
[junit4:junit4]   2> 17641 T1112 C67 P62934 REQ /update {distrib.from=http://127.0.0.1:62930/solr/collection1/&update.distrib=TOLEADER&wt=javabin&version=2} status=0 QTime=5 
[junit4:junit4]   2> 17641 T1095 C65 P62930 /update {wt=javabin&version=2} {add=[140]} 0 7
[junit4:junit4]   2> 17645 T1080 C68 P62928 /update {wt=javabin&version=2} {add=[141 (1413704026860552192)]} 0 1
[junit4:junit4]   2> 17654 T1132 C66 P62944 REQ /update {update.distrib=FROMLEADER&distrib.from=http://127.0.0.1:62934/solr/collection1/&wt=javabin&version=2} status=0 QTime=1 
[junit4:junit4]   2> 17654 T1112 C67 P62934 REQ /update {distrib.from=http://127.0.0.1:62930/solr/collection1/&update.distrib=TOLEADER&wt=javabin&version=2} status=0 QTime=4 
[junit4:junit4]   2> 17655 T1095 C65 P62930 /update {wt=javabin&version=2} {add=[141]} 0 7
[junit4:junit4]   2> 17659 T1080 C68 P62928 /update {wt=javabin&version=2} {add=[142 (1413704026875232256)]} 0 1
[junit4:junit4]   2> 17688 T1132 C66 P62944 REQ /update {distrib.from=http://127.0.0.1:62934/solr/collection1/&update.distrib=FROMLEADER&wt=javabin&version=2} status=0 QTime=12 
[junit4:junit4]   2> 17688 T1108 C67 P62934 /update {wt=javabin&version=2} {add=[142 (1413704026879426560)]} 0 26
[junit4:junit4]   2> 17703 T1080 C68 P62928 /update {wt=javabin&version=2} {add=[143 (1413704026909835264)]} 0 12
[junit4:junit4]   2> 17712 T1132 C66 P62944 REQ /update {distrib.from=http://127.0.0.1:62934/solr/collection1/&update.distrib=FROMLEADER&wt=javabin&version=2} status=0 QTime=2 
[junit4:junit4]   2> 17713 T1108 C67 P62934 /update {wt=javabin&version=2} {add=[143 (1413704026925563904)]} 0 7
[junit4:junit4]   2> 17717 T1080 C68 P62928 /update {wt=javabin&version=2} {add=[144 (1413704026935001088)]} 0 2
[junit4:junit4]   2> 17726 T1132 C66 P62944 REQ /update {update.distrib=FROMLEADER&distrib.from=http://127.0.0.1:62934/solr/collection1/&wt=javabin&version=2} status=0 QTime=1 
[junit4:junit4]   2> 17726 T1112 C67 P62934 REQ /update {distrib.from=http://127.0.0.1:62930/solr/collection1/&update.distrib=TOLEADER&wt=javabin&version=2} status=0 QTime=4 
[junit4:junit4]   2> 17727 T1095 C65 P62930 /update {wt=javabin&version=2} {add=[144]} 0 7
[junit4:junit4]   2> 17731 T1080 C68 P62928 /update {wt=javabin&version=2} {add=[145 (1413704026950729728)]} 0 1
[junit4:junit4]   2> 17740 T1132 C66 P62944 REQ /update {update.distrib=FROMLEADER&distrib.from=http://127.0.0.1:62934/solr/collection1/&wt=javabin&version=2} status=0 QTime=1 
[junit4:junit4]   2> 17741 T1112 C67 P62934 REQ /update {distrib.from=http://127.0.0.1:62930/solr/collection1/&update.distrib=TOLEADER&wt=javabin&version=2} status=0 QTime=5 
[junit4:junit4]   2> 17741 T1095 C65 P62930 /update {wt=javabin&version=2} {add=[145]} 0 7
[junit4:junit4]   2> 17745 T1080 C68 P62928 /update {wt=javabin&version=2} {add=[146 (1413704026965409792)]} 0 1
[junit4:junit4]   2> 17776 T1118 C64 P62937 REQ /update {update.distrib=FROMLEADER&distrib.from=http://127.0.0.1:62930/solr/collection1/&wt=javabin&version=2} status=0 QTime=12 
[junit4:junit4]   2> 17777 T1096 C65 P62930 REQ /update {distrib.from=http://127.0.0.1:62934/solr/collection1/&update.distrib=TOLEADER&wt=javabin&version=2} status=0 QTime=27 
[junit4:junit4]   2> 17777 T1108 C67 P62934 /update {wt=javabin&version=2} {add=[146]} 0 29
[junit4:junit4]   2> 17781 T1080 C68 P62928 /update {wt=javabin&version=2} {add=[147 (1413704027003158528)]} 0 1
[junit4:junit4]   2> 17790 T1132 C66 P62944 REQ /update {update.distrib=FROMLEADER&distrib.from=http://127.0.0.1:62934/solr/collection1/&wt=javabin&version=2} status=0 QTime=1 
[junit4:junit4]   2> 17791 T1112 C67 P62934 REQ /update {distrib.from=http://127.0.0.1:62930/solr/collection1/&update.distrib=TOLEADER&wt=javabin&version=2} status=0 QTime=5 
[junit4:junit4]   2> 17791 T1095 C65 P62930 /update {wt=javabin&version=2} {add=[147]} 0 7
[junit4:junit4]   2> 17795 T1080 C68 P62928 /update {wt=javabin&version=2} {add=[148 (1413704027017838592)]} 0 1
[junit4:junit4]   2> 17804 T1118 C64 P62937 REQ /update {distrib.from=http://127.0.0.1:62930/solr/collection1/&update.distrib=FROMLEADER&wt=javabin&version=2} status=0 QTime=2 
[junit4:junit4]   2> 17805 T1095 C65 P62930 /update {wt=javabin&version=2} {add=[148 (1413704027022032896)]} 0 7
[junit4:junit4]   2> 17808 T1080 C68 P62928 /update {wt=javabin&version=2} {add=[149 (1413704027031470080)]} 0 1
[junit4:junit4]   2> 17817 T1132 C66 P62944 REQ /update {update.distrib=FROMLEADER&distrib.from=http://127.0.0.1:62934/solr/collection1/&wt=javabin&version=2} status=0 QTime=1 
[junit4:junit4]   2> 17818 T1112 C67 P62934 REQ /update {distrib.from=http://127.0.0.1:62930/solr/collection1/&update.distrib=TOLEADER&wt=javabin&version=2} status=0 QTime=5 
[junit4:junit4]   2> 17818 T1095 C65 P62930 /update {wt=javabin&version=2} {add=[149]} 0 7
[junit4:junit4]   2> 17819 T1068 oasc.AbstractDistribZkTestBase.waitForRecoveriesToFinish Wait for recoveries to finish - collection: collection1 failOnTimeout:true timeout (sec):1800
[junit4:junit4]   2> 17820 T1068 oascc.ZkStateReader.updateClusterState Updating cloud state from ZooKeeper... 
[junit4:junit4]   2> 17823 T1080 C68 P62928 oasu.DirectUpdateHandler2.commit start commit{flags=0,_version_=0,optimize=false,openSearcher=true,waitSearcher=true,expungeDeletes=false,softCommit=false}
[junit4:junit4]   2> 18196 T1080 C68 P62928 oasc.SolrDeletionPolicy.onCommit SolrDeletionPolicy.onCommit: commits:num=2
[junit4:junit4]   2> 		commit{dir=NRTCachingDirectory(org.apache.lucene.store.NIOFSDirectory@/usr/home/hudson/hudson-slave/workspace/Lucene-Solr-Tests-trunk-java7/solr/build/solr-core/test/J1/org.apache.solr.cloud.BasicDistributedZk2Test-1348213203779/control/data/index lockFactory=org.apache.lucene.store.NativeFSLockFactory@75750677; maxCacheMB=48.0 maxMergeSizeMB=4.0),segFN=segments_2,generation=2,filenames=[_0_Asserting_0.tim, _0_Lucene40_0.tim, _0.fnm, _0_Asserting_0.tip, _0_Memory_0.ram, _0_NestedPulsing_0.frq, _0_nrm.cfs, _0_Lucene40_0.prx, _0_NestedPulsing_0.tip, _0_NestedPulsing_0.prx, _0_NestedPulsing_0.tim, _0_Lucene40_0.tip, _0_Asserting_0.prx, _0_Asserting_0.frq, _0_Lucene40_0.frq, _0_nrm.cfe, segments_2, _0.fdx, _0.si, _0.fdt]
[junit4:junit4]   2> 		commit{dir=NRTCachingDirectory(org.apache.lucene.store.NIOFSDirectory@/usr/home/hudson/hudson-slave/workspace/Lucene-Solr-Tests-trunk-java7/solr/build/solr-core/test/J1/org.apache.solr.cloud.BasicDistributedZk2Test-1348213203779/control/data/i

[...truncated too long message...]

estBase.java:154)
[junit4:junit4]    > 	at org.apache.solr.cloud.AbstractFullDistribZkTestBase.waitForRecoveriesToFinish(AbstractFullDistribZkTestBase.java:560)
[junit4:junit4]    > 	at org.apache.solr.cloud.AbstractFullDistribZkTestBase.waitForThingsToLevelOut(AbstractFullDistribZkTestBase.java:1135)
[junit4:junit4]    > 	at org.apache.solr.cloud.SyncSliceTest.doTest(SyncSliceTest.java:162)
[junit4:junit4]    > 	at org.apache.solr.BaseDistributedSearchTestCase.testDistribSearch(BaseDistributedSearchTestCase.java:695)
[junit4:junit4]    > 	at sun.reflect.NativeMethodAccessorImpl.invoke0(Native Method)
[junit4:junit4]    > 	at sun.reflect.NativeMethodAccessorImpl.invoke(NativeMethodAccessorImpl.java:57)
[junit4:junit4]    > 	at sun.reflect.DelegatingMethodAccessorImpl.invoke(DelegatingMethodAccessorImpl.java:43)
[junit4:junit4]    > 	at java.lang.reflect.Method.invoke(Method.java:601)
[junit4:junit4]    > 	at com.carrotsearch.randomizedtesting.RandomizedRunner.invoke(RandomizedRunner.java:1559)
[junit4:junit4]    > 	at com.carrotsearch.randomizedtesting.RandomizedRunner.access$600(RandomizedRunner.java:79)
[junit4:junit4]    > 	at com.carrotsearch.randomizedtesting.RandomizedRunner$6.evaluate(RandomizedRunner.java:737)
[junit4:junit4]    > 	at com.carrotsearch.randomizedtesting.RandomizedRunner$7.evaluate(RandomizedRunner.java:773)
[junit4:junit4]    > 	at com.carrotsearch.randomizedtesting.RandomizedRunner$8.evaluate(RandomizedRunner.java:787)
[junit4:junit4]    > 	at com.carrotsearch.randomizedtesting.rules.SystemPropertiesRestoreRule$1.evaluate(SystemPropertiesRestoreRule.java:53)
[junit4:junit4]    > 	at org.apache.lucene.util.TestRuleSetupTeardownChained$1.evaluate(TestRuleSetupTeardownChained.java:50)
[junit4:junit4]    > 	at org.apache.lucene.util.TestRuleFieldCacheSanity$1.evaluate(TestRuleFieldCacheSanity.java:51)
[junit4:junit4]    > 	at org.apache.lucene.util.AbstractBeforeAfterRule$1.evaluate(AbstractBeforeAfterRule.java:45)
[junit4:junit4]    > 	at com.carrotsearch.randomizedtesting.rules.SystemPropertiesInvariantRule$1.evaluate(SystemPropertiesInvariantRule.java:55)
[junit4:junit4]    > 	at org.apache.lucene.util.TestRuleThreadAndTestName$1.evaluate(TestRuleThreadAndTestName.java:48)
[junit4:junit4]    > 	at org.apache.lucene.util.TestRuleIgnoreAfterMaxFailures$1.evaluate(TestRuleIgnoreAfterMaxFailures.java:70)
[junit4:junit4]    > 	at org.apache.lucene.util.TestRuleMarkFailure$1.evaluate(TestRuleMarkFailure.java:48)
[junit4:junit4]    > 	at com.carrotsearch.randomizedtesting.rules.StatementAdapter.evaluate(StatementAdapter.java:36)
[junit4:junit4]    > 	at com.carrotsearch.randomizedtesting.ThreadLeakControl$StatementRunner.run(ThreadLeakControl.java:358)
[junit4:junit4]    > 	at com.carrotsearch.randomizedtesting.ThreadLeakControl.forkTimeoutingTask(ThreadLeakControl.java:782)
[junit4:junit4]    > 	at com.carrotsearch.randomizedtesting.ThreadLeakControl$3.evaluate(ThreadLeakControl.java:442)
[junit4:junit4]    > 	at com.carrotsearch.randomizedtesting.RandomizedRunner.runSingleTest(RandomizedRunner.java:746)
[junit4:junit4]    > 	at com.carrotsearch.randomizedtesting.RandomizedRunner$3.evaluate(RandomizedRunner.java:648)
[junit4:junit4]    > 	at com.carrotsearch.randomizedtesting.RandomizedRunner$4.evaluate(RandomizedRunner.java:682)
[junit4:junit4]    > 	at com.carrotsearch.randomizedtesting.RandomizedRunner$5.evaluate(RandomizedRunner.java:693)
[junit4:junit4]    > 	at com.carrotsearch.randomizedtesting.rules.StatementAdapter.evaluate(StatementAdapter.java:36)
[junit4:junit4]    > 	at com.carrotsearch.randomizedtesting.rules.SystemPropertiesRestoreRule$1.evaluate(SystemPropertiesRestoreRule.java:53)
[junit4:junit4]    > 	at org.apache.lucene.util.AbstractBeforeAfterRule$1.evaluate(AbstractBeforeAfterRule.java:45)
[junit4:junit4]    > 	at org.apache.lucene.util.TestRuleStoreClassName$1.evaluate(TestRuleStoreClassName.java:42)
[junit4:junit4]    > 	at com.carrotsearch.randomizedtesting.rules.SystemPropertiesInvariantRule$1.evaluate(SystemPropertiesInvariantRule.java:55)
[junit4:junit4]    > 	at com.carrotsearch.randomizedtesting.rules.NoShadowingOrOverridesOnMethodsRule$1.evaluate(NoShadowingOrOverridesOnMethodsRule.java:39)
[junit4:junit4]    > 	at com.carrotsearch.randomizedtesting.rules.NoShadowingOrOverridesOnMethodsRule$1.evaluate(NoShadowingOrOverridesOnMethodsRule.java:39)
[junit4:junit4]    > 	at com.carrotsearch.randomizedtesting.rules.StatementAdapter.evaluate(StatementAdapter.java:36)
[junit4:junit4]    > 	at org.apache.lucene.util.TestRuleAssertionsRequired$1.evaluate(TestRuleAssertionsRequired.java:43)
[junit4:junit4]    > 	at org.apache.lucene.util.TestRuleMarkFailure$1.evaluate(TestRuleMarkFailure.java:48)
[junit4:junit4]    > 	at org.apache.lucene.util.TestRuleIgnoreAfterMaxFailures$1.evaluate(TestRuleIgnoreAfterMaxFailures.java:70)
[junit4:junit4]    > 	at org.apache.lucene.util.TestRuleIgnoreTestSuites$1.evaluate(TestRuleIgnoreTestSuites.java:55)
[junit4:junit4]    > 	at com.carrotsearch.randomizedtesting.rules.StatementAdapter.evaluate(StatementAdapter.java:36)
[junit4:junit4]    > 	at com.carrotsearch.randomizedtesting.ThreadLeakControl$StatementRunner.run(ThreadLeakControl.java:358)
[junit4:junit4]    > 	at java.lang.Thread.run(Thread.java:722)
[junit4:junit4]   2> 135609 T2649 oas.SolrTestCaseJ4.deleteCore ###deleteCore
[junit4:junit4]   2> NOTE: test params are: codec=Lucene40: {range_facet_l=PostingsFormat(name=SimpleText), text=PostingsFormat(name=Lucene40WithOrds), _version_=PostingsFormat(name=SimpleText), rnd_b=PostingsFormat(name=Memory doPackFST= false), intDefault=PostingsFormat(name=SimpleText), timestamp=PostingsFormat(name=SimpleText), id=PostingsFormat(name=Memory doPackFST= false), a_t=PostingsFormat(name=SimpleText), range_facet_sl=PostingsFormat(name=Lucene40WithOrds), range_facet_si=PostingsFormat(name=Direct), other_tl1=PostingsFormat(name=SimpleText), multiDefault=PostingsFormat(name=Direct), a_si=PostingsFormat(name=Direct)}, sim=RandomSimilarityProvider(queryNorm=false,coord=crazy): {}, locale=ar_QA, timezone=Europe/Vaduz
[junit4:junit4]   2> NOTE: FreeBSD 9.0-RELEASE amd64/Oracle Corporation 1.7.0_06 (64-bit)/cpus=16,threads=1,free=361359520,total=524288000
[junit4:junit4]   2> NOTE: All tests run in this JVM: [BinaryUpdateRequestHandlerTest, DistanceFunctionTest, QueryElevationComponentTest, TestCoreContainer, TestGroupingSearch, TestLMJelinekMercerSimilarityFactory, ClusterStateTest, TestNumberUtils, NotRequiredUniqueKeyTest, PreAnalyzedFieldTest, TestFastOutputStream, AlternateDirectoryTest, TestStressVersions, TermsComponentTest, TestFastLRUCache, TestRandomFaceting, TestPerFieldSimilarity, SolrCoreCheckLockOnStartupTest, NumericFieldsTest, AutoCommitTest, TestSolrJ, DateMathParserTest, SolrRequestParserTest, SearchHandlerTest, TestDefaultSimilarityFactory, DirectSolrConnectionTest, ResponseLogComponentTest, PluginInfoTest, TestConfig, SimplePostToolTest, TestPHPSerializedResponseWriter, FileBasedSpellCheckerTest, SimpleFacetsTest, TestWordDelimiterFilterFactory, IndexBasedSpellCheckerTest, UpdateRequestProcessorFactoryTest, SystemInfoHandlerTest, BadComponentTest, SpellPossibilityIteratorTest, NoCacheHeaderTest, DistributedTermsComponentTest, CoreAdminHandlerTest, CoreContainerCoreInitFailuresTest, LoggingHandlerTest, DistributedSpellCheckComponentTest, TestFiltering, TestBadConfig, TestRangeQuery, MoreLikeThisHandlerTest, ZkCLITest, DefaultValueUpdateProcessorTest, SuggesterFSTTest, CSVRequestHandlerTest, CircularListTest, BasicDistributedZkTest, OverseerTest, SpellCheckComponentTest, TestReplicationHandler, LeaderElectionIntegrationTest, TestRealTimeGet, ZkControllerTest, SpellCheckCollatorTest, TestExtendedDismaxParser, SoftAutoCommitTest, ZkSolrClientTest, TestFaceting, WordBreakSolrSpellCheckerTest, StatsComponentTest, TestRecovery, TestJoin, SolrCoreTest, LukeRequestHandlerTest, DirectSolrSpellCheckerTest, SortByFunctionTest, TestBinaryResponseWriter, SampleTest, HighlighterTest, TestIndexSearcher, TestTrie, CacheHeaderTest, QueryEqualityTest, TestCSVLoader, SpatialFilterTest, MBeansHandlerTest, CurrencyFieldTest, TestPseudoReturnFields, SolrInfoMBeanTest, MinimalSchemaTest, TestQueryTypes, XmlUpdateRequestHandlerTest, FieldAnalysisRequestHandlerTest, SuggesterWFSTTest, TestSurroundQueryParser, DirectUpdateHandlerOptimizeTest, TestSolrQueryParser, FastVectorHighlighterTest, JSONWriterTest, RequestHandlersTest, TestArbitraryIndexDir, SolrCmdDistributorTest, TestLuceneMatchVersion, TestPropInject, TestIndexingPerformance, HighlighterConfigTest, SOLR749Test, TestXIncludeConfig, TestDocSet, TestQuerySenderListener, IndexReaderFactoryTest, OutputWriterTest, TestJmxMonitoredMap, TestPhraseSuggestions, LegacyHTMLStripCharFilterTest, TestCodecSupport, PrimUtilsTest, ResourceLoaderTest, TestSolrXMLSerializer, SpellingQueryConverterTest, ZkNodePropsTest, AnalysisAfterCoreReloadTest, SyncSliceTest]
[junit4:junit4] Completed on J0 in 135.64s, 1 test, 1 failure <<< FAILURES!

[...truncated 11 lines...]
BUILD FAILED
/usr/home/hudson/hudson-slave/workspace/Lucene-Solr-Tests-trunk-java7/build.xml:32: The following error occurred while executing this line:
/usr/home/hudson/hudson-slave/workspace/Lucene-Solr-Tests-trunk-java7/solr/build.xml:179: The following error occurred while executing this line:
/usr/home/hudson/hudson-slave/workspace/Lucene-Solr-Tests-trunk-java7/lucene/module-build.xml:63: The following error occurred while executing this line:
/usr/home/hudson/hudson-slave/workspace/Lucene-Solr-Tests-trunk-java7/lucene/common-build.xml:1140: The following error occurred while executing this line:
/usr/home/hudson/hudson-slave/workspace/Lucene-Solr-Tests-trunk-java7/lucene/common-build.xml:813: There were test failures: 230 suites, 950 tests, 2 failures, 7 ignored (2 assumptions)

Total time: 30 minutes 45 seconds
Build step 'Invoke Ant' marked build as failure
Recording test results
Email was triggered for: Failure
Sending email for trigger: Failure



Mime
View raw message