lucene-dev mailing list archives

Site index · List index
Message view « Date » · « Thread »
Top « Date » · « Thread »
From Apache Jenkins Server <jenk...@builds.apache.org>
Subject [JENKINS] Lucene-Solr-Tests-trunk-java7 - Build # 3171 - Failure
Date Fri, 07 Sep 2012 00:19:07 GMT
Build: https://builds.apache.org/job/Lucene-Solr-Tests-trunk-java7/3171/

3 tests failed.
FAILED:  junit.framework.TestSuite.org.apache.solr.handler.TestReplicationHandler

Error Message:
ERROR: SolrIndexSearcher opens=76 closes=75

Stack Trace:
java.lang.AssertionError: ERROR: SolrIndexSearcher opens=76 closes=75
	at __randomizedtesting.SeedInfo.seed([766A42608FB47CD6]:0)
	at org.junit.Assert.fail(Assert.java:93)
	at org.apache.solr.SolrTestCaseJ4.endTrackingSearchers(SolrTestCaseJ4.java:223)
	at org.apache.solr.SolrTestCaseJ4.afterClass(SolrTestCaseJ4.java:89)
	at sun.reflect.NativeMethodAccessorImpl.invoke0(Native Method)
	at sun.reflect.NativeMethodAccessorImpl.invoke(NativeMethodAccessorImpl.java:57)
	at sun.reflect.DelegatingMethodAccessorImpl.invoke(DelegatingMethodAccessorImpl.java:43)
	at java.lang.reflect.Method.invoke(Method.java:601)
	at com.carrotsearch.randomizedtesting.RandomizedRunner.invoke(RandomizedRunner.java:1559)
	at com.carrotsearch.randomizedtesting.RandomizedRunner.access$600(RandomizedRunner.java:79)
	at com.carrotsearch.randomizedtesting.RandomizedRunner$5.evaluate(RandomizedRunner.java:700)
	at com.carrotsearch.randomizedtesting.rules.StatementAdapter.evaluate(StatementAdapter.java:36)
	at com.carrotsearch.randomizedtesting.rules.SystemPropertiesRestoreRule$1.evaluate(SystemPropertiesRestoreRule.java:53)
	at org.apache.lucene.util.AbstractBeforeAfterRule$1.evaluate(AbstractBeforeAfterRule.java:45)
	at org.apache.lucene.util.TestRuleStoreClassName$1.evaluate(TestRuleStoreClassName.java:42)
	at com.carrotsearch.randomizedtesting.rules.SystemPropertiesInvariantRule$1.evaluate(SystemPropertiesInvariantRule.java:55)
	at com.carrotsearch.randomizedtesting.rules.NoShadowingOrOverridesOnMethodsRule$1.evaluate(NoShadowingOrOverridesOnMethodsRule.java:39)
	at com.carrotsearch.randomizedtesting.rules.NoShadowingOrOverridesOnMethodsRule$1.evaluate(NoShadowingOrOverridesOnMethodsRule.java:39)
	at org.apache.lucene.util.TestRuleAssertionsRequired$1.evaluate(TestRuleAssertionsRequired.java:40)
	at org.apache.lucene.util.TestRuleMarkFailure$1.evaluate(TestRuleMarkFailure.java:48)
	at org.apache.lucene.util.TestRuleIgnoreAfterMaxFailures$1.evaluate(TestRuleIgnoreAfterMaxFailures.java:70)
	at org.apache.lucene.util.TestRuleIgnoreTestSuites$1.evaluate(TestRuleIgnoreTestSuites.java:55)
	at com.carrotsearch.randomizedtesting.rules.StatementAdapter.evaluate(StatementAdapter.java:36)
	at com.carrotsearch.randomizedtesting.ThreadLeakControl$StatementRunner.run(ThreadLeakControl.java:358)
	at java.lang.Thread.run(Thread.java:722)


REGRESSION:  org.apache.solr.update.SoftAutoCommitTest.testSoftAndHardCommitMaxTimeRapidAdds

Error Message:
1: soft occured too fast: 1346976220088 + (500 * 1) !<= 1346976220484

Stack Trace:
java.lang.AssertionError: 1: soft occured too fast: 1346976220088 + (500 * 1) !<= 1346976220484
	at __randomizedtesting.SeedInfo.seed([766A42608FB47CD6:2A7FEC5964363DAE]:0)
	at org.junit.Assert.fail(Assert.java:93)
	at org.junit.Assert.assertTrue(Assert.java:43)
	at org.apache.solr.update.SoftAutoCommitTest.testSoftAndHardCommitMaxTimeRapidAdds(SoftAutoCommitTest.java:312)
	at sun.reflect.NativeMethodAccessorImpl.invoke0(Native Method)
	at sun.reflect.NativeMethodAccessorImpl.invoke(NativeMethodAccessorImpl.java:57)
	at sun.reflect.DelegatingMethodAccessorImpl.invoke(DelegatingMethodAccessorImpl.java:43)
	at java.lang.reflect.Method.invoke(Method.java:601)
	at com.carrotsearch.randomizedtesting.RandomizedRunner.invoke(RandomizedRunner.java:1559)
	at com.carrotsearch.randomizedtesting.RandomizedRunner.access$600(RandomizedRunner.java:79)
	at com.carrotsearch.randomizedtesting.RandomizedRunner$6.evaluate(RandomizedRunner.java:737)
	at com.carrotsearch.randomizedtesting.RandomizedRunner$7.evaluate(RandomizedRunner.java:773)
	at com.carrotsearch.randomizedtesting.RandomizedRunner$8.evaluate(RandomizedRunner.java:787)
	at com.carrotsearch.randomizedtesting.rules.SystemPropertiesRestoreRule$1.evaluate(SystemPropertiesRestoreRule.java:53)
	at org.apache.lucene.util.TestRuleSetupTeardownChained$1.evaluate(TestRuleSetupTeardownChained.java:50)
	at org.apache.lucene.util.TestRuleFieldCacheSanity$1.evaluate(TestRuleFieldCacheSanity.java:51)
	at org.apache.lucene.util.AbstractBeforeAfterRule$1.evaluate(AbstractBeforeAfterRule.java:45)
	at com.carrotsearch.randomizedtesting.rules.SystemPropertiesInvariantRule$1.evaluate(SystemPropertiesInvariantRule.java:55)
	at org.apache.lucene.util.TestRuleThreadAndTestName$1.evaluate(TestRuleThreadAndTestName.java:48)
	at org.apache.lucene.util.TestRuleIgnoreAfterMaxFailures$1.evaluate(TestRuleIgnoreAfterMaxFailures.java:70)
	at org.apache.lucene.util.TestRuleMarkFailure$1.evaluate(TestRuleMarkFailure.java:48)
	at com.carrotsearch.randomizedtesting.rules.StatementAdapter.evaluate(StatementAdapter.java:36)
	at com.carrotsearch.randomizedtesting.ThreadLeakControl$StatementRunner.run(ThreadLeakControl.java:358)
	at com.carrotsearch.randomizedtesting.ThreadLeakControl.forkTimeoutingTask(ThreadLeakControl.java:782)
	at com.carrotsearch.randomizedtesting.ThreadLeakControl$3.evaluate(ThreadLeakControl.java:442)
	at com.carrotsearch.randomizedtesting.RandomizedRunner.runSingleTest(RandomizedRunner.java:746)
	at com.carrotsearch.randomizedtesting.RandomizedRunner$3.evaluate(RandomizedRunner.java:648)
	at com.carrotsearch.randomizedtesting.RandomizedRunner$4.evaluate(RandomizedRunner.java:682)
	at com.carrotsearch.randomizedtesting.RandomizedRunner$5.evaluate(RandomizedRunner.java:693)
	at com.carrotsearch.randomizedtesting.rules.StatementAdapter.evaluate(StatementAdapter.java:36)
	at com.carrotsearch.randomizedtesting.rules.SystemPropertiesRestoreRule$1.evaluate(SystemPropertiesRestoreRule.java:53)
	at org.apache.lucene.util.AbstractBeforeAfterRule$1.evaluate(AbstractBeforeAfterRule.java:45)
	at org.apache.lucene.util.TestRuleStoreClassName$1.evaluate(TestRuleStoreClassName.java:42)
	at com.carrotsearch.randomizedtesting.rules.SystemPropertiesInvariantRule$1.evaluate(SystemPropertiesInvariantRule.java:55)
	at com.carrotsearch.randomizedtesting.rules.NoShadowingOrOverridesOnMethodsRule$1.evaluate(NoShadowingOrOverridesOnMethodsRule.java:39)
	at com.carrotsearch.randomizedtesting.rules.NoShadowingOrOverridesOnMethodsRule$1.evaluate(NoShadowingOrOverridesOnMethodsRule.java:39)
	at org.apache.lucene.util.TestRuleAssertionsRequired$1.evaluate(TestRuleAssertionsRequired.java:40)
	at org.apache.lucene.util.TestRuleMarkFailure$1.evaluate(TestRuleMarkFailure.java:48)
	at org.apache.lucene.util.TestRuleIgnoreAfterMaxFailures$1.evaluate(TestRuleIgnoreAfterMaxFailures.java:70)
	at org.apache.lucene.util.TestRuleIgnoreTestSuites$1.evaluate(TestRuleIgnoreTestSuites.java:55)
	at com.carrotsearch.randomizedtesting.rules.StatementAdapter.evaluate(StatementAdapter.java:36)
	at com.carrotsearch.randomizedtesting.ThreadLeakControl$StatementRunner.run(ThreadLeakControl.java:358)
	at java.lang.Thread.run(Thread.java:722)


FAILED:  junit.framework.TestSuite.org.apache.solr.update.SoftAutoCommitTest

Error Message:
ERROR: SolrIndexSearcher opens=11 closes=10

Stack Trace:
java.lang.AssertionError: ERROR: SolrIndexSearcher opens=11 closes=10
	at __randomizedtesting.SeedInfo.seed([766A42608FB47CD6]:0)
	at org.junit.Assert.fail(Assert.java:93)
	at org.apache.solr.SolrTestCaseJ4.endTrackingSearchers(SolrTestCaseJ4.java:223)
	at org.apache.solr.util.AbstractSolrTestCase.afterClassAbstractSolrTestCase(AbstractSolrTestCase.java:121)
	at sun.reflect.NativeMethodAccessorImpl.invoke0(Native Method)
	at sun.reflect.NativeMethodAccessorImpl.invoke(NativeMethodAccessorImpl.java:57)
	at sun.reflect.DelegatingMethodAccessorImpl.invoke(DelegatingMethodAccessorImpl.java:43)
	at java.lang.reflect.Method.invoke(Method.java:601)
	at com.carrotsearch.randomizedtesting.RandomizedRunner.invoke(RandomizedRunner.java:1559)
	at com.carrotsearch.randomizedtesting.RandomizedRunner.access$600(RandomizedRunner.java:79)
	at com.carrotsearch.randomizedtesting.RandomizedRunner$5.evaluate(RandomizedRunner.java:700)
	at com.carrotsearch.randomizedtesting.rules.StatementAdapter.evaluate(StatementAdapter.java:36)
	at com.carrotsearch.randomizedtesting.rules.SystemPropertiesRestoreRule$1.evaluate(SystemPropertiesRestoreRule.java:53)
	at org.apache.lucene.util.AbstractBeforeAfterRule$1.evaluate(AbstractBeforeAfterRule.java:45)
	at org.apache.lucene.util.TestRuleStoreClassName$1.evaluate(TestRuleStoreClassName.java:42)
	at com.carrotsearch.randomizedtesting.rules.SystemPropertiesInvariantRule$1.evaluate(SystemPropertiesInvariantRule.java:55)
	at com.carrotsearch.randomizedtesting.rules.NoShadowingOrOverridesOnMethodsRule$1.evaluate(NoShadowingOrOverridesOnMethodsRule.java:39)
	at com.carrotsearch.randomizedtesting.rules.NoShadowingOrOverridesOnMethodsRule$1.evaluate(NoShadowingOrOverridesOnMethodsRule.java:39)
	at org.apache.lucene.util.TestRuleAssertionsRequired$1.evaluate(TestRuleAssertionsRequired.java:40)
	at org.apache.lucene.util.TestRuleMarkFailure$1.evaluate(TestRuleMarkFailure.java:48)
	at org.apache.lucene.util.TestRuleIgnoreAfterMaxFailures$1.evaluate(TestRuleIgnoreAfterMaxFailures.java:70)
	at org.apache.lucene.util.TestRuleIgnoreTestSuites$1.evaluate(TestRuleIgnoreTestSuites.java:55)
	at com.carrotsearch.randomizedtesting.rules.StatementAdapter.evaluate(StatementAdapter.java:36)
	at com.carrotsearch.randomizedtesting.ThreadLeakControl$StatementRunner.run(ThreadLeakControl.java:358)
	at java.lang.Thread.run(Thread.java:722)




Build Log:
[...truncated 7658 lines...]
[junit4:junit4] Suite: org.apache.solr.update.SoftAutoCommitTest
[junit4:junit4]   2> 6475 T14 oasu.AbstractSolrTestCase.setUp ####SETUP_START testSoftAndHardCommitMaxTimeRapidAdds
[junit4:junit4]   2> 6478 T14 oasc.SolrResourceLoader.<init> new SolrResourceLoader for directory: '/usr/home/hudson/hudson-slave/workspace/Lucene-Solr-Tests-trunk-java7/solr/build/solr-core/test-files/solr/collection1/'
[junit4:junit4]   2> 6485 T14 oasc.SolrResourceLoader.replaceClassLoader Adding 'file:/usr/home/hudson/hudson-slave/workspace/Lucene-Solr-Tests-trunk-java7/solr/build/solr-core/test-files/solr/collection1/lib/classes/' to classloader
[junit4:junit4]   2> 6486 T14 oasc.SolrResourceLoader.replaceClassLoader Adding 'file:/usr/home/hudson/hudson-slave/workspace/Lucene-Solr-Tests-trunk-java7/solr/build/solr-core/test-files/solr/collection1/lib/README' to classloader
[junit4:junit4]   2> 6688 T14 oasc.SolrConfig.<init> Using Lucene MatchVersion: LUCENE_50
[junit4:junit4]   2> 6900 T14 oasc.SolrConfig.<init> Loaded SolrConfig: solrconfig.xml
[junit4:junit4]   2> 6902 T14 oass.IndexSchema.readSchema Reading Solr Schema
[junit4:junit4]   2> 7005 T14 oass.IndexSchema.readSchema Schema name=test
[junit4:junit4]   2> 8694 T14 oass.OpenExchangeRatesOrgProvider.init Initialized with rates=open-exchange-rates.json, refreshInterval=1440.
[junit4:junit4]   2> 8718 T14 oass.IndexSchema.readSchema default search field in schema is text
[junit4:junit4]   2> 8724 T14 oass.IndexSchema.readSchema unique key field: id
[junit4:junit4]   2> 8903 T14 oass.FileExchangeRateProvider.reload Reloading exchange rates from file currency.xml
[junit4:junit4]   2> 8922 T14 oass.FileExchangeRateProvider.reload Reloading exchange rates from file currency.xml
[junit4:junit4]   2> 8929 T14 oass.OpenExchangeRatesOrgProvider.reload Reloading exchange rates from open-exchange-rates.json
[junit4:junit4]   2> 8949 T14 oass.OpenExchangeRatesOrgProvider.reload Reloading exchange rates from open-exchange-rates.json
[junit4:junit4]   2> 8954 T14 oasc.SolrResourceLoader.locateSolrHome JNDI not configured for solr (NoInitialContextEx)
[junit4:junit4]   2> 8955 T14 oasc.SolrResourceLoader.locateSolrHome using system property solr.solr.home: /usr/home/hudson/hudson-slave/workspace/Lucene-Solr-Tests-trunk-java7/solr/build/solr-core/test-files/solr
[junit4:junit4]   2> 8956 T14 oasc.SolrResourceLoader.<init> new SolrResourceLoader for directory: '/usr/home/hudson/hudson-slave/workspace/Lucene-Solr-Tests-trunk-java7/solr/build/solr-core/test-files/solr/'
[junit4:junit4]   2> 8982 T14 oasc.CoreContainer.<init> New CoreContainer 1002242034
[junit4:junit4]   2> 8983 T14 oasc.SolrCore.<init> [collection1] Opening new SolrCore at /usr/home/hudson/hudson-slave/workspace/Lucene-Solr-Tests-trunk-java7/solr/build/solr-core/test-files/solr/collection1/, dataDir=/usr/home/hudson/hudson-slave/workspace/Lucene-Solr-Tests-trunk-java7/solr/build/solr-core/test/J1/./org.apache.solr.update.SoftAutoCommitTest-1346976214924/
[junit4:junit4]   2> 8989 T14 oasc.JmxMonitoredMap.<init> JMX monitoring is enabled. Adding Solr mbeans to JMX Server: com.sun.jmx.mbeanserver.JmxMBeanServer@753d7d27
[junit4:junit4]   2> 8998 T14 oasc.SolrCore.getNewIndexDir WARNING New index directory detected: old=null new=/usr/home/hudson/hudson-slave/workspace/Lucene-Solr-Tests-trunk-java7/solr/build/solr-core/test/J1/./org.apache.solr.update.SoftAutoCommitTest-1346976214924/index/
[junit4:junit4]   2> 8999 T14 oasc.SolrCore.initIndex WARNING [collection1] Solr index directory '/usr/home/hudson/hudson-slave/workspace/Lucene-Solr-Tests-trunk-java7/solr/build/solr-core/test/J1/./org.apache.solr.update.SoftAutoCommitTest-1346976214924/index' doesn't exist. Creating new index...
[junit4:junit4]   2> 9000 T14 oasc.CachingDirectoryFactory.get return new directory for /usr/home/hudson/hudson-slave/workspace/Lucene-Solr-Tests-trunk-java7/solr/build/solr-core/test/J1/./org.apache.solr.update.SoftAutoCommitTest-1346976214924/index forceNew:false
[junit4:junit4]   2> 9027 T14 oasc.SolrDeletionPolicy.onCommit SolrDeletionPolicy.onCommit: commits:num=1
[junit4:junit4]   2> 		commit{dir=MockDirWrapper(NRTCachingDirectory(org.apache.lucene.store.RAMDirectory@16e5acf7 lockFactory=org.apache.lucene.store.NativeFSLockFactory@50ed69d9; maxCacheMB=0.9091796875 maxMergeSizeMB=0.9541015625)),segFN=segments_1,generation=1,filenames=[segments_1]
[junit4:junit4]   2> 9028 T14 oasc.SolrDeletionPolicy.updateCommits newest commit = 1
[junit4:junit4]   2> 9119 T14 oasc.SolrCore.initWriters created xml: solr.XMLResponseWriter
[junit4:junit4]   2> 9394 T14 oasup.UpdateRequestProcessorChain.init inserting DistributedUpdateProcessorFactory into updateRequestProcessorChain "dedupe"
[junit4:junit4]   2> 9395 T14 oasup.UpdateRequestProcessorChain.init inserting DistributedUpdateProcessorFactory into updateRequestProcessorChain "dedupe-allfields"
[junit4:junit4]   2> 9396 T14 oasup.UpdateRequestProcessorChain.init inserting DistributedUpdateProcessorFactory into updateRequestProcessorChain "stored_sig"
[junit4:junit4]   2> 9409 T14 oasup.UpdateRequestProcessorChain.init inserting DistributedUpdateProcessorFactory into updateRequestProcessorChain "uniq-fields"
[junit4:junit4]   2> 9629 T14 oasup.UpdateRequestProcessorChain.init inserting DistributedUpdateProcessorFactory into updateRequestProcessorChain "distrib-dup-test-chain-implicit"
[junit4:junit4]   2> 9630 T14 oasc.RequestHandlers.initHandlersFromConfig adding lazy requestHandler: solr.ReplicationHandler
[junit4:junit4]   2> 9636 T14 oasc.RequestHandlers.initHandlersFromConfig created /replication: solr.ReplicationHandler
[junit4:junit4]   2> 9637 T14 oasc.RequestHandlers.initHandlersFromConfig created standard: solr.StandardRequestHandler
[junit4:junit4]   2> 9662 T14 oasc.RequestHandlers.initHandlersFromConfig created /get: solr.RealTimeGetHandler
[junit4:junit4]   2> 9747 T14 oasc.RequestHandlers.initHandlersFromConfig created dismax: solr.SearchHandler
[junit4:junit4]   2> 9750 T14 oasc.RequestHandlers.initHandlersFromConfig created mock: org.apache.solr.core.MockQuerySenderListenerReqHandler
[junit4:junit4]   2> 9756 T14 oasc.RequestHandlers.initHandlersFromConfig created /admin/: org.apache.solr.handler.admin.AdminHandlers
[junit4:junit4]   2> 9758 T14 oasc.RequestHandlers.initHandlersFromConfig created defaults: solr.StandardRequestHandler
[junit4:junit4]   2> 9759 T14 oasc.RequestHandlers.initHandlersFromConfig adding lazy requestHandler: solr.StandardRequestHandler
[junit4:junit4]   2> 9760 T14 oasc.RequestHandlers.initHandlersFromConfig created lazy: solr.StandardRequestHandler
[junit4:junit4]   2> 9783 T14 oasc.RequestHandlers.initHandlersFromConfig created /update: solr.UpdateRequestHandler
[junit4:junit4]   2> 9785 T14 oasc.RequestHandlers.initHandlersFromConfig created /terms: org.apache.solr.handler.component.SearchHandler
[junit4:junit4]   2> 9787 T14 oasc.RequestHandlers.initHandlersFromConfig created spellCheckCompRH: org.apache.solr.handler.component.SearchHandler
[junit4:junit4]   2> 9788 T14 oasc.RequestHandlers.initHandlersFromConfig created spellCheckCompRH_Direct: org.apache.solr.handler.component.SearchHandler
[junit4:junit4]   2> 9790 T14 oasc.RequestHandlers.initHandlersFromConfig created spellCheckWithWordbreak: org.apache.solr.handler.component.SearchHandler
[junit4:junit4]   2> 9792 T14 oasc.RequestHandlers.initHandlersFromConfig created spellCheckWithWordbreak_Direct: org.apache.solr.handler.component.SearchHandler
[junit4:junit4]   2> 9793 T14 oasc.RequestHandlers.initHandlersFromConfig created spellCheckCompRH1: org.apache.solr.handler.component.SearchHandler
[junit4:junit4]   2> 9795 T14 oasc.RequestHandlers.initHandlersFromConfig created tvrh: org.apache.solr.handler.component.SearchHandler
[junit4:junit4]   2> 9824 T14 oasc.RequestHandlers.initHandlersFromConfig created /mlt: solr.MoreLikeThisHandler
[junit4:junit4]   2> 9854 T14 oasc.RequestHandlers.initHandlersFromConfig created /debug/dump: solr.DumpRequestHandler
[junit4:junit4]   2> 9859 T14 oashl.XMLLoader.init xsltCacheLifetimeSeconds=60
[junit4:junit4]   2> 9866 T14 oasc.SolrCore.initDeprecatedSupport WARNING solrconfig.xml uses deprecated <admin/gettableFiles>, Please update your config to use the ShowFileRequestHandler.
[junit4:junit4]   2> 9903 T14 oasc.SolrCore.initDeprecatedSupport WARNING adding ShowFileRequestHandler with hidden files: [THROW.ERROR.ON.ADD.UPDATEPROCESSOR.JS, SOLRCONFIG-HIGHLIGHT.XML, SCHEMA-REQUIRED-FIELDS.XML, SCHEMA-REPLICATION2.XML, SCHEMA-MINIMAL.XML, BAD-SCHEMA-DUP-DYNAMICFIELD.XML, TRIVIAL.UPDATEPROCESSOR1.JS, SOLRCONFIG-CACHING.XML, SOLRCONFIG-REPEATER.XML, CURRENCY.XML, SOLRCONFIG-MERGEPOLICY.XML, BAD-SCHEMA-NONTEXT-ANALYZER.XML, SOLRCONFIG-TLOG.XML, SOLRCONFIG-MASTER.XML, BAD-SCHEMA-UNIQUEKEY-MULTIVALUED.XML, SCHEMA11.XML, SOLRCONFIG-BASIC.XML, DA_COMPOUNDDICTIONARY.TXT, MISSLEADING.EXTENSION.UPDATEPROCESSOR.JS.TXT, SCHEMA-COPYFIELD-TEST.XML, SOLRCONFIG-SLAVE.XML, SOLRCONFIG-PROPINJECT-INDEXDEFAULT.XML, ELEVATE.XML, TRIVIAL.UPDATEPROCESSOR0.JS, BAD-SOLRCONFIG-BOGUS-SCRIPTENGINE-NAME.XML, SCHEMA-CHARFILTERS.XML, SCHEMA-IB.XML, SOLRCONFIG-QUERYSENDER.XML, DA_UTF8.XML, SCHEMA-REPLICATION1.XML, CONDITIONAL.UPDATEPROCESSOR.JS, MISSING.FUNCTIONS.UPDATEPROCESSOR.JS, SOLRCONFIG-ENABLEPLUGIN.XML, HYPHENATION.DTD, SCHEMA-PHRASESUGGEST.XML, STEMDICT.TXT, HUNSPELL-TEST.AFF, STOPTYPES-1.TXT, STOPWORDSWRONGENCODING.TXT, SCHEMA-NUMERIC.XML, SOLRCONFIG-TRANSFORMERS.XML, SOLRCONFIG-PROPINJECT.XML, BAD-SCHEMA-NOT-INDEXED-BUT-TF.XML, SOLRCONFIG-SIMPLELOCK.XML, WDFTYPES.TXT, SCHEMA-REVERSED.XML, STOPTYPES-2.TXT, SOLRCONFIG-SPELLCHECKCOMPONENT.XML, SCHEMA-DFR.XML, SOLRCONFIG-PHRASESUGGEST.XML, BAD-SCHEMA-NOT-INDEXED-BUT-POS.XML, KEEP-1.TXT, OPEN-EXCHANGE-RATES.JSON, STOPWITHBOM.TXT, SOLRCONFIG-SPELLCHECKER.XML, SCHEMA-BINARYFIELD.XML, SOLRCONFIG-UPDATE-PROCESSOR-CHAINS.XML, BAD-SCHEMA-OMIT-TF-BUT-NOT-POS.XML, BAD-SCHEMA-DUP-FIELDTYPE.XML, SOLRCONFIG-MASTER1.XML, SYNONYMS.TXT, SCHEMA.XML, SCHEMA_CODEC.XML, SOLRCONFIG-SOLR-749.XML, SOLRCONFIG-MASTER1-KEEPONEBACKUP.XML, STOP-2.TXT, SOLRCONFIG-FUNCTIONQUERY.XML, SCHEMA-LMDIRICHLET.XML, SOLRCONFIG-TERMINDEX.XML, SOLRCONFIG-ELEVATE.XML, STOPWORDS.TXT, SCHEMA-FOLDING.XML, SCHEMA-STOP-KEEP.XML, BAD-SCHEMA-NOT-INDEXED-BUT-NORMS.XML, SOLRCONFIG-SOLCOREPROPERTIES.XML, STOP-1.TXT, SOLRCONFIG-MASTER2.XML, SCHEMA-SPELLCHECKER.XML, SOLRCONFIG-LAZYWRITER.XML, SCHEMA-LUCENEMATCHVERSION.XML, FRENCHARTICLES.TXT, BAD-MP-SOLRCONFIG.XML, SCHEMA15.XML, SOLRCONFIG-REQHANDLER.INCL, SCHEMASURROUND.XML, SOLRCONFIG-MASTER3.XML, HUNSPELL-TEST.DIC, BAD-SCHEMA-CODEC-GLOBAL-VS-FT-MISMATCH.XML, SOLRCONFIG-XINCLUDE.XML, SOLRCONFIG-DELPOLICY1.XML, SOLRCONFIG-SLAVE1.XML, SCHEMA-SIM.XML, SCHEMA-COLLATE.XML, STOP-SNOWBALL.TXT, BAD-SCHEMA-SIM-GLOBAL-VS-FT-MISMATCH.XML, PROTWORDS.TXT, SCHEMA-TRIE.XML, SOLRCONFIG_CODEC.XML, BAD-SOLRCONFIG-INVALID-SCRIPTFILE.XML, SCHEMA-TFIDF.XML, SOLRCONFIG-SCRIPT-UPDATEPROCESSOR.XML, SCHEMA-LMJELINEKMERCER.XML, PHRASESUGGEST.TXT, BAD-SOLRCONFIG-MISSING-SCRIPTFILE.XML, BAD-SCHEMA-UNIQUEKEY-USES-DEFAULT.XML, OLD_SYNONYMS.TXT, SOLRCONFIG-DELPOLICY2.XML, SOLRCONFIG-NATIVELOCK.XML, XSLT, BAD-SCHEMA-DUP-FIELD.XML, SOLRCONFIG-NOCACHE.XML, SCHEMA-BM25.XML, ADDFIELDS.UPDATEPROCESSOR.JS, SOLRCONFIG-QUERYSENDER-NOQUERY.XML, SOLRCONFIG-ALTDIRECTORY.XML, COMPOUNDDICTIONARY.TXT, SOLRCONFIG_PERF.XML, BAD-SCHEMA-ANALYZER-CLASS-AND-NESTED.XML, SCHEMA-NOT-REQUIRED-UNIQUE-KEY.XML, KEEP-2.TXT, BAD-SCHEMA-UNIQUEKEY-IS-COPYFIELD-DEST.XML, SCHEMA12.XML, MAPPING-ISOLATIN1ACCENT.TXT, BAD_SOLRCONFIG.XML, BAD-SCHEMA-EXTERNAL-FILEFIELD.XML]
[junit4:junit4]   2> 9908 T14 oass.SolrIndexSearcher.<init> Opening Searcher@7ba7e777 main
[junit4:junit4]   2> 9909 T14 oass.SolrIndexSearcher.getIndexDir WARNING WARNING: Directory impl does not support setting indexDir: org.apache.lucene.store.MockDirectoryWrapper
[junit4:junit4]   2> 9957 T14 oasu.CommitTracker.<init> Hard AutoCommit: disabled
[junit4:junit4]   2> 9958 T14 oasu.CommitTracker.<init> Soft AutoCommit: disabled
[junit4:junit4]   2> 9961 T14 oashc.SpellCheckComponent.inform Initializing spell checkers
[junit4:junit4]   2> 10195 T14 oass.DirectSolrSpellChecker.init init: {name=direct,classname=DirectSolrSpellChecker,field=lowerfilt,minQueryLength=3}
[junit4:junit4]   2> 10533 T14 oashc.HttpShardHandlerFactory.getParameter Setting socketTimeout to: 0
[junit4:junit4]   2> 10534 T14 oashc.HttpShardHandlerFactory.getParameter Setting urlScheme to: http://
[junit4:junit4]   2> 10534 T14 oashc.HttpShardHandlerFactory.getParameter Setting connTimeout to: 0
[junit4:junit4]   2> 10535 T14 oashc.HttpShardHandlerFactory.getParameter Setting maxConnectionsPerHost to: 20
[junit4:junit4]   2> 10536 T14 oashc.HttpShardHandlerFactory.getParameter Setting corePoolSize to: 0
[junit4:junit4]   2> 10537 T14 oashc.HttpShardHandlerFactory.getParameter Setting maximumPoolSize to: 2147483647
[junit4:junit4]   2> 10537 T14 oashc.HttpShardHandlerFactory.getParameter Setting maxThreadIdleTime to: 5
[junit4:junit4]   2> 10538 T14 oashc.HttpShardHandlerFactory.getParameter Setting sizeOfQueue to: -1
[junit4:junit4]   2> 10539 T14 oashc.HttpShardHandlerFactory.getParameter Setting fairnessPolicy to: false
[junit4:junit4]   2> 10540 T14 oascsi.HttpClientUtil.createClient Creating new http client, config:maxConnectionsPerHost=20&maxConnections=10000&socketTimeout=0&connTimeout=0&retry=false
[junit4:junit4]   2> 10630 T15 oasc.SolrCore.registerSearcher [collection1] Registered new searcher Searcher@7ba7e777 main{StandardDirectoryReader(segments_1:1)}
[junit4:junit4]   2> 10644 T14 oasc.CoreContainer.register registering core: collection1
[junit4:junit4]   2> 10648 T14 oasu.AbstractSolrTestCase.setUp ####SETUP_END testSoftAndHardCommitMaxTimeRapidAdds
[junit4:junit4]   2> ASYNC  NEW_CORE C0 name=collection1 org.apache.solr.core.SolrCore@616e6f28
[junit4:junit4]   2> 10752 T14 C0 oascsi.HttpClientUtil.createClient Creating new http client, config:maxConnections=500&maxConnectionsPerHost=16
[junit4:junit4]   2> 11161 T14 C0 oasc.SolrDeletionPolicy.onInit SolrDeletionPolicy.onInit: commits:num=1
[junit4:junit4]   2> 		commit{dir=MockDirWrapper(NRTCachingDirectory(org.apache.lucene.store.RAMDirectory@16e5acf7 lockFactory=org.apache.lucene.store.NativeFSLockFactory@50ed69d9; maxCacheMB=0.9091796875 maxMergeSizeMB=0.9541015625)),segFN=segments_1,generation=1,filenames=[segments_1]
[junit4:junit4]   2> 11162 T14 C0 oasc.SolrDeletionPolicy.updateCommits newest commit = 1
[junit4:junit4]   2> 11539 T14 C0 UPDATE [collection1] webapp=null path=null params={} {add=[5000]} 0 820
[junit4:junit4]   2> 11648 T14 C0 UPDATE [collection1] webapp=null path=null params={} {add=[5001]} 0 5
[junit4:junit4]   2> 11680 T14 C0 UPDATE [collection1] webapp=null path=null params={} {add=[5002]} 0 3
[junit4:junit4]   2> 11711 T14 C0 UPDATE [collection1] webapp=null path=null params={} {add=[5003]} 0 5
[junit4:junit4]   2> 11735 T14 C0 UPDATE [collection1] webapp=null path=null params={} {add=[5004]} 0 3
[junit4:junit4]   2> 12034 T17 oasu.DirectUpdateHandler2.commit start commit{flags=0,_version_=0,optimize=false,openSearcher=true,waitSearcher=true,expungeDeletes=false,softCommit=true}
[junit4:junit4]   2> 12036 T14 oasu.AbstractSolrTestCase.tearDown ####TEARDOWN_START testSoftAndHardCommitMaxTimeRapidAdds
[junit4:junit4]   2> 12036 T14 oasc.CoreContainer.shutdown Shutting down CoreContainer instance=1002242034
[junit4:junit4]   2> 12037 T14 oasc.SolrCore.close [collection1]  CLOSING SolrCore org.apache.solr.core.SolrCore@616e6f28
[junit4:junit4]   2> 12094 T14 oasc.SolrCore.closeSearcher [collection1] Closing main searcher on request.
[junit4:junit4]   2> 12095 T14 oasu.DirectUpdateHandler2.close closing DirectUpdateHandler2{commits=1,autocommit maxTime=1200ms,autocommits=0,soft autocommit maxTime=500ms,soft autocommits=1,optimizes=0,rollbacks=0,expungeDeletes=0,docsPending=5,adds=5,deletesById=0,deletesByQuery=0,errors=0,cumulative_adds=5,cumulative_deletesById=0,cumulative_deletesByQuery=0,cumulative_errors=0}
[junit4:junit4]   2> 12096 T14 oasu.DefaultSolrCoreState.decref SolrCoreState ref count has reached 0 - closing IndexWriter
[junit4:junit4]   2> 12910 T17 oass.SolrIndexSearcher.<init> Opening Searcher@3f430afc main
[junit4:junit4]   2> 12911 T17 oass.SolrIndexSearcher.getIndexDir WARNING WARNING: Directory impl does not support setting indexDir: org.apache.lucene.store.MockDirectoryWrapper
[junit4:junit4]   2> 12914 T14 C0 oasc.SolrDeletionPolicy.onCommit SolrDeletionPolicy.onCommit: commits:num=2
[junit4:junit4]   2> 		commit{dir=MockDirWrapper(NRTCachingDirectory(org.apache.lucene.store.RAMDirectory@16e5acf7 lockFactory=org.apache.lucene.store.NativeFSLockFactory@50ed69d9; maxCacheMB=0.9091796875 maxMergeSizeMB=0.9541015625)),segFN=segments_1,generation=1,filenames=[segments_1]
[junit4:junit4]   2> 		commit{dir=MockDirWrapper(NRTCachingDirectory(org.apache.lucene.store.RAMDirectory@16e5acf7 lockFactory=org.apache.lucene.store.NativeFSLockFactory@50ed69d9; maxCacheMB=0.9091796875 maxMergeSizeMB=0.9541015625)),segFN=segments_2,generation=2,filenames=[_0_Asserting_0.tim, _0_TestBloomFilteredLucene40Postings_0.tim, _0_TestBloomFilteredLucene40Postings_0.blm, _0_TestBloomFilteredLucene40Postings_0.tip, _0.fnm, _0_Asserting_0.tip, _0_Memory_0.ram, _0_TestBloomFilteredLucene40Postings_0.prx, _0_NestedPulsing_0.frq, _0_nrm.cfs, _0_NestedPulsing_0.tip, _0_NestedPulsing_0.prx, _0_NestedPulsing_0.tim, _0_Asserting_0.prx, _0_Asserting_0.frq, _0_nrm.cfe, segments_2, _0_TestBloomFilteredLucene40Postings_0.frq, _0.fdx, _0.si, _0.fdt]
[junit4:junit4]   2> 12915 T14 C0 oasc.SolrDeletionPolicy.updateCommits newest commit = 2
[junit4:junit4]   2> 12920 T14 oasc.SolrException.log SEVERE Error closing directory:java.lang.RuntimeException: MockDirectoryWrapper: cannot close: there are still open files: {_0_Asserting_0.tim=1, _0_TestBloomFilteredLucene40Postings_0.tim=1, _0_TestBloomFilteredLucene40Postings_0.prx=1, _0_NestedPulsing_0.frq=1, _0_nrm.cfs=7, _0_NestedPulsing_0.prx=1, _0_NestedPulsing_0.tim=1, _0_Asserting_0.prx=1, _0_Asserting_0.frq=1, _0_TestBloomFilteredLucene40Postings_0.frq=1, _0.fdx=1, _0.fdt=1}
[junit4:junit4]   2> 		at org.apache.lucene.store.MockDirectoryWrapper.close(MockDirectoryWrapper.java:565)
[junit4:junit4]   2> 		at org.apache.solr.core.CachingDirectoryFactory.close(CachingDirectoryFactory.java:109)
[junit4:junit4]   2> 		at org.apache.solr.update.DefaultSolrCoreState.decref(DefaultSolrCoreState.java:161)
[junit4:junit4]   2> 		at org.apache.solr.update.DirectUpdateHandler2.close(DirectUpdateHandler2.java:662)
[junit4:junit4]   2> 		at org.apache.solr.core.SolrCore.close(SolrCore.java:900)
[junit4:junit4]   2> 		at org.apache.solr.core.CoreContainer.shutdown(CoreContainer.java:623)
[junit4:junit4]   2> 		at org.apache.solr.util.TestHarness.close(TestHarness.java:434)
[junit4:junit4]   2> 		at org.apache.solr.util.AbstractSolrTestCase.tearDown(AbstractSolrTestCase.java:209)
[junit4:junit4]   2> 		at sun.reflect.NativeMethodAccessorImpl.invoke0(Native Method)
[junit4:junit4]   2> 		at sun.reflect.NativeMethodAccessorImpl.invoke(NativeMethodAccessorImpl.java:57)
[junit4:junit4]   2> 		at sun.reflect.DelegatingMethodAccessorImpl.invoke(DelegatingMethodAccessorImpl.java:43)
[junit4:junit4]   2> 		at java.lang.reflect.Method.invoke(Method.java:601)
[junit4:junit4]   2> 		at com.carrotsearch.randomizedtesting.RandomizedRunner.invoke(RandomizedRunner.java:1559)
[junit4:junit4]   2> 		at com.carrotsearch.randomizedtesting.RandomizedRunner.access$600(RandomizedRunner.java:79)
[junit4:junit4]   2> 		at com.carrotsearch.randomizedtesting.RandomizedRunner$8.evaluate(RandomizedRunner.java:795)
[junit4:junit4]   2> 		at com.carrotsearch.randomizedtesting.rules.SystemPropertiesRestoreRule$1.evaluate(SystemPropertiesRestoreRule.java:53)
[junit4:junit4]   2> 		at org.apache.lucene.util.TestRuleSetupTeardownChained$1.evaluate(TestRuleSetupTeardownChained.java:50)
[junit4:junit4]   2> 		at org.apache.lucene.util.TestRuleFieldCacheSanity$1.evaluate(TestRuleFieldCacheSanity.java:51)
[junit4:junit4]   2> 		at org.apache.lucene.util.AbstractBeforeAfterRule$1.evaluate(AbstractBeforeAfterRule.java:45)
[junit4:junit4]   2> 		at com.carrotsearch.randomizedtesting.rules.SystemPropertiesInvariantRule$1.evaluate(SystemPropertiesInvariantRule.java:55)
[junit4:junit4]   2> 		at org.apache.lucene.util.TestRuleThreadAndTestName$1.evaluate(TestRuleThreadAndTestName.java:48)
[junit4:junit4]   2> 		at org.apache.lucene.util.TestRuleIgnoreAfterMaxFailures$1.evaluate(TestRuleIgnoreAfterMaxFailures.java:70)
[junit4:junit4]   2> 		at org.apache.lucene.util.TestRuleMarkFailure$1.evaluate(TestRuleMarkFailure.java:48)
[junit4:junit4]   2> 		at com.carrotsearch.randomizedtesting.rules.StatementAdapter.evaluate(StatementAdapter.java:36)
[junit4:junit4]   2> 		at com.carrotsearch.randomizedtesting.ThreadLeakControl$StatementRunner.run(ThreadLeakControl.java:358)
[junit4:junit4]   2> 		at com.carrotsearch.randomizedtesting.ThreadLeakControl.forkTimeoutingTask(ThreadLeakControl.java:782)
[junit4:junit4]   2> 		at com.carrotsearch.randomizedtesting.ThreadLeakControl$3.evaluate(ThreadLeakControl.java:442)
[junit4:junit4]   2> 		at com.carrotsearch.randomizedtesting.RandomizedRunner.runSingleTest(RandomizedRunner.java:746)
[junit4:junit4]   2> 		at com.carrotsearch.randomizedtesting.RandomizedRunner$3.evaluate(RandomizedRunner.java:648)
[junit4:junit4]   2> 		at com.carrotsearch.randomizedtesting.RandomizedRunner$4.evaluate(RandomizedRunner.java:682)
[junit4:junit4]   2> 		at com.carrotsearch.randomizedtesting.RandomizedRunner$5.evaluate(RandomizedRunner.java:693)
[junit4:junit4]   2> 		at com.carrotsearch.randomizedtesting.rules.StatementAdapter.evaluate(StatementAdapter.java:36)
[junit4:junit4]   2> 		at com.carrotsearch.randomizedtesting.rules.SystemPropertiesRestoreRule$1.evaluate(SystemPropertiesRestoreRule.java:53)
[junit4:junit4]   2> 		at org.apache.lucene.util.AbstractBeforeAfterRule$1.evaluate(AbstractBeforeAfterRule.java:45)
[junit4:junit4]   2> 		at org.apache.lucene.util.TestRuleStoreClassName$1.evaluate(TestRuleStoreClassName.java:42)
[junit4:junit4]   2> 		at com.carrotsearch.randomizedtesting.rules.SystemPropertiesInvariantRule$1.evaluate(SystemPropertiesInvariantRule.java:55)
[junit4:junit4]   2> 		at com.carrotsearch.randomizedtesting.rules.NoShadowingOrOverridesOnMethodsRule$1.evaluate(NoShadowingOrOverridesOnMethodsRule.java:39)
[junit4:junit4]   2> 		at com.carrotsearch.randomizedtesting.rules.NoShadowingOrOverridesOnMethodsRule$1.evaluate(NoShadowingOrOverridesOnMethodsRule.java:39)
[junit4:junit4]   2> 		at org.apache.lucene.util.TestRuleAssertionsRequired$1.evaluate(TestRuleAssertionsRequired.java:40)
[junit4:junit4]   2> 		at org.apache.lucene.util.TestRuleMarkFailure$1.evaluate(TestRuleMarkFailure.java:48)
[junit4:junit4]   2> 		at org.apache.lucene.util.TestRuleIgnoreAfterMaxFailures$1.evaluate(TestRuleIgnoreAfterMaxFailures.java:70)
[junit4:junit4]   2> 		at org.apache.lucene.util.TestRuleIgnoreTestSuites$1.evaluate(TestRuleIgnoreTestSuites.java:55)
[junit4:junit4]   2> 		at com.carrotsearch.randomizedtesting.rules.StatementAdapter.evaluate(StatementAdapter.java:36)
[junit4:junit4]   2> 		at com.carrotsearch.randomizedtesting.ThreadLeakControl$StatementRunner.run(ThreadLeakControl.java:358)
[junit4:junit4]   2> 		at java.lang.Thread.run(Thread.java:722)
[junit4:junit4]   2> 	Caused by: java.lang.RuntimeException: unclosed IndexInput: _0_TestBloomFilteredLucene40Postings_0.prx
[junit4:junit4]   2> 		at org.apache.lucene.store.MockDirectoryWrapper.addFileHandle(MockDirectoryWrapper.java:475)
[junit4:junit4]   2> 		at org.apache.lucene.store.MockDirectoryWrapper.openInput(MockDirectoryWrapper.java:501)
[junit4:junit4]   2> 		at org.apache.lucene.codecs.lucene40.Lucene40PostingsReader.<init>(Lucene40PostingsReader.java:79)
[junit4:junit4]   2> 		at org.apache.lucene.codecs.lucene40.Lucene40PostingsFormat.fieldsProducer(Lucene40PostingsFormat.java:310)
[junit4:junit4]   2> 		at org.apache.lucene.codecs.bloom.BloomFilteringPostingsFormat$BloomFilteredFieldsProducer.<init>(BloomFilteringPostingsFormat.java:172)
[junit4:junit4]   2> 		at org.apache.lucene.codecs.bloom.BloomFilteringPostingsFormat.fieldsProducer(BloomFilteringPostingsFormat.java:149)
[junit4:junit4]   2> 		at org.apache.lucene.codecs.bloom.TestBloomFilteredLucene40Postings.fieldsProducer(TestBloomFilteredLucene40Postings.java:72)
[junit4:junit4]   2> 		at org.apache.lucene.codecs.perfield.PerFieldPostingsFormat$FieldsReader.<init>(PerFieldPostingsFormat.java:186)
[junit4:junit4]   2> 		at org.apache.lucene.codecs.perfield.PerFieldPostingsFormat.fieldsProducer(PerFieldPostingsFormat.java:225)
[junit4:junit4]   2> 		at org.apache.lucene.index.SegmentCoreReaders.<init>(SegmentCoreReaders.java:107)
[junit4:junit4]   2> 		at org.apache.lucene.index.SegmentReader.<init>(SegmentReader.java:57)
[junit4:junit4]   2> 		at org.apache.lucene.index.ReadersAndLiveDocs.getReader(ReadersAndLiveDocs.java:120)
[junit4:junit4]   2> 		at org.apache.lucene.index.ReadersAndLiveDocs.getReadOnlyClone(ReadersAndLiveDocs.java:205)
[junit4:junit4]   2> 		at org.apache.lucene.index.StandardDirectoryReader.open(StandardDirectoryReader.java:96)
[junit4:junit4]   2> 		at org.apache.lucene.index.IndexWriter.getReader(IndexWriter.java:362)
[junit4:junit4]   2> 		at org.apache.lucene.index.StandardDirectoryReader.doOpenIfChanged(StandardDirectoryReader.java:252)
[junit4:junit4]   2> 		at org.apache.lucene.index.DirectoryReader.openIfChanged(DirectoryReader.java:247)
[junit4:junit4]   2> 		at org.apache.solr.core.SolrCore.openNewSearcher(SolrCore.java:1243)
[junit4:junit4]   2> 		at org.apache.solr.core.SolrCore.getSearcher(SolrCore.java:1416)
[junit4:junit4]   2> 		at org.apache.solr.update.DirectUpdateHandler2.commit(DirectUpdateHandler2.java:552)
[junit4:junit4]   2> 		at org.apache.solr.update.CommitTracker.run(CommitTracker.java:215)
[junit4:junit4]   2> 		at java.util.concurrent.Executors$RunnableAdapter.call(Executors.java:471)
[junit4:junit4]   2> 		at java.util.concurrent.FutureTask$Sync.innerRun(FutureTask.java:334)
[junit4:junit4]   2> 		at java.util.concurrent.FutureTask.run(FutureTask.java:166)
[junit4:junit4]   2> 		at java.util.concurrent.ScheduledThreadPoolExecutor$ScheduledFutureTask.access$201(ScheduledThreadPoolExecutor.java:178)
[junit4:junit4]   2> 		at java.util.concurrent.ScheduledThreadPoolExecutor$ScheduledFutureTask.run(ScheduledThreadPoolExecutor.java:292)
[junit4:junit4]   2> 		at java.util.concurrent.ThreadPoolExecutor.runWorker(ThreadPoolExecutor.java:1110)
[junit4:junit4]   2> 		at java.util.concurrent.ThreadPoolExecutor$Worker.run(ThreadPoolExecutor.java:603)
[junit4:junit4]   2> 		... 1 more
[junit4:junit4]   2> 	
[junit4:junit4]   2> 12921 T17 oasc.SolrException.log SEVERE auto commit error...:org.apache.solr.common.SolrException: java.util.concurrent.RejectedExecutionException: Task java.util.concurrent.FutureTask@b5b633 rejected from java.util.concurrent.ThreadPoolExecutor@19cccea2[Terminated, pool size = 0, active threads = 0, queued tasks = 0, completed tasks = 2]
[junit4:junit4]   2> 		at org.apache.solr.core.SolrCore.getSearcher(SolrCore.java:1537)
[junit4:junit4]   2> 		at org.apache.solr.update.DirectUpdateHandler2.commit(DirectUpdateHandler2.java:552)
[junit4:junit4]   2> 		at org.apache.solr.update.CommitTracker.run(CommitTracker.java:215)
[junit4:junit4]   2> 		at java.util.concurrent.Executors$RunnableAdapter.call(Executors.java:471)
[junit4:junit4]   2> 		at java.util.concurrent.FutureTask$Sync.innerRun(FutureTask.java:334)
[junit4:junit4]   2> 		at java.util.concurrent.FutureTask.run(FutureTask.java:166)
[junit4:junit4]   2> 		at java.util.concurrent.ScheduledThreadPoolExecutor$ScheduledFutureTask.access$201(ScheduledThreadPoolExecutor.java:178)
[junit4:junit4]   2> 		at java.util.concurrent.ScheduledThreadPoolExecutor$ScheduledFutureTask.run(ScheduledThreadPoolExecutor.java:292)
[junit4:junit4]   2> 		at java.util.concurrent.ThreadPoolExecutor.runWorker(ThreadPoolExecutor.java:1110)
[junit4:junit4]   2> 		at java.util.concurrent.ThreadPoolExecutor$Worker.run(ThreadPoolExecutor.java:603)
[junit4:junit4]   2> 		at java.lang.Thread.run(Thread.java:722)
[junit4:junit4]   2> 	Caused by: java.util.concurrent.RejectedExecutionException: Task java.util.concurrent.FutureTask@b5b633 rejected from java.util.concurrent.ThreadPoolExecutor@19cccea2[Terminated, pool size = 0, active threads = 0, queued tasks = 0, completed tasks = 2]
[junit4:junit4]   2> 		at java.util.concurrent.ThreadPoolExecutor$AbortPolicy.rejectedExecution(ThreadPoolExecutor.java:2013)
[junit4:junit4]   2> 		at java.util.concurrent.ThreadPoolExecutor.reject(ThreadPoolExecutor.java:816)
[junit4:junit4]   2> 		at java.util.concurrent.ThreadPoolExecutor.execute(ThreadPoolExecutor.java:1337)
[junit4:junit4]   2> 		at java.util.concurrent.AbstractExecutorService.submit(AbstractExecutorService.java:132)
[junit4:junit4]   2> 		at java.util.concurrent.Executors$DelegatedExecutorService.submit(Executors.java:642)
[junit4:junit4]   2> 		at org.apache.solr.core.SolrCore.getSearcher(SolrCore.java:1468)
[junit4:junit4]   2> 		... 10 more
[junit4:junit4]   2> 	
[junit4:junit4]   2> 12922 T14 oasu.DefaultSolrCoreState.decref Closing SolrCoreState - canceling any ongoing recovery
[junit4:junit4]   2> NOTE: reproduce with: ant test  -Dtestcase=SoftAutoCommitTest -Dtests.method=testSoftAndHardCommitMaxTimeRapidAdds -Dtests.seed=766A42608FB47CD6 -Dtests.multiplier=3 -Dtests.slow=true -Dtests.locale=fi_FI -Dtests.timezone=Europe/Andorra -Dtests.file.encoding=US-ASCII
[junit4:junit4] FAILURE 6.62s J1 | SoftAutoCommitTest.testSoftAndHardCommitMaxTimeRapidAdds <<<
[junit4:junit4]    > Throwable #1: java.lang.AssertionError: 1: soft occured too fast: 1346976220088 + (500 * 1) !<= 1346976220484
[junit4:junit4]    > 	at __randomizedtesting.SeedInfo.seed([766A42608FB47CD6:2A7FEC5964363DAE]:0)
[junit4:junit4]    > 	at org.junit.Assert.fail(Assert.java:93)
[junit4:junit4]    > 	at org.junit.Assert.assertTrue(Assert.java:43)
[junit4:junit4]    > 	at org.apache.solr.update.SoftAutoCommitTest.testSoftAndHardCommitMaxTimeRapidAdds(SoftAutoCommitTest.java:312)
[junit4:junit4]    > 	at sun.reflect.NativeMethodAccessorImpl.invoke0(Native Method)
[junit4:junit4]    > 	at sun.reflect.NativeMethodAccessorImpl.invoke(NativeMethodAccessorImpl.java:57)
[junit4:junit4]    > 	at sun.reflect.DelegatingMethodAccessorImpl.invoke(DelegatingMethodAccessorImpl.java:43)
[junit4:junit4]    > 	at java.lang.reflect.Method.invoke(Method.java:601)
[junit4:junit4]    > 	at com.carrotsearch.randomizedtesting.RandomizedRunner.invoke(RandomizedRunner.java:1559)
[junit4:junit4]    > 	at com.carrotsearch.randomizedtesting.RandomizedRunner.access$600(RandomizedRunner.java:79)
[junit4:junit4]    > 	at com.carrotsearch.randomizedtesting.RandomizedRunner$6.evaluate(RandomizedRunner.java:737)
[junit4:junit4]    > 	at com.carrotsearch.randomizedtesting.RandomizedRunner$7.evaluate(RandomizedRunner.java:773)
[junit4:junit4]    > 	at com.carrotsearch.randomizedtesting.RandomizedRunner$8.evaluate(RandomizedRunner.java:787)
[junit4:junit4]    > 	at com.carrotsearch.randomizedtesting.rules.SystemPropertiesRestoreRule$1.evaluate(SystemPropertiesRestoreRule.java:53)
[junit4:junit4]    > 	at org.apache.lucene.util.TestRuleSetupTeardownChained$1.evaluate(TestRuleSetupTeardownChained.java:50)
[junit4:junit4]    > 	at org.apache.lucene.util.TestRuleFieldCacheSanity$1.evaluate(TestRuleFieldCacheSanity.java:51)
[junit4:junit4]    > 	at org.apache.lucene.util.AbstractBeforeAfterRule$1.evaluate(AbstractBeforeAfterRule.java:45)
[junit4:junit4]    > 	at com.carrotsearch.randomizedtesting.rules.SystemPropertiesInvariantRule$1.evaluate(SystemPropertiesInvariantRule.java:55)
[junit4:junit4]    > 	at org.apache.lucene.util.TestRuleThreadAndTestName$1.evaluate(TestRuleThreadAndTestName.java:48)
[junit4:junit4]    > 	at org.apache.lucene.util.TestRuleIgnoreAfterMaxFailures$1.evaluate(TestRuleIgnoreAfterMaxFailures.java:70)
[junit4:junit4]    > 	at org.apache.lucene.util.TestRuleMarkFailure$1.evaluate(TestRuleMarkFailure.java:48)
[junit4:junit4]    > 	at com.carrotsearch.randomizedtesting.rules.StatementAdapter.evaluate(StatementAdapter.java:36)
[junit4:junit4]    > 	at com.carrotsearch.randomizedtesting.ThreadLeakControl$StatementRunner.run(ThreadLeakControl.java:358)
[junit4:junit4]    > 	at com.carrotsearch.randomizedtesting.ThreadLeakControl.forkTimeoutingTask(ThreadLeakControl.java:782)
[junit4:junit4]    > 	at com.carrotsearch.randomizedtesting.ThreadLeakControl$3.evaluate(ThreadLeakControl.java:442)
[junit4:junit4]    > 	at com.carrotsearch.randomizedtesting.RandomizedRunner.runSingleTest(RandomizedRunner.java:746)
[junit4:junit4]    > 	at com.carrotsearch.randomizedtesting.RandomizedRunner$3.evaluate(RandomizedRunner.java:648)
[junit4:junit4]    > 	at com.carrotsearch.randomizedtesting.RandomizedRunner$4.evaluate(RandomizedRunner.java:682)
[junit4:junit4]    > 	at com.carrotsearch.randomizedtesting.RandomizedRunner$5.evaluate(RandomizedRunner.java:693)
[junit4:junit4]    > 	at com.carrotsearch.randomizedtesting.rules.StatementAdapter.evaluate(StatementAdapter.java:36)
[junit4:junit4]    > 	at com.carrotsearch.randomizedtesting.rules.SystemPropertiesRestoreRule$1.evaluate(SystemPropertiesRestoreRule.java:53)
[junit4:junit4]    > 	at org.apache.lucene.util.AbstractBeforeAfterRule$1.evaluate(AbstractBeforeAfterRule.java:45)
[junit4:junit4]    > 	at org.apache.lucene.util.TestRuleStoreClassName$1.evaluate(TestRuleStoreClassName.java:42)
[junit4:junit4]    > 	at com.carrotsearch.randomizedtesting.rules.SystemPropertiesInvariantRule$1.evaluate(SystemPropertiesInvariantRule.java:55)
[junit4:junit4]    > 	at com.carrotsearch.randomizedtesting.rules.NoShadowingOrOverridesOnMethodsRule$1.evaluate(NoShadowingOrOverridesOnMethodsRule.java:39)
[junit4:junit4]    > 	at com.carrotsearch.randomizedtesting.rules.NoShadowingOrOverridesOnMethodsRule$1.evaluate(NoShadowingOrOverridesOnMethodsRule.java:39)
[junit4:junit4]    > 	at org.apache.lucene.util.TestRuleAssertionsRequired$1.evaluate(TestRuleAssertionsRequired.java:40)
[junit4:junit4]    > 	at org.apache.lucene.util.TestRuleMarkFailure$1.evaluate(TestRuleMarkFailure.java:48)
[junit4:junit4]    > 	at org.apache.lucene.util.TestRuleIgnoreAfterMaxFailures$1.evaluate(TestRuleIgnoreAfterMaxFailures.java:70)
[junit4:junit4]    > 	at org.apache.lucene.util.TestRuleIgnoreTestSuites$1.evaluate(TestRuleIgnoreTestSuites.java:55)
[junit4:junit4]    > 	at com.carrotsearch.randomizedtesting.rules.StatementAdapter.evaluate(StatementAdapter.java:36)
[junit4:junit4]    > 	at com.carrotsearch.randomizedtesting.ThreadLeakControl$StatementRunner.run(ThreadLeakControl.java:358)
[junit4:junit4]    > 	at java.lang.Thread.run(Thread.java:722)
[junit4:junit4]   2> 13096 T14 oasu.AbstractSolrTestCase.setUp ####SETUP_START testSoftAndHardCommitMaxTimeMixedAdds
[junit4:junit4]   2> 13099 T14 oasc.SolrResourceLoader.<init> new SolrResourceLoader for directory: '/usr/home/hudson/hudson-slave/workspace/Lucene-Solr-Tests-trunk-java7/solr/build/solr-core/test-files/solr/collection1/'
[junit4:junit4]   2> 13101 T14 oasc.SolrResourceLoader.replaceClassLoader Adding 'file:/usr/home/hudson/hudson-slave/workspace/Lucene-Solr-Tests-trunk-java7/solr/build/solr-core/test-files/solr/collection1/lib/classes/' to classloader
[junit4:junit4]   2> 13102 T14 oasc.SolrResourceLoader.replaceClassLoader Adding 'file:/usr/home/hudson/hudson-slave/workspace/Lucene-Solr-Tests-trunk-java7/solr/build/solr-core/test-files/solr/collection1/lib/README' to classloader
[junit4:junit4]   2> 13243 T14 oasc.SolrConfig.<init> Using Lucene MatchVersion: LUCENE_50
[junit4:junit4]   2> 13266 T3 oasu.ConcurrentLRUCache.finalize SEVERE ConcurrentLRUCache was not destroyed prior to finalize(), indicates a bug -- POSSIBLE RESOURCE LEAK!!!
[junit4:junit4]   2> 13270 T3 oasu.ConcurrentLRUCache.finalize SEVERE ConcurrentLRUCache was not destroyed prior to finalize(), indicates a bug -- POSSIBLE RESOURCE LEAK!!!
[junit4:junit4]   2> 13352 T14 oasc.SolrConfig.<init> Loaded SolrConfig: solrconfig.xml
[junit4:junit4]   2> 13353 T14 oass.IndexSchema.readSchema Reading Solr Schema
[junit4:junit4]   2> 13420 T14 oass.IndexSchema.readSchema Schema name=test
[junit4:junit4]   2> 14195 T14 oass.OpenExchangeRatesOrgProvider.init Initialized with rates=open-exchange-rates.json, refreshInterval=1440.
[junit4:junit4]   2> 14213 T14 oass.IndexSchema.readSchema default search field in schema is text
[junit4:junit4]   2> 14218 T14 oass.IndexSchema.readSchema unique key field: id
[junit4:junit4]   2> 14242 T14 oass.FileExchangeRateProvider.reload Reloading exchange rates from file currency.xml
[junit4:junit4]   2> 14247 T14 oass.FileExchangeRateProvider.reload Reloading exchange rates from file currency.xml
[junit4:junit4]   2> 14251 T14 oass.OpenExchangeRatesOrgProvider.reload Reloading exchange rates from open-exchange-rates.json
[junit4:junit4]   2> 14254 T14 oass.OpenExchangeRatesOrgProvider.reload Reloading exchange rates from open-exchange-rates.json
[junit4:junit4]   2> 14256 T14 oasc.SolrResourceLoader.locateSolrHome JNDI not configured for solr (NoInitialContextEx)
[junit4:junit4]   2> 14257 T14 oasc.SolrResourceLoader.locateSolrHome using system property solr.solr.home: /usr/home/hudson/hudson-slave/workspace/Lucene-Solr-Tests-trunk-java7/solr/build/solr-core/test-files/solr
[junit4:junit4]   2> 14257 T14 oasc.SolrResourceLoader.<init> new SolrResourceLoader for directory: '/usr/home/hudson/hudson-slave/workspace/Lucene-Solr-Tests-trunk-java7/solr/build/solr-core/test-files/solr/'
[junit4:junit4]   2> 14267 T14 oasc.CoreContainer.<init> New CoreContainer 677035369
[junit4:junit4]   2> 14267 T14 oasc.SolrCore.<init> [collection1] Opening new SolrCore at /usr/home/hudson/hudson-slave/workspace/Lucene-Solr-Tests-trunk-java7/solr/build/solr-core/test-files/solr/collection1/, dataDir=/usr/home/hudson/hudson-slave/workspace/Lucene-Solr-Tests-trunk-java7/solr/build/solr-core/test/J1/./org.apache.solr.update.SoftAutoCommitTest-1346976221546/
[junit4:junit4]   2> 14268 T14 oasc.JmxMonitoredMap.<init> JMX monitoring is enabled. Adding Solr mbeans to JMX Server: com.sun.jmx.mbeanserver.JmxMBeanServer@753d7d27
[junit4:junit4]   2> 14269 T14 oasc.SolrCore.getNewIndexDir WARNING New index directory detected: old=null new=/usr/home/hudson/hudson-slave/workspace/Lucene-Solr-Tests-trunk-java7/solr/build/solr-core/test/J1/./org.apache.solr.update.SoftAutoCommitTest-1346976221546/index/
[junit4:junit4]   2> 14270 T14 oasc.SolrCore.initIndex WARNING [collection1] Solr index directory '/usr/home/hudson/hudson-slave/workspace/Lucene-Solr-Tests-trunk-java7/solr/build/solr-core/test/J1/./org.apache.solr.update.SoftAutoCommitTest-1346976221546/index' doesn't exist. Creating new index...
[junit4:junit4]   2> 14270 T14 oasc.CachingDirectoryFactory.get return new directory for /usr/home/hudson/hudson-slave/workspace/Lucene-Solr-Tests-trunk-java7/solr/build/solr-core/test/J1/./org.apache.solr.update.SoftAutoCommitTest-1346976221546/index forceNew:false
[junit4:junit4]   2> 14273 T14 oasc.SolrDeletionPolicy.onCommit SolrDeletionPolicy.onCommit: commits:num=1
[junit4:junit4]   2> 		commit{dir=MockDirWrapper(org.apache.lucene.store.RAMDirectory@776afbcf lockFactory=org.apache.lucene.store.NativeFSLockFactory@27833133),segFN=segments_1,generation=1,filenames=[segments_1]
[junit4:junit4]   2> 14273 T14 oasc.SolrDeletionPolicy.updateCommits newest commit = 1
[junit4:junit4]   2> 14274 T14 oasc.SolrCore.initWriters created xml: solr.XMLResponseWriter
[junit4:junit4]   2> 14278 T14 oasup.UpdateRequestProcessorChain.init inserting DistributedUpdateProcessorFactory into updateRequestProcessorChain "dedupe"
[junit4:junit4]   2> 14279 T14 oasup.UpdateRequestProcessorChain.init inserting DistributedUpdateProcessorFactory into updateRequestProcessorChain "dedupe-allfields"
[junit4:junit4]   2> 14279 T14 oasup.UpdateRequestProcessorChain.init inserting DistributedUpdateProcessorFactory into updateRequestProcessorChain "stored_sig"
[junit4:junit4]   2> 14280 T14 oasup.UpdateRequestProcessorChain.init inserting DistributedUpdateProcessorFactory into updateRequestProcessorChain "uniq-fields"
[junit4:junit4]   2> 14281 T14 oasup.UpdateRequestProcessorChain.init inserting DistributedUpdateProcessorFactory into updateRequestProcessorChain "distrib-dup-test-chain-implicit"
[junit4:junit4]   2> 14282 T14 oasc.RequestHandlers.initHandlersFromConfig adding lazy requestHandler: solr.ReplicationHandler
[junit4:junit4]   2> 14282 T14 oasc.RequestHandlers.initHandlersFromConfig created /replication: solr.ReplicationHandler
[junit4:junit4]   2> 14283 T14 oasc.RequestHandlers.initHandlersFromConfig created standard: solr.StandardRequestHandler
[junit4:junit4]   2> 14284 T14 oasc.RequestHandlers.initHandlersFromConfig created /get: solr.RealTimeGetHandler
[junit4:junit4]   2> 14285 T14 oasc.RequestHandlers.initHandlersFromConfig created dismax: solr.SearchHandler
[junit4:junit4]   2> 14286 T14 oasc.RequestHandlers.initHandlersFromConfig created mock: org.apache.solr.core.MockQuerySenderListenerReqHandler
[junit4:junit4]   2> 14287 T14 oasc.RequestHandlers.initHandlersFromConfig created /admin/: org.apache.solr.handler.admin.AdminHandlers
[junit4:junit4]   2> 14288 T14 oasc.RequestHandlers.initHandlersFromConfig created defaults: solr.StandardRequestHandler
[junit4:junit4]   2> 14288 T14 oasc.RequestHandlers.initHandlersFromConfig adding lazy requestHandler: solr.StandardRequestHandler
[junit4:junit4]   2> 14289 T14 oasc.RequestHandlers.initHandlersFromConfig created lazy: solr.StandardRequestHandler
[junit4:junit4]   2> 14290 T14 oasc.RequestHandlers.initHandlersFromConfig created /update: solr.UpdateRequestHandler
[junit4:junit4]   2> 14291 T14 oasc.RequestHandlers.initHandlersFromConfig created /terms: org.apache.solr.handler.component.SearchHandler
[junit4:junit4]   2> 14291 T14 oasc.RequestHandlers.initHandlersFromConfig created spellCheckCompRH: org.apache.solr.handler.component.SearchHandler
[junit4:junit4]   2> 14292 T14 oasc.RequestHandlers.initHandlersFromConfig created spellCheckCompRH_Direct: org.apache.solr.handler.component.SearchHandler
[junit4:junit4]   2> 14293 T14 oasc.RequestHandlers.initHandlersFromConfig created spellCheckWithWordbreak: org.apache.solr.handler.component.SearchHandler
[junit4:junit4]   2> 14294 T14 oasc.RequestHandlers.initHandlersFromConfig created spellCheckWithWordbreak_Direct: org.apache.solr.handler.component.SearchHandler
[junit4:junit4]   2> 14295 T14 oasc.RequestHandlers.initHandlersFromConfig created spellCheckCompRH1: org.apache.solr.handler.component.SearchHandler
[junit4:junit4]   2> 14296 T14 oasc.RequestHandlers.initHandlersFromConfig created tvrh: org.apache.solr.handler.component.SearchHandler
[junit4:junit4]   2> 14297 T14 oasc.RequestHandlers.initHandlersFromConfig created /mlt: solr.MoreLikeThisHandler
[junit4:junit4]   2> 14298 T14 oasc.RequestHandlers.initHandlersFromConfig created /debug/dump: solr.DumpRequestHandler
[junit4:junit4]   2> 14301 T14 oashl.XMLLoader.init xsltCacheLifetimeSeconds=60
[junit4:junit4]   2> 14305 T14 oasc.SolrCore.initDeprecatedSupport WARNING solrconfig.xml uses deprecated <admin/gettableFiles>, Please update your config to use the ShowFileRequestHandler.
[junit4:junit4]   2> 14339 T14 oasc.SolrCore.initDeprecatedSupport WARNING adding ShowFileRequestHandler with hidden files: [THROW.ERROR.ON.ADD.UPDATEPROCESSOR.JS, SOLRCONFIG-HIGHLIGHT.XML, SCHEMA-REQUIRED-FIELDS.XML, SCHEMA-REPLICATION2.XML, SCHEMA-MINIMAL.XML, BAD-SCHEMA-DUP-DYNAMICFIELD.XML, TRIVIAL.UPDATEPROCESSOR1.JS, SOLRCONFIG-CACHING.XML, SOLRCONFIG-REPEATER.XML, CURRENCY.XML, SOLRCONFIG-MERGEPOLICY.XML, BAD-SCHEMA-NONTEXT-ANALYZER.XML, SOLRCONFIG-TLOG.XML, SOLRCONFIG-MASTER.XML, BAD-SCHEMA-UNIQUEKEY-MULTIVALUED.XML, SCHEMA11.XML, SOLRCONFIG-BASIC.XML, DA_COMPOUNDDICTIONARY.TXT, MISSLEADING.EXTENSION.UPDATEPROCESSOR.JS.TXT, SCHEMA-COPYFIELD-TEST.XML, SOLRCONFIG-SLAVE.XML, SOLRCONFIG-PROPINJECT-INDEXDEFAULT.XML, ELEVATE.XML, TRIVIAL.UPDATEPROCESSOR0.JS, BAD-SOLRCONFIG-BOGUS-SCRIPTENGINE-NAME.XML, SCHEMA-CHARFILTERS.XML, SCHEMA-IB.XML, SOLRCONFIG-QUERYSENDER.XML, DA_UTF8.XML, SCHEMA-REPLICATION1.XML, CONDITIONAL.UPDATEPROCESSOR.JS, MISSING.FUNCTIONS.UPDATEPROCESSOR.JS, SOLRCONFIG-ENABLEPLUGIN.XML, HYPHENATION.DTD, SCHEMA-PHRASESUGGEST.XML, STEMDICT.TXT, HUNSPELL-TEST.AFF, STOPTYPES-1.TXT, STOPWORDSWRONGENCODING.TXT, SCHEMA-NUMERIC.XML, SOLRCONFIG-TRANSFORMERS.XML, SOLRCONFIG-PROPINJECT.XML, BAD-SCHEMA-NOT-INDEXED-BUT-TF.XML, SOLRCONFIG-SIMPLELOCK.XML, WDFTYPES.TXT, SCHEMA-REVERSED.XML, STOPTYPES-2.TXT, SOLRCONFIG-SPELLCHECKCOMPONENT.XML, SCHEMA-DFR.XML, SOLRCONFIG-PHRASESUGGEST.XML, BAD-SCHEMA-NOT-INDEXED-BUT-POS.XML, KEEP-1.TXT, OPEN-EXCHANGE-RATES.JSON, STOPWITHBOM.TXT, SOLRCONFIG-SPELLCHECKER.XML, SCHEMA-BINARYFIELD.XML, SOLRCONFIG-UPDATE-PROCESSOR-CHAINS.XML, BAD-SCHEMA-OMIT-TF-BUT-NOT-POS.XML, BAD-SCHEMA-DUP-FIELDTYPE.XML, SOLRCONFIG-MASTER1.XML, SYNONYMS.TXT, SCHEMA.XML, SCHEMA_CODEC.XML, SOLRCONFIG-SOLR-749.XML, SOLRCONFIG-MASTER1-KEEPONEBACKUP.XML, STOP-2.TXT, SOLRCONFIG-FUNCTIONQUERY.XML, SCHEMA-LMDIRICHLET.XML, SOLRCONFIG-TERMINDEX.XML, SOLRCONFIG-ELEVATE.XML, STOPWORDS.TXT, SCHEMA-FOLDING.XML, SCHEMA-STOP-KEEP.XML, BAD-SCHEMA-NOT-INDEXED-BUT-NORMS.XML, SOLRCONFIG-SOLCOREPROPERTIES.XML, STOP-1.TXT, SOLRCONFIG-MASTER2.XML, SCHEMA-SPELLCHECKER.XML, SOLRCONFIG-LAZYWRITER.XML, SCHEMA-LUCENEMATCHVERSION.XML, FRENCHARTICLES.TXT, BAD-MP-SOLRCONFIG.XML, SCHEMA15.XML, SOLRCONFIG-REQHANDLER.INCL, SCHEMASURROUND.XML, SOLRCONFIG-MASTER3.XML, HUNSPELL-TEST.DIC, BAD-SCHEMA-CODEC-GLOBAL-VS-FT-MISMATCH.XML, SOLRCONFIG-XINCLUDE.XML, SOLRCONFIG-DELPOLICY1.XML, SOLRCONFIG-SLAVE1.XML, SCHEMA-SIM.XML, SCHEMA-COLLATE.XML, STOP-SNOWBALL.TXT, BAD-SCHEMA-SIM-GLOBAL-VS-FT-MISMATCH.XML, PROTWORDS.TXT, SCHEMA-TRIE.XML, SOLRCONFIG_CODEC.XML, BAD-SOLRCONFIG-INVALID-SCRIPTFILE.XML, SCHEMA-TFIDF.XML, SOLRCONFIG-SCRIPT-UPDATEPROCESSOR.XML, SCHEMA-LMJELINEKMERCER.XML, PHRASESUGGEST.TXT, BAD-SOLRCONFIG-MISSING-SCRIPTFILE.XML, BAD-SCHEMA-UNIQUEKEY-USES-DEFAULT.XML, OLD_SYNONYMS.TXT, SOLRCONFIG-DELPOLICY2.XML, SOLRCONFIG-NATIVELOCK.XML, XSLT, BAD-SCHEMA-DUP-FIELD.XML, SOLRCONFIG-NOCACHE.XML, SCHEMA-BM25.XML, ADDFIELDS.UPDATEPROCESSOR.JS, SOLRCONFIG-QUERYSENDER-NOQUERY.XML, SOLRCONFIG-ALTDIRECTORY.XML, COMPOUNDDICTIONARY.TXT, SOLRCONFIG_PERF.XML, BAD-SCHEMA-ANALYZER-CLASS-AND-NESTED.XML, SCHEMA-NOT-REQUIRED-UNIQUE-KEY.XML, KEEP-2.TXT, BAD-SCHEMA-UNIQUEKEY-IS-COPYFIELD-DEST.XML, SCHEMA12.XML, MAPPING-ISOLATIN1ACCENT.TXT, BAD_SOLRCONFIG.XML, BAD-SCHEMA-EXTERNAL-FILEFIELD.XML]
[junit4:junit4]   2> 14344 T14 oass.SolrIndexSearcher.<init> Opening Searcher@206e9689 main
[junit4:junit4]   2> 14344 T14 oass.SolrIndexSearcher.getIndexDir WARNING WARNING: Directory impl does not support setting indexDir: org.apache.lucene.store.MockDirectoryWrapper
[junit4:junit4]   2> 14345 T14 oasu.CommitTracker.<init> Hard AutoCommit: disabled
[junit4:junit4]   2> 14345 T14 oasu.CommitTracker.<init> Soft AutoCommit: disabled
[junit4:junit4]   2> 14346 T14 oashc.SpellCheckComponent.inform Initializing spell checkers
[junit4:junit4]   2> 14371 T14 oass.DirectSolrSpellChecker.init init: {name=direct,classname=DirectSolrSpellChecker,field=lowerfilt,minQueryLength=3}
[junit4:junit4]   2> 14423 T14 oashc.HttpShardHandlerFactory.getParameter Setting socketTimeout to: 0
[junit4:junit4]   2> 14424 T14 oashc.HttpShardHandlerFactory.getParameter Setting urlScheme to: http://
[junit4:junit4]   2> 14424 T14 oashc.HttpShardHandlerFactory.getParameter Setting connTimeout to: 0
[junit4:junit4]   2> 14425 T14 oashc.HttpShardHandlerFactory.getParameter Setting maxConnectionsPerHost to: 20
[junit4:junit4]   2> 14425 T14 oashc.HttpShardHandlerFactory.getParameter Setting corePoolSize to: 0
[junit4:junit4]   2> 14426 T14 oashc.HttpShardHandlerFactory.getParameter Setting maximumPoolSize to: 2147483647
[junit4:junit4]   2> 14427 T14 oashc.HttpShardHandlerFactory.getParameter Setting maxThreadIdleTime to: 5
[junit4:junit4]   2> 14427 T14 oashc.HttpShardHandlerFactory.getParameter Setting sizeOfQueue to: -1
[junit4:junit4]   2> 14427 T14 oashc.HttpShardHandlerFactory.getParameter Setting fairnessPolicy to: false
[junit4:junit4]   2> 14428 T14 oascsi.HttpClientUtil.createClient Creating new http client, config:maxConnectionsPerHost=20&maxConnections=10000&socketTimeout=0&connTimeout=0&retry=false
[junit4:junit4]   2> 14449 T18 oasc.SolrCore.registerSearcher [collection1] Registered new searcher Searcher@206e9689 main{StandardDirectoryReader(segments_1:1)}
[junit4:junit4]   2> 14458 T14 oasc.CoreContainer.register registering core: collection1
[junit4:junit4]   2> 14462 T14 oasu.AbstractSolrTestCase.setUp ####SETUP_END testSoftAndHardCommitMaxTimeMixedAdds
[junit4:junit4]   2> ASYNC  NEW_CORE C1 name=collection1 org.apache.solr.core.SolrCore@5d494d31
[junit4:junit4]   2> 14471 T14 C1 oasc.SolrDeletionPolicy.onInit SolrDeletionPolicy.onInit: commits:num=1
[junit4:junit4]   2> 		commit{dir=MockDirWrapper(org.apache.lucene.store.RAMDirectory@776afbcf lockFactory=org.apache.lucene.store.NativeFSLockFactory@27833133),segFN=segments_1,generation=1,filenames=[segments_1]
[junit4:junit4]   2> 14472 T14 C1 oasc.SolrDeletionPolicy.updateCommits newest commit = 1
[junit4:junit4]   2> 14475 T14 C1 UPDATE [collection1] webapp=null path=null params={} {add=[529]} 0 7
[junit4:junit4]   2> 14976 T20 oasu.DirectUpdateHandler2.commit start commit{flags=0,_version_=0,optimize=false,openSearcher=true,waitSearcher=true,expungeDeletes=false,softCommit=true}
[junit4:junit4]   2> 14990 T20 oass.SolrIndexSearcher.<init> Opening Searcher@2aec7bcd main
[junit4:junit4]   2> 14994 T20 oass.SolrIndexSearcher.getIndexDir WARNING WARNING: Directory impl does not support setting indexDir: org.apache.lucene.store.MockDirectoryWrapper
[junit4:junit4]   2> 15014 T20 oasu.DirectUpdateHandler2.commit end_commit_flush
[junit4:junit4]   2> 15018 T18 oasc.SolrCore.registerSearcher [collection1] Registered new searcher Searcher@2aec7bcd main{StandardDirectoryReader(segments_1:3:nrt _0(5.0):C1)}
[junit4:junit4]   2> 15021 T14 C1 UPDATE [collection1] webapp=null path=null params={} {add=[530]} 0 3
[junit4:junit4]   2> 15522 T20 oasu.DirectUpdateHandler2.commit start commit{flags=0,_version_=0,optimize=false,openSearcher=true,waitSearcher=true,expungeDeletes=false,softCommit=true}
[junit4:junit4]   2> 15644 T20 oass.SolrIndexSearcher.<init> Opening Searcher@76cf71a5 main
[junit4:junit4]   2> 15644 T20 oass.SolrIndexSearcher.getIndexDir WARNING WARNING: Directory impl does not support setting indexDir: org.apache.lucene.store.MockDirectoryWrapper
[junit4:junit4]   2> 15645 T20 oasu.DirectUpdateHandler2.commit end_commit_flush
[junit4:junit4]   2> 15651 T18 oasc.SolrCore.registerSearcher [collection1] Registered new searcher Searcher@76cf71a5 main{StandardDirectoryReader(segments_1:5:nrt _0(5.0):C1 _1(5.0):C1)}
[junit4:junit4]   2> 15676 T19 oasu.DirectUpdateHandler2.commit start commit{flags=0,_version_=0,optimize=false,openSearcher=true,waitSearcher=true,expungeDeletes=false,softCommit=false}
[junit4:junit4]   2> 15678 T19 oasc.SolrDeletionPolicy.onCommit SolrDeletionPolicy.onCommit: commits:num=2
[junit4:junit4]   2> 		commit{dir=MockDirWrapper(org.apache.lucene.store.RAMDirectory@776afbcf lockFactory=org.apache.lucene.store.NativeFSLockFactory@27833133),segFN=segments_1,generation=1,filenames=[segments_1]
[junit4:junit4]   2> 		commit{dir=MockDirWrapper(org.apache.lucene.store.RAMDirectory@776afbcf lockFactory=org.apache.lucene.store.NativeFSLockFactory@27833133),segFN=segments_2,generation=2,filenames=[_0_Asserting_0.tim, _1_NestedPulsing_0.tip, _1_NestedPulsing_0.prx, _0_Asserting_0.tip, _0_TestBloomFilteredLucene40Postings_0.prx, _1_TestBloomFilteredLucene40Postings_0.blm, _0_NestedPulsing_0.tip, _1.fnm, _0_NestedPulsing_0.tim, _0_Asserting_0.prx, _1_TestBloomFilteredLucene40Postings_0.tip, _1_Asserting_0.tim, _1_Memory_0.ram, _1_Asserting_0.tip, _0_TestBloomFilteredLucene40Postings_0.frq, _1_NestedPulsing_0.tim, _1_TestBloomFilteredLucene40Postings_0.tim, _0.si, _0_TestBloomFilteredLucene40Postings_0.tim, _1_nrm.cfs, _0_TestBloomFilteredLucene40Postings_0.tip, _0_TestBloomFilteredLucene40Postings_0.blm, _0.fnm, _1_TestBloomFilteredLucene40Postings_0.prx, _0_Memory_0.ram, _1_Asserting_0.frq, _0_NestedPulsing_0.frq, _0_nrm.cfs, _1_TestBloomFilteredLucene40Postings_0.frq, _0_NestedPulsing_0.prx, _1_nrm.cfe, _1.fdx, _0_Asserting_0.frq, _1_NestedPulsing_0.frq, _1.fdt, _1_Asserting_0.prx, _1.si, _0_nrm.cfe, segments_2, _0.fdx, _0.fdt]
[junit4:junit4]   2> 15678 T19 oasc.SolrDeletionPolicy.updateCommits newest commit = 2
[junit4:junit4]   2> 15679 T19 oass.SolrIndexSearcher.<init> Opening Searcher@63120157 main
[junit4:junit4]   2> 15680 T19 oass.SolrIndexSearcher.getIndexDir WARNING WARNING: Directory impl does not support setting indexDir: org.apache.lucene.store.MockDirectoryWrapper
[junit4:junit4]   2> 15680 T19 oasu.DirectUpdateHandler2.commit end_commit_flush
[junit4:junit4]   2> 15685 T18 oasc.SolrCore.registerSearcher [collection1] Registered new searcher Searcher@63120157 main{StandardDirectoryReader(segments_1:5:nrt _0(5.0):C1 _1(5.0):C1)}
[junit4:junit4]   2> 18881 T14 oasu.AbstractSolrTestCase.tearDown ####TEARDOWN_START testSoftAndHardCommitMaxTimeMixedAdds
[junit4:junit4]   2> 18882 T14 oasc.CoreContainer.shutdown Shutting down CoreContainer instance=677035369
[junit4:junit4]   2> 18882 T14 oasc.SolrCore.close [collection1]  CLOSING SolrCore org.apache.solr.core.SolrCore@5d494d31
[junit4:junit4]   2> 18916 T14 oasc.SolrCore.closeSearcher [collection1] Closing main searcher on request.
[junit4:junit4]   2> 18917 T14 oasu.DirectUpdateHandler2.close closing DirectUpdateHandler2{commits=3,autocommit maxTime=1200ms,autocommits=1,soft autocommit maxTime=500ms,soft autocommits=2,optimizes=0,rollbacks=0,expungeDeletes=0,docsPending=0,adds=0,deletesById=0,deletesByQuery=0,errors=0,cumulative_adds=2,cumulative_deletesById=0,cumulative_deletesByQuery=0,cumulative_errors=0}
[junit4:junit4]   2> 18918 T14 oasu.DefaultSolrCoreState.decref SolrCoreState ref count has reached 0 - closing IndexWriter
[junit4:junit4]   2> 19175 T14 oasu.DefaultSolrCoreState.decref Closing SolrCoreState - canceling any ongoing recovery
[junit4:junit4]   2> 19211 T14 oasu.AbstractSolrTestCase.setUp ####SETUP_START testSoftAndHardCommitMaxTimeDelete
[junit4:junit4]   2> 19214 T14 oasc.SolrResourceLoader.<init> new SolrResourceLoader for directory: '/usr/home/hudson/hudson-slave/workspace/Lucene-Solr-Tests-trunk-java7/solr/build/solr-core/test-files/solr/collection1/'
[junit4:junit4]   2> 19217 T14 oasc.SolrResourceLoader.replaceClassLoader Adding 'file:/usr/home/hudson/hudson-slave/workspace/Lucene-Solr-Tests-trunk-java7/solr/build/solr-core/test-files/solr/collection1/lib/classes/' to classloader
[junit4:junit4]   2> 19218 T14 oasc.SolrResourceLoader.replaceClassLoader Adding 'file:/usr/home/hudson/hudson-slave/workspace/Lucene-Solr-Tests-trunk-java7/solr/build/solr-core/test-files/solr/collection1/lib/README' to classloader
[junit4:junit4]   2> 19341 T14 oasc.SolrConfig.<init> Using Lucene MatchVersion: LUCENE_50
[junit4:junit4]   2> 19446 T14 oasc.SolrConfig.<init> Loaded SolrConfig: solrconfig.xml
[junit4:junit4]   2> 19448 T14 oass.IndexSchema.readSchema Reading Solr Schema
[junit4:junit4]   2> 19505 T14 oass.IndexSchema.readSchema Schema name=test
[junit4:junit4]   2> 20159 T14 oass.OpenExchangeRatesOrgProvider.init Initialized with rates=open-exchange-rates.json, refreshInterval=1440.
[junit4:junit4]   2> 20171 T14 oass.IndexSchema.readSchema default search field in schema is text
[junit4:junit4]   2> 20180 T14 oass.IndexSchema.readSchema unique key field: id
[junit4:junit4]   2> 20199 T14 oass.FileExchangeRateProvider.reload Reloading exchange rates from file currency.xml
[junit4:junit4]   2> 20204 T14 oass.FileExchangeRateProvider.reload Reloading exchange rates from file currency.xml
[junit4:junit4]   2> 20209 T14 oass.OpenExchangeRatesOrgProvider.reload Reloading exchange rates from open-exchange-rates.json
[junit4:junit4]   2> 20212 T14 oass.OpenExchangeRatesOrgProvider.reload Reloading exchange rates from open-exchange-rates.json
[junit4:junit4]   2> 20214 T14 oasc.SolrResourceLoader.locateSolrHome JNDI not configured for solr (NoInitialContextEx)
[junit4:junit4]   2> 20215 T14 oasc.SolrResourceLoader.locateSolrHome using system property solr.solr.home: /usr/home/hudson/hudson-slave/workspace/Lucene-Solr-Tests-trunk-java7/solr/build/solr-core/test-files/solr
[junit4:junit4]   2> 20215 T14 oasc.SolrResourceLoader.<init> new SolrResourceLoader for directory: '/usr/home/hudson/hudson-slave/workspace/Lucene-Solr-Tests-trunk-java7/solr/build/solr-core/test-files/solr/'
[junit4:junit4]   2> 20224 T14 oasc.CoreContainer.<init> New CoreContainer 1256796441
[junit4:junit4]   2> 20225 T14 oasc.SolrCore.<init> [collection1] Opening new SolrCore at /usr/home/hudson/hudson-slave/workspace/Lucene-Solr-Tests-trunk-java7/solr/build/solr-core/test-files/solr/collection1/, dataDir=/usr/home/hudson/hudson-slave/workspace/Lucene-Solr-Tests-trunk-java7/solr/build/solr-core/test/J1/./org.apache.solr.update.SoftAutoCommitTest-1346976227660/
[junit4:junit4]   2> 20226 T14 oasc.JmxMonitoredMap.<init> JMX monitoring is enabled. Adding Solr mbeans to JMX Server: com.sun.jmx.mbeanserver.JmxMBeanServer@753d7d27
[junit4:junit4]   2> 20227 T14 oasc.SolrCore.getNewIndexDir WARNING New index directory detected: old=null new=/usr/home/hudson/hudson-slave/workspace/Lucene-Solr-Tests-trunk-java7/solr/build/solr-core/test/J1/./org.apache.solr.update.SoftAutoCommitTest-1346976227660/index/
[junit4:junit4]   2> 20227 T14 oasc.SolrCore.initIndex WARNING [collection1] Solr index directory '/usr/home/hudson/hudson-slave/workspace/Lucene-Solr-Tests-trunk-java7/solr/build/solr-core/test/J1/./org.apache.solr.update.SoftAutoCommitTest-1346976227660/index' doesn't exist. Creating new index...
[junit4:junit4]   2> 20244 T14 oasc.CachingDirectoryFactory.get return new directory for /usr/home/hudson/hudson-slave/workspace/Lucene-Solr-Tests-trunk-java7/solr/build/solr-core/test/J1/./org.apache.solr.update.SoftAutoCommitTest-1346976227660/index forceNew:false
[junit4:junit4]   2> 20247 T14 oasc.SolrDeletionPolicy.onCommit SolrDeletionPolicy.onCommit: commits:num=1
[junit4:junit4]   2> 		commit{dir=MockDirWrapper(org.apache.lucene.store.MMapDirectory@/usr/home/hudson/hudson-slave/workspace/Lucene-Solr-Tests-trunk-java7/solr/build/solr-core/test/J1/index2065920659tmp lockFactory=org.apache.lucene.store.NativeFSLockFactory@1f831b84),segFN=segments_1,generation=1,filenames=[segments_1]
[junit4:junit4]   2> 20247 T14 oasc.SolrDeletionPolicy.updateCommits newest commit = 1
[junit4:junit4]   2> 20248 T14 oasc.SolrCore.initWriters created xml: solr.XMLResponseWriter
[junit4:junit4]   2> 20251 T14 oasup.UpdateRequestProcessorChain.init inserting DistributedUpdateProcessorFactory into updateRequestProcessorChain "dedupe"
[junit4:junit4]   2> 20251 T14 oasup.UpdateRequestProcessorChain.init inserting DistributedUpdateProcessorFactory into updateRequestProcessorChain "dedupe-allfields"
[junit4:junit4]   2> 20252 T14 oasup.UpdateRequestProcessorChain.init inserting DistributedUpdateProcessorFactory into updateRequestProcessorChain "stored_sig"
[junit4:junit4]   2> 20253 T14 oasup.UpdateRequestProcessorChain.init inserting DistributedUpdateProcessorFactory into updateRequestProcessorChain "uniq-fields"
[junit4:junit4]   2> 20254 T14 oasup.UpdateRequestProcessorChain.init inserting DistributedUpdateProcessorFactory into updateRequestProcessorChain "distrib-dup-test-chain-implicit"
[junit4:junit4]   2> 20254 T14 oasc.RequestHandlers.initHandlersFromConfig adding lazy requestHandler: solr.ReplicationHandler
[junit4:junit4]   2> 20255 T14 oasc.RequestHandlers.initHandlersFromConfig created /replication: solr.ReplicationHandler
[junit4:junit4]   2> 20256 T14 oasc.RequestHandlers.initHandlersFromConfig created standard: solr.StandardRequestHandler
[junit4:junit4]   2> 20257 T14 oasc.RequestHandlers.initHandlersFromConfig created /get: solr.RealTimeGetHandler
[junit4:junit4]   2> 20257 T14 oasc.RequestHandlers.initHandlersFromConfig created dismax: solr.SearchHandler
[junit4:junit4]   2> 20258 T14 oasc.RequestHandlers.initHandlersFromConfig created mock: org.apache.solr.core.MockQuerySenderListenerReqHandler
[junit4:junit4]   2> 20259 T14 oasc.RequestHandlers.initHandlersFromConfig created /admin/: org.apache.solr.handler.admin.AdminHandlers
[junit4:junit4]   2> 20260 T14 oasc.RequestHandlers.initHandlersFromConfig created defaults: solr.StandardRequestHandler
[junit4:junit4]   2> 20260 T14 oasc.RequestHandlers.initHandlersFromConfig adding lazy requestHandler: solr.StandardRequestHandler
[junit4:junit4]   2> 20261 T14 oasc.RequestHandlers.initHandlersFromConfig created lazy: solr.StandardRequestHandler
[junit4:junit4]   2> 20261 T14 oasc.RequestHandlers.initHandlersFromConfig created /update: solr.UpdateRequestHandler
[junit4:junit4]   2> 20262 T14 oasc.RequestHandlers.initHandlersFromConfig created /terms: org.apache.solr.handler.component.SearchHandler
[junit4:junit4]   2> 20263 T14 oasc.RequestHandlers.initHandlersFromConfig created spellCheckCompRH: org.apache.solr.handler.component.SearchHandler
[junit4:junit4]   2> 20264 T14 oasc.RequestHandlers.initHandlersFromConfig created spellCheckCompRH_Direct: org.apache.solr.handler.component.SearchHandler
[junit4:junit4]   2> 20264 T14 oasc.RequestHandlers.initHandlersFromConfig created spellCheckWithWordbreak: org.apache.solr.handler.component.SearchHandler
[junit4:junit4]   2> 20265 T14 oasc.RequestHandlers.initHandlersFromConfig created spellCheckWithWordbreak_Direct: org.apache.solr.handler.component.SearchHandler
[junit4:junit4]   2> 20266 T14 oasc.RequestHandlers.initHandlersFromConfig created spellCheckCompRH1: org.apache.solr.handler.component.SearchHandler
[junit4:junit4]   2> 20267 T14 oasc.RequestHandlers.initHandlersFromConfig created tvrh: org.apache.solr.handler.component.SearchHandler
[junit4:junit4]   2> 20268 T14 oasc.RequestHandlers.initHandlersFromConfig created /mlt: solr.MoreLikeThisHandler
[junit4:junit4]   2> 20270 T14 oasc.RequestHandlers.initHandlersFromConfig created /debug/dump: solr.DumpRequestHandler
[junit4:junit4]   2> 20273 T14 oashl.XMLLoader.init xsltCacheLifetimeSeconds=60
[junit4:junit4]   2> 20278 T14 oasc.SolrCore.initDeprecatedSupport WARNING solrconfig.xml uses deprecated <admin/gettableFiles>, Please update your config to use the ShowFileRequestHandler.
[junit4:junit4]   2> 20281 T14 oasc.SolrCore.initDeprecatedSupport WARNING adding ShowFileRequestHandler with hidden files: [THROW.ERROR.ON.ADD.UPDATEPROCESSOR.JS, SOLRCONFIG-HIGHLIGHT.XML, SCHEMA-REQUIRED-FIELDS.XML, SCHEMA-REPLICATION2.XML, SCHEMA-MINIMAL.XML, BAD-SCHEMA-DUP-DYNAMICFIELD.XML, TRIVIAL.UPDATEPROCESSOR1.JS, SOLRCONFIG-CACHING.XML, SOLRCONFIG-REPEATER.XML, CURRENCY.XML, SOLRCONFIG-MERGEPOLICY.XML, BAD-SCHEMA-NONTEXT-ANALYZER.XML, SOLRCONFIG-TLOG.XML, SOLRCONFIG-MASTER.XML, BAD-SCHEMA-UNIQUEKEY-MULTIVALUED.XML, SCHEMA11.XML, SOLRCONFIG-BASIC.XML, DA_COMPOUNDDICTIONARY.TXT, MISSLEADING.EXTENSION.UPDATEPROCESSOR.JS.TXT, SCHEMA-COPYFIELD-TEST.XML, SOLRCONFIG-SLAVE.XML, SOLRCONFIG-PROPINJECT-INDEXDEFAULT.XML, ELEVATE.XML, TRIVIAL.UPDATEPROCESSOR0.JS, BAD-SOLRCONFIG-BOGUS-SCRIPTENGINE-NAME.XML, SCHEMA-CHARFILTERS.XML, SCHEMA-IB.XML, SOLRCONFIG-QUERYSENDER.XML, DA_UTF8.XML, SCHEMA-REPLICATION1.XML, CONDITIONAL.UPDATEPROCESSOR.JS, MISSING.FUNCTIONS.UPDATEPROCESSOR.JS, SOLRCONFIG-ENABLEPLUGIN.XML, HYPHENATION.DTD, SCHEMA-PHRASESUGGEST.XML, STEMDICT.TXT, HUNSPELL-TEST.AFF, STOPTYPES-1.TXT, STOPWORDSWRONGENCODING.TXT, SCHEMA-NUMERIC.XML, SOLRCONFIG-TRANSFORMERS.XML, SOLRCONFIG-PROPINJECT.XML, BAD-SCHEMA-NOT-INDEXED-BUT-TF.XML, SOLRCONFIG-SIMPLELOCK.XML, WDFTYPES.TXT, SCHEMA-REVERSED.XML, STOPTYPES-2.TXT, SOLRCONFIG-SPELLCHECKCOMPONENT.XML, SCHEMA-DFR.XML, SOLRCONFIG-PHRASESUGGEST.XML, BAD-SCHEMA-NOT-INDEXED-BUT-POS.XML, KEEP-1.TXT, OPEN-EXCHANGE-RATES.JSON, STOPWITHBOM.TXT, SOLRCONFIG-SPELLCHECKER.XML, SCHEMA-BINARYFIELD.XML, SOLRCONFIG-UPDATE-PROCESSOR-CHAINS.XML, BAD-SCHEMA-OMIT-TF-BUT-NOT-POS.XML, BAD-SCHEMA-DUP-FIELDTYPE.XML, SOLRCONFIG-MASTER1.XML, SYNONYMS.TXT, SCHEMA.XML, SCHEMA_CODEC.XML, SOLRCONFIG-SOLR-749.XML, SOLRCONFIG-MASTER1-KEEPONEBACKUP.XML, STOP-2.TXT, SOLRCONFIG-FUNCTIONQUERY.XML, SCHEMA-LMDIRICHLET.XML, SOLRCONFIG-TERMINDEX.XML, SOLRCONFIG-ELEVATE.XML, STOPWORDS.TXT, SCHEMA-FOLDING.XML, SCHEMA-STOP-KEEP.XML, BAD-SCHEMA-NOT-INDEXED-BUT-NORMS.XML, SOLRCONFIG-SOLCOREPROPERTIES.XML, STOP-1.TXT, SOLRCONFIG-MASTER2.XML, SCHEMA-SPELLCHECKER.XML, SOLRCONFIG-LAZYWRITER.XML, SCHEMA-LUCENEMATCHVERSION.XML, FRENCHARTICLES.TXT, BAD-MP-SOLRCONFIG.XML, SCHEMA15.XML, SOLRCONFIG-REQHANDLER.INCL, SCHEMASURROUND.XML, SOLRCONFIG-MASTER3.XML, HUNSPELL-TEST.DIC, BAD-SCHEMA-CODEC-GLOBAL-VS-FT-MISMATCH.XML, SOLRCONFIG-XINCLUDE.XML, SOLRCONFIG-DELPOLICY1.XML, SOLRCONFIG-SLAVE1.XML, SCHEMA-SIM.XML, SCHEMA-COLLATE.XML, STOP-SNOWBALL.TXT, BAD-SCHEMA-SIM-GLOBAL-VS-FT-MISMATCH.XML, PROTWORDS.TXT, SCHEMA-TRIE.XML, SOLRCONFIG_CODEC.XML, BAD-SOLRCONFIG-INVALID-SCRIPTFILE.XML, SCHEMA-TFIDF.XML, SOLRCONFIG-SCRIPT-UPDATEPROCESSOR.XML, SCHEMA-LMJELINEKMERCER.XML, PHRASESUGGEST.TXT, BAD-SOLRCONFIG-MISSING-SCRIPTFILE.XML, BAD-SCHEMA-UNIQUEKEY-USES-DEFAULT.XML, OLD_SYNONYMS.TXT, SOLRCONFIG-DELPOLICY2.XML, SOLRCONFIG-NATIVELOCK.XML, XSLT, BAD-SCHEMA-DUP-FIELD.XML, SOLRCONFIG-NOCACHE.XML, SCHEMA-BM25.XML, ADDFIELDS.UPDATEPROCESSOR.JS, SOLRCONFIG-QUERYSENDER-NOQUERY.XML, SOLRCONFIG-ALTDIRECTORY.XML, COMPOUNDDICTIONARY.TXT, SOLRCONFIG_PERF.XML, BAD-SCHEMA-ANALYZER-CLASS-AND-NESTED.XML, SCHEMA-NOT-REQUIRED-UNIQUE-KEY.XML, KEEP-2.TXT, BAD-SCHEMA-UNIQUEKEY-IS-COPYFIELD-DEST.XML, SCHEMA12.XML, MAPPING-ISOLATIN1ACCENT.TXT, BAD_SOLRCONFIG.XML, BAD-SCHEMA-EXTERNAL-FILEFIELD.XML]
[junit4:junit4]   2> 20295 T14 oass.SolrIndexSearcher.<init> Opening Searcher@2a98a2e8 main
[junit4:junit4]   2> 20296 T14 oass.SolrIndexSearcher.getIndexDir WARNING WARNING: Directory impl does not support setting indexDir: org.apache.lucene.store.MockDirectoryWrapper
[junit4:junit4]   2> 20296 T14 oasu.CommitTracker.<init> Hard AutoCommit: disabled
[junit4:junit4]   2> 20297 T14 oasu.CommitTracker.<init> Soft AutoCommit: disabled
[junit4:junit4]   2> 20298 T14 oashc.SpellCheckComponent.inform Initializing spell checkers
[junit4:junit4]   2> 20318 T14 oass.DirectSolrSpellChecker.init init: {name=direct,classname=DirectSolrSpellChecker,field=lowerfilt,minQueryLength=3}
[junit4:junit4]   2> 20359 T14 oashc.HttpShardHandlerFactory.getParameter Setting socketTimeout to: 0
[junit4:junit4]   2> 20359 T14 oashc.HttpShardHandlerFactory.getParameter Setting urlScheme to: http://
[junit4:junit4]   2> 20360 T14 oashc.HttpShardHandlerFactory.getParameter Setting connTimeout to: 0
[junit4:junit4]   2> 20360 T14 oashc.HttpShardHandlerFactory.getParameter Setting maxConnectionsPerHost to: 20
[junit4:junit4]   2> 20361 T14 oashc.HttpShardHandlerFactory.getParameter Setting corePoolSize to: 0
[junit4:junit4]   2> 20361 T14 oashc.HttpShardHandlerFactory.getParameter Setting maximumPoolSize to: 2147483647
[junit4:junit4]   2> 20362 T14 oashc.HttpShardHandlerFactory.getParameter Setting maxThreadIdleTime to: 5
[junit4:junit4]   2> 20362 T14 oashc.HttpShardHandlerFactory.getParameter Setting sizeOfQueue to: -1
[junit4:junit4]   2> 20362 T14 oashc.HttpShardHandlerFactory.getParameter Setting fairnessPolicy to: false
[junit4:junit4]   2> 20363 T14 oascsi.HttpClientUtil.createClient Creating new http client, config:maxConnectionsPerHost=20&maxConnections=10000&socketTimeout=0&connTimeout=0&retry=false
[junit4:junit4]   2> 20381 T21 oasc.SolrCore.registerSearcher [collection1] Registered new searcher Searcher@2a98a2e8 main{StandardDirectoryReader(segments_1:1)}
[junit4:junit4]   2> 20388 T14 oasc.CoreContainer.register registering core: collection1
[junit4:junit4]   2> 20391 T14 oasu.AbstractSolrTestCase.setUp ####SETUP_END testSoftAndHardCommitMaxTimeDelete
[junit4:junit4]   2> ASYNC  NEW_CORE C2 name=collection1 org.apache.solr.core.SolrCore@139686bb
[junit4:junit4]   2> 20401 T14 C2 oasc.SolrDeletionPolicy.onInit SolrDeletionPolicy.onInit: commits:num=1
[junit4:junit4]   2> 		commit{dir=MockDirWrapper(org.apache.lucene.store.MMapDirectory@/usr/home/hudson/hudson-slave/workspace/Lucene-Solr-Tests-trunk-java7/solr/build/solr-core/test/J1/index2065920659tmp lockFactory=org.apache.lucene.store.NativeFSLockFactory@1f831b84),segFN=segments_1,generation=1,filenames=[segments_1]
[junit4:junit4]   2> 20402 T14 C2 oasc.SolrDeletionPolicy.updateCommits newest commit = 1
[junit4:junit4]   2> 20405 T14 C2 UPDATE [collection1] webapp=null path=null params={} {add=[529]} 0 8
[junit4:junit4]   2> 20421 T14 C2 oasu.DirectUpdateHandler2.commit start commit{flags=0,_version_=0,optimize=false,openSearcher=true,waitSearcher=true,expungeDeletes=false,softCommit=false}
[junit4:junit4]   2> 20438 T14 C2 oasc.SolrDeletionPolicy.onCommit SolrDeletionPolicy.onCommit: commits:num=2
[junit4:junit4]   2> 		commit{dir=MockDirWrapper(org.apache.lucene.store.MMapDirectory@/usr/home/hudson/hudson-slave/workspace/Lucene-Solr-Tests-trunk-java7/solr/build/solr-core/test/J1/index2065920659tmp lockFactory=org.apache.lucene.store.NativeFSLockFactory@1f831b84),segFN=segments_1,generation=1,filenames=[segments_1]
[junit4:junit4]   2> 		commit{dir=MockDirWrapper(org.apache.lucene.store.MMapDirectory@/usr/home/hudson/hudson-slave/workspace/Lucene-Solr-Tests-trunk-java7/solr/build/solr-core/test/J1/index2065920659tmp lockFactory=org.apache.lucene.store.NativeFSLockFactory@1f831b84),segFN=segments_2,generation=2,filenames=[_0_Asserting_0.tim, _0_TestBloomFilteredLucene40Postings_0.tim, _0_TestBloomFilteredLucene40Postings_0.blm, _0_TestBloomFilteredLucene40Postings_0.tip, _0.fnm, _0_Asserting_0.tip, _0_Memory_0.ram, _0_TestBloomFilteredLucene40Postings_0.prx, _0_NestedPulsing_0.frq, _0_nrm.cfs, _0_NestedPulsing_0.tip, _0_NestedPulsing_0.prx, _0_NestedPulsing_0.tim, _0_Asserting_0.prx, _0_Asserting_0.frq, _0_nrm.cfe, segments_2, _0_TestBloomFilteredLucene40Postings_0.frq, _0.fdx, _0.si, _0.fdt]
[junit4:junit4]   2> 20439 T14 C2 oasc.SolrDeletionPolicy.updateCommits newest commit = 2
[junit4:junit4]   2> 20459 T14 C2 oass.SolrIndexSearcher.<init> Opening Searcher@6b61edef main
[junit4:junit4]   2> 20460 T14 C2 oass.SolrIndexSearcher.getIndexDir WARNING WARNING: Directory impl does not support setting indexDir: org.apache.lucene.store.MockDirectoryWrapper
[junit4:junit4]   2> 20462 T14 C2 oasu.DirectUpdateHandler2.commit end_commit_flush
[junit4:junit4]   2> 20466 T21 oasc.SolrCore.registerSearcher [collection1] Registered new searcher Searcher@6b61edef main{StandardDirectoryReader(segments_2:3 _0(5.0):C1)}
[junit4:junit4]   2> 20467 T14 C2 UPDATE [collection1] webapp=null path=null params={} {commit=} 0 46
[junit4:junit4]   2> 20479 T14 C2 UPDATE [collection1] webapp=null path=null params={} {delete=[529]} 0 4
[junit4:junit4]   2> 20981 T23 oasu.DirectUpdateHandler2.commit start commit{flags=0,_version_=0,optimize=false,openSearcher=true,waitSearcher=true,expungeDeletes=false,softCommit=true}
[junit4:junit4]   2> 21000 T23 oass.SolrIndexSearcher.<init> Opening Searcher@546632b main
[junit4:junit4]   2> 21001 T23 oass.SolrIndexSearcher.getIndexDir WARNING WARNING: Directory impl does not support setting indexDir: org.apache.lucene.store.MockDirectoryWrapper
[junit4:junit4]   2> 21002 T23 oasu.DirectUpdateHandler2.commit end_commit_flush
[junit4:junit4]   2> 21005 T21 oasc.SolrCore.registerSearcher [collection1] Registered new searcher Searcher@546632b main{StandardDirectoryReader(segments_2:5:nrt)}
[junit4:junit4]   2> 21009 T14 C2 UPDATE [collection1] webapp=null path=null params={} {add=[550]} 0 3
[junit4:junit4]   2> 21510 T23 oasu.DirectUpdateHandler2.commit start commit{flags=0,_version_=0,optimize=false,openSearcher=true,waitSearcher=true,expungeDeletes=false,softCommit=true}
[junit4:junit4]   2> 21532 T23 oass.SolrIndexSearcher.<init> Opening Searcher@59bc8b79 main
[junit4:junit4]   2> 21532 T23 oass.SolrIndexSearcher.getIndexDir WARNING WARNING: Directory impl does not support setting indexDir: org.apache.lucene.store.MockDirectoryWrapper
[junit4:junit4]   2> 21533 T23 oasu.DirectUpdateHandler2.commit end_commit_flush
[junit4:junit4]   2> 21537 T21 oasc.SolrCore.registerSearcher [collection1] Registered new searcher Searcher@59bc8b79 main{StandardDirectoryReader(segments_2:7:nrt _1(5.0):C1)}
[junit4:junit4]   2> 21681 T22 oasu.DirectUpdateHandler2.commit start commit{flags=0,_version_=0,optimize=false,openSearcher=true,waitSearcher=true,expungeDeletes=false,softCommit=false}
[junit4:junit4]   2> 21687 T22 oasc.SolrDeletionPolicy.onCommit SolrDeletionPolicy.onCommit: commits:num=2
[junit4:junit4]   2> 		commit{dir=MockDirWrapper(org.apache.lucene.store.MMapDirectory@/usr/home/hudson/hudson-slave/workspace/Lucene-Solr-Tests-trunk-java7/solr/build/solr-core/test/J1/index2065920659tmp lockFactory=org.apache.lucene.store.NativeFSLockFactory@1f831b84),segFN=segments_2,generation=2,filenames=[_0_Asserting_0.tim, _0_TestBloomFilteredLucene40Postings_0.tim, _0_TestBloomFilteredLucene40Postings_0.blm, _0_TestBloomFilteredLucene40Postings_0.tip, _0.fnm, _0_Asserting_0.tip, _0_Memory_0.ram, _0_TestBloomFilteredLucene40Postings_0.prx, _0_NestedPulsing_0.frq, _0_nrm.cfs, _0_NestedPulsing_0.tip, _0_NestedPulsing_0.prx, _0_NestedPulsing_0.tim, _0_Asserting_0.prx, _0_Asserting_0.frq, _0_nrm.cfe, segments_2, _0_TestBloomFilteredLucene40Postings_0.frq, _0.fdx, _0.si, _0.fdt]
[junit4:junit4]   2> 		commit{dir=MockDirWrapper(org.apache.lucene.store.MMapDirectory@/usr/home/hudson/hudson-slave/workspace/Lucene-Solr-Tests-trunk-java7/solr/build/solr-core/test/J1/index2065920659tmp lockFactory=org.apache.lucene.store.NativeFSLockFactory@1f831b84),segFN=segments_3,generation=3,filenames=[_1_NestedPulsing_0.tip, _1_nrm.cfs, _1_TestBloomFilteredLucene40Postings_0.prx, _1_NestedPulsing_0.prx, _1_TestBloomFilteredLucene40Postings_0.blm, _1_Asserting_0.frq, _1.fnm, _1_TestBloomFilteredLucene40Postings_0.frq, _1_nrm.cfe, _1_TestBloomFilteredLucene40Postings_0.tip, _1_Asserting_0.tim, _1.fdx, _1_Memory_0.ram, _1_NestedPulsing_0.frq, _1.fdt, _1_Asserting_0.prx, _1_Asserting_0.tip, _1.si, _1_NestedPulsing_0.tim, _1_TestBloomFilteredLucene40Postings_0.tim, segments_3]
[junit4:junit4]   2> 21688 T22 oasc.SolrDeletionPolicy.updateCommits newest commit = 3
[junit4:junit4]   2> 21698 T22 oass.SolrIndexSearcher.<init> Opening Searcher@5c481da6 main
[junit4:junit4]   2> 21699 T22 oass.SolrIndexSearcher.getIndexDir WARNING WARNING: Directory impl does not support setting indexDir: org.apache.lucene.store.MockDirectoryWrapper
[junit4:junit4]   2> 21700 T22 oasu.DirectUpdateHandler2.commit end_commit_flush
[junit4:junit4]   2> 21705 T21 oasc.SolrCore.registerSearcher [collection1] Registered new searcher Searcher@5c481da6 main{StandardDirectoryReader(segments_2:7:nrt _1(5.0):C1)}
[junit4:junit4]   2> 23698 T14 oasu.AbstractSolrTestCase.tearDown ####TEARDOWN_START testSoftAndHardCommitMaxTimeDelete
[junit4:junit4]   2> 23698 T14 oasc.CoreContainer.shutdown Shutting down CoreContainer instance=1256796441
[junit4:junit4]   2> 23699 T14 oasc.SolrCore.close [collection1]  CLOSING SolrCore org.apache.solr.core.SolrCore@139686bb
[junit4:junit4]   2> 23719 T14 oasc.SolrCore.closeSearcher [collection1] Closing main searcher on request.
[junit4:junit4]   2> 23719 T14 oasu.DirectUpdateHandler2.close closing DirectUpdateHandler2{commits=4,autocommit maxTime=1200ms,autocommits=1,soft autocommit maxTime=500ms,soft autocommits=2,optimizes=0,rollbacks=0,expungeDeletes=0,docsPending=0,adds=0,deletesById=0,deletesByQuery=0,errors=0,cumulative_adds=2,cumulative_deletesById=1,cumulative_deletesByQuery=0,cumulative_errors=0}
[junit4:junit4]   2> 23720 T14 oasu.DefaultSolrCoreState.decref SolrCoreState ref count has reached 0 - closing IndexWriter
[junit4:junit4]   2> 23742 T14 oasu.DefaultSolrCoreState.decref Closing SolrCoreState - canceling any ongoing recovery
[junit4:junit4]   2> 144902 T14 oas.SolrTestCaseJ4.endTrackingSearchers SEVERE ERROR: SolrIndexSearcher opens=11 closes=10
[junit4:junit4]   2> NOTE: test params are: codec=Lucene40: {timestamp=PostingsFormat(name=NestedPulsing), range_facet_l=PostingsFormat(name=NestedPulsing), id=PostingsFormat(name=TestBloomFilteredLucene40Postings), range_facet_sl=PostingsFormat(name=Memory doPackFST= true), text=PostingsFormat(name=Memory doPackFST= true), range_facet_si=PostingsFormat(name=Asserting), subject=PostingsFormat(name=Asserting), multiDefault=PostingsFormat(name=Asserting), intDefault=PostingsFormat(name=NestedPulsing)}, sim=DefaultSimilarity, locale=fi_FI, timezone=Europe/Andorra
[junit4:junit4]   2> NOTE: FreeBSD 9.0-RELEASE amd64/Oracle Corporation 1.7.0_06 (64-bit)/cpus=16,threads=1,free=57069344,total=95420416
[junit4:junit4]   2> NOTE: All tests run in this JVM: [MultiTermTest, SoftAutoCommitTest]
[junit4:junit4]   2> NOTE: reproduce with: ant test  -Dtestcase=SoftAutoCommitTest -Dtests.seed=766A42608FB47CD6 -Dtests.multiplier=3 -Dtests.slow=true -Dtests.locale=fi_FI -Dtests.timezone=Europe/Andorra -Dtests.file.encoding=US-ASCII
[junit4:junit4] ERROR   0.00s J1 | SoftAutoCommitTest (suite) <<<
[junit4:junit4]    > Throwable #1: java.lang.AssertionError: ERROR: SolrIndexSearcher opens=11 closes=10
[junit4:junit4]    > 	at __randomizedtesting.SeedInfo.seed([766A42608FB47CD6]:0)
[junit4:junit4]    > 	at org.junit.Assert.fail(Assert.java:93)
[junit4:junit4]    > 	at org.apache.solr.SolrTestCaseJ4.endTrackingSearchers(SolrTestCaseJ4.java:223)
[junit4:junit4]    > 	at org.apache.solr.util.AbstractSolrTestCase.afterClassAbstractSolrTestCase(AbstractSolrTestCase.java:121)
[junit4:junit4]    > 	at sun.reflect.NativeMethodAccessorImpl.invoke0(Native Method)
[junit4:junit4]    > 	at sun.reflect.NativeMethodAccessorImpl.invoke(NativeMethodAccessorImpl.java:57)
[junit4:junit4]    > 	at sun.reflect.DelegatingMethodAccessorImpl.invoke(DelegatingMethodAccessorImpl.java:43)
[junit4:junit4]    > 	at java.lang.reflect.Method.invoke(Method.java:601)
[junit4:junit4]    > 	at com.carrotsearch.randomizedtesting.RandomizedRunner.invoke(RandomizedRunner.java:1559)
[junit4:junit4]    > 	at com.carrotsearch.randomizedtesting.RandomizedRunner.access$600(RandomizedRunner.java:79)
[junit4:junit4]    > 	at com.carrotsearch.randomizedtesting.RandomizedRunner$5.evaluate(RandomizedRunner.java:700)
[junit4:junit4]    > 	at com.carrotsearch.randomizedtesting.rules.StatementAdapter.evaluate(StatementAdapter.java:36)
[junit4:junit4]    > 	at com.carrotsearch.randomizedtesting.rules.SystemPropertiesRestoreRule$1.evaluate(SystemPropertiesRestoreRule.java:53)
[junit4:junit4]    > 	at org.apache.lucene.util.AbstractBeforeAfterRule$1.evaluate(AbstractBeforeAfterRule.java:45)
[junit4:junit4]    > 	at org.apache.lucene.util.TestRuleStoreClassName$1.evaluate(TestRuleStoreClassName.java:42)
[junit4:junit4]    > 	at com.carrotsearch.randomizedtesting.rules.SystemPropertiesInvariantRule$1.evaluate(SystemPropertiesInvariantRule.java:55)
[junit4:junit4]    > 	at com.carrotsearch.randomizedtesting.rules.NoShadowingOrOverridesOnMethodsRule$1.evaluate(NoShadowingOrOverridesOnMethodsRule.java:39)
[junit4:junit4]    > 	at com.carrotsearch.randomizedtesting.rules.NoShadowingOrOverridesOnMethodsRule$1.evaluate(NoShadowingOrOverridesOnMethodsRule.java:39)
[junit4:junit4]    > 	at org.apache.lucene.util.TestRuleAssertionsRequired$1.evaluate(TestRuleAssertionsRequired.java:40)
[junit4:junit4]    > 	at org.apache.lucene.util.TestRuleMarkFailure$1.evaluate(TestRuleMarkFailure.java:48)
[junit4:junit4]    > 	at org.apache.lucene.util.TestRuleIgnoreAfterMaxFailures$1.evaluate(TestRuleIgnoreAfterMaxFailures.java:70)
[junit4:junit4]    > 	at org.apache.lucene.util.TestRuleIgnoreTestSuites$1.evaluate(TestRuleIgnoreTestSuites.java:55)
[junit4:junit4]    > 	at com.carrotsearch.randomizedtesting.rules.StatementAdapter.evaluate(StatementAdapter.java:36)
[junit4:junit4]    > 	at com.carrotsearch.randomizedtesting.ThreadLeakControl$StatementRunner.run(ThreadLeakControl.java:358)
[junit4:junit4]    > 	at java.lang.Thread.run(Thread.java:722)
[junit4:junit4] Completed on J1 in 138.51s, 3 tests, 2 failures <<< FAILURES!

[...truncated 75 lines...]
[junit4:junit4] Suite: org.apache.solr.handler.TestReplicationHandler
[junit4:junit4]   2> 25 T173 oejs.Server.doStart jetty-8.1.2.v20120308
[junit4:junit4]   2> 29 T173 oejs.AbstractConnector.doStart Started SocketConnector@0.0.0.0:34798
[junit4:junit4]   2> 30 T173 oasc.SolrResourceLoader.locateSolrHome JNDI not configured for solr (NoInitialContextEx)
[junit4:junit4]   2> 31 T173 oasc.SolrResourceLoader.locateSolrHome using system property solr.solr.home: ./org.apache.solr.handler.TestReplicationHandler$SolrInstance-1346976467783/master
[junit4:junit4]   2> 31 T173 oasc.SolrResourceLoader.<init> new SolrResourceLoader for deduced Solr Home: './org.apache.solr.handler.TestReplicationHandler$SolrInstance-1346976467783/master/'
[junit4:junit4]   2> 76 T173 oass.SolrDispatchFilter.init SolrDispatchFilter.init()
[junit4:junit4]   2> 77 T173 oasc.SolrResourceLoader.locateSolrHome JNDI not configured for solr (NoInitialContextEx)
[junit4:junit4]   2> 77 T173 oasc.SolrResourceLoader.locateSolrHome using system property solr.solr.home: ./org.apache.solr.handler.TestReplicationHandler$SolrInstance-1346976467783/master
[junit4:junit4]   2> 78 T173 oasc.CoreContainer$Initializer.initialize looking for solr.xml: /usr/home/hudson/hudson-slave/workspace/Lucene-Solr-Tests-trunk-java7/solr/build/solr-core/test/J1/./org.apache.solr.handler.TestReplicationHandler$SolrInstance-1346976467783/master/solr.xml
[junit4:junit4]   2> 78 T173 oasc.CoreContainer.<init> New CoreContainer 147553800
[junit4:junit4]   2> 79 T173 oasc.CoreContainer$Initializer.initialize no solr.xml file found - using default
[junit4:junit4]   2> 79 T173 oasc.CoreContainer.load Loading CoreContainer using Solr Home: './org.apache.solr.handler.TestReplicationHandler$SolrInstance-1346976467783/master/'
[junit4:junit4]   2> 80 T173 oasc.SolrResourceLoader.<init> new SolrResourceLoader for directory: './org.apache.solr.handler.TestReplicationHandler$SolrInstance-1346976467783/master/'
[junit4:junit4]   2> 114 T173 oasc.CoreContainer.load Registering Log Listener
[junit4:junit4]   2> 138 T173 oasc.CoreContainer.create Creating SolrCore 'collection1' using instanceDir: ./org.apache.solr.handler.TestReplicationHandler$SolrInstance-1346976467783/master/collection1
[junit4:junit4]   2> 139 T173 oasc.SolrResourceLoader.<init> new SolrResourceLoader for directory: './org.apache.solr.handler.TestReplicationHandler$SolrInstance-1346976467783/master/collection1/'
[junit4:junit4]   2> 194 T173 oasc.SolrConfig.<init> Using Lucene MatchVersion: LUCENE_50
[junit4:junit4]   2> 286 T173 oasc.SolrConfig.<init> Loaded SolrConfig: solrconfig.xml
[junit4:junit4]   2> 288 T173 oass.IndexSchema.readSchema Reading Solr Schema
[junit4:junit4]   2> 292 T173 oass.IndexSchema.readSchema Schema name=test
[junit4:junit4]   2> 320 T173 oass.IndexSchema.readSchema unique key field: id
[junit4:junit4]   2> 322 T173 oasc.SolrCore.<init> [collection1] Opening new SolrCore at ./org.apache.solr.handler.TestReplicationHandler$SolrInstance-1346976467783/master/collection1/, dataDir=./org.apache.solr.handler.TestReplicationHandler$SolrInstance-1346976467783/master/collection1/data/
[junit4:junit4]   2> 323 T173 oasc.SolrCore.<init> JMX monitoring not detected for core: collection1
[junit4:junit4]   2> 357 T173 oasc.SolrCore.getNewIndexDir WARNING New index directory detected: old=null new=./org.apache.solr.handler.TestReplicationHandler$SolrInstance-1346976467783/master/collection1/data/index/
[junit4:junit4]   2> 359 T173 oasc.SolrCore.initIndex WARNING [collection1] Solr index directory './org.apache.solr.handler.TestReplicationHandler$SolrInstance-1346976467783/master/collection1/data/index' doesn't exist. Creating new index...
[junit4:junit4]   2> 360 T173 oasc.CachingDirectoryFactory.get return new directory for /usr/home/hudson/hudson-slave/workspace/Lucene-Solr-Tests-trunk-java7/solr/build/solr-core/test/J1/./org.apache.solr.handler.TestReplicationHandler$SolrInstance-1346976467783/master/collection1/data/index forceNew:false
[junit4:junit4]   2> 367 T173 oasc.SolrDeletionPolicy.onCommit SolrDeletionPolicy.onCommit: commits:num=1
[junit4:junit4]   2> 		commit{dir=NRTCachingDirectory(org.apache.lucene.store.NIOFSDirectory@/usr/home/hudson/hudson-slave/workspace/Lucene-Solr-Tests-trunk-java7/solr/build/solr-core/test/J1/org.apache.solr.handler.TestReplicationHandler$SolrInstance-1346976467783/master/collection1/data/index lockFactory=org.apache.lucene.store.SingleInstanceLockFactory@726c452f; maxCacheMB=48.0 maxMergeSizeMB=4.0),segFN=segments_1,generation=1,filenames=[segments_1]
[junit4:junit4]   2> 368 T173 oasc.SolrDeletionPolicy.updateCommits newest commit = 1
[junit4:junit4]   2> 369 T173 oasc.RequestHandlers.initHandlersFromConfig created standard: solr.StandardRequestHandler
[junit4:junit4]   2> 425 T173 oasc.RequestHandlers.initHandlersFromConfig created /replication: solr.ReplicationHandler
[junit4:junit4]   2> 426 T173 oasc.RequestHandlers.initHandlersFromConfig created defaults: solr.StandardRequestHandler
[junit4:junit4]   2> 426 T173 oasc.RequestHandlers.initHandlersFromConfig adding lazy requestHandler: solr.StandardRequestHandler
[junit4:junit4]   2> 427 T173 oasc.RequestHandlers.initHandlersFromConfig created lazy: solr.StandardRequestHandler
[junit4:junit4]   2> 427 T173 oasc.RequestHandlers.initHandlersFromConfig created /update: solr.UpdateRequestHandler
[junit4:junit4]   2> 431 T173 oashl.XMLLoader.init xsltCacheLifetimeSeconds=60
[junit4:junit4]   2> 439 T173 oass.SolrIndexSearcher.<init> Opening Searcher@639e51d9 main
[junit4:junit4]   2> 440 T173 oasu.CommitTracker.<init> Hard AutoCommit: disabled
[junit4:junit4]   2> 440 T173 oasu.CommitTracker.<init> Soft AutoCommit: disabled
[junit4:junit4]   2> 441 T173 oashc.HttpShardHandlerFactory.getParameter Setting socketTimeout to: 0
[junit4:junit4]   2> 441 T173 oashc.HttpShardHandlerFactory.getParameter Setting urlScheme to: http://
[junit4:junit4]   2> 442 T173 oashc.HttpShardHandlerFactory.getParameter Setting connTimeout to: 0
[junit4:junit4]   2> 442 T173 oashc.HttpShardHandlerFactory.getParameter Setting maxConnectionsPerHost to: 20
[junit4:junit4]   2> 443 T173 oashc.HttpShardHandlerFactory.getParameter Setting corePoolSize to: 0
[junit4:junit4]   2> 443 T173 oashc.HttpShardHandlerFactory.getParameter Setting maximumPoolSize to: 2147483647
[junit4:junit4]   2> 444 T173 oashc.HttpShardHandlerFactory.getParameter Setting maxThreadIdleTime to: 5
[junit4:junit4]   2> 444 T173 oashc.HttpShardHandlerFactory.getParameter Setting sizeOfQueue to: -1
[junit4:junit4]   2> 445 T173 oashc.HttpShardHandlerFactory.getParameter Setting fairnessPolicy to: false
[junit4:junit4]   2> 445 T173 oascsi.HttpClientUtil.createClient Creating new http client, config:maxConnectionsPerHost=20&maxConnections=10000&socketTimeout=0&connTimeout=0&retry=false
[junit4:junit4]   2> 468 T173 oash.ReplicationHandler.inform Replication enabled for following config files: schema.xml
[junit4:junit4]   2> 472 T173 oash.ReplicationHandler.inform Commits will be reserved for  10000
[junit4:junit4]   2> 473 T183 oasc.SolrCore.registerSearcher [collection1] Registered new searcher Searcher@639e51d9 main{StandardDirectoryReader(segments_1:1)}
[junit4:junit4]   2> 473 T173 oasc.CoreContainer.register registering core: collection1
[junit4:junit4]   2> 474 T173 oass.SolrDispatchFilter.init user.dir=/usr/home/hudson/hudson-slave/workspace/Lucene-Solr-Tests-trunk-java7/solr/build/solr-core/test/J1
[junit4:junit4]   2> 474 T173 oass.SolrDispatchFilter.init SolrDispatchFilter.init() done
[junit4:junit4]   2> 475 T173 oascsi.HttpClientUtil.createClient Creating new http client, config:maxConnections=128&maxConnectionsPerHost=32&followRedirects=false
[junit4:junit4]   2> 500 T173 oejs.Server.doStart jetty-8.1.2.v20120308
[junit4:junit4]   2> 503 T173 oejs.AbstractConnector.doStart Started SocketConnector@0.0.0.0:34800
[junit4:junit4]   2> 503 T173 oasc.SolrResourceLoader.locateSolrHome JNDI not configured for solr (NoInitialContextEx)
[junit4:junit4]   2> 504 T173 oasc.SolrResourceLoader.locateSolrHome using system property solr.solr.home: ./org.apache.solr.handler.TestReplicationHandler$SolrInstance-1346976468271/slave
[junit4:junit4]   2> 504 T173 oasc.SolrResourceLoader.<init> new SolrResourceLoader for deduced Solr Home: './org.apache.solr.handler.TestReplicationHandler$SolrInstance-1346976468271/slave/'
[junit4:junit4]   2> 545 T173 oass.SolrDispatchFilter.init SolrDispatchFilter.init()
[junit4:junit4]   2> 546 T173 oasc.SolrResourceLoader.locateSolrHome JNDI not configured for solr (NoInitialContextEx)
[junit4:junit4]   2> 546 T173 oasc.SolrResourceLoader.locateSolrHome using system property solr.solr.home: ./org.apache.solr.handler.TestReplicationHandler$SolrInstance-1346976468271/slave
[junit4:junit4]   2> 547 T173 oasc.CoreContainer$Initializer.initialize looking for solr.xml: /usr/home/hudson/hudson-slave/workspace/Lucene-Solr-Tests-trunk-java7/solr/build/solr-core/test/J1/./org.apache.solr.handler.TestReplicationHandler$SolrInstance-1346976468271/slave/solr.xml
[junit4:junit4]   2> 547 T173 oasc.CoreContainer.<init> New CoreContainer 865576638
[junit4:junit4]   2> 548 T173 oasc.CoreContainer$Initializer.initialize no solr.xml file found - using default
[junit4:junit4]   2> 548 T173 oasc.CoreContainer.load Loading CoreContainer using Solr Home: './org.apache.solr.handler.TestReplicationHandler$SolrInstance-1346976468271/slave/'
[junit4:junit4]   2> 549 T173 oasc.SolrResourceLoader.<init> new SolrResourceLoader for directory: './org.apache.solr.handler.TestReplicationHandler$SolrInstance-1346976468271/slave/'
[junit4:junit4]   2> 585 T173 oasc.CoreContainer.load Registering Log Listener
[junit4:junit4]   2> 610 T173 oasc.CoreContainer.create Creating SolrCore 'collection1' using instanceDir: ./org.apache.solr.handler.TestReplicationHandler$SolrInstance-1346976468271/slave/collection1
[junit4:junit4]   2> 611 T173 oasc.SolrResourceLoader.<init> new SolrResourceLoader for directory: './org.apache.solr.handler.TestReplicationHandler$SolrInstance-1346976468271/slave/collection1/'
[junit4:junit4]   2> 657 T173 oasc.SolrConfig.<init> Using Lucene MatchVersion: LUCENE_50
[junit4:junit4]   2> 723 T173 oasc.SolrConfig.<init> Loaded SolrConfig: solrconfig.xml
[junit4:junit4]   2> 724 T173 oass.IndexSchema.readSchema Reading Solr Schema
[junit4:junit4]   2> 729 T173 oass.IndexSchema.readSchema Schema name=test
[junit4:junit4]   2> 756 T173 oass.IndexSchema.readSchema unique key field: id
[junit4:junit4]   2> 758 T173 oasc.SolrCore.<init> [collection1] Opening new SolrCore at ./org.apache.solr.handler.TestReplicationHandler$SolrInstance-1346976468271/slave/collection1/, dataDir=./org.apache.solr.handler.TestReplicationHandler$SolrInstance-1346976468271/slave/collection1/data/
[junit4:junit4]   2> 758 T173 oasc.SolrCore.<init> JMX monitoring not detected for core: collection1
[junit4:junit4]   2> 759 T173 oasc.SolrCore.getNewIndexDir WARNING New index directory detected: old=null new=./org.apache.solr.handler.TestReplicationHandler$SolrInstance-1346976468271/slave/collection1/data/index/
[junit4:junit4]   2> 760 T173 oasc.SolrCore.initIndex WARNING [collection1] Solr index directory './org.apache.solr.handler.TestReplicationHandler$SolrInstance-1346976468271/slave/collection1/data/index' doesn't exist. Creating new index...
[junit4:junit4]   2> 761 T173 oasc.CachingDirectoryFactory.get return new directory for /usr/home/hudson/hudson-slave/workspace/Lucene-Solr-Tests-trunk-java7/solr/build/solr-core/test/J1/./org.apache.solr.handler.TestReplicationHandler$SolrInstance-1346976468271/slave/collection1/data/index forceNew:false
[junit4:junit4]   2> 768 T173 oasc.SolrDeletionPolicy.onCommit SolrDeletionPolicy.onCommit: commits:num=1
[junit4:junit4]   2> 		commit{dir=NRTCachingDirectory(org.apache.lucene.store.NIOFSDirectory@/usr/home/hudson/hudson-slave/workspace/Lucene-Solr-Tests-trunk-java7/solr/build/solr-core/test/J1/org.apache.solr.handler.TestReplicationHandler$SolrInstance-1346976468271/slave/collection1/data/index lockFactory=org.apache.lucene.store.SingleInstanceLockFactory@7bc456e7; maxCacheMB=48.0 maxMergeSizeMB=4.0),segFN=segments_1,generation=1,filenames=[segments_1]
[junit4:junit4]   2> 768 T173 oasc.SolrDeletionPolicy.updateCommits newest commit = 1
[junit4:junit4]   2> 769 T173 oasc.RequestHandlers.initHandlersFromConfig created standard: solr.StandardRequestHandler
[junit4:junit4]   2> 770 T173 oasc.RequestHandlers.initHandlersFromConfig created defaults: solr.StandardRequestHandler
[junit4:junit4]   2> 770 T173 oasc.RequestHandlers.initHandlersFromConfig adding lazy requestHandler: solr.StandardRequestHandler
[junit4:junit4]   2> 771 T173 oasc.RequestHandlers.initHandlersFromConfig created lazy: solr.StandardRequestHandler
[junit4:junit4]   2> 771 T173 oasc.RequestHandlers.initHandlersFromConfig created /update: solr.UpdateRequestHandler
[junit4:junit4]   2> 772 T173 oasc.RequestHandlers.initHandlersFromConfig created /replication: solr.ReplicationHandler
[junit4:junit4]   2> 777 T173 oashl.XMLLoader.init xsltCacheLifetimeSeconds=60
[junit4:junit4]   2> 785 T173 oass.SolrIndexSearcher.<init> Opening Searcher@2bc5c0d main
[junit4:junit4]   2> 785 T173 oasu.CommitTracker.<init> Hard AutoCommit: disabled
[junit4:junit4]   2> 786 T173 oasu.CommitTracker.<init> Soft AutoCommit: disabled
[junit4:junit4]   2> 787 T173 oashc.HttpShardHandlerFactory.getParameter Setting socketTimeout to: 0
[junit4:junit4]   2> 787 T173 oashc.HttpShardHandlerFactory.getParameter Setting urlScheme to: http://
[junit4:junit4]   2> 787 T173 oashc.HttpShardHandlerFactory.getParameter Setting connTimeout to: 0
[junit4:junit4]   2> 788 T173 oashc.HttpShardHandlerFactory.getParameter Setting maxConnectionsPerHost to: 20
[junit4:junit4]   2> 788 T173 oashc.HttpShardHandlerFactory.getParameter Setting corePoolSize to: 0
[junit4:junit4]   2> 789 T173 oashc.HttpShardHandlerFactory.getParameter Setting maximumPoolSize to: 2147483647
[junit4:junit4]   2> 789 T173 oashc.HttpShardHandlerFactory.getParameter Setting maxThreadIdleTime to: 5
[junit4:junit4]   2> 790 T173 oashc.HttpShardHandlerFactory.getParameter Setting sizeOfQueue to: -1
[junit4:junit4]   2> 790 T173 oashc.HttpShardHandlerFactory.getParameter Setting fairnessPolicy to: false
[junit4:junit4]   2> 791 T173 oascsi.HttpClientUtil.createClient Creating new http client, config:maxConnectionsPerHost=20&maxConnections=10000&socketTimeout=0&connTimeout=0&retry=false
[junit4:junit4]   2> 808 T173 oascsi.HttpClientUtil.createClient Creating new http client, config:connTimeout=5000&socketTimeout=20000&allowCompression=false&maxConnections=10000&maxConnectionsPerHost=10000
[junit4:junit4]   2> 838 T173 oash.SnapPuller.startExecutorService Poll Scheduled at an interval of 1000ms
[junit4:junit4]   2> 839 T193 oasc.SolrCore.registerSearcher [collection1] Registered new searcher Searcher@2bc5c0d main{StandardDirectoryReader(segments_1:1)}
[junit4:junit4]   2> 839 T173 oasc.CoreContainer.register registering core: collection1
[junit4:junit4]   2> 839 T173 oass.SolrDispatchFilter.init user.dir=/usr/home/hudson/hudson-slave/workspace/Lucene-Solr-Tests-trunk-java7/solr/build/solr-core/test/J1
[junit4:junit4]   2> 840 T173 oass.SolrDispatchFilter.init SolrDispatchFilter.init() done
[junit4:junit4]   2> 840 T173 oascsi.HttpClientUtil.createClient Creating new http client, config:maxConnections=128&maxConnectionsPerHost=32&followRedirects=false
[junit4:junit4]   2> 861 T173 oas.SolrTestCaseJ4.setUp ###Starting test
[junit4:junit4]   2> 861 T173 oasc.CoreContainer.shutdown Shutting down CoreContainer instance=865576638
[junit4:junit4]   2> 862 T173 oasc.SolrCore.close [collection1]  CLOSING SolrCore org.apache.solr.core.SolrCore@42af4b1d
[junit4:junit4]   2> 863 T173 oasc.SolrCore.closeSearcher [collection1] Closing main searcher on request.
[junit4:junit4]   2> 863 T173 oasu.DirectUpdateHandler2.close closing DirectUpdateHandler2{commits=0,autocommits=0,soft autocommits=0,optimizes=0,rollbacks=0,expungeDeletes=0,docsPending=0,adds=0,deletesById=0,deletesByQuery=0,errors=0,cumulative_adds=0,cumulative_deletesById=0,cumulative_deletesByQuery=0,cumulative_errors=0}
[junit4:junit4]   2> 864 T173 oasu.DefaultSolrCoreState.decref SolrCoreState ref count has reached 0 - closing IndexWriter
[junit4:junit4]   2> 864 T173 oasu.DefaultSolrCoreState.decref Closing SolrCoreState - canceling any ongoing recovery
[junit4:junit4]   2> 865 T173 oejsh.ContextHandler.doStop stopped o.e.j.s.ServletContextHandler{/solr,null}
[junit4:junit4]   2> ASYNC  NEW_CORE C13 name=collection1 org.apache.solr.core.SolrCore@2ff6893c
[junit4:junit4]   2> 925 T176 C13 oasu.DirectUpdateHandler2.deleteAll [collection1] REMOVING ALL DOCUMENTS FROM INDEX
[junit4:junit4]   2> 930 T176 C13 oasc.SolrDeletionPolicy.onInit SolrDeletionPolicy.onInit: commits:num=1
[junit4:junit4]   2> 		commit{dir=NRTCachingDirectory(org.apache.lucene.store.NIOFSDirectory@/usr/home/hudson/hudson-slave/workspace/Lucene-Solr-Tests-trunk-java7/solr/build/solr-core/test/J1/org.apache.solr.handler.TestReplicationHandler$SolrInstance-1346976467783/master/collection1/data/index lockFactory=org.apache.lucene.store.SingleInstanceLockFactory@726c452f; maxCacheMB=48.0 maxMergeSizeMB=4.0),segFN=segments_1,generation=1,filenames=[segments_1]
[junit4:junit4]   2> 930 T176 C13 oasc.SolrDeletionPolicy.updateCommits newest commit = 1
[junit4:junit4]   2> 932 T176 C13 UPDATE [collection1] webapp=/solr path=/update params={wt=javabin&version=2} {deleteByQuery=*:*} 0 7
[junit4:junit4]   2> 936 T176 C13 UPDATE [collection1] webapp=/solr path=/update params={wt=javabin&version=2} {add=[0]} 0 2
[junit4:junit4]   2> 939 T176 C13 UPDATE [collection1] webapp=/solr path=/update params={wt=javabin&version=2} {add=[1]} 0 0
[junit4:junit4]   2> 942 T176 C13 UPDATE [collection1] webapp=/solr path=/update params={wt=javabin&version=2} {add=[2]} 0 0
[junit4:junit4]   2> 945 T176 C13 UPDATE [collection1] webapp=/solr path=/update params={wt=javabin&version=2} {add=[3]} 0 0
[junit4:junit4]   2> 948 T176 C13 UPDATE [collection1] webapp=/solr path=/update params={wt=javabin&version=2} {add=[4]} 0 0
[junit4:junit4]   2> 951 T176 C13 UPDATE [collection1] webapp=/solr path=/update params={wt=javabin&version=2} {add=[5]} 0 0
[junit4:junit4]   2> 954 T176 C13 UPDATE [collection1] webapp=/solr path=/update params={wt=javabin&version=2} {add=[6]} 0 0
[junit4:junit4]   2> 957 T176 C13 UPDATE [collection1] webapp=/solr path=/update params={wt=javabin&version=2} {add=[7]} 0 0
[junit4:junit4]   2> 960 T176 C13 UPDATE [collection1] webapp=/solr path=/update params={wt=javabin&version=2} {add=[8]} 0 0
[junit4:junit4]   2> 963 T176 C13 UPDATE [collection1] webapp=/solr path=/update params={wt=javabin&version=2} {add=[9]} 0 0
[junit4:junit4]   2> 966 T176 C13 oasu.DirectUpdateHandler2.commit start commit{flags=0,_version_=0,optimize=false,openSearcher=true,waitSearcher=true,expungeDeletes=false,softCommit=false}
[junit4:junit4]   2> 1033 T176 C13 oasc.SolrDeletionPolicy.onCommit SolrDeletionPolicy.onCommit: commits:num=2
[junit4:junit4]   2> 		commit{dir=NRTCachingDirectory(org.apache.lucene.store.NIOFSDirectory@/usr/home/hudson/hudson-slave/workspace/Lucene-Solr-Tests-trunk-java7/solr/build/solr-core/test/J1/org.apache.solr.handler.TestReplicationHandler$SolrInstance-1346976467783/master/collection1/data/index lockFactory=org.apache.lucene.store.SingleInstanceLockFactory@726c452f; maxCacheMB=48.0 maxMergeSizeMB=4.0),segFN=segments_1,generation=1,filenames=[segments_1]
[junit4:junit4]   2> 		commit{dir=NRTCachingDirectory(org.apache.lucene.store.NIOFSDirectory@/usr/home/hudson/hudson-slave/workspace/Lucene-Solr-Tests-trunk-java7/solr/build/solr-core/test/J1/org.apache.solr.handler.TestReplicationHandler$SolrInstance-1346976467783/master/collection1/data/index lockFactory=org.apache.lucene.store.SingleInstanceLockFactory@726c452f; maxCacheMB=48.0 maxMergeSizeMB=4.0),segFN=segments_2,generation=2,filenames=[_0_Pulsing40_0.tim, _0.fnm, _0_nrm.cfe, _0_Pulsing40_0.tip, segments_2, _0.fdx, _0_nrm.cfs, _0.si, _0_Pulsing40_0.frq, _0.fdt]
[junit4:junit4]   2> 1033 T176 C13 oasc.SolrDeletionPolicy.updateCommits newest commit = 2
[junit4:junit4]   2> 1044 T176 C13 oass.SolrIndexSearcher.<init> Opening Searcher@7c197838 main
[junit4:junit4]   2> 1044 T176 C13 oasu.DirectUpdateHandler2.commit end_commit_flush
[junit4:junit4]   2> 1045 T183 oasc.SolrCore.registerSearcher [collection1] Registered new searcher Searcher@7c197838 main{StandardDirectoryReader(segments_2:4 _0(5.0):C10)}
[junit4:junit4]   2> 1046 T176 C13 UPDATE [collection1] webapp=/solr path=/update params={waitSearcher=true&wt=javabin&commit=true&softCommit=false&version=2} {commit=} 0 80
[junit4:junit4]   2> 1050 T176 C13 REQ [collection1] webapp=/solr path=/select params={wt=javabin&q=*:*&version=2} hits=10 status=0 QTime=1 
[junit4:junit4]   2> 1158 T173 oasc.CoreContainer.shutdown Shutting down CoreContainer instance=147553800
[junit4:junit4]   2> 1159 T173 oasc.SolrCore.close [collection1]  CLOSING SolrCore org.apache.solr.core.SolrCore@2ff6893c
[junit4:junit4]   2> 1159 T173 oasc.SolrCore.closeSearcher [collection1] Closing main searcher on request.
[junit4:junit4]   2> 1160 T173 oasu.DirectUpdateHandler2.close closing DirectUpdateHandler2{commits=1,autocommits=0,soft autocommits=0,optimizes=0,rollbacks=0,expungeDeletes=0,docsPending=0,adds=0,deletesById=0,deletesByQuery=0,errors=0,cumulative_adds=10,cumulative_deletesById=0,cumulative_deletesByQuery=1,cumulative_errors=0}
[junit4:junit4]   2> 1161 T173 oasu.DefaultSolrCoreState.decref SolrCoreState ref count has reached 0 - closing IndexWriter
[junit4:junit4]   2> 1163 T173 oasu.DefaultSolrCoreState.decref Closing SolrCoreState - canceling any ongoing recovery
[junit4:junit4]   2> 1163 T173 oejsh.ContextHandler.doStop stopped o.e.j.s.ServletContextHandler{/solr,null}
[junit4:junit4]   2> 1216 T173 oejs.Server.doStart jetty-8.1.2.v20120308
[junit4:junit4]   2> 1219 T173 oejs.AbstractConnector.doStart Started SocketConnector@0.0.0.0:34802
[junit4:junit4]   2> 1220 T173 oasc.SolrResourceLoader.locateSolrHome JNDI not configured for solr (NoInitialContextEx)
[junit4:junit4]   2> 1220 T173 oasc.SolrResourceLoader.locateSolrHome using system property solr.solr.home: ./org.apache.solr.handler.TestReplicationHandler$SolrInstance-1346976467783/master
[junit4:junit4]   2> 1221 T173 oasc.SolrResourceLoader.<init> new SolrResourceLoader for deduced Solr Home: './org.apache.solr.handler.TestReplicationHandler$SolrInstance-1346976467783/master/'
[junit4:junit4]   2> 1268 T173 oass.SolrDispatchFilter.init SolrDispatchFilter.init()
[junit4:junit4]   2> 1268 T173 oasc.SolrResourceLoader.locateSolrHome JNDI not configured for solr (NoInitialContextEx)
[junit4:junit4]   2> 1269 T173 oasc.SolrResourceLoader.locateSolrHome using system property solr.solr.home: ./org.apache.solr.handler.TestReplicationHandler$SolrInstance-1346976467783/master
[junit4:junit4]   2> 1269 T173 oasc.CoreContainer$Initializer.initialize looking for solr.xml: /usr/home/hudson/hudson-slave/workspace/Lucene-Solr-Tests-trunk-java7/solr/build/solr-core/test/J1/./org.apache.solr.handler.TestReplicationHandler$SolrInstance-1346976467783/master/solr.xml
[junit4:junit4]   2> 1270 T173 oasc.CoreContainer.<init> New CoreContainer 1778408735
[junit4:junit4]   2> 1271 T173 oasc.CoreContainer$Initializer.initialize no solr.xml file found - using default
[junit4:junit4]   2> 1271 T173 oasc.CoreContainer.load Loading CoreContainer using Solr Home: './org.apache.solr.handler.TestReplicationHandler$SolrInstance-1346976467783/master/'
[junit4:junit4]   2> 1272 T173 oasc.SolrResourceLoader.<init> new SolrResourceLoader for directory: './org.apache.solr.handler.TestReplicationHandler$SolrInstance-1346976467783/master/'
[junit4:junit4]   2> 1308 T173 oasc.CoreContainer.load Registering Log Listener
[junit4:junit4]   2> 1332 T173 oasc.CoreContainer.create Creating SolrCore 'collection1' using instanceDir: ./org.apache.solr.handler.TestReplicationHandler$SolrInstance-1346976467783/master/collection1
[junit4:junit4]   2> 1333 T173 oasc.SolrResourceLoader.<init> new SolrResourceLoader for directory: './org.apache.solr.handler.TestReplicationHandler$SolrInstance-1346976467783/master/collection1/'
[junit4:junit4]   2> 1384 T173 oasc.SolrConfig.<init> Using Lucene MatchVersion: LUCENE_50
[junit4:junit4]   2> 1441 T173 oasc.SolrConfig.<init> Loaded SolrConfig: solrconfig.xml
[junit4:junit4]   2> 1442 T173 oass.IndexSchema.readSchema Reading Solr Schema
[junit4:junit4]   2> 1459 T173 oass.IndexSchema.readSchema Schema name=test
[junit4:junit4]   2> 1482 T173 oass.IndexSchema.readSchema unique key field: id
[junit4:junit4]   2> 1484 T173 oasc.SolrCore.<init> [collection1] Opening new SolrCore at ./org.apache.solr.handler.TestReplicationHandler$SolrInstance-1346976467783/master/collection1/, dataDir=./org.apache.solr.handler.TestReplicationHandler$SolrInstance-1346976467783/master/collection1/data/
[junit4:junit4]   2> 1485 T173 oasc.SolrCore.<init> JMX monitoring not detected for core: collection1
[junit4:junit4]   2> 1485 T173 oasc.SolrCore.getNewIndexDir WARNING New index directory detected: old=null new=./org.apache.solr.handler.TestReplicationHandler$SolrInstance-1346976467783/master/collection1/data/index/
[junit4:junit4]   2> 1487 T173 oasc.RequestHandlers.initHandlersFromConfig created standard: solr.StandardRequestHandler
[junit4:junit4]   2> 1488 T173 oasc.RequestHandlers.initHandlersFromConfig created /replication: solr.ReplicationHandler
[junit4:junit4]   2> 1488 T173 oasc.RequestHandlers.initHandlersFromConfig created defaults: solr.StandardRequestHandler
[junit4:junit4]   2> 1489 T173 oasc.RequestHandlers.initHandlersFromConfig adding lazy requestHandler: solr.StandardRequestHandler
[junit4:junit4]   2> 1490 T173 oasc.RequestHandlers.initHandlersFromConfig created lazy: solr.StandardRequestHandler
[junit4:junit4]   2> 1491 T173 oasc.RequestHandlers.initHandlersFromConfig created /update: solr.UpdateRequestHandler
[junit4:junit4]   2> 1495 T173 oashl.XMLLoader.init xsltCacheLifetimeSeconds=60
[junit4:junit4]   2> 1499 T173 oasc.CachingDirectoryFactory.get return new directory for /usr/home/hudson/hudson-slave/workspace/Lucene-Solr-Tests-trunk-java7/solr/build/solr-core/test/J1/./org.apache.solr.handler.TestReplicationHandler$SolrInstance-1346976467783/master/collection1/data/index forceNew:false
[junit4:junit4]   2> 1503 T173 oass.SolrIndexSearcher.<init> Opening Searcher@788f35da main
[junit4:junit4]   2> 1504 T173 oasu.CommitTracker.<init> Hard AutoCommit: disabled
[junit4:junit4]   2> 1505 T173 oasu.CommitTracker.<init> Soft AutoCommit: disabled
[junit4:junit4]   2> 1505 T173 oashc.HttpShardHandlerFactory.getParameter Setting socketTimeout to: 0
[junit4:junit4]   2> 1506 T173 oashc.HttpShardHandlerFactory.getParameter Setting urlScheme to: http://
[junit4:junit4]   2> 1506 T173 oashc.HttpShardHandlerFactory.getParameter Setting connTimeout to: 0
[junit4:junit4]   2> 1507 T173 oashc.HttpShardHandlerFactory.getParameter Setting maxConnectionsPerHost to: 20
[junit4:junit4]   2> 1508 T173 oashc.HttpShardHandlerFactory.getParameter Setting corePoolSize to: 0
[junit4:junit4]   2> 1508 T173 oashc.HttpShardHandlerFactory.getParameter Setting maximumPoolSize to: 2147483647
[junit4:junit4]   2> 1509 T173 oashc.HttpShardHandlerFactory.getParameter Setting maxThreadIdleTime to: 5
[junit4:junit4]   2> 1509 T173 oashc.HttpShardHandlerFactory.getParameter Setting sizeOfQueue to: -1
[junit4:junit4]   2> 1510 T173 oashc.HttpShardHandlerFactory.getParameter Setting fairnessPolicy to: false
[junit4:junit4]   2> 1510 T173 oascsi.HttpClientUtil.createClient Creating new http client, config:maxConnectionsPerHost=20&maxConnections=10000&socketTimeout=0&connTimeout=0&retry=false
[junit4:junit4]   2> 1526 T173 oash.ReplicationHandler.inform Replication enabled for following config files: schema.xml
[junit4:junit4]   2> 1527 T173 oasu.DefaultSolrCoreState.newIndexWriter Creating new IndexWriter...
[junit4:junit4]   2> 1528 T173 oasu.DefaultSolrCoreState.newIndexWriter Waiting until IndexWriter is unused... core=collection1
[junit4:junit4]   2> 1529 T173 oasc.CachingDirectoryFactory.get return new directory for /usr/home/hudson/hudson-slave/workspace/Lucene-Solr-Tests-trunk-java7/solr/build/solr-core/test/J1/./org.apache.solr.handler.TestReplicationHandler$SolrInstance-1346976467783/master/collection1/data/index forceNew:true
[junit4:junit4]   2> 1534 T173 oasc.SolrDeletionPolicy.onInit SolrDeletionPolicy.onInit: commits:num=1
[junit4:junit4]   2> 		commit{dir=NRTCachingDirectory(org.apache.lucene.store.NIOFSDirectory@/usr/home/hudson/hudson-slave/workspace/Lucene-Solr-Tests-trunk-java7/solr/build/solr-core/test/J1/org.apache.solr.handler.TestReplicationHandler$SolrInstance-1346976467783/master/collection1/data/index lockFactory=org.apache.lucene.store.SingleInstanceLockFactory@2062d4b6; maxCacheMB=48.0 maxMergeSizeMB=4.0),segFN=segments_2,generation=2,filenames=[_0.fnm, _0_Pulsing40_0.tim, _0_nrm.cfe, _0_Pulsing40_0.tip, segments_2, _0.fdx, _0_nrm.cfs, _0.si, _0_Pulsing40_0.frq, _0.fdt]
[junit4:junit4]   2> 1534 T173 oasc.SolrDeletionPolicy.updateCommits newest commit = 2
[junit4:junit4]   2> 1535 T173 oasu.DefaultSolrCoreState.newIndexWriter New IndexWriter is ready to be used.
[junit4:junit4]   2> 1536 T173 oash.ReplicationHandler.inform Commits will be reserved for  10000
[junit4:junit4]   2> 1537 T204 oasc.SolrCore.registerSearcher [collection1] Registered new searcher Searcher@788f35da main{StandardDirectoryReader(segments_2:4 _0(5.0):C10)}
[junit4:junit4]   2> 1537 T173 oasc.CoreContainer.register registering core: collection1
[junit4:junit4]   2> 1538 T173 oass.SolrDispatchFilter.init user.dir=/usr/home/hudson/hudson-slave/workspace/Lucene-Solr-Tests-trunk-java7/solr/build/solr-core/test/J1
[junit4:junit4]   2> 1539 T173 oass.SolrDispatchFilter.init SolrDispatchFilter.init() done
[junit4:junit4]   2> 1539 T173 oascsi.HttpClientUtil.createClient Creating new http client, config:maxConnections=128&maxConnectionsPerHost=32&followRedirects=false
[junit4:junit4]   2> 1556 T173 oejs.Server.doStart jetty-8.1.2.v20120308
[junit4:junit4]   2> 1560 T173 oejs.AbstractConnector.doStart Started SocketConnector@0.0.0.0:34803
[junit4:junit4]   2> 1561 T173 oasc.SolrResourceLoader.locateSolrHome JNDI not configured for solr (NoInitialContextEx)
[junit4:junit4]   2> 1562 T173 oasc.SolrResourceLoader.locateSolrHome using system property solr.solr.home: ./org.apache.solr.handler.TestReplicationHandler$SolrInstance-1346976468271/slave
[junit4:junit4]   2> 1563 T173 oasc.SolrResourceLoader.<init> new SolrResourceLoader for deduced Solr Home: './org.apache.solr.handler.TestReplicationHandler$SolrInstance-1346976468271/slave/'
[junit4:junit4]   2> 1588 T173 oass.SolrDispatchFilter.init SolrDispatchFilter.init()
[junit4:junit4]   2> 1589 T173 oasc.SolrResourceLoader.locateSolrHome JNDI not configured for solr (NoInitialContextEx)
[junit4:junit4]   2> 1589 T173 oasc.SolrResourceLoader.locateSolrHome using system property solr.solr.home: ./org.apache.solr.handler.TestReplicationHandler$SolrInstance-1346976468271/slave
[junit4:junit4]   2> 1590 T173 oasc.CoreContainer$Initializer.initialize looking for solr.xml: /usr/home/hudson/hudson-slave/workspace/Lucene-Solr-Tests-trunk-java7/solr/build/solr-core/test/J1/./org.apache.solr.handler.TestReplicationHandler$SolrInstance-1346976468271/slave/solr.xml
[junit4:junit4]   2> 1590 T173 oasc.CoreContainer.<init> New CoreContainer 1208580977
[junit4:junit4]   2> 1591 T173 oasc.CoreContainer$Initializer.initialize no solr.xml file found - using default
[junit4:junit4]   2> 1592 T173 oasc.CoreContainer.load Loading CoreContainer using Solr Home: './org.apache.solr.handler.TestReplicationHandler$SolrInstance-1346976468271/slave/'
[junit4:junit4]   2> 1592 T173 oasc.SolrResourceLoader.<init> new SolrResourceLoader for directory: './org.apache.solr.handler.TestReplicationHandler$SolrInstance-1346976468271/slave/'
[junit4:junit4]   2> 1614 T173 oasc.CoreContainer.load Registering Log Listener
[junit4:junit4]   2> 1636 T173 oasc.CoreContainer.create Creating SolrCore 'collection1' using instanceDir: ./org.apache.solr.handler.TestReplicationHandler$SolrInstance-1346976468271/slave/collection1
[junit4:junit4]   2> 1637 T173 oasc.SolrResourceLoader.<init> new SolrResourceLoader for directory: './org.apache.solr.handler.TestReplicationHandler$SolrInstance-1346976468271/slave/collection1/'
[junit4:junit4]   2> 1679 T173 oasc.SolrConfig.<init> Using Lucene MatchVersion: LUCENE_50
[junit4:junit4]   2> 1737 T173 oasc.SolrConfig.<init> Loaded SolrConfig: solrconfig.xml
[junit4:junit4]   2> 1738 T173 oass.IndexSchema.readSchema Reading Solr Schema
[junit4:junit4]   2> 1742 T173 oass.IndexSchema.readSchema Schema name=test
[junit4:junit4]   2> 1763 T173 oass.IndexSchema.readSchema unique key field: id
[junit4:junit4]   2> 1765 T173 oasc.SolrCore.<init> [collection1] Opening new SolrCore at ./org.apache.solr.handler.TestReplicationHandler$SolrInstance-1346976468271/slave/collection1/, dataDir=./org.apache.solr.handler.TestReplicationHandler$SolrInstance-1346976468271/slave/collection1/data/
[junit4:junit4]   2> 1766 T173 oasc.SolrCore.<init> JMX monitoring not detected for core: collection1
[junit4:junit4]   2> 1767 T173 oasc.SolrCore.getNewIndexDir WARNING New index directory detected: old=null new=./org.apache.solr.handler.TestReplicationHandler$SolrInstance-1346976468271/slave/collection1/data/index/
[junit4:junit4]   2> 1769 T173 oasc.RequestHandlers.initHandlersFromConfig created standard: solr.StandardRequestHandler
[junit4:junit4]   2> 1769 T173 oasc.RequestHandlers.initHandlersFromConfig created defaults: solr.StandardRequestHandler
[junit4:junit4]   2> 1770 T173 oasc.RequestHandlers.initHandlersFromConfig adding lazy requestHandler: solr.StandardRequestHandler
[junit4:junit4]   2> 1770 T173 oasc.RequestHandlers.initHandlersFromConfig created lazy: solr.StandardRequestHandler
[junit4:junit4]   2> 1771 T173 oasc.RequestHandlers.initHandlersFromConfig created /update: solr.UpdateRequestHandler
[junit4:junit4]   2> 1772 T173 oasc.RequestHandlers.initHandlersFromConfig created /replication: solr.ReplicationHandler
[junit4:junit4]   2> 1773 T173 oashl.XMLLoader.init xsltCacheLifetimeSeconds=60
[junit4:junit4]   2> 1777 T173 oasc.CachingDirectoryFactory.get return new directory for /usr/home/hudson/hudson-slave/workspace/Lucene-Solr-Tests-trunk-java7/solr/build/solr-core/test/J1/./org.apache.solr.handler.TestReplicationHandler$SolrInstance-1346976468271/slave/collection1/data/index forceNew:false
[junit4:junit4]   2> 1779 T173 oass.SolrIndexSearcher.<init> Opening Searcher@4dfd6478 main
[junit4:junit4]   2> 1780 T173 oasu.CommitTracker.<init> Hard AutoCommit: disabled
[junit4:junit4]   2> 1780 T173 oasu.CommitTracker.<init> Soft AutoCommit: disabled
[junit4:junit4]   2> 1781 T173 oashc.HttpShardHandlerFactory.getParameter Setting socketTimeout to: 0
[junit4:junit4]   2> 1782 T173 oashc.HttpShardHandlerFactory.getParameter Setting urlScheme to: http://
[junit4:junit4]   2> 1782 T173 oashc.HttpShardHandlerFactory.getParameter Setting connTimeout to: 0
[junit4:junit4]   2> 1783 T173 oashc.HttpShardHandlerFactory.getParameter Setting maxConnectionsPerHost to: 20
[junit4:junit4]   2> 1783 T173 oashc.HttpShardHandlerFactory.getParameter Setting corePoolSize to: 0
[junit4:junit4]   2> 1784 T173 oashc.HttpShardHandlerFactory.getParameter Setting maximumPoolSize to: 2147483647
[junit4:junit4]   2> 1784 T173 oashc.HttpShardHandlerFactory.getParameter Setting maxThreadIdleTime to: 5
[junit4:junit4]   2> 1785 T173 oashc.HttpShardHandlerFactory.getParameter Setting sizeOfQueue to: -1
[junit4:junit4]   2> 1785 T173 oashc.HttpShardHandlerFactory.getParameter Setting fairnessPolicy to: false
[junit4:junit4]   2> 1786 T173 oascsi.HttpClientUtil.createClient Creating new http client, config:maxConnectionsPerHost=20&maxConnections=10000&socketTimeout=0&connTimeout=0&retry=false
[junit4:junit4]   2> 1798 T173 oash.SnapPuller.startExecutorService Poll Scheduled at an interval of 1000ms
[junit4:junit4]   2> 1799 T214 oasc.SolrCore.registerSearcher [collection1] Registered new searcher Searcher@4dfd6478 main{StandardDirectoryReader(segments_1:1)}
[junit4:junit4]   2> 1799 T173 oasc.CoreContainer.register registering core: collection1
[junit4:junit4]   2> 1800 T173 oass.SolrDispatchFilter.init user.dir=/usr/home/hudson/hudson-slave/workspace/Lucene-Solr-Tests-trunk-java7/solr/build/solr-core/test/J1
[junit4:junit4]   2> 1801 T173 oass.SolrDispatchFilter.init SolrDispatchFilter.init() done
[junit4:junit4]   2> 1801 T173 oascsi.HttpClientUtil.createClient Creating new http client, config:maxConnections=128&maxConnectionsPerHost=32&followRedirects=false
[junit4:junit4]   2> ASYNC  NEW_CORE C14 name=collection1 org.apache.solr.core.SolrCore@6809ee3b
[junit4:junit4]   2> 1819 T207 C14 REQ [collection1] webapp=/solr path=/select params={wt=javabin&q=*:*&version=2} hits=0 status=0 QTime=0 
[junit4:junit4]   2> 1923 T207 C14 REQ [collection1] webapp=/solr path=/select params={wt=javabin&q=*:*&version=2} hits=0 status=0 QTime=0 
[junit4:junit4]   2> 2028 T207 C14 REQ [collection1] webapp=/solr path=/select params={wt=javabin&q=*:*&version=2} hits=0 status=0 QTime=1 
[junit4:junit4]   2> 2132 T207 C14 REQ [collection1] webapp=/solr path=/select params={wt=javabin&q=*:*&version=2} hits=0 status=0 QTime=1 
[junit4:junit4]   2> ASYNC  NEW_CORE C15 name=collection1 org.apache.solr.core.SolrCore@15a20a12
[junit4:junit4]   2> 2225 T197 C15 REQ [collection1] webapp=/solr path=/replication params={command=indexversion&wt=javabin&qt=/replication&version=2} status=0 QTime=1 
[junit4:junit4]   2> 2226 T215 oash.SnapPuller.fetchLatestIndex Master's generation: 2
[junit4:junit4]   2> 2226 T215 oash.SnapPuller.fetchLatestIndex Slave's generation: 1
[junit4:junit4]   2> 2227 T215 oash.SnapPuller.fetchLatestIndex Starting replication process
[junit4:junit4]   2> 2236 T207 C14 REQ [collection1] webapp=/solr path=/select params={wt=javabin&q=*:*&version=2} hits=0 status=0 QTime=0 
[junit4:junit4]   2> 2238 T197 C15 REQ [collection1] webapp=/solr path=/replication params={command=filelist&generation=2&wt=javabin&qt=/replication&version=2} status=0 QTime=9 
[junit4:junit4]   2> 2239 T215 oash.SnapPuller.fetchLatestIndex Number of files in latest index in master: 10
[junit4:junit4]   2> 2244 T215 oash.SnapPuller.fetchLatestIndex Starting download to ./org.apache.solr.handler.TestReplicationHandler$SolrInstance-1346976468271/slave/collection1/data/index.20120907040750022 fullCopy=false
[junit4:junit4]   2> 2259 T197 C15 REQ [collection1] webapp=/solr path=/replication params={file=_0_Pulsing40_0.tim&command=filecontent&checksum=true&compression=true&generation=2&qt=/replication&wt=filestream} status=0 QTime=5 
[junit4:junit4]   2> 2280 T197 C15 REQ [collection1] webapp=/solr path=/replication params={file=_0.fnm&command=filecontent&checksum=true&compression=true&generation=2&qt=/replication&wt=filestream} status=0 QTime=0 
[junit4:junit4]   2> 2286 T197 C15 REQ [collection1] webapp=/solr path=/replication params={file=_0_nrm.cfe&command=filecontent&checksum=true&compression=true&generation=2&qt=/replication&wt=filestream} status=0 QTime=0 
[junit4:junit4]   2> 2291 T197 C15 REQ [collection1] webapp=/solr path=/replication params={file=segments_2&command=filecontent&checksum=true&compression=true&generation=2&qt=/replication&wt=filestream} status=0 QTime=0 
[junit4:junit4]   2> 2296 T197 C15 REQ [collection1] webapp=/solr path=/replication params={file=_0_Pulsing40_0.tip&command=filecontent&checksum=true&compression=true&generation=2&qt=/replication&wt=filestream} status=0 QTime=0 
[junit4:junit4]   2> 2305 T197 C15 REQ [collection1] webapp=/solr path=/replication params={file=_0.fdx&command=filecontent&checksum=true&compression=true&generation=2&qt=/replication&wt=filestream} status=0 QTime=0 
[junit4:junit4]   2> 2310 T197 C15 REQ [collection1] webapp=/solr path=/replication params={file=_0_nrm.cfs&command=filecontent&checksum=true&compression=true&generation=2&qt=/replication&wt=filestream} status=0 QTime=0 
[junit4:junit4]   2> 2315 T197 C15 REQ [collection1] webapp=/solr path=/replication params={file=_0.si&command=filecontent&checksum=true&compression=true&generation=2&qt=/replication&wt=filestream} status=0 QTime=0 
[junit4:junit4]   2> 2320 T197 C15 REQ [collection1] webapp=/solr path=/replication params={file=_0_Pulsing40_0.frq&command=filecontent&checksum=true&compression=true&generation=2&qt=/replication&wt=filestream} status=0 QTime=0 
[junit4:junit4]   2> 2325 T197 C15 REQ [collection1] webapp=/solr path=/replication params={file=_0.fdt&command=filecontent&checksum=true&compression=true&generation=2&qt=/replication&wt=filestream} status=0 QTime=0 
[junit4:junit4]   2> 2327 T215 oash.SnapPuller.fetchLatestIndex Total time taken for download : 0 secs
[junit4:junit4]   2> 2340 T207 C14 REQ [collection1] webapp=/solr path=/select params={wt=javabin&q=*:*&version=2} hits=0 status=0 QTime=0 
[junit4:junit4]   2> 2385 T215 oasu.DefaultSolrCoreState.newIndexWriter Creating new IndexWriter...
[junit4:junit4]   2> 2386 T215 oasu.DefaultSolrCoreState.newIndexWriter Waiting until IndexWriter is unused... core=collection1
[junit4:junit4]   2> 2388 T215 oasc.CachingDirectoryFactory.get return new directory for /usr/home/hudson/hudson-slave/workspace/Lucene-Solr-Tests-trunk-java7/solr/build/solr-core/test/J1/./org.apache.solr.handler.TestReplicationHandler$SolrInstance-1346976468271/slave/collection1/data/index forceNew:true
[junit4:junit4]   2> 2396 T215 oasc.SolrDeletionPolicy.onInit SolrDeletionPolicy.onInit: commits:num=2
[junit4:junit4]   2> 		commit{dir=NRTCachingDirectory(org.apache.lucene.store.NIOFSDirectory@/usr/home/hudson/hudson-slave/workspace/Lucene-Solr-Tests-trunk-java7/solr/build/solr-core/test/J1/org.apache.solr.handler.TestReplicationHandler$SolrInstance-1346976468271/slave/collection1/data/index lockFactory=org.apache.lucene.store.SingleInstanceLockFactory@35b0050; maxCacheMB=48.0 maxMergeSizeMB=4.0),segFN=segments_1,generation=1,filenames=[segments_1]
[junit4:junit4]   2> 		commit{dir=NRTCachingDirectory(org.apache.lucene.store.NIOFSDirectory@/usr/home/hudson/hudson-slave/workspace/Lucene-Solr-Tests-trunk-java7/solr/build/solr-core/test/J1/org.apache.solr.handler.TestReplicationHandler$SolrInstance-1346976468271/slave/collection1/data/index lockFactory=org.apache.lucene.store.SingleInstanceLockFactory@35b0050; maxCacheMB=48.0 maxMergeSizeMB=4.0),segFN=segments_2,generation=2,filenames=[_0.fnm, _0_Pulsing40_0.tim, _0_nrm.cfe, _0_Pulsing40_0.tip, segments_2, _0.fdx, _0_nrm.cfs, _0.si, _0_Pulsing40_0.frq, _0.fdt]
[junit4:junit4]   2> 2397 T215 oasc.SolrDeletionPolicy.updateCommits newest commit = 2
[junit4:junit4]   2> 2397 T215 oasu.DefaultSolrCoreState.newIndexWriter New IndexWriter is ready to be used.
[junit4:junit4]   2> 2403 T215 oass.SolrIndexSearcher.<init> Opening Searcher@2b0bc844 main
[junit4:junit4]   2> 2403 T214 oasc.SolrCore.registerSearcher [collection1] Registered new searcher Searcher@2b0bc844 main{StandardDirectoryReader(segments_2:4:nrt _0(5.0):C10)}
[junit4:junit4]   2> 2404 T214 oasc.CachingDirectoryFactory.close Closing directory:/usr/home/hudson/hudson-slave/workspace/Lucene-Solr-Tests-trunk-java7/solr/build/solr-core/test/J1/./org.apache.solr.handler.TestReplicationHandler$SolrInstance-1346976468271/slave/collection1/data/index
[junit4:junit4]   2> 2404 T215 oasu.DirectUpdateHandler2.commit start commit{flags=0,_version_=0,optimize=false,openSearcher=true,waitSearcher=true,expungeDeletes=false,softCommit=false}
[junit4:junit4]   2> 2405 T215 oass.SolrIndexSearcher.<init> Opening Searcher@5ff87491 main
[junit4:junit4]   2> 2406 T215 oasu.DirectUpdateHandler2.commit end_commit_flush
[junit4:junit4]   2> 2406 T214 oasc.SolrCore.registerSearcher [collection1] Registered new searcher Searcher@5ff87491 main{StandardDirectoryReader(segments_2:4:nrt _0(5.0):C10)}
[junit4:junit4]   2> 2407 T215 oash.SnapPuller.fetchLatestIndex removing temporary index download directory ./org.apache.solr.handler.TestReplicationHandler$SolrInstance-1346976468271/slave/collection1/data/index.20120907040750022
[junit4:junit4]   2> 2445 T207 C14 REQ [collection1] webapp=/solr path=/select params={wt=javabin&q=*:*&version=2} hits=10 status=0 QTime=1 
[junit4:junit4]   2> 2549 T198 C15 REQ [collection1] webapp=/solr path=/replication params={command=indexversion&qt=/replication&wt=javabin&version=2} status=0 QTime=0 
[junit4:junit4]   2> 2552 T198 C15 REQ [collection1] webapp=/solr path=/replication params={command=commits&qt=/replication&wt=javabin&version=2} status=0 QTime=0 
[junit4:junit4]   2> 2567 T198 oasc.CoreContainer.reload Reloading SolrCore 'collection1' using instanceDir: /usr/home/hudson/hudson-slave/workspace/Lucene-Solr-Tests-trunk-java7/solr/build/solr-core/test/J1/./org.apache.solr.handler.TestReplicationHandler$SolrInstance-1346976467783/master/collection1
[junit4:junit4]   2> 2568 T198 oasc.SolrResourceLoader.<init> new SolrResourceLoader for directory: '/usr/home/hudson/hudson-slave/workspace/Lucene-Solr-Tests-trunk-java7/solr/build/solr-core/test/J1/./org.apache.solr.handler.TestReplicationHandler$SolrInstance-1346976467783/master/collection1/'
[junit4:junit4]   2> 2643 T198 oasc.SolrConfig.<init> Using Lucene MatchVersion: LUCENE_50
[junit4:junit4]   2> 2704 T198 oasc.SolrConfig.<init> Loaded SolrConfig: solrconfig.xml
[junit4:junit4]   2> 2705 T198 oass.IndexSchema.readSchema Reading Solr Schema
[junit4:junit4]   2> 2710 T198 oass.IndexSchema.readSchema Schema name=test
[junit4:junit4]   2> 2735 T198 oass.IndexSchema.readSchema unique key field: id
[junit4:junit4]   2> 2737 T198 oasc.SolrCore.<init> [collection1] Opening new SolrCore at /usr/home/hudson/hudson-slave/workspace/Lucene-Solr-Tests-trunk-java7/solr/build/solr-core/test/J1/./org.apache.solr.handler.TestReplicationHandler$SolrInstance-1346976467783/master/collection1/, dataDir=./org.apache.solr.handler.TestReplicationHandler$SolrInstance-1346976467783/master/collection1/data/
[junit4:junit4]   2> 2737 T198 oasc.SolrCore.<init> JMX monitoring not detected for core: collection1
[junit4:junit4]   2> 2738 T198 oasc.SolrCore.getNewIndexDir WARNING New index directory detected: old=null new=./org.apache.solr.handler.TestReplicationHandler$SolrInstance-1346976467783/master/collection1/data/index/
[junit4:junit4]   2> 2741 T198 oasc.RequestHandlers.initHandlersFromConfig created standard: solr.StandardRequestHandler
[junit4:junit4]   2> 2741 T198 oasc.RequestHandlers.initHandlersFromConfig created /replication: solr.ReplicationHandler
[junit4:junit4]   2> 2742 T198 oasc.RequestHandlers.initHandlersFromConfig created defaults: solr.StandardRequestHandler
[junit4:junit4]   2> 2742 T198 oasc.RequestHandlers.initHandlersFromConfig adding lazy requestHandler: solr.StandardRequestHandler
[junit4:junit4]   2> 2742 T198 oasc.RequestHandlers.initHandlersFromConfig created lazy: solr.StandardRequestHandler
[junit4:junit4]   2> 2743 T198 oasc.RequestHandlers.initHandlersFromConfig created /update: solr.UpdateRequestHandler
[junit4:junit4]   2> 2748 T198 oashl.XMLLoader.init xsltCacheLifetimeSeconds=60
[junit4:junit4]   2> 2759 T198 oass.SolrIndexSearcher.<init> Opening Searcher@1b8fc338 main
[junit4:junit4]   2> 2760 T198 oasu.CommitTracker.<init> Hard AutoCommit: disabled
[junit4:junit4]   2> 2761 T198 oasu.CommitTracker.<init> Soft AutoCommit: disabled
[junit4:junit4]   2> 2761 T198 oash.ReplicationHandler.inform Replication enabled for following config files: schema.xml
[junit4:junit4]   2> 2762 T198 oasu.DefaultSolrCoreState.newIndexWriter Creating new IndexWriter...
[junit4:junit4]   2> 2762 T198 oasu.DefaultSolrCoreState.newIndexWriter Waiting until IndexWriter is unused... core=collection1
[junit4:junit4]   2> 2763 T198 oasu.DefaultSolrCoreState.newIndexWriter Rollback old IndexWriter... core=collection1
[junit4:junit4]   2> 2765 T198 oasc.CachingDirectoryFactory.get return new directory for /usr/home/hudson/hudson-slave/workspace/Lucene-Solr-Tests-trunk-java7/solr/build/solr-core/test/J1/./org.apache.solr.handler.TestReplicationHandler$SolrInstance-1346976467783/master/collection1/data/index forceNew:true
[junit4:junit4]   2> 2770 T198 oasc.SolrDeletionPolicy.onInit SolrDeletionPolicy.onInit: commits:num=1
[junit4:junit4]   2> 		commit{dir=NRTCachingDirectory(org.apache.lucene.store.NIOFSDirectory@/usr/home/hudson/hudson-slave/workspace/Lucene-Solr-Tests-trunk-java7/solr/build/solr-core/test/J1/org.apache.solr.handler.TestReplicationHandler$SolrInstance-1346976467783/master/collection1/data/index lockFactory=org.apache.lucene.store.SingleInstanceLockFactory@42a70f8c; maxCacheMB=48.0 maxMergeSizeMB=4.0),segFN=segments_2,generation=2,filenames=[_0.fnm, _0_Pulsing40_0.tim, _0_nrm.cfe, _0_Pulsing40_0.tip, segments_2, _0.fdx, _0_nrm.cfs, _0.si, _0_Pulsing40_0.frq, _0.fdt]
[junit4:junit4]   2> 2770 T198 oasc.SolrDeletionPolicy.updateCommits newest commit = 2
[junit4:junit4]   2> 2771 T198 oasu.DefaultSolrCoreState.newIndexWriter New IndexWriter is ready to be used.
[junit4:junit4]   2> 2771 T198 oash.ReplicationHandler.inform Commits will be reserved for  10000
[junit4:junit4]   2> 2772 T217 oasc.SolrCore.registerSearcher [collection1] Registered new searcher Searcher@1b8fc338 main{StandardDirectoryReader(segments_2:4 _0(5.0):C10)}
[junit4:junit4]   2> 2772 T198 oasc.CoreContainer.register replacing core: collection1
[junit4:junit4]   2> 2773 T198 oasc.SolrCore.close [collection1]  CLOSING SolrCore org.apache.solr.core.SolrCore@15a20a12
[junit4:junit4]   2> 2773 T198 oasc.SolrCore.closeSearcher [collection1] Closing main searcher on request.
[junit4:junit4]   2> 2774 T198 oasc.CachingDirectoryFactory.close Closing directory:/usr/home/hudson/hudson-slave/workspace/Lucene-Solr-Tests-trunk-java7/solr/build/solr-core/test/J1/./org.apache.solr.handler.TestReplicationHandler$SolrInstance-1346976467783/master/collection1/data/index
[junit4:junit4]   2> 2775 T198 oasu.DirectUpdateHandler2.close closing DirectUpdateHandler2{commits=0,autocommits=0,soft autocommits=0,optimizes=0,rollbacks=0,expungeDeletes=0,docsPending=0,adds=0,deletesById=0,deletesByQuery=0,errors=0,cumulative_adds=0,cumulative_deletesById=0,cumulative_deletesByQuery=0,cumulative_errors=0}
[junit4:junit4]   2> ASYNC  NEW_CORE C16 name=collection1 org.apache.solr.core.SolrCore@65edd283
[junit4:junit4]   2> 2783 T198 C16 REQ [collection1] webapp=/solr path=/replication params={command=indexversion&qt=/replication&wt=javabin&version=2} status=0 QTime=1 
[junit4:junit4]   2> 2785 T198 C16 REQ [collection1] webapp=/solr path=/replication params={command=commits&qt=/replication&wt=javabin&version=2} status=0 QTime=0 
[junit4:junit4]   2> 2790 T198 C16 UPDATE [collection1] webapp=/solr path=/update params={wt=javabin&version=2} {add=[110]} 0 2
[junit4:junit4]   2> 2793 T198 C16 UPDATE [collection1] webapp=/solr path=/update params={wt=javabin&version=2} {add=[120]} 0 0
[junit4:junit4]   2> 2796 T198 C16 oasu.DirectUpdateHandler2.commit start commit{flags=0,_version_=0,optimize=false,openSearcher=true,waitSearcher=true,expungeDeletes=false,softCommit=false}
[junit4:junit4]   2> 2838 T198 C16 oasc.SolrDeletionPolicy.onCommit SolrDeletionPolicy.onCommit: commits:num=2
[junit4:junit4]   2> 		commit{dir=NRTCachingDirectory(org.apache.lucene.store.NIOFSDirectory@/usr/home/hudson/hudson-slave/workspace/Lucene-Solr-Tests-trunk-java7/solr/build/solr-core/test/J1/org.apache.solr.handler.TestReplicationHandler$SolrInstance-1346976467783/master/collection1/data/index lockFactory=org.apache.lucene.store.SingleInstanceLockFactory@42a70f8c; maxCacheMB=48.0 maxMergeSizeMB=4.0),segFN=segments_2,generation=2,filenames=[_0.fnm, _0_Pulsing40_0.tim, _0_nrm.cfe, _0_Pulsing40_0.tip, segments_2, _0.fdx, _0_nrm.cfs, _0.si, _0_Pulsing40_0.frq, _0.fdt]
[junit4:junit4]   2> 		commit{dir=NRTCachingDirectory(org.apache.lucene.store.NIOFSDirectory@/usr/home/hudson/hudson-slave/workspace/Lucene-Solr-Tests-trunk-java7/solr/build/solr-core/test/J1/org.apache.solr.handler.TestReplicationHandler$SolrInstance-1346976467783/master/collection1/data/index lockFactory=org.apache.lucene.store.SingleInstanceLockFactory@42a70f8c; maxCacheMB=48.0 maxMergeSizeMB=4.0),segFN=segments_3,generation=3,filenames=[_1_nrm.cfs, _0_Pulsing40_0.tim, _0.fnm, _1_Pulsing40_0.tip, _1_Pulsing40_0.tim, _0_nrm.cfs, _1.fnm, _0_Pulsing40_0.frq, _1_nrm.cfe, _1_Pulsing40_0.frq, _1.fdx, _1.fdt, _1.si, _0_nrm.cfe, _0_Pulsing40_0.tip, _0.fdx, _0.si, segments_3, _0.fdt]
[junit4:junit4]   2> 2839 T198 C16 oasc.SolrDeletionPolicy.updateCommits newest commit = 3
[junit4:junit4]   2> 2854 T198 C16 oass.SolrIndexSearcher.<init> Opening Searcher@268a995e main
[junit4:junit4]   2> 2855 T198 C16 oasu.DirectUpdateHandler2.commit end_commit_flush
[junit4:junit4]   2> 2855 T217 oasc.SolrCore.registerSearcher [collection1] Registered new searcher Searcher@268a995e main{StandardDirectoryReader(segments_3:6 _0(5.0):C10 _1(5.0):C2)}
[junit4:junit4]   2> 2855 T198 C16 UPDATE [collection1] webapp=/solr path=/update params={waitSearcher=true&wt=javabin&commit=true&softCommit=false&version=2} {commit=} 0 59
[junit4:junit4]   2> 2859 T198 C16 REQ [collection1] webapp=/solr path=/select params={wt=javabin&q=*:*&version=2} hits=12 status=0 QTime=1 
[junit4:junit4]   2> 2963 T207 C14 REQ [collection1] webapp=/solr path=/select params={wt=javabin&q=*:*&version=2} hits=10 status=0 QTime=0 
[junit4:junit4]   2> 3067 T207 C14 REQ [collection1] webapp=/solr path=/select params={wt=javabin&q=*:*&version=2} hits=10 status=0 QTime=0 
[junit4:junit4]   2> 3171 T207 C14 REQ [collection1] webapp=/solr path=/select params={wt=javabin&q=*:*&version=2} hits=10 status=0 QTime=0 
[junit4:junit4]   2> 3220 T197 C16 REQ [collection1] webapp=/solr path=/replication params={command=indexversion&wt=javabin&qt=/replication&version=2} status=0 QTime=0 
[junit4:junit4]   2> 3221 T215 oash.SnapPuller.fetchLatestIndex Master's generation: 3
[junit4:junit4]   2> 3221 T215 oash.SnapPuller.fetchLatestIndex Slave's generation: 2
[junit4:junit4]   2> 3221 T215 oash.SnapPuller.fetchLatestIndex Starting replication process
[junit4:junit4]   2> 3227 T197 C16 REQ [collection1] webapp=/solr path=/replication params={command=filelist&generation=3&wt=javabin&qt=/replication&version=2} status=0 QTime=3 
[junit4:junit4]   2> 3228 T215 oash.SnapPuller.fetchLatestIndex Number of files in latest index in master: 19
[junit4:junit4]   2> 3235 T215 oash.SnapPuller.fetchLatestIndex Starting download to ./org.apache.solr.handler.TestReplicationHandler$SolrInstance-1346976468271/slave/collection1/data/index.20120907040751011 fullCopy=false
[junit4:junit4]   2> 3238 T197 C16 REQ [collection1] webapp=/solr path=/replication params={file=_1_nrm.cfs&command=filecontent&checksum=true&compression=true&generation=3&qt=/replication&wt=filestream} status=0 QTime=0 
[junit4:junit4]   2> 3240 T215 oash.SnapPuller.downloadIndexFiles Skipping download for /usr/home/hudson/hudson-slave/workspace/Lucene-Solr-Tests-trunk-java7/solr/build/solr-core/test/J1/org.apache.solr.handler.TestReplicationHandler$SolrInstance-1346976468271/slave/collection1/data/index/_0.fnm
[junit4:junit4]   2> 3240 T215 oash.SnapPuller.downloadIndexFiles Skipping download for /usr/home/hudson/hudson-slave/workspace/Lucene-Solr-Tests-trunk-java7/solr/build/solr-core/test/J1/org.apache.solr.handler.TestReplicationHandler$SolrInstance-1346976468271/slave/collection1/data/index/_0_Pulsing40_0.tim
[junit4:junit4]   2> 3243 T197 C16 REQ [collection1] webapp=/solr path=/replication params={file=_1_Pulsing40_0.tip&command=filecontent&checksum=true&compression=true&generation=3&qt=/replication&wt=filestream} status=0 QTime=0 
[junit4:junit4]   2> 3247 T197 C16 REQ [collection1] webapp=/solr path=/replication params={file=_1_Pulsing40_0.tim&command=filecontent&checksum=true&compression=true&generation=3&qt=/replication&wt=filestream} status=0 QTime=0 
[junit4:junit4]   2> 3249 T215 oash.SnapPuller.downloadIndexFiles Skipping download for /usr/home/hudson/hudson-slave/workspace/Lucene-Solr-Tests-trunk-java7/solr/build/solr-core/test/J1/org.apache.solr.handler.TestReplicationHandler$SolrInstance-1346976468271/slave/collection1/data/index/_0_nrm.cfs
[junit4:junit4]   2> 3249 T215 oash.SnapPuller.downloadIndexFiles Skipping download for /usr/home/hudson/hudson-slave/workspace/Lucene-Solr-Tests-trunk-java7/solr/build/solr-core/test/J1/org.apache.solr.handler.TestReplicationHandler$SolrInstance-1346976468271/slave/collection1/data/index/_0_Pulsing40_0.frq
[junit4:junit4]   2> 3252 T197 C16 REQ [collection1] webapp=/solr path=/replication params={file=_1.fnm&command=filecontent&checksum=true&compression=true&generation=3&qt=/replication&wt=filestream} status=0 QTime=0 
[junit4:junit4]   2> 3256 T197 C16 REQ [collection1] webapp=/solr path=/replication params={file=_1_nrm.cfe&command=filecontent&checksum=true&compression=true&generation=3&qt=/replication&wt=filestream} status=0 QTime=0 
[junit4:junit4]   2> 3261 T197 C16 REQ [collection1] webapp=/solr path=/replication params={file=_1_Pulsing40_0.frq&command=filecontent&checksum=true&compression=true&generation=3&qt=/replication&wt=filestream} status=0 QTime=0 
[junit4:junit4]   2> 3266 T197 C16 REQ [collection1] webapp=/solr path=/replication params={file=_1.fdx&command=filecontent&checksum=true&compression=true&generation=3&qt=/replication&wt=filestream} status=0 QTime=0 
[junit4:junit4]   2> 3271 T197 C16 REQ [collection1] webapp=/solr path=/replication params={file=_1.fdt&command=filecontent&checksum=true&compression=true&generation=3&qt=/replication&wt=filestream} status=0 QTime=0 
[junit4:junit4]   2> 3275 T207 C14 REQ [collection1] webapp=/solr path=/select params={wt=javabin&q=*:*&version=2} hits=10 status=0 QTime=0 
[junit4:junit4]   2> 3276 T197 C16 REQ [collection1] webapp=/solr path=/replication params={file=_1.si&command=filecontent&checksum=true&compression=true&generation=3&qt=/replication&wt=filestream} status=0 QTime=0 
[junit4:junit4]   2> 3278 T215 oash.SnapPuller.downloadIndexFiles Skipping download for /usr/home/hudson/hudson-slave/workspace/Lucene-Solr-Tests-trunk-java7/solr/build/solr-core/test/J1/org.apache.solr.handler.TestReplicationHandler$SolrInstance-1346976468271/slave/collection1/data/index/_0_nrm.cfe
[junit4:junit4]   2> 3279 T215 oash.SnapPuller.downloadIndexFiles Skipping download for /usr/home/hudson/hudson-slave/workspace/Lucene-Solr-Tests-trunk-java7/solr/build/solr-core/test/J1/org.apache.solr.handler.TestReplicationHandler$SolrInstance-1346976468271/slave/collection1/data/index/_0_Pulsing40_0.tip
[junit4:junit4]   2> 3279 T215 oash.SnapPuller.downloadIndexFiles Skipping download for /usr/home/hudson/hudson-slave/workspace/Lucene-Solr-Tests-trunk-java7/solr/build/solr-core/test/J1/org.apache.solr.handler.TestReplicationHandler$SolrInstance-1346976468271/slave/collection1/data/index/_0.fdx
[junit4:junit4]   2> 3279 T215 oash.SnapPuller.downloadIndexFiles Skipping download for /usr/home/hudson/hudson-slave/workspace/Lucene-Solr-Tests-trunk-java7/solr/build/solr-core/test/J1/org.apache.solr.handler.TestReplicationHandler$SolrInstance-1346976468271/slave/collection1/data/index/_0.si
[junit4:junit4]   2> 3280 T215 oash.SnapPuller.downloadIndexFiles Skipping download for /usr/home/hudson/hudson-slave/workspace/Lucene-Solr-Tests-trunk-java7/solr/build/solr-core/test/J1/org.apache.solr.handler.TestReplicationHandler$SolrInstance-1346976468271/slave/collection1/data/index/_0.fdt
[junit4:junit4]   2> 3283 T197 C16 REQ [collection1] webapp=/solr path=/replication params={file=segments_3&command=filecontent&checksum=true&compression=true&generation=3&qt=/replication&wt=filestream} status=0 QTime=0 
[junit4:junit4]   2> 3285 T215 oash.SnapPuller.fetchLatestIndex Total time taken for download : 0 secs
[junit4:junit4]   2> 3302 T215 oasu.DefaultSolrCoreState.newIndexWriter Creating new IndexWriter...
[junit4:junit4]   2> 3303 T215 oasu.DefaultSolrCoreState.newIndexWriter Waiting until IndexWriter is unused... core=collection1
[junit4:junit4]   2> 3303 T215 oasu.DefaultSolrCoreState.newIndexWriter Closing old IndexWriter... core=collection1
[junit4:junit4]   2> 3304 T215 oasc.CachingDirectoryFactory.get return new directory for /usr/home/hudson/hudson-slave/workspace/Lucene-Solr-Tests-trunk-java7/solr/build/solr-core/test/J1/./org.apache.solr.handler.TestReplicationHandler$SolrInstance-1346976468271/slave/collection1/data/index forceNew:true
[junit4:junit4]   2> 3315 T215 oasc.SolrDeletionPolicy.onInit SolrDeletionPolicy.onInit: commits:num=2
[junit4:junit4]   2> 		commit{dir=NRTCachingDirectory(org.apache.lucene.store.NIOFSDirectory@/usr/home/hudson/hudson-slave/workspace/Lucene-Solr-Tests-trunk-java7/solr/build/solr-core/test/J1/org.apache.solr.handler.TestReplicationHandler$SolrInstance-1346976468271/slave/collection1/data/index lockFactory=org.apache.lucene.store.SingleInstanceLockFactory@b863f5c; maxCacheMB=48.0 maxMergeSizeMB=4.0),segFN=segments_2,generation=2,filenames=[_0.fnm, _0_Pulsing40_0.tim, _0_nrm.cfe, _0_Pulsing40_0.tip, segments_2, _0.fdx, _0_nrm.cfs, _0.si, _0_Pulsing40_0.frq, _0.fdt]
[junit4:junit4]   2> 		commit{dir=NRTCachingDirectory(org.apache.lucene.store.NIOFSDirectory@/usr/home/hudson/hudson-slave/workspace/Lucene-Solr-Tests-trunk-java7/solr/build/solr-core/test/J1/org.apache.solr.handler.TestReplicationHandler$SolrInstance-1346976468271/slave/collection1/data/index lockFactory=org.apache.lucene.store.SingleInstanceLockFactory@b863f5c; maxCacheMB=48.0 maxMergeSizeMB=4.0),segFN=segments_3,generation=3,filenames=[_1_nrm.cfs, _0_Pulsing40_0.tim, _0.fnm, _1_Pulsing40_0.tip, _1_Pulsing40_0.tim, _0_nrm.cfs, _1.fnm, _0_Pulsing40_0.frq, _1_nrm.cfe, _1_Pulsing40_0.frq, _1.fdx, _1.fdt, _1.si, _0_nrm.cfe, _0_Pulsing40_0.tip, _0.fdx, _0.si, segments_3, _0.fdt]
[junit4:junit4]   2> 3316 T215 oasc.SolrDeletionPolicy.updateCommits newest commit = 3
[junit4:junit4]   2> 3317 T215 oasu.DefaultSolrCoreState.newIndexWriter New IndexWriter is ready to be used.
[junit4:junit4]   2> 3324 T215 oass.SolrIndexSearcher.<init> Opening Searcher@6836bc4a main
[junit4:junit4]   2> 3325 T214 oasc.SolrCore.registerSearcher [collection1] Registered new searcher Searcher@6836bc4a main{StandardDirectoryReader(segments_3:6:nrt _0(5.0):C10 _1(5.0):C2)}
[junit4:junit4]   2> 3326 T215 oasu.DirectUpdateHandler2.commit start commit{flags=0,_version_=0,optimize=false,openSearcher=true,waitSearcher=true,expungeDeletes=false,softCommit=false}
[junit4:junit4]   2> 3327 T215 oass.SolrIndexSearcher.<init> Opening Searcher@1fa7abb1 main
[junit4:junit4]   2> 3327 T215 oasu.DirectUpdateHandler2.commit end_commit_flush
[junit4:junit4]   2> 3327 T214 oasc.SolrCore.registerSearcher [collection1] Registered new searcher Searcher@1fa7abb1 main{StandardDirectoryReader(segments_3:6:nrt _0(5.0):C10 _1(5.0):C2)}
[junit4:junit4]   2> 3328 T215 oash.SnapPuller.fetchLatestIndex removing temporary index download directory ./org.apache.solr.handler.TestReplicationHandler$SolrInstance-1346976468271/slave/collection1/data/index.20120907040751011
[junit4:junit4]   2> 3379 T207 C14 REQ [collection1] webapp=/solr path=/select params={wt=javabin&q=*:*&version=2} hits=12 status=0 QTime=0 
[junit4:junit4]   2> 3488 T173 oasc.CoreContainer.shutdown Shutting down CoreContainer instance=1778408735
[junit4:junit4]   2> 3489 T173 oasc.SolrCore.close [collection1]  CLOSING SolrCore org.apache.solr.core.SolrCore@65edd283
[junit4:junit4]   2> 3489 T173 oasc.SolrCore.closeSearcher [collection1] Closing main searcher on request.
[junit4:junit4]   2> 3491 T173 oasc.CachingDirectoryFactory.close Closing directory:/usr/home/hudson/hudson-slave/workspace/Lucene-Solr-Tests-trunk-java7/solr/build/solr-core/test/J1/./org.apache.solr.handler.TestReplicationHandler$SolrInstance-1346976467783/master/collection1/data/index
[junit4:junit4]   2> 3492 T173 oasu.DirectUpdateHandler2.close closing DirectUpdateHandler2{commits=1,autocommits=0,soft autocommits=0,optimizes=0,rollbacks=0,expungeDeletes=0,docsPending=0,adds=0,deletesById=0,deletesByQuery=0,errors=0,cumulative_adds=2,cumulative_deletesById=0,cumulative_deletesByQuery=0,cumulative_errors=0}
[junit4:junit4]   2> 3493 T173 oasu.DefaultSolrCoreState.decref SolrCoreState ref count has reached 0 - closing IndexWriter
[junit4:junit4]   2> 3494 T173 oasu.DefaultSolrCoreState.decref Closing SolrCoreState - canceling any ongoing recovery
[junit4:junit4]   2> 3495 T173 oejsh.ContextHandler.doStop stopped o.e.j.s.ServletContextHandler{/solr,null}
[junit4:junit4]   2> 3549 T173 oejs.Server.doStart jetty-8.1.2.v20120308
[junit4:junit4]   2> 3552 T173 oejs.AbstractConnector.doStart Started SocketConnector@0.0.0.0:34811
[junit4:junit4]   2> 3553 T173 oasc.SolrResourceLoader.locateSolrHome JNDI not configured for solr (NoInitialContextEx)
[junit4:junit4]   2> 3553 T173 oasc.SolrResourceLoader.locateSolrHome using system property solr.solr.home: ./org.apache.solr.handler.TestReplicationHandler$SolrInstance-1346976467783/master
[junit4:junit4]   2> 3554 T173 oasc.SolrResourceLoader.<init> new SolrResourceLoader for deduced Solr Home: './org.apache.solr.handler.TestReplicationHandler$SolrInstance-1346976467783/master/'
[junit4:junit4]   2> 3603 T173 oass.SolrDispatchFilter.init SolrDispatchFilter.init()
[junit4:junit4]   2> 3605 T173 oasc.SolrResourceLoader.locateSolrHome JNDI not configured for solr (NoInitialContextEx)
[junit4:junit4]   2> 3605 T173 oasc.SolrResourceLoader.locateSolrHome using system property solr.solr.home: ./org.apache.solr.handler.TestReplicationHandler$SolrInstance-1346976467783/master
[junit4:junit4]   2> 3606 T173 oasc.CoreContainer$Initializer.initialize looking for solr.xml: /usr/home/hudson/hudson-slave/workspace/Lucene-Solr-Tests-trunk-java7/solr/build/solr-core/test/J1/./org.apache.solr.handler.TestReplicationHandler$SolrInstance-1346976467783/master/solr.xml
[junit4:junit4]   2> 3606 T173 oasc.CoreContainer.<init> New CoreContainer 1069387276
[junit4:junit4]   2> 3607 T173 oasc.CoreContainer$Initializer.initialize no solr.xml file found - using default
[junit4:junit4]   2> 3608 T173 oasc.CoreContainer.load Loading CoreContainer using Solr Home: './org.apache.solr.handler.TestReplicationHandler$SolrInstance-1346976467783/master/'
[junit4:junit4]   2> 3608 T173 oasc.SolrResourceLoader.<init> new SolrResourceLoader for directory: './org.apache.solr.handler.TestReplicationHandler$SolrInstance-1346976467783/master/'
[junit4:junit4]   2> 3647 T173 oasc.CoreContainer.load Registering Log Listener
[junit4:junit4]   2> 3677 T173 oasc.CoreContainer.create Creating SolrCore 'collection1' using instanceDir: ./org.apache.solr.handler.TestReplicationHandler$SolrInstance-1346976467783/master/collection1
[junit4:junit4]   2> 3678 T173 oasc.SolrResourceLoader.<init> new SolrResourceLoader for directory: './org.apache.solr.handler.TestReplicationHandler$SolrInstance-1346976467783/master/collection1/'
[junit4:junit4]   2> 3730 T173 oasc.SolrConfig.<init> Using Lucene MatchVersion: LUCENE_50
[junit4:junit4]   2> 3808 T173 oasc.SolrConfig.<init> Loaded SolrConfig: solrconfig.xml
[junit4:junit4]   2> 3810 T173 oass.IndexSchema.readSchema Reading Solr Schema
[junit4:junit4]   2> 3814 T173 oass.IndexSchema.readSchema Schema name=test
[junit4:junit4]   2> 3838 T173 oass.IndexSchema.readSchema unique key field: id
[junit4:junit4]   2> 3840 T173 oasc.SolrCore.<init> [collection1] Opening new SolrCore at ./org.apache.solr.handler.TestReplicationHandler$SolrInstance-1346976467783/master/collection1/, dataDir=./org.apache.solr.handler.TestReplicationHandler$SolrInstance-1346976467783/master/collection1/data/
[junit4:junit4]   2> 3841 T173 oasc.SolrCore.<init> JMX monitoring not detected for core: collection1
[junit4:junit4]   2> 3842 T173 oasc.SolrCore.getNewIndexDir WARNING New index directory detected: old=null new=./org.apache.solr.handler.TestReplicationHandler$SolrInstance-1346976467783/master/collection1/data/index/
[junit4:junit4]   2> 3844 T173 oasc.RequestHandlers.initHandlersFromConfig created standard: solr.StandardRequestHandler
[junit4:junit4]   2> 3845 T173 oasc.RequestHandlers.initHandlersFromConfig created /replication: solr.ReplicationHandler
[junit4:junit4]   2> 3845 T173 oasc.RequestHandlers.initHandlersFromConfig created defaults: solr.StandardRequestHandler
[junit4:junit4]   2> 3846 T173 oasc.RequestHandlers.initHandlersFromConfig adding lazy requestHandler: solr.StandardRequestHandler
[junit4:junit4]   2> 3846 T173 oasc.RequestHandlers.initHandlersFromConfig created lazy: solr.StandardRequestHandler
[junit4:junit4]   2> 3847 T173 oasc.RequestHandlers.initHandlersFromConfig created /update: solr.UpdateRequestHandler
[junit4:junit4]   2> 3851 T173 oashl.XMLLoader.init xsltCacheLifetimeSeconds=60
[junit4:junit4]   2> 3855 T173 oasc.CachingDirectoryFactory.get return new directory for /usr/home/hudson/hudson-slave/workspace/Lucene-Solr-Tests-trunk-java7/solr/build/solr-core/test/J1/./org.apache.solr.handler.TestReplicationHandler$SolrInstance-1346976467783/master/collection1/data/index forceNew:false
[junit4:junit4]   2> 3868 T173 oass.SolrIndexSearcher.<init> Opening Searcher@4dc97503 main
[junit4:junit4]   2> 3869 T173 oasu.CommitTracker.<init> Hard AutoCommit: disabled
[junit4:junit4]   2> 3870 T173 oasu.CommitTracker.<init> Soft AutoCommit: disabled
[junit4:junit4]   2> 3870 T173 oashc.HttpShardHandlerFactory.getParameter Setting socketTimeout to: 0
[junit4:junit4]   2> 3871 T173 oashc.HttpShardHandlerFactory.getParameter Setting urlScheme to: http://
[junit4:junit4]   2> 3871 T173 oashc.HttpShardHandlerFactory.getParameter Setting connTimeout to: 0
[junit4:junit4]   2> 3872 T173 oashc.HttpShardHandlerFactory.getParameter Setting maxConnectionsPerHost to: 20
[junit4:junit4]   2> 3872 T173 oashc.HttpShardHandlerFactory.getParameter Setting corePoolSize to: 0
[junit4:junit4]   2> 3873 T173 oashc.HttpShardHandlerFactory.getParameter Setting maximumPoolSize to: 2147483647
[junit4:junit4]   2> 3874 T173 oashc.HttpShardHandlerFactory.getParameter Setting maxThreadIdleTime to: 5
[junit4:junit4]   2> 3874 T173 oashc.HttpShardHandlerFactory.getParameter Setting sizeOfQueue to: -1
[junit4:junit4]   2> 3875 T173 oashc.HttpShardHandlerFactory.getParameter Setting fairnessPolicy to: false
[junit4:junit4]   2> 3876 T173 oascsi.HttpClientUtil.createClient Creating new http client, config:maxConnectionsPerHost=20&maxConnections=10000&socketTimeout=0&connTimeout=0&retry=false
[junit4:junit4]   2> 3892 T173 oash.ReplicationHandler.inform Replication enabled for following config files: schema.xml
[junit4:junit4]   2> 3893 T173 oash.ReplicationHandler.inform Commits will be reserved for  10000
[junit4:junit4]   2> 3894 T228 oasc.SolrCore.registerSearcher [collection1] Registered new searcher Searcher@4dc97503 main{StandardDirectoryReader(segments_3:6 _0(5.0):C10 _1(5.0):C2)}
[junit4:junit4]   2> 3894 T173 oasc.CoreContainer.register registering core: collection1
[junit4:junit4]   2> 3894 T173 oass.SolrDispatchFilter.init user.dir=/usr/home/hudson/hudson-slave/workspace/Lucene-Solr-Tests-trunk-java7/solr/build/solr-core/test/J1
[junit4:junit4]   2> 3895 T173 oass.SolrDispatchFilter.init SolrDispatchFilter.init() done
[junit4:junit4]   2> 3896 T173 oascsi.HttpClientUtil.createClient Creating new http client, config:maxConnections=128&maxConnectionsPerHost=32&followRedirects=false
[junit4:junit4]   2> 3913 T173 oasc.CoreContainer.shutdown Shutting down CoreContainer instance=1208580977
[junit4:junit4]   2> 3914 T173 oasc.SolrCore.close [collection1]  CLOSING SolrCore org.apache.solr.core.SolrCore@6809ee3b
[junit4:junit4]   2> 3915 T173 oasc.SolrCore.closeSearcher [collection1] Closing main searcher on request.
[junit4:junit4]   2> 3915 T173 oasu.DirectUpdateHandler2.close closing DirectUpdateHandler2{commits=2,autocommits=0,soft autocommits=0,optimizes=0,rollbacks=0,expungeDeletes=0,docsPending=0,adds=0,deletesById=0,deletesByQuery=0,errors=0,cumulative_adds=0,cumulative_deletesById=0,cumulative_deletesByQuery=0,cumulative_errors=0}
[junit4:junit4]   2> 3916 T173 oasu.DefaultSolrCoreState.decref SolrCoreState ref count has reached 0 - closing IndexWriter
[junit4:junit4]   2> 3918 T173 oasu.DefaultSolrCoreState.decref Closing SolrCoreState - canceling any ongoing recovery
[junit4:junit4]   2> 3919 T173 oejsh.ContextHandler.doStop stopped o.e.j.s.ServletContextHandler{/solr,null}
[junit4:junit4]   2> 3971 T173 oejs.Server.doStart jetty-8.1.2.v20120308
[junit4:junit4]   2> 3974 T173 oejs.AbstractConnector.doStart Started SocketConnector@0.0.0.0:34812
[junit4:junit4]   2> 3975 T173 oasc.SolrResourceLoader.locateSolrHome JNDI not configured for solr (NoInitialContextEx)
[junit4:junit4]   2> 3976 T173 oasc.SolrResourceLoader.locateSolrHome using system property solr.solr.home: ./org.apache.solr.handler.TestReplicationHandler$SolrInstance-1346976468271/slave
[junit4:junit4]   2> 3977 T173 oasc.SolrResourceLoader.<init> new SolrResourceLoader for deduced Solr Home: './org.apache.solr.handler.TestReplicationHandler$SolrInstance-1346976468271/slave/'
[junit4:junit4]   2> 3994 T173 oass.SolrDispatchFilter.init SolrDispatchFilter.init()
[junit4:junit4]   2> 3995 T173 oasc.SolrResourceLoader.locateSolrHome JNDI not configured for solr (NoInitialContextEx)
[junit4:junit4]   2> 3996 T173 oasc.SolrResourceLoader.locateSolrHome using system property solr.solr.home: ./org.apache.solr.handler.TestReplicationHandler$SolrInstance-1346976468271/slave
[junit4:junit4]   2> 3996 T173 oasc.CoreContainer$Initializer.initialize looking for solr.xml: /usr/home/hudson/hudson-slave/workspace/Lucene-Solr-Tests-trunk-java7/solr/build/solr-core/test/J1/./org.apache.solr.handler.TestReplicationHandler$SolrInstance-1346976468271/slave/solr.xml
[junit4:junit4]   2> 3997 T173 oasc.CoreContainer.<init> New CoreContainer 1815489364
[junit4:junit4]   2> 3997 T173 oasc.CoreContainer$Initializer.initialize no solr.xml file found - using default
[junit4:junit4]   2> 3998 T173 oasc.CoreContainer.load Loading CoreContainer using Solr Home: './org.apache.solr.handler.TestReplicationHandler$SolrInstance-1346976468271/slave/'
[junit4:junit4]   2> 3998 T173 oasc.SolrResourceLoader.<init> new SolrResourceLoader for directory: './org.apache.solr.handler.TestReplicationHandler$SolrInstance-1346976468271/slave/'
[junit4:junit4]   2> 4025 T173 oasc.CoreContainer.load Registering Log Listener
[junit4:junit4]   2> 4050 T173 oasc.CoreContainer.create Creating SolrCore 'collection1' using instanceDir: ./org.apache.solr.handler.TestReplicationHandler$SolrInstance-1346976468271/slave/collection1
[junit4:junit4]   2> 4051 T173 oasc.SolrResourceLoader.<init> new SolrResourceLoader for directory: './org.apache.solr.handler.TestReplicationHandler$SolrInstance-1346976468271/slave/collection1/'
[junit4:junit4]   2> 4095 T173 oasc.SolrConfig.<init> Using Lucene MatchVersion: LUCENE_50
[junit4:junit4]   2> 4156 T173 oasc.SolrConfig.<init> Loaded SolrConfig: solrconfig.xml
[junit4:junit4]   2> 4158 T173 oass.IndexSchema.readSchema Reading Solr Schema
[junit4:junit4]   2> 4162 T173 oass.IndexSchema.readSchema Schema name=test
[junit4:junit4]   2> 4185 T173 oass.IndexSchema.readSchema unique key field: id
[junit4:junit4]   2> 4187 T173 oasc.SolrCore.<init> [collection1] Opening new SolrCore at ./org.apache.solr.handler.TestReplicationHandler$SolrInstance-1346976468271/slave/collection1/, dataDir=./org.apache.solr.handler.TestReplicationHandler$SolrInstance-1346976468271/slave/collection1/data/
[junit4:junit4]   2> 4187 T173 oasc.SolrCore.<init> JMX monitoring not detected for core: collection1
[junit4:junit4]   2> 4197 T173 oasc.SolrCore.getNewIndexDir WARNING New index directory detected: old=null new=./org.apache.solr.handler.TestReplicationHandler$SolrInstance-1346976468271/slave/collection1/data/index/
[junit4:junit4]   2> 4198 T173 oasc.RequestHandlers.initHandlersFromConfig created standard: solr.StandardRequestHandler
[junit4:junit4]   2> 4199 T173 oasc.RequestHandlers.initHandlersFromConfig created defaults: solr.StandardRequestHandler
[junit4:junit4]   2> 4200 T173 oasc.RequestHandlers.initHandlersFromConfig adding lazy requestHandler: solr.StandardRequestHandler
[junit4:junit4]   2> 4200 T173 oasc.RequestHandlers.initHandlersFromConfig created lazy: solr.StandardRequestHandler
[junit4:junit4]   2> 4201 T173 oasc.RequestHandlers.initHandlersFromConfig created /update: solr.UpdateRequestHandler
[junit4:junit4]   2> 4201 T173 oasc.RequestHandlers.initHandlersFromConfig created /replication: solr.ReplicationHandler
[junit4:junit4]   2> 4203 T173 oashl.XMLLoader.init xsltCacheLifetimeSeconds=60
[junit4:junit4]   2> 4207 T173 oasc.CachingDirectoryFactory.get return new directory for /usr/home/hudson/hudson-slave/workspace/Lucene-Solr-Tests-trunk-java7/solr/build/solr-core/test/J1/./org.apache.solr.handler.TestReplicationHandler$SolrInstance-1346976468271/slave/collection1/data/index forceNew:false
[junit4:junit4]   2> 4220 T173 oass.SolrIndexSearcher.<init> Opening Searcher@1780e41a main
[junit4:junit4]   2> 4221 T173 oasu.CommitTracker.<init> Hard AutoCommit: disabled
[junit4:junit4]   2> 4221 T173 oasu.CommitTracker.<init> Soft AutoCommit: disabled
[junit4:junit4]   2> 4222 T173 oashc.HttpShardHandlerFactory.getParameter Setting socketTimeout to: 0
[junit4:junit4]   2> 4222 T173 oashc.HttpShardHandlerFactory.getParameter Setting urlScheme to: http://
[junit4:junit4]   2> 4223 T173 oashc.HttpShardHandlerFactory.getParameter Setting connTimeout to: 0
[junit4:junit4]   2> 4223 T173 oashc.HttpShardHandlerFactory.getParameter Setting maxConnectionsPerHost to: 20
[junit4:junit4]   2> 4224 T173 oashc.HttpShardHandlerFactory.getParameter Setting corePoolSize to: 0
[junit4:junit4]   2> 4224 T173 oashc.HttpShardHandlerFactory.getParameter Setting maximumPoolSize to: 2147483647
[junit4:junit4]   2> 4225 T173 oashc.HttpShardHandlerFactory.getParameter Setting maxThreadIdleTime to: 5
[junit4:junit4]   2> 4225 T173 oashc.HttpShardHandlerFactory.getParameter Setting sizeOfQueue to: -1
[junit4:junit4]   2> 4226 T173 oashc.HttpShardHandlerFactory.getParameter Setting fairnessPolicy to: false
[junit4:junit4]   2> 4227 T173 oascsi.HttpClientUtil.createClient Creating new http client, config:maxConnectionsPerHost=20&maxConnections=10000&socketTimeout=0&connTimeout=0&retry=false
[junit4:junit4]   2> 4240 T173 oash.SnapPuller.startExecutorService Poll Scheduled at an interval of 1000ms
[junit4:junit4]   2> 4241 T238 oasc.SolrCore.registerSearcher [collection1] Registered new searcher Searcher@1780e41a main{StandardDirectoryReader(segments_3:6 _0(5.0):C10 _1(5.0):C2)}
[junit4:junit4]   2> 4241 T173 oasc.CoreContainer.register registering core: collection1
[junit4:junit4]   2> 4242 T173 oass.SolrDispatchFilter.init user.dir=/usr/home/hudson/hudson-slave/workspace/Lucene-Solr-Tests-trunk-java7/solr/build/solr-core/test/J1
[junit4:junit4]   2> 4242 T173 oass.SolrDispatchFilter.init SolrDispatchFilter.init() done
[junit4:junit4]   2> 4243 T173 oascsi.HttpClientUtil.createClient Creating new http client, config:maxConnections=128&maxConnectionsPerHost=32&followRedirects=false
[junit4:junit4]   2> ASYNC  NEW_CORE C17 name=collection1 org.apache.solr.core.SolrCore@2f0d356b
[junit4:junit4]   2> 4295 T221 C17 REQ [collection1] webapp=/solr path=/replication params={command=details&qt=/replication&wt=javabin&version=2} status=0 QTime=33 
[junit4:junit4]   2> 4315 T222 C17 REQ [collection1] webapp=/solr path=/replication params={command=details&slave=false&qt=/replication&wt=javabin&version=2} status=0 QTime=5 
[junit4:junit4]   2> ASYNC  NEW_CORE C18 name=collection1 org.apache.solr.core.SolrCore@400f1a30
[junit4:junit4]   2> 4316 T231 C18 REQ [collection1] webapp=/solr path=/replication params={command=details&qt=/replication&wt=javabin&version=2} status=0 QTime=12 
[junit4:junit4]   2> 4339 T173 oejs.Server.doStart jetty-8.1.2.v20120308
[junit4:junit4]   2> 4341 T173 oejs.AbstractConnector.doStart Started SocketConnector@0.0.0.0:34816
[junit4:junit4]   2> 4342 T173 oasc.SolrResourceLoader.locateSolrHome JNDI not configured for solr (NoInitialContextEx)
[junit4:junit4]   2> 4343 T173 oasc.SolrResourceLoader.locateSolrHome using system property solr.solr.home: ./org.apache.solr.handler.TestReplicationHandler$SolrInstance-1346976472100/repeater
[junit4:junit4]   2> 4343 T173 oasc.SolrResourceLoader.<init> new SolrResourceLoader for deduced Solr Home: './org.apache.solr.handler.TestReplicationHandler$SolrInstance-1346976472100/repeater/'
[junit4:junit4]   2> 4391 T173 oass.SolrDispatchFilter.init SolrDispatchFilter.init()
[junit4:junit4]   2> 4392 T173 oasc.SolrResourceLoader.locateSolrHome JNDI not configured for solr (NoInitialContextEx)
[junit4:junit4]   2> 4393 T173 oasc.SolrResourceLoader.locateSolrHome using system property solr.solr.home: ./org.apache.solr.handler.TestReplicationHandler$SolrInstance-1346976472100/repeater
[junit4:junit4]   2> 4393 T173 oasc.CoreContainer$Initializer.initialize looking for solr.xml: /usr/home/hudson/hudson-slave/workspace/Lucene-Solr-Tests-trunk-java7/solr/build/solr-core/test/J1/./org.apache.solr.handler.TestReplicationHandler$SolrInstance-1346976472100/repeater/solr.xml
[junit4:junit4]   2> 4394 T173 oasc.CoreContainer.<init> New CoreContainer 28805470
[junit4:junit4]   2> 4394 T173 oasc.CoreContainer$Initializer.initialize no solr.xml file found - using default
[junit4:junit4]   2> 4395 T173 oasc.CoreContainer.load Loading CoreContainer using Solr Home: './org.apache.solr.handler.TestReplicationHandler$SolrInstance-1346976472100/repeater/'
[junit4:junit4]   2> 4395 T173 oasc.SolrResourceLoader.<init> new SolrResourceLoader for directory: './org.apache.solr.handler.TestReplicationHandler$SolrInstance-1346976472100/repeater/'
[junit4:junit4]   2> 4430 T173 oasc.CoreContainer.load Registering Log Listener
[junit4:junit4]   2> 4452 T173 oasc.CoreContainer.create Creating SolrCore 'collection1' using instanceDir: ./org.apache.solr.handler.TestReplicationHandler$SolrInstance-1346976472100/repeater/collection1
[junit4:junit4]   2> 4454 T173 oasc.SolrResourceLoader.<init> new SolrResourceLoader for directory: './org.apache.solr.handler.TestReplicationHandler$SolrInstance-1346976472100/repeater/collection1/'
[junit4:junit4]   2> 4507 T173 oasc.SolrConfig.<init> Using Lucene MatchVersion: LUCENE_50
[junit4:junit4]   2> 5273 T222 C17 REQ [collection1] webapp=/solr path=/replication params={command=indexversion&wt=javabin&qt=/replication&version=2} status=0 QTime=1 
[junit4:junit4]   2> 5301 T173 oasc.SolrConfig.<init> Loaded SolrConfig: solrconfig.xml
[junit4:junit4]   2> 5302 T173 oass.IndexSchema.readSchema Reading Solr Schema
[junit4:junit4]   2> 5307 T173 oass.IndexSchema.readSchema Schema name=test
[junit4:junit4]   2> 5331 T173 oass.IndexSchema.readSchema unique key field: id
[junit4:junit4]   2> 5333 T173 oasc.SolrCore.<init> [collection1] Opening new SolrCore at ./org.apache.solr.handler.TestReplicationHandler$SolrInstance-1346976472100/repeater/collection1/, dataDir=./org.apache.solr.handler.TestReplicationHandler$SolrInstance-1346976472100/repeater/collection1/data/
[junit4:junit4]   2> 5334 T173 oasc.SolrCore.<init> JMX monitoring not detected for core: collection1
[junit4:junit4]   2> 5335 T173 oasc.SolrCore.getNewIndexDir WARNING New index directory detected: old=null new=./org.apache.solr.handler.TestReplicationHandler$SolrInstance-1346976472100/repeater/collection1/data/index/
[junit4:junit4]   2> 5336 T173 oasc.SolrCore.initIndex WARNING [collection1] Solr index directory './org.apache.solr.handler.TestReplicationHandler$SolrInstance-1346976472100/repeater/collection1/data/index' doesn't exist. Creating new index...
[junit4:junit4]   2> 5337 T173 oasc.CachingDirectoryFactory.get return new directory for /usr/home/hudson/hudson-slave/workspace/Lucene-Solr-Tests-trunk-java7/solr/build/solr-core/test/J1/./org.apache.solr.handler.TestReplicationHandler$SolrInstance-1346976472100/repeater/collection1/data/index forceNew:false
[junit4:junit4]   2> 5343 T173 oasc.SolrDeletionPolicy.onCommit SolrDeletionPolicy.onCommit: commits:num=1
[junit4:junit4]   2> 		commit{dir=NRTCachingDirectory(org.apache.lucene.store.NIOFSDirectory@/usr/home/hudson/hudson-slave/workspace/Lucene-Solr-Tests-trunk-java7/solr/build/solr-core/test/J1/org.apache.solr.handler.TestReplicationHandler$SolrInstance-1346976472100/repeater/collection1/data/index lockFactory=org.apache.lucene.store.SingleInstanceLockFactory@3e2ce189; maxCacheMB=48.0 maxMergeSizeMB=4.0),segFN=segments_1,generation=1,filenames=[segments_1]
[junit4:junit4]   2> 5343 T173 oasc.SolrDeletionPolicy.updateCommits newest commit = 1
[junit4:junit4]   2> 5345 T173 oasc.RequestHandlers.initHandlersFromConfig created standard: solr.StandardRequestHandler
[junit4:junit4]   2> 5345 T173 oasc.RequestHandlers.initHandlersFromConfig created defaults: solr.StandardRequestHandler
[junit4:junit4]   2> 5346 T173 oasc.RequestHandlers.initHandlersFromConfig adding lazy requestHandler: solr.StandardRequestHandler
[junit4:junit4]   2> 5346 T173 oasc.RequestHandlers.initHandlersFromConfig created lazy: solr.StandardRequestHandler
[junit4:junit4]   2> 5347 T173 oasc.RequestHandlers.initHandlersFromConfig created /update: solr.UpdateRequestHandler
[junit4:junit4]   2> 5348 T173 oasc.RequestHandlers.initHandlersFromConfig created /replication: solr.ReplicationHandler
[junit4:junit4]   2> 5352 T173 oashl.XMLLoader.init xsltCacheLifetimeSeconds=60
[junit4:junit4]   2> 5359 T173 oass.SolrIndexSearcher.<init> Opening Searcher@5a6a7b90 main
[junit4:junit4]   2> 5360 T173 oasu.CommitTracker.<init> Hard AutoCommit: disabled
[junit4:junit4]   2> 5360 T173 oasu.CommitTracker.<init> Soft AutoCommit: disabled
[junit4:junit4]   2> 5361 T173 oashc.HttpShardHandlerFactory.getParameter Setting socketTimeout to: 0
[junit4:junit4]   2> 5362 T173 oashc.HttpShardHandlerFactory.getParameter Setting urlScheme to: http://
[junit4:junit4]   2> 5362 T173 oashc.HttpShardHandlerFactory.getParameter Setting connTimeout to: 0
[junit4:junit4]   2> 5363 T173 oashc.HttpShardHandlerFactory.getParameter Setting maxConnectionsPerHost to: 20
[junit4:junit4]   2> 5363 T173 oashc.HttpShardHandlerFactory.getParameter Setting corePoolSize to: 0
[junit4:junit4]   2> 5364 T173 oashc.HttpShardHandlerFactory.getParameter Setting maximumPoolSize to: 2147483647
[junit4:junit4]   2> 5364 T173 oashc.HttpShardHandlerFactory.getParameter Setting maxThreadIdleTime to: 5
[junit4:junit4]   2> 5365 T173 oashc.HttpShardHandlerFactory.getParameter Setting sizeOfQueue to: -1
[junit4:junit4]   2> 5365 T173 oashc.HttpShardHandlerFactory.getParameter Setting fairnessPolicy to: false
[junit4:junit4]   2> 5366 T173 oascsi.HttpClientUtil.createClient Creating new http client, config:maxConnectionsPerHost=20&maxConnections=10000&socketTimeout=0&connTimeout=0&retry=false
[junit4:junit4]   2> 5384 T173 oash.SnapPuller.<init> WARNING 'masterUrl' must be specified without the /replication suffix
[junit4:junit4]   2> 5385 T173 oash.SnapPuller.startExecutorService Poll Scheduled at an interval of 1000ms
[junit4:junit4]   2> 5385 T173 oash.ReplicationHandler.inform Replication enabled for following config files: schema.xml
[junit4:junit4]   2> 5386 T173 oash.ReplicationHandler.inform Commits will be reserved for  10000
[junit4:junit4]   2> 5386 T249 oasc.SolrCore.registerSearcher [collection1] Registered new searcher Searcher@5a6a7b90 main{StandardDirectoryReader(segments_1:1)}
[junit4:junit4]   2> 5386 T173 oasc.CoreContainer.register registering core: collection1
[junit4:junit4]   2> 5387 T173 oass.SolrDispatchFilter.init user.dir=/usr/home/hudson/hudson-slave/workspace/Lucene-Solr-Tests-trunk-java7/solr/build/solr-core/test/J1
[junit4:junit4]   2> 5388 T173 oass.SolrDispatchFilter.init SolrDispatchFilter.init() done
[junit4:junit4]   2> 5388 T173 oascsi.HttpClientUtil.createClient Creating new http client, config:maxConnections=128&maxConnectionsPerHost=32&followRedirects=false
[junit4:junit4]   2> 5422 T222 C17 REQ [collection1] webapp=/solr path=/replication params={command=details&slave=false&qt=/replication&wt=javabin&version=2} status=0 QTime=10 
[junit4:junit4]   2> ASYNC  NEW_CORE C19 name=collection1 org.apache.solr.core.SolrCore@39a396e4
[junit4:junit4]   2> 5423 T242 C19 REQ [collection1] webapp=/solr path=/replication params={command=details&qt=/replication&wt=javabin&version=2} status=0 QTime=15 
[junit4:junit4]   2> 5424 T173 oasc.CoreContainer.shutdown Shutting down CoreContainer instance=28805470
[junit4:junit4]   2> 5425 T173 oasc.SolrCore.close [collection1]  CLOSING SolrCore org.apache.solr.core.SolrCore@39a396e4
[junit4:junit4]   2> 5426 T173 oasc.SolrCore.closeSearcher [collection1] Closing main searcher on request.
[junit4:junit4]   2> 5427 T173 oasu.DirectUpdateHandler2.close closing DirectUpdateHandler2{commits=0,autocommits=0,soft autocommits=0,optimizes=0,rollbacks=0,expungeDeletes=0,docsPending=0,adds=0,deletesById=0,deletesByQuery=0,errors=0,cumulative_adds=0,cumulative_deletesById=0,cumulative_deletesByQuery=0,cumulative_errors=0}
[junit4:junit4]   2> 5427 T173 oasu.DefaultSolrCoreState.decref SolrCoreState ref count has reached 0 - closing IndexWriter
[junit4:junit4]   2> 5428 T173 oasu.DefaultSolrCoreState.decref Closing SolrCoreState - canceling any ongoing recovery
[junit4:junit4]   2> 5428 T173 oejsh.ContextHandler.doStop stopped o.e.j.s.ServletContextHandler{/solr,null}
[junit4:junit4]   2> 5488 T221 C17 REQ [collection1] webapp=/solr path=/select params={wt=javabin&q=*:*&version=2} hits=12 status=0 QTime=0 
[junit4:junit4]   2> 5492 T221 C17 oasu.DirectUpdateHandler2.deleteAll [collection1] REMOVING ALL DOCUMENTS FROM INDEX
[junit4:junit4]   2> 5505 T221 C17 oasc.SolrDeletionPolicy.onInit SolrDeletionPolicy.onInit: commits:num=2
[junit4:junit4]   2> 		commit{dir=NRTCachingDirectory(org.apache.lucene.store.NIOFSDirectory@/usr/home/hudson/hudson-slave/workspace/Lucene-Solr-Tests-trunk-java7/solr/build/solr-core/test/J1/org.apache.solr.handler.TestReplicationHandler$SolrInstance-1346976467783/master/collection1/data/index lockFactory=org.apache.lucene.store.SingleInstanceLockFactory@6606d2be; maxCacheMB=48.0 maxMergeSizeMB=4.0),segFN=segments_2,generation=2,filenames=[_0.fnm, _0_Pulsing40_0.tim, _0_nrm.cfe, _0_Pulsing40_0.tip, segments_2, _0.fdx, _0_nrm.cfs, _0.si, _0_Pulsing40_0.frq, _0.fdt]
[junit4:junit4]   2> 		commit{dir=NRTCachingDirectory(org.apache.lucene.store.NIOFSDirectory@/usr/home/hudson/hudson-slave/workspace/Lucene-Solr-Tests-trunk-java7/solr/build/solr-core/test/J1/org.apache.solr.handler.TestReplicationHandler$SolrInstance-1346976467783/master/collection1/data/index lockFactory=org.apache.lucene.store.SingleInstanceLockFactory@6606d2be; maxCacheMB=48.0 maxMergeSizeMB=4.0),segFN=segments_3,generation=3,filenames=[_1_nrm.cfs, _0_Pulsing40_0.tim, _0.fnm, _1_Pulsing40_0.tip, _1_Pulsing40_0.tim, _0_nrm.cfs, _1.fnm, _0_Pulsing40_0.frq, _1_nrm.cfe, _1_Pulsing40_0.frq, _1.fdx, _1.fdt, _1.si, _0_nrm.cfe, _0_Pulsing40_0.tip, _0.fdx, _0.si, segments_3, _0.fdt]
[junit4:junit4]   2> 5506 T221 C17 oasc.SolrDeletionPolicy.updateCommits newest commit = 3
[junit4:junit4]   2> 5513 T221 C17 UPDATE [collection1] webapp=/solr path=/update params={wt=javabin&version=2} {deleteByQuery=*:*} 0 21
[junit4:junit4]   2> 5516 T221 C17 oasu.DirectUpdateHandler2.commit start commit{flags=0,_version_=0,optimize=false,openSearcher=true,waitSearcher=true,expungeDeletes=false,softCommit=false}
[junit4:junit4]   2> 5527 T221 C17 oasc.SolrDeletionPolicy.onCommit SolrDeletionPolicy.onCommit: commits:num=2
[junit4:junit4]   2> 		commit{dir=NRTCachingDirectory(org.apache.lucene.store.NIOFSDirectory@/usr/home/hudson/hudson-slave/workspace/Lucene-Solr-Tests-trunk-java7/solr/build/solr-core/test/J1/org.apache.solr.handler.TestReplicationHandler$SolrInstance-1346976467783/master/collection1/data/index lockFactory=org.apache.lucene.store.SingleInstanceLockFactory@6606d2be; maxCacheMB=48.0 maxMergeSizeMB=4.0),segFN=segments_3,generation=3,filenames=[_1_nrm.cfs, _0_Pulsing40_0.tim, _0.fnm, _1_Pulsing40_0.tip, _1_Pulsing40_0.tim, _0_nrm.cfs, _1.fnm, _0_Pulsing40_0.frq, _1_nrm.cfe, _1_Pulsing40_0.frq, _1.fdx, _1.fdt, _1.si, _0_nrm.cfe, _0_Pulsing40_0.tip, _0.fdx, _0.si, segments_3, _0.fdt]
[junit4:junit4]   2> 		commit{dir=NRTCachingDirectory(org.apache.lucene.store.NIOFSDirectory@/usr/home/hudson/hudson-slave/workspace/Lucene-Solr-Tests-trunk-java7/solr/build/solr-core/test/J1/org.apache.solr.handler.TestReplicationHandler$SolrInstance-1346976467783/master/collection1/data/index lockFactory=org.apache.lucene.store.SingleInstanceLockFactory@6606d2be; maxCacheMB=48.0 maxMergeSizeMB=4.0),segFN=segments_4,generation=4,filenames=[segments_4]
[junit4:junit4]   2> 5528 T221 C17 oasc.SolrDeletionPolicy.updateCommits newest commit = 4
[junit4:junit4]   2> 5540 T221 C17 oass.SolrIndexSearcher.<init> Opening Searcher@4449d0a4 main
[junit4:junit4]   2> 5540 T221 C17 oasu.DirectUpdateHandler2.commit end_commit_flush
[junit4:junit4]   2> 5540 T228 oasc.SolrCore.registerSearcher [collection1] Registered new searcher Searcher@4449d0a4 main{StandardDirectoryReader(segments_4:7)}
[junit4:junit4]   2> 5542 T221 C17 UPDATE [collection1] webapp=/solr path=/update params={waitSearcher=true&wt=javabin&commit=true&softCommit=false&version=2} {commit=} 0 26
[junit4:junit4]   2> 5545 T231 C18 REQ [collection1] webapp=/solr path=/select params={wt=javabin&q=*:*&version=2} hits=12 status=0 QTime=0 
[junit4:junit4]   2> 5649 T231 C18 REQ [collection1] webapp=/solr path=/select params={wt=javabin&q=*:*&version=2} hits=12 status=0 QTime=0 
[junit4:junit4]   2> 5753 T231 C18 REQ [collection1] webapp=/solr path=/select params={wt=javabin&q=*:*&version=2} hits=12 status=0 QTime=0 
[junit4:junit4]   2> 5857 T231 C18 REQ [collection1] webapp=/solr path=/select params={wt=javabin&q=*:*&version=2} hits=12 status=0 QTime=0 
[junit4:junit4]   2> 5961 T231 C18 REQ [collection1] webapp=/solr path=/select params={wt=javabin&q=*:*&version=2} hits=12 status=0 QTime=0 
[junit4:junit4]   2> 6065 T231 C18 REQ [collection1] webapp=/solr path=/select params={wt=javabin&q=*:*&version=2} hits=12 status=0 QTime=0 
[junit4:junit4]   2> 6171 T231 C18 REQ [collection1] webapp=/solr path=/select params={wt=javabin&q=*:*&version=2} hits=12 status=0 QTime=1 
[junit4:junit4]   2> 6221 T222 C17 REQ [collection1] webapp=/solr path=/replication params={command=indexversion&wt=javabin&qt=/replication&version=2} status=0 QTime=0 
[junit4:junit4]   2> 6222 T239 oash.SnapPuller.fetchLatestIndex Master's generation: 4
[junit4:junit4]   2> 6223 T239 oash.SnapPuller.fetchLatestIndex Slave's generation: 3
[junit4:junit4]   2> 6223 T239 oash.SnapPuller.fetchLatestIndex Starting replication process
[junit4:junit4]   2> 6226 T222 C17 REQ [collection1] webapp=/solr path=/replication params={command=filelist&generation=4&wt=javabin&qt=/replication&version=2} status=0 QTime=1 
[junit4:junit4]   2> 6227 T239 oash.SnapPuller.fetchLatestIndex Number of files in latest index in master: 1
[junit4:junit4]   2> 6229 T239 oash.SnapPuller.fetchLatestIndex Starting download to ./org.apache.solr.handler.TestReplicationHandler$SolrInstance-1346976468271/slave/collection1/data/index.20120907040754011 fullCopy=false
[junit4:junit4]   2> 6232 T222 C17 REQ [collection1] webapp=/solr path=/replication params={file=segments_4&command=filecontent&checksum=true&generation=4&qt=/replication&wt=filestream} status=0 QTime=0 
[junit4:junit4]   2> 6235 T239 oash.SnapPuller.fetchLatestIndex Total time taken for download : 0 secs
[junit4:junit4]   2> 6238 T239 oasu.DefaultSolrCoreState.newIndexWriter Creating new IndexWriter...
[junit4:junit4]   2> 6238 T239 oasu.DefaultSolrCoreState.newIndexWriter Waiting until IndexWriter is unused... core=collection1
[junit4:junit4]   2> 6240 T239 oasc.CachingDirectoryFactory.get return new directory for /usr/home/hudson/hudson-slave/workspace/Lucene-Solr-Tests-trunk-java7/solr/build/solr-core/test/J1/./org.apache.solr.handler.TestReplicationHandler$SolrInstance-1346976468271/slave/collection1/data/index forceNew:true
[junit4:junit4]   2> 6253 T239 oasc.SolrDeletionPolicy.onInit SolrDeletionPolicy.onInit: commits:num=2
[junit4:junit4]   2> 		commit{dir=NRTCachingDirectory(org.apache.lucene.store.NIOFSDirectory@/usr/home/hudson/hudson-slave/workspace/Lucene-Solr-Tests-trunk-java7/solr/build/solr-core/test/J1/org.apache.solr.handler.TestReplicationHandler$SolrInstance-1346976468271/slave/collection1/data/index lockFactory=org.apache.lucene.store.SingleInstanceLockFactory@565a722b; maxCacheMB=48.0 maxMergeSizeMB=4.0),segFN=segments_3,generation=3,filenames=[_1_nrm.cfs, _0_Pulsing40_0.tim, _0.fnm, _1_Pulsing40_0.tip, _1_Pulsing40_0.tim, _0_nrm.cfs, _1.fnm, _0_Pulsing40_0.frq, _1_nrm.cfe, _1_Pulsing40_0.frq, _1.fdx, _1.fdt, _1.si, _0_nrm.cfe, _0_Pulsing40_0.tip, _0.fdx, _0.si, segments_3, _0.fdt]
[junit4:junit4]   2> 		commit{dir=NRTCachingDirectory(org.apache.lucene.store.NIOFSDirectory@/usr/home/hudson/hudson-slave/workspace/Lucene-Solr-Tests-trunk-java7/solr/build/solr-core/test/J1/org.apache.solr.handler.TestReplicationHandler$SolrInstance-1346976468271/slave/collection1/data/index lockFactory=org.apache.lucene.store.SingleInstanceLockFactory@565a722b; maxCacheMB=48.0 maxMergeSizeMB=4.0),segFN=segments_4,generation=4,filenames=[segments_4]
[junit4:junit4]   2> 6254 T239 oasc.SolrDeletionPolicy.updateCommits newest commit = 4
[junit4:junit4]   2> 6263 T239 oasu.DefaultSolrCoreState.newIndexWriter New IndexWriter is ready to be used.
[junit4:junit4]   2> 6264 T239 oass.SolrIndexSearcher.<init> Opening Searcher@74510dba main
[junit4:junit4]   2> 6265 T238 oasc.SolrCore.registerSearcher [collection1] Registered new searcher Searcher@74510dba main{StandardDirectoryReader(segments_4:7:nrt)}
[junit4:junit4]   2> 6266 T238 oasc.CachingDirectoryFactory.close Closing directory:/usr/home/hudson/hudson-slave/workspace/Lucene-Solr-Tests-trunk-java7/solr/build/solr-core/test/J1/./org.apache.solr.handler.TestReplicationHandler$SolrInstance-1346976468271/slave/collection1/data/index
[junit4:junit4]   2> 6266 T239 oasu.DirectUpdateHandler2.commit start commit{flags=0,_version_=0,optimize=false,openSearcher=true,waitSearcher=true,expungeDeletes=false,softCommit=false}
[junit4:junit4]   2> 6267 T239 oass.SolrIndexSearcher.<init> Opening Searcher@75c74de9 main
[junit4:junit4]   2> 6268 T239 oasu.DirectUpdateHandler2.commit end_commit_flush
[junit4:junit4]   2> 6268 T238 oasc.SolrCore.registerSearcher [collection1] Registered new searcher Searcher@75c74de9 main{StandardDirectoryReader(segments_4:7:nrt)}
[junit4:junit4]   2> 6268 T239 oash.SnapPuller.fetchLatestIndex removing temporary index download directory ./org.apache.solr.handler.TestReplicationHandler$SolrInstance-1346976468271/slave/collection1/data/index.20120907040754011
[junit4:junit4]   2> 6276 T231 C18 REQ [collection1] webapp=/solr path=/select params={wt=javabin&q=*:*&version=2} hits=0 status=0 QTime=1 
[junit4:junit4]   2> 6382 T221 C17 UPDATE [collection1] webapp=/solr path=/update params={wt=javabin&version=2} {add=[0]} 0 2
[junit4:junit4]   2> 6385 T221 C17 UPDATE [collection1] webapp=/solr path=/update params={wt=javabin&version=2} {add=[1]} 0 0
[junit4:junit4]   2> 6388 T221 C17 UPDATE [collection1] webapp=/solr path=/update params={wt=javabin&version=2} {add=[2]} 0 0
[junit4:junit4]   2> 6391 T221 C17 UPDATE [collection1] webapp=/solr path=/update params={wt=javabin&version=2} {add=[3]} 0 0
[junit4:junit4]   2> 6394 T221 C17 UPDATE [collection1] webapp=/solr path=/update params={wt=javabin&version=

[...truncated too long message...]

d=backup&numberToKeep=1} status=0 QTime=16 
[junit4:junit4]   2> 36838 T381 C30 REQ [collection1] webapp=/solr path=/replication params={command=details} status=0 QTime=3 
[junit4:junit4]   2> 37856 T382 C30 REQ [collection1] webapp=/solr path=/replication params={command=backup&numberToKeep=1} status=0 QTime=0 
[junit4:junit4]   2> 37860 T381 C30 REQ [collection1] webapp=/solr path=/replication params={command=details} status=0 QTime=4 
[junit4:junit4]   2> 38070 T381 C30 REQ [collection1] webapp=/solr path=/replication params={command=details} status=0 QTime=8 
[junit4:junit4]   2> 38083 T173 oas.SolrTestCaseJ4.tearDown ###Ending test
[junit4:junit4]   1> replicate slave to master
[junit4:junit4]   2> 38087 T173 oasc.CoreContainer.shutdown Shutting down CoreContainer instance=1443213285
[junit4:junit4]   2> 38088 T173 oasc.SolrCore.close [collection1]  CLOSING SolrCore org.apache.solr.core.SolrCore@58093ae5
[junit4:junit4]   2> 38088 T173 oasc.SolrCore.closeSearcher [collection1] Closing main searcher on request.
[junit4:junit4]   2> 38089 T173 oasu.DirectUpdateHandler2.close closing DirectUpdateHandler2{commits=1,autocommits=0,soft autocommits=0,optimizes=0,rollbacks=0,expungeDeletes=0,docsPending=0,adds=0,deletesById=0,deletesByQuery=0,errors=0,cumulative_adds=493,cumulative_deletesById=0,cumulative_deletesByQuery=1,cumulative_errors=0}
[junit4:junit4]   2> 38090 T173 oasu.DefaultSolrCoreState.decref SolrCoreState ref count has reached 0 - closing IndexWriter
[junit4:junit4]   2> 38091 T173 oasu.DefaultSolrCoreState.decref Closing SolrCoreState - canceling any ongoing recovery
[junit4:junit4]   2> 38092 T173 oejsh.ContextHandler.doStop stopped o.e.j.s.ServletContextHandler{/solr,null}
[junit4:junit4]   2> 38144 T173 oasc.CoreContainer.shutdown Shutting down CoreContainer instance=35208043
[junit4:junit4]   2> 38145 T173 oasc.SolrCore.close [collection1]  CLOSING SolrCore org.apache.solr.core.SolrCore@116ea92d
[junit4:junit4]   2> 38146 T173 oasc.SolrCore.closeSearcher [collection1] Closing main searcher on request.
[junit4:junit4]   2> 38146 T173 oasu.DirectUpdateHandler2.close closing DirectUpdateHandler2{commits=2,autocommits=0,soft autocommits=0,optimizes=0,rollbacks=0,expungeDeletes=0,docsPending=0,adds=0,deletesById=0,deletesByQuery=0,errors=0,cumulative_adds=1,cumulative_deletesById=0,cumulative_deletesByQuery=0,cumulative_errors=0}
[junit4:junit4]   2> 38147 T173 oasu.DefaultSolrCoreState.decref SolrCoreState ref count has reached 0 - closing IndexWriter
[junit4:junit4]   2> 38148 T173 oasu.DefaultSolrCoreState.decref Closing SolrCoreState - canceling any ongoing recovery
[junit4:junit4]   2> 38148 T173 oejsh.ContextHandler.doStop stopped o.e.j.s.ServletContextHandler{/solr,null}
[junit4:junit4]   2> 38234 T173 oas.SolrTestCaseJ4.deleteCore ###deleteCore
[junit4:junit4]   2> 40219 T376 oash.SnapPuller.fetchLatestIndex SEVERE Master at: http://localhost:34901/solr is not available. Index fetch failed. Exception: org.apache.solr.client.solrj.SolrServerException: IOException occured when talking to server at: http://localhost:34901/solr
[junit4:junit4]   2> 40221 T376 oash.SnapPuller.logReplicationTimeAndConfFiles WARNING Exception while updating statistics java.io.FileNotFoundException: ./org.apache.solr.handler.TestReplicationHandler$SolrInstance-1346976468271/slave/collection1/data/replication.properties (No such file or directory)
[junit4:junit4]   2> 	at java.io.FileOutputStream.open(Native Method)
[junit4:junit4]   2> 	at java.io.FileOutputStream.<init>(FileOutputStream.java:212)
[junit4:junit4]   2> 	at java.io.FileOutputStream.<init>(FileOutputStream.java:165)
[junit4:junit4]   2> 	at org.apache.solr.handler.SnapPuller.logReplicationTimeAndConfFiles(SnapPuller.java:483)
[junit4:junit4]   2> 	at org.apache.solr.handler.SnapPuller.fetchLatestIndex(SnapPuller.java:409)
[junit4:junit4]   2> 	at org.apache.solr.handler.ReplicationHandler.doFetch(ReplicationHandler.java:297)
[junit4:junit4]   2> 	at org.apache.solr.handler.SnapPuller$1.run(SnapPuller.java:176)
[junit4:junit4]   2> 	at java.util.concurrent.Executors$RunnableAdapter.call(Executors.java:471)
[junit4:junit4]   2> 	at java.util.concurrent.FutureTask$Sync.innerRunAndReset(FutureTask.java:351)
[junit4:junit4]   2> 	at java.util.concurrent.FutureTask.runAndReset(FutureTask.java:178)
[junit4:junit4]   2> 	at java.util.concurrent.ScheduledThreadPoolExecutor$ScheduledFutureTask.access$301(ScheduledThreadPoolExecutor.java:178)
[junit4:junit4]   2> 	at java.util.concurrent.ScheduledThreadPoolExecutor$ScheduledFutureTask.run(ScheduledThreadPoolExecutor.java:293)
[junit4:junit4]   2> 	at java.util.concurrent.ThreadPoolExecutor.runWorker(ThreadPoolExecutor.java:1110)
[junit4:junit4]   2> 	at java.util.concurrent.ThreadPoolExecutor$Worker.run(ThreadPoolExecutor.java:603)
[junit4:junit4]   2> 	at java.lang.Thread.run(Thread.java:722)
[junit4:junit4]   2> 
[junit4:junit4]   2> 159356 T173 oas.SolrTestCaseJ4.endTrackingSearchers SEVERE ERROR: SolrIndexSearcher opens=76 closes=75
[junit4:junit4]   2> NOTE: test params are: codec=Lucene40: {newname=Pulsing40(freqCutoff=1 minBlockSize=34 maxBlockSize=155), id=Pulsing40(freqCutoff=1 minBlockSize=34 maxBlockSize=155), name=Pulsing40(freqCutoff=1 minBlockSize=34 maxBlockSize=155)}, sim=RandomSimilarityProvider(queryNorm=true,coord=no): {}, locale=fr, timezone=W-SU
[junit4:junit4]   2> NOTE: FreeBSD 9.0-RELEASE amd64/Oracle Corporation 1.7.0_06 (64-bit)/cpus=16,threads=1,free=117585216,total=272629760
[junit4:junit4]   2> NOTE: All tests run in this JVM: [MultiTermTest, SoftAutoCommitTest, TestDistributedSearch, TestBM25SimilarityFactory, TestSolrDeletionPolicy1, TestDocumentBuilder, TestReplicationHandler]
[junit4:junit4]   2> NOTE: reproduce with: ant test  -Dtestcase=TestReplicationHandler -Dtests.seed=766A42608FB47CD6 -Dtests.multiplier=3 -Dtests.slow=true -Dtests.locale=fr -Dtests.timezone=W-SU -Dtests.file.encoding=US-ASCII
[junit4:junit4] ERROR   0.00s J1 | TestReplicationHandler (suite) <<<
[junit4:junit4]    > Throwable #1: java.lang.AssertionError: ERROR: SolrIndexSearcher opens=76 closes=75
[junit4:junit4]    > 	at __randomizedtesting.SeedInfo.seed([766A42608FB47CD6]:0)
[junit4:junit4]    > 	at org.junit.Assert.fail(Assert.java:93)
[junit4:junit4]    > 	at org.apache.solr.SolrTestCaseJ4.endTrackingSearchers(SolrTestCaseJ4.java:223)
[junit4:junit4]    > 	at org.apache.solr.SolrTestCaseJ4.afterClass(SolrTestCaseJ4.java:89)
[junit4:junit4]    > 	at sun.reflect.NativeMethodAccessorImpl.invoke0(Native Method)
[junit4:junit4]    > 	at sun.reflect.NativeMethodAccessorImpl.invoke(NativeMethodAccessorImpl.java:57)
[junit4:junit4]    > 	at sun.reflect.DelegatingMethodAccessorImpl.invoke(DelegatingMethodAccessorImpl.java:43)
[junit4:junit4]    > 	at java.lang.reflect.Method.invoke(Method.java:601)
[junit4:junit4]    > 	at com.carrotsearch.randomizedtesting.RandomizedRunner.invoke(RandomizedRunner.java:1559)
[junit4:junit4]    > 	at com.carrotsearch.randomizedtesting.RandomizedRunner.access$600(RandomizedRunner.java:79)
[junit4:junit4]    > 	at com.carrotsearch.randomizedtesting.RandomizedRunner$5.evaluate(RandomizedRunner.java:700)
[junit4:junit4]    > 	at com.carrotsearch.randomizedtesting.rules.StatementAdapter.evaluate(StatementAdapter.java:36)
[junit4:junit4]    > 	at com.carrotsearch.randomizedtesting.rules.SystemPropertiesRestoreRule$1.evaluate(SystemPropertiesRestoreRule.java:53)
[junit4:junit4]    > 	at org.apache.lucene.util.AbstractBeforeAfterRule$1.evaluate(AbstractBeforeAfterRule.java:45)
[junit4:junit4]    > 	at org.apache.lucene.util.TestRuleStoreClassName$1.evaluate(TestRuleStoreClassName.java:42)
[junit4:junit4]    > 	at com.carrotsearch.randomizedtesting.rules.SystemPropertiesInvariantRule$1.evaluate(SystemPropertiesInvariantRule.java:55)
[junit4:junit4]    > 	at com.carrotsearch.randomizedtesting.rules.NoShadowingOrOverridesOnMethodsRule$1.evaluate(NoShadowingOrOverridesOnMethodsRule.java:39)
[junit4:junit4]    > 	at com.carrotsearch.randomizedtesting.rules.NoShadowingOrOverridesOnMethodsRule$1.evaluate(NoShadowingOrOverridesOnMethodsRule.java:39)
[junit4:junit4]    > 	at org.apache.lucene.util.TestRuleAssertionsRequired$1.evaluate(TestRuleAssertionsRequired.java:40)
[junit4:junit4]    > 	at org.apache.lucene.util.TestRuleMarkFailure$1.evaluate(TestRuleMarkFailure.java:48)
[junit4:junit4]    > 	at org.apache.lucene.util.TestRuleIgnoreAfterMaxFailures$1.evaluate(TestRuleIgnoreAfterMaxFailures.java:70)
[junit4:junit4]    > 	at org.apache.lucene.util.TestRuleIgnoreTestSuites$1.evaluate(TestRuleIgnoreTestSuites.java:55)
[junit4:junit4]    > 	at com.carrotsearch.randomizedtesting.rules.StatementAdapter.evaluate(StatementAdapter.java:36)
[junit4:junit4]    > 	at com.carrotsearch.randomizedtesting.ThreadLeakControl$StatementRunner.run(ThreadLeakControl.java:358)
[junit4:junit4]    > 	at java.lang.Thread.run(Thread.java:722)
[junit4:junit4] Completed on J1 in 159.40s, 1 test, 1 failure <<< FAILURES!

[...truncated 506 lines...]
BUILD FAILED
/usr/home/hudson/hudson-slave/workspace/Lucene-Solr-Tests-trunk-java7/build.xml:29: The following error occurred while executing this line:
/usr/home/hudson/hudson-slave/workspace/Lucene-Solr-Tests-trunk-java7/solr/build.xml:146: The following error occurred while executing this line:
/usr/home/hudson/hudson-slave/workspace/Lucene-Solr-Tests-trunk-java7/lucene/module-build.xml:63: The following error occurred while executing this line:
/usr/home/hudson/hudson-slave/workspace/Lucene-Solr-Tests-trunk-java7/lucene/common-build.xml:1132: The following error occurred while executing this line:
/usr/home/hudson/hudson-slave/workspace/Lucene-Solr-Tests-trunk-java7/lucene/common-build.xml:809: There were test failures: 228 suites, 919 tests, 2 suite-level errors, 1 failure, 6 ignored (1 assumption)

Total time: 31 minutes 42 seconds
Build step 'Invoke Ant' marked build as failure
Recording test results
Email was triggered for: Failure
Sending email for trigger: Failure



Mime
View raw message