lucene-dev mailing list archives

Site index · List index
Message view « Date » · « Thread »
Top « Date » · « Thread »
From Mark Miller <markrmil...@gmail.com>
Subject Re: [JENKINS] Lucene-Solr-Tests-4.x-Java6 - Build # 656 - Still Failing
Date Mon, 17 Sep 2012 03:17:56 GMT
Apache jenkins is having a lot of trouble here - uwes Jenkins and my machine seem to have no such problem. I'll try some workarounds for our POS Jenkins machine as soon as I can. Fairly busy this week though. Unfortunately I'm not home so that I can try my FreeBSD virt machine. 

I'd love an annotation to avoid running tests on our crappy freebsd Jenkins. 

Mark

Sent from my iPad

On Sep 16, 2012, at 10:43 PM, Apache Jenkins Server <jenkins@builds.apache.org> wrote:

> Build: https://builds.apache.org/job/Lucene-Solr-Tests-4.x-Java6/656/
> 
> 1 tests failed.
> REGRESSION:  org.apache.solr.cloud.BasicDistributedZk2Test.testDistribSearch
> 
> Error Message:
> Shard still reported as live in zk
> 
> Stack Trace:
> java.lang.AssertionError: Shard still reported as live in zk
>    at __randomizedtesting.SeedInfo.seed([FA7E6D12BFF5FD93:7B98E30AC8AA9DAF]:0)
>    at org.junit.Assert.fail(Assert.java:93)
>    at org.apache.solr.cloud.AbstractFullDistribZkTestBase.waitToSeeNotLive(AbstractFullDistribZkTestBase.java:1220)
>    at org.apache.solr.cloud.BasicDistributedZk2Test.brindDownShardIndexSomeDocsAndRecover(BasicDistributedZk2Test.java:190)
>    at org.apache.solr.cloud.BasicDistributedZk2Test.doTest(BasicDistributedZk2Test.java:83)
>    at org.apache.solr.BaseDistributedSearchTestCase.testDistribSearch(BaseDistributedSearchTestCase.java:695)
>    at sun.reflect.NativeMethodAccessorImpl.invoke0(Native Method)
>    at sun.reflect.NativeMethodAccessorImpl.invoke(NativeMethodAccessorImpl.java:57)
>    at sun.reflect.DelegatingMethodAccessorImpl.invoke(DelegatingMethodAccessorImpl.java:43)
>    at java.lang.reflect.Method.invoke(Method.java:616)
>    at com.carrotsearch.randomizedtesting.RandomizedRunner.invoke(RandomizedRunner.java:1559)
>    at com.carrotsearch.randomizedtesting.RandomizedRunner.access$600(RandomizedRunner.java:79)
>    at com.carrotsearch.randomizedtesting.RandomizedRunner$6.evaluate(RandomizedRunner.java:737)
>    at com.carrotsearch.randomizedtesting.RandomizedRunner$7.evaluate(RandomizedRunner.java:773)
>    at com.carrotsearch.randomizedtesting.RandomizedRunner$8.evaluate(RandomizedRunner.java:787)
>    at com.carrotsearch.randomizedtesting.rules.SystemPropertiesRestoreRule$1.evaluate(SystemPropertiesRestoreRule.java:53)
>    at org.apache.lucene.util.TestRuleSetupTeardownChained$1.evaluate(TestRuleSetupTeardownChained.java:50)
>    at org.apache.lucene.util.TestRuleFieldCacheSanity$1.evaluate(TestRuleFieldCacheSanity.java:51)
>    at org.apache.lucene.util.AbstractBeforeAfterRule$1.evaluate(AbstractBeforeAfterRule.java:45)
>    at com.carrotsearch.randomizedtesting.rules.SystemPropertiesInvariantRule$1.evaluate(SystemPropertiesInvariantRule.java:55)
>    at org.apache.lucene.util.TestRuleThreadAndTestName$1.evaluate(TestRuleThreadAndTestName.java:48)
>    at org.apache.lucene.util.TestRuleIgnoreAfterMaxFailures$1.evaluate(TestRuleIgnoreAfterMaxFailures.java:70)
>    at org.apache.lucene.util.TestRuleMarkFailure$1.evaluate(TestRuleMarkFailure.java:48)
>    at com.carrotsearch.randomizedtesting.rules.StatementAdapter.evaluate(StatementAdapter.java:36)
>    at com.carrotsearch.randomizedtesting.ThreadLeakControl$StatementRunner.run(ThreadLeakControl.java:358)
>    at com.carrotsearch.randomizedtesting.ThreadLeakControl.forkTimeoutingTask(ThreadLeakControl.java:782)
>    at com.carrotsearch.randomizedtesting.ThreadLeakControl$3.evaluate(ThreadLeakControl.java:442)
>    at com.carrotsearch.randomizedtesting.RandomizedRunner.runSingleTest(RandomizedRunner.java:746)
>    at com.carrotsearch.randomizedtesting.RandomizedRunner$3.evaluate(RandomizedRunner.java:648)
>    at com.carrotsearch.randomizedtesting.RandomizedRunner$4.evaluate(RandomizedRunner.java:682)
>    at com.carrotsearch.randomizedtesting.RandomizedRunner$5.evaluate(RandomizedRunner.java:693)
>    at com.carrotsearch.randomizedtesting.rules.StatementAdapter.evaluate(StatementAdapter.java:36)
>    at com.carrotsearch.randomizedtesting.rules.SystemPropertiesRestoreRule$1.evaluate(SystemPropertiesRestoreRule.java:53)
>    at org.apache.lucene.util.AbstractBeforeAfterRule$1.evaluate(AbstractBeforeAfterRule.java:45)
>    at org.apache.lucene.util.TestRuleStoreClassName$1.evaluate(TestRuleStoreClassName.java:42)
>    at com.carrotsearch.randomizedtesting.rules.SystemPropertiesInvariantRule$1.evaluate(SystemPropertiesInvariantRule.java:55)
>    at com.carrotsearch.randomizedtesting.rules.NoShadowingOrOverridesOnMethodsRule$1.evaluate(NoShadowingOrOverridesOnMethodsRule.java:39)
>    at com.carrotsearch.randomizedtesting.rules.NoShadowingOrOverridesOnMethodsRule$1.evaluate(NoShadowingOrOverridesOnMethodsRule.java:39)
>    at com.carrotsearch.randomizedtesting.rules.StatementAdapter.evaluate(StatementAdapter.java:36)
>    at org.apache.lucene.util.TestRuleAssertionsRequired$1.evaluate(TestRuleAssertionsRequired.java:43)
>    at org.apache.lucene.util.TestRuleMarkFailure$1.evaluate(TestRuleMarkFailure.java:48)
>    at org.apache.lucene.util.TestRuleIgnoreAfterMaxFailures$1.evaluate(TestRuleIgnoreAfterMaxFailures.java:70)
>    at org.apache.lucene.util.TestRuleIgnoreTestSuites$1.evaluate(TestRuleIgnoreTestSuites.java:55)
>    at com.carrotsearch.randomizedtesting.rules.StatementAdapter.evaluate(StatementAdapter.java:36)
>    at com.carrotsearch.randomizedtesting.ThreadLeakControl$StatementRunner.run(ThreadLeakControl.java:358)
>    at java.lang.Thread.run(Thread.java:679)
> 
> 
> 
> 
> Build Log:
> [...truncated 7491 lines...]
> [junit4:junit4] Suite: org.apache.solr.cloud.BasicDistributedZk2Test
> [junit4:junit4]   2> 3 T2401 oas.SolrTestCaseJ4.setUp ###Starting testDistribSearch
> [junit4:junit4]   2> Creating dataDir: /usr/home/hudson/hudson-slave/workspace/Lucene-Solr-Tests-4.x-Java6/solr/build/solr-core/test/J1/./solrtest-BasicDistributedZk2Test-1347849325657
> [junit4:junit4]   2> 4 T2401 oasc.ZkTestServer.run STARTING ZK TEST SERVER
> [junit4:junit4]   2> 7 T2402 oazs.ZooKeeperServer.setTickTime tickTime set to 1000
> [junit4:junit4]   2> 8 T2402 oazs.NIOServerCnxn$Factory.<init> binding to port 0.0.0.0/0.0.0.0:0
> [junit4:junit4]   2> 9 T2402 oazsp.FileTxnSnapLog.save Snapshotting: 0
> [junit4:junit4]   2> 105 T2401 oasc.ZkTestServer.run start zk server on port:49261
> [junit4:junit4]   2> 105 T2401 oaz.ZooKeeper.<init> Initiating client connection, connectString=127.0.0.1:49261 sessionTimeout=10000 watcher=org.apache.solr.common.cloud.ConnectionManager@3f9fb3d
> [junit4:junit4]   2> 106 T2401 oascc.ConnectionManager.waitForConnected Waiting for client to connect to ZooKeeper
> [junit4:junit4]   2> 106 T2407 oaz.ClientCnxn$SendThread.startConnect Opening socket connection to server /127.0.0.1:49261
> [junit4:junit4]   2> 107 T2407 oaz.ClientCnxn$SendThread.primeConnection Socket connection established to localhost/127.0.0.1:49261, initiating session
> [junit4:junit4]   2> 107 T2403 oazs.NIOServerCnxn$Factory.run Accepted socket connection from /140.211.11.196:49262
> [junit4:junit4]   2> 108 T2403 oazs.NIOServerCnxn.readConnectRequest Client attempting to establish new session at /140.211.11.196:49262
> [junit4:junit4]   2> 108 T2405 oazsp.FileTxnLog.append Creating new log file: log.1
> [junit4:junit4]   2> 114 T2405 oazs.NIOServerCnxn.finishSessionInit Established session 0x139d2148c5f0000 with negotiated timeout 10000 for client /140.211.11.196:49262
> [junit4:junit4]   2> 114 T2407 oaz.ClientCnxn$SendThread.readConnectResult Session establishment complete on server localhost/127.0.0.1:49261, sessionid = 0x139d2148c5f0000, negotiated timeout = 10000
> [junit4:junit4]   2> 115 T2408 oascc.ConnectionManager.process Watcher org.apache.solr.common.cloud.ConnectionManager@3f9fb3d name:ZooKeeperConnection Watcher:127.0.0.1:49261 got event WatchedEvent state:SyncConnected type:None path:null path:null type:None
> [junit4:junit4]   2> 115 T2401 oascc.ConnectionManager.waitForConnected Client is connected to ZooKeeper
> [junit4:junit4]   2> 115 T2401 oascc.SolrZkClient.makePath makePath: /solr
> [junit4:junit4]   2> 128 T2406 oazs.PrepRequestProcessor.pRequest Processed session termination for sessionid: 0x139d2148c5f0000
> [junit4:junit4]   2> 129 T2408 oaz.ClientCnxn$EventThread.run EventThread shut down
> [junit4:junit4]   2> 129 T2401 oaz.ZooKeeper.close Session: 0x139d2148c5f0000 closed
> [junit4:junit4]   2> 129 T2403 oazs.NIOServerCnxn.closeSock Closed socket connection for client /140.211.11.196:49262 which had sessionid 0x139d2148c5f0000
> [junit4:junit4]   2> 130 T2401 oaz.ZooKeeper.<init> Initiating client connection, connectString=127.0.0.1:49261/solr sessionTimeout=10000 watcher=org.apache.solr.common.cloud.ConnectionManager@4ad6979e
> [junit4:junit4]   2> 130 T2409 oaz.ClientCnxn$SendThread.startConnect Opening socket connection to server /127.0.0.1:49261
> [junit4:junit4]   2> 130 T2401 oascc.ConnectionManager.waitForConnected Waiting for client to connect to ZooKeeper
> [junit4:junit4]   2> 131 T2409 oaz.ClientCnxn$SendThread.primeConnection Socket connection established to localhost/127.0.0.1:49261, initiating session
> [junit4:junit4]   2> 131 T2403 oazs.NIOServerCnxn$Factory.run Accepted socket connection from /140.211.11.196:49263
> [junit4:junit4]   2> 131 T2403 oazs.NIOServerCnxn.readConnectRequest Client attempting to establish new session at /140.211.11.196:49263
> [junit4:junit4]   2> 133 T2405 oazs.NIOServerCnxn.finishSessionInit Established session 0x139d2148c5f0001 with negotiated timeout 10000 for client /140.211.11.196:49263
> [junit4:junit4]   2> 133 T2409 oaz.ClientCnxn$SendThread.readConnectResult Session establishment complete on server localhost/127.0.0.1:49261, sessionid = 0x139d2148c5f0001, negotiated timeout = 10000
> [junit4:junit4]   2> 133 T2410 oascc.ConnectionManager.process Watcher org.apache.solr.common.cloud.ConnectionManager@4ad6979e name:ZooKeeperConnection Watcher:127.0.0.1:49261/solr got event WatchedEvent state:SyncConnected type:None path:null path:null type:None
> [junit4:junit4]   2> 133 T2401 oascc.ConnectionManager.waitForConnected Client is connected to ZooKeeper
> [junit4:junit4]   2> 133 T2401 oascc.SolrZkClient.makePath makePath: /collections/collection1
> [junit4:junit4]   2> 141 T2401 oascc.SolrZkClient.makePath makePath: /collections/collection1/shards
> [junit4:junit4]   2> 148 T2401 oascc.SolrZkClient.makePath makePath: /collections/control_collection
> [junit4:junit4]   2> 150 T2401 oascc.SolrZkClient.makePath makePath: /collections/control_collection/shards
> [junit4:junit4]   2> 152 T2401 oasc.AbstractZkTestCase.putConfig put /usr/home/hudson/hudson-slave/workspace/Lucene-Solr-Tests-4.x-Java6/solr/build/solr-core/test-files/solr/collection1/conf/solrconfig.xml to /configs/conf1/solrconfig.xml
> [junit4:junit4]   2> 153 T2401 oascc.SolrZkClient.makePath makePath: /configs/conf1/solrconfig.xml
> [junit4:junit4]   2> 170 T2401 oasc.AbstractZkTestCase.putConfig put /usr/home/hudson/hudson-slave/workspace/Lucene-Solr-Tests-4.x-Java6/solr/build/solr-core/test-files/solr/collection1/conf/schema.xml to /configs/conf1/schema.xml
> [junit4:junit4]   2> 171 T2401 oascc.SolrZkClient.makePath makePath: /configs/conf1/schema.xml
> [junit4:junit4]   2> 274 T2401 oasc.AbstractZkTestCase.putConfig put /usr/home/hudson/hudson-slave/workspace/Lucene-Solr-Tests-4.x-Java6/solr/build/solr-core/test-files/solr/collection1/conf/solrconfig.xml to /configs/conf1/solrconfig.xml
> [junit4:junit4]   2> 275 T2401 oascc.SolrZkClient.makePath makePath: /configs/conf1/solrconfig.xml
> [junit4:junit4]   2> 277 T2401 oasc.AbstractZkTestCase.putConfig put /usr/home/hudson/hudson-slave/workspace/Lucene-Solr-Tests-4.x-Java6/solr/build/solr-core/test-files/solr/collection1/conf/stopwords.txt to /configs/conf1/stopwords.txt
> [junit4:junit4]   2> 277 T2401 oascc.SolrZkClient.makePath makePath: /configs/conf1/stopwords.txt
> [junit4:junit4]   2> 288 T2401 oasc.AbstractZkTestCase.putConfig put /usr/home/hudson/hudson-slave/workspace/Lucene-Solr-Tests-4.x-Java6/solr/build/solr-core/test-files/solr/collection1/conf/protwords.txt to /configs/conf1/protwords.txt
> [junit4:junit4]   2> 289 T2401 oascc.SolrZkClient.makePath makePath: /configs/conf1/protwords.txt
> [junit4:junit4]   2> 291 T2401 oasc.AbstractZkTestCase.putConfig put /usr/home/hudson/hudson-slave/workspace/Lucene-Solr-Tests-4.x-Java6/solr/build/solr-core/test-files/solr/collection1/conf/currency.xml to /configs/conf1/currency.xml
> [junit4:junit4]   2> 291 T2401 oascc.SolrZkClient.makePath makePath: /configs/conf1/currency.xml
> [junit4:junit4]   2> 293 T2401 oasc.AbstractZkTestCase.putConfig put /usr/home/hudson/hudson-slave/workspace/Lucene-Solr-Tests-4.x-Java6/solr/build/solr-core/test-files/solr/collection1/conf/open-exchange-rates.json to /configs/conf1/open-exchange-rates.json
> [junit4:junit4]   2> 294 T2401 oascc.SolrZkClient.makePath makePath: /configs/conf1/open-exchange-rates.json
> [junit4:junit4]   2> 301 T2401 oasc.AbstractZkTestCase.putConfig put /usr/home/hudson/hudson-slave/workspace/Lucene-Solr-Tests-4.x-Java6/solr/build/solr-core/test-files/solr/collection1/conf/mapping-ISOLatin1Accent.txt to /configs/conf1/mapping-ISOLatin1Accent.txt
> [junit4:junit4]   2> 301 T2401 oascc.SolrZkClient.makePath makePath: /configs/conf1/mapping-ISOLatin1Accent.txt
> [junit4:junit4]   2> 303 T2401 oasc.AbstractZkTestCase.putConfig put /usr/home/hudson/hudson-slave/workspace/Lucene-Solr-Tests-4.x-Java6/solr/build/solr-core/test-files/solr/collection1/conf/old_synonyms.txt to /configs/conf1/old_synonyms.txt
> [junit4:junit4]   2> 304 T2401 oascc.SolrZkClient.makePath makePath: /configs/conf1/old_synonyms.txt
> [junit4:junit4]   2> 306 T2401 oasc.AbstractZkTestCase.putConfig put /usr/home/hudson/hudson-slave/workspace/Lucene-Solr-Tests-4.x-Java6/solr/build/solr-core/test-files/solr/collection1/conf/synonyms.txt to /configs/conf1/synonyms.txt
> [junit4:junit4]   2> 306 T2401 oascc.SolrZkClient.makePath makePath: /configs/conf1/synonyms.txt
> [junit4:junit4]   2> 313 T2406 oazs.PrepRequestProcessor.pRequest Processed session termination for sessionid: 0x139d2148c5f0001
> [junit4:junit4]   2> 314 T2410 oaz.ClientCnxn$EventThread.run EventThread shut down
> [junit4:junit4]   2> 314 T2403 oazs.NIOServerCnxn.closeSock Closed socket connection for client /140.211.11.196:49263 which had sessionid 0x139d2148c5f0001
> [junit4:junit4]   2> 314 T2401 oaz.ZooKeeper.close Session: 0x139d2148c5f0001 closed
> [junit4:junit4]   2> 316 T2401 oejs.Server.doStart jetty-8.1.2.v20120308
> [junit4:junit4]   2> 320 T2401 oejs.AbstractConnector.doStart Started SocketConnector@0.0.0.0:49264
> [junit4:junit4]   2> 320 T2401 oasc.SolrResourceLoader.locateSolrHome JNDI not configured for solr (NoInitialContextEx)
> [junit4:junit4]   2> 321 T2401 oasc.SolrResourceLoader.locateSolrHome using system property solr.solr.home: /usr/home/hudson/hudson-slave/workspace/Lucene-Solr-Tests-4.x-Java6/solr/build/solr-core/test-files/solr
> [junit4:junit4]   2> 321 T2401 oasc.SolrResourceLoader.<init> new SolrResourceLoader for deduced Solr Home: '/usr/home/hudson/hudson-slave/workspace/Lucene-Solr-Tests-4.x-Java6/solr/build/solr-core/test-files/solr/'
> [junit4:junit4]   2> 344 T2401 oass.SolrDispatchFilter.init SolrDispatchFilter.init()
> [junit4:junit4]   2> 344 T2401 oasc.SolrResourceLoader.locateSolrHome JNDI not configured for solr (NoInitialContextEx)
> [junit4:junit4]   2> 345 T2401 oasc.SolrResourceLoader.locateSolrHome using system property solr.solr.home: /usr/home/hudson/hudson-slave/workspace/Lucene-Solr-Tests-4.x-Java6/solr/build/solr-core/test-files/solr
> [junit4:junit4]   2> 345 T2401 oasc.CoreContainer$Initializer.initialize looking for solr.xml: /usr/home/hudson/hudson-slave/workspace/Lucene-Solr-Tests-4.x-Java6/solr/build/solr-core/test-files/solr/solr.xml
> [junit4:junit4]   2> 345 T2401 oasc.CoreContainer.<init> New CoreContainer 415813317
> [junit4:junit4]   2> 346 T2401 oasc.CoreContainer.load Loading CoreContainer using Solr Home: '/usr/home/hudson/hudson-slave/workspace/Lucene-Solr-Tests-4.x-Java6/solr/build/solr-core/test-files/solr/'
> [junit4:junit4]   2> 346 T2401 oasc.SolrResourceLoader.<init> new SolrResourceLoader for directory: '/usr/home/hudson/hudson-slave/workspace/Lucene-Solr-Tests-4.x-Java6/solr/build/solr-core/test-files/solr/'
> [junit4:junit4]   2> 368 T2401 oasc.CoreContainer.load Registering Log Listener
> [junit4:junit4]   2> 378 T2401 oasc.CoreContainer.initZooKeeper Zookeeper client=127.0.0.1:49261/solr
> [junit4:junit4]   2> 379 T2401 oaz.ZooKeeper.<init> Initiating client connection, connectString=127.0.0.1:49261/solr sessionTimeout=5000 watcher=org.apache.solr.common.cloud.ConnectionManager@2cc22333
> [junit4:junit4]   2> 380 T2420 oaz.ClientCnxn$SendThread.startConnect Opening socket connection to server /127.0.0.1:49261
> [junit4:junit4]   2> 380 T2401 oascc.ConnectionManager.waitForConnected Waiting for client to connect to ZooKeeper
> [junit4:junit4]   2> 381 T2420 oaz.ClientCnxn$SendThread.primeConnection Socket connection established to localhost/127.0.0.1:49261, initiating session
> [junit4:junit4]   2> 381 T2403 oazs.NIOServerCnxn$Factory.run Accepted socket connection from /140.211.11.196:49265
> [junit4:junit4]   2> 381 T2403 oazs.NIOServerCnxn.readConnectRequest Client attempting to establish new session at /140.211.11.196:49265
> [junit4:junit4]   2> 383 T2405 oazs.NIOServerCnxn.finishSessionInit Established session 0x139d2148c5f0002 with negotiated timeout 5000 for client /140.211.11.196:49265
> [junit4:junit4]   2> 384 T2420 oaz.ClientCnxn$SendThread.readConnectResult Session establishment complete on server localhost/127.0.0.1:49261, sessionid = 0x139d2148c5f0002, negotiated timeout = 5000
> [junit4:junit4]   2> 384 T2421 oascc.ConnectionManager.process Watcher org.apache.solr.common.cloud.ConnectionManager@2cc22333 name:ZooKeeperConnection Watcher:127.0.0.1:49261/solr got event WatchedEvent state:SyncConnected type:None path:null path:null type:None
> [junit4:junit4]   2> 384 T2401 oascc.ConnectionManager.waitForConnected Client is connected to ZooKeeper
> [junit4:junit4]   2> 386 T2406 oazs.PrepRequestProcessor.pRequest Got user-level KeeperException when processing sessionid:0x139d2148c5f0002 type:create cxid:0x2 zxid:0xfffffffffffffffe txntype:unknown reqpath:n/a Error Path:/solr/overseer Error:KeeperErrorCode = NodeExists for /solr/overseer
> [junit4:junit4]   2> 393 T2401 oascc.SolrZkClient.makePath makePath: /live_nodes
> [junit4:junit4]   2> 395 T2401 oasc.ZkController.createEphemeralLiveNode Register node as live in ZooKeeper:/live_nodes/127.0.0.1:49264_solr
> [junit4:junit4]   2> 395 T2406 oazs.PrepRequestProcessor.pRequest Got user-level KeeperException when processing sessionid:0x139d2148c5f0002 type:delete cxid:0x7 zxid:0xfffffffffffffffe txntype:unknown reqpath:n/a Error Path:/solr/live_nodes/127.0.0.1:49264_solr Error:KeeperErrorCode = NoNode for /solr/live_nodes/127.0.0.1:49264_solr
> [junit4:junit4]   2> 401 T2401 oascc.SolrZkClient.makePath makePath: /live_nodes/127.0.0.1:49264_solr
> [junit4:junit4]   2> 403 T2401 oashc.HttpShardHandlerFactory.getParameter Setting socketTimeout to: 0
> [junit4:junit4]   2> 403 T2401 oashc.HttpShardHandlerFactory.getParameter Setting urlScheme to: http://
> [junit4:junit4]   2> 403 T2401 oashc.HttpShardHandlerFactory.getParameter Setting connTimeout to: 0
> [junit4:junit4]   2> 404 T2401 oashc.HttpShardHandlerFactory.getParameter Setting maxConnectionsPerHost to: 20
> [junit4:junit4]   2> 404 T2401 oashc.HttpShardHandlerFactory.getParameter Setting corePoolSize to: 0
> [junit4:junit4]   2> 404 T2401 oashc.HttpShardHandlerFactory.getParameter Setting maximumPoolSize to: 2147483647
> [junit4:junit4]   2> 405 T2401 oashc.HttpShardHandlerFactory.getParameter Setting maxThreadIdleTime to: 5
> [junit4:junit4]   2> 405 T2401 oashc.HttpShardHandlerFactory.getParameter Setting sizeOfQueue to: -1
> [junit4:junit4]   2> 405 T2401 oashc.HttpShardHandlerFactory.getParameter Setting fairnessPolicy to: false
> [junit4:junit4]   2> 406 T2401 oascsi.HttpClientUtil.createClient Creating new http client, config:maxConnectionsPerHost=20&maxConnections=10000&socketTimeout=0&connTimeout=0&retry=false
> [junit4:junit4]   2> 415 T2401 oascc.SolrZkClient.makePath makePath: /overseer_elect/election
> [junit4:junit4]   2> 419 T2406 oazs.PrepRequestProcessor.pRequest Got user-level KeeperException when processing sessionid:0x139d2148c5f0002 type:delete cxid:0x15 zxid:0xfffffffffffffffe txntype:unknown reqpath:n/a Error Path:/solr/overseer_elect/leader Error:KeeperErrorCode = NoNode for /solr/overseer_elect/leader
> [junit4:junit4]   2> 432 T2401 oascc.SolrZkClient.makePath makePath: /overseer_elect/leader
> [junit4:junit4]   2> 433 T2401 oasc.Overseer.start Overseer (id=88332653406650370-127.0.0.1:49264_solr-n_0000000000) starting
> [junit4:junit4]   2> 434 T2406 oazs.PrepRequestProcessor.pRequest Got user-level KeeperException when processing sessionid:0x139d2148c5f0002 type:create cxid:0x1a zxid:0xfffffffffffffffe txntype:unknown reqpath:n/a Error Path:/solr/overseer Error:KeeperErrorCode = NodeExists for /solr/overseer
> [junit4:junit4]   2> 435 T2406 oazs.PrepRequestProcessor.pRequest Got user-level KeeperException when processing sessionid:0x139d2148c5f0002 type:create cxid:0x1b zxid:0xfffffffffffffffe txntype:unknown reqpath:n/a Error Path:/solr/overseer Error:KeeperErrorCode = NodeExists for /solr/overseer
> [junit4:junit4]   2> 444 T2406 oazs.PrepRequestProcessor.pRequest Got user-level KeeperException when processing sessionid:0x139d2148c5f0002 type:create cxid:0x1c zxid:0xfffffffffffffffe txntype:unknown reqpath:n/a Error Path:/solr/overseer Error:KeeperErrorCode = NodeExists for /solr/overseer
> [junit4:junit4]   2> 445 T2406 oazs.PrepRequestProcessor.pRequest Got user-level KeeperException when processing sessionid:0x139d2148c5f0002 type:create cxid:0x1d zxid:0xfffffffffffffffe txntype:unknown reqpath:n/a Error Path:/solr/overseer Error:KeeperErrorCode = NodeExists for /solr/overseer
> [junit4:junit4]   2> 446 T2423 oasc.OverseerCollectionProcessor.run Process current queue of collection creations
> [junit4:junit4]   2> 446 T2401 oascc.SolrZkClient.makePath makePath: /clusterstate.json
> [junit4:junit4]   2> 455 T2401 oascc.ZkStateReader.createClusterStateWatchersAndUpdate Updating cluster state from ZooKeeper... 
> [junit4:junit4]   2> 456 T2422 oasc.Overseer$ClusterStateUpdater.run Starting to work on the main queue
> [junit4:junit4]   2> 460 T2401 oasc.CoreContainer.create Creating SolrCore 'collection1' using instanceDir: /usr/home/hudson/hudson-slave/workspace/Lucene-Solr-Tests-4.x-Java6/solr/build/solr-core/test-files/solr/collection1
> [junit4:junit4]   2> 460 T2401 oasc.ZkController.createCollectionZkNode Check for collection zkNode:control_collection
> [junit4:junit4]   2> 461 T2401 oasc.ZkController.createCollectionZkNode Collection zkNode exists
> [junit4:junit4]   2> 461 T2401 oasc.ZkController.readConfigName Load collection config from:/collections/control_collection
> [junit4:junit4]   2> 462 T2401 oasc.SolrResourceLoader.<init> new SolrResourceLoader for directory: '/usr/home/hudson/hudson-slave/workspace/Lucene-Solr-Tests-4.x-Java6/solr/build/solr-core/test-files/solr/collection1/'
> [junit4:junit4]   2> 463 T2401 oasc.SolrResourceLoader.replaceClassLoader Adding 'file:/usr/home/hudson/hudson-slave/workspace/Lucene-Solr-Tests-4.x-Java6/solr/build/solr-core/test-files/solr/collection1/lib/README' to classloader
> [junit4:junit4]   2> 464 T2401 oasc.SolrResourceLoader.replaceClassLoader Adding 'file:/usr/home/hudson/hudson-slave/workspace/Lucene-Solr-Tests-4.x-Java6/solr/build/solr-core/test-files/solr/collection1/lib/classes/' to classloader
> [junit4:junit4]   2> 498 T2401 oasc.SolrConfig.<init> Using Lucene MatchVersion: LUCENE_40
> [junit4:junit4]   2> 546 T2401 oasc.SolrConfig.<init> Loaded SolrConfig: solrconfig.xml
> [junit4:junit4]   2> 647 T2401 oass.IndexSchema.readSchema Reading Solr Schema
> [junit4:junit4]   2> 653 T2401 oass.IndexSchema.readSchema Schema name=test
> [junit4:junit4]   2> 1071 T2401 oass.OpenExchangeRatesOrgProvider.init Initialized with rates=open-exchange-rates.json, refreshInterval=1440.
> [junit4:junit4]   2> 1079 T2401 oass.IndexSchema.readSchema default search field in schema is text
> [junit4:junit4]   2> 1082 T2401 oass.IndexSchema.readSchema unique key field: id
> [junit4:junit4]   2> 1090 T2401 oass.FileExchangeRateProvider.reload Reloading exchange rates from file currency.xml
> [junit4:junit4]   2> 1094 T2401 oass.FileExchangeRateProvider.reload Reloading exchange rates from file currency.xml
> [junit4:junit4]   2> 1097 T2401 oass.OpenExchangeRatesOrgProvider.reload Reloading exchange rates from open-exchange-rates.json
> [junit4:junit4]   2> 1097 T2401 oass.OpenExchangeRatesOrgProvider.reload Reloading exchange rates from open-exchange-rates.json
> [junit4:junit4]   2> 1098 T2401 oasc.SolrCore.<init> [collection1] Opening new SolrCore at /usr/home/hudson/hudson-slave/workspace/Lucene-Solr-Tests-4.x-Java6/solr/build/solr-core/test-files/solr/collection1/, dataDir=./org.apache.solr.cloud.BasicDistributedZk2Test-1347849325656/control/data/
> [junit4:junit4]   2> 1099 T2401 oasc.JmxMonitoredMap.<init> JMX monitoring is enabled. Adding Solr mbeans to JMX Server: com.sun.jmx.mbeanserver.JmxMBeanServer@35ecfe07
> [junit4:junit4]   2> 1099 T2401 oasc.SolrCore.getNewIndexDir WARNING New index directory detected: old=null new=./org.apache.solr.cloud.BasicDistributedZk2Test-1347849325656/control/data/index/
> [junit4:junit4]   2> 1100 T2401 oasc.SolrCore.initIndex WARNING [collection1] Solr index directory './org.apache.solr.cloud.BasicDistributedZk2Test-1347849325656/control/data/index' doesn't exist. Creating new index...
> [junit4:junit4]   2> 1101 T2401 oasc.CachingDirectoryFactory.get return new directory for /usr/home/hudson/hudson-slave/workspace/Lucene-Solr-Tests-4.x-Java6/solr/build/solr-core/test/J1/./org.apache.solr.cloud.BasicDistributedZk2Test-1347849325656/control/data/index forceNew:false
> [junit4:junit4]   2> 1131 T2401 oasc.SolrDeletionPolicy.onCommit SolrDeletionPolicy.onCommit: commits:num=1
> [junit4:junit4]   2>        commit{dir=NRTCachingDirectory(org.apache.lucene.store.NIOFSDirectory@/usr/home/hudson/hudson-slave/workspace/Lucene-Solr-Tests-4.x-Java6/solr/build/solr-core/test/J1/org.apache.solr.cloud.BasicDistributedZk2Test-1347849325656/control/data/index lockFactory=org.apache.lucene.store.NativeFSLockFactory@6c16417a; maxCacheMB=48.0 maxMergeSizeMB=4.0),segFN=segments_1,generation=1,filenames=[segments_1]
> [junit4:junit4]   2> 1131 T2401 oasc.SolrDeletionPolicy.updateCommits newest commit = 1
> [junit4:junit4]   2> 1132 T2401 oasc.SolrCore.initWriters created xml: solr.XMLResponseWriter
> [junit4:junit4]   2> 1133 T2401 oasup.UpdateRequestProcessorChain.init inserting DistributedUpdateProcessorFactory into updateRequestProcessorChain "dedupe"
> [junit4:junit4]   2> 1134 T2401 oasup.UpdateRequestProcessorChain.init inserting DistributedUpdateProcessorFactory into updateRequestProcessorChain "dedupe-allfields"
> [junit4:junit4]   2> 1134 T2401 oasup.UpdateRequestProcessorChain.init inserting DistributedUpdateProcessorFactory into updateRequestProcessorChain "stored_sig"
> [junit4:junit4]   2> 1135 T2401 oasup.UpdateRequestProcessorChain.init inserting DistributedUpdateProcessorFactory into updateRequestProcessorChain "uniq-fields"
> [junit4:junit4]   2> 1135 T2401 oasup.UpdateRequestProcessorChain.init inserting DistributedUpdateProcessorFactory into updateRequestProcessorChain "distrib-dup-test-chain-implicit"
> [junit4:junit4]   2> 1136 T2401 oasc.RequestHandlers.initHandlersFromConfig adding lazy requestHandler: solr.ReplicationHandler
> [junit4:junit4]   2> 1136 T2401 oasc.RequestHandlers.initHandlersFromConfig created /replication: solr.ReplicationHandler
> [junit4:junit4]   2> 1136 T2401 oasc.RequestHandlers.initHandlersFromConfig created standard: solr.StandardRequestHandler
> [junit4:junit4]   2> 1137 T2401 oasc.RequestHandlers.initHandlersFromConfig created /get: solr.RealTimeGetHandler
> [junit4:junit4]   2> 1137 T2401 oasc.RequestHandlers.initHandlersFromConfig created dismax: solr.SearchHandler
> [junit4:junit4]   2> 1138 T2401 oasc.RequestHandlers.initHandlersFromConfig created mock: org.apache.solr.core.MockQuerySenderListenerReqHandler
> [junit4:junit4]   2> 1138 T2401 oasc.RequestHandlers.initHandlersFromConfig created /admin/: org.apache.solr.handler.admin.AdminHandlers
> [junit4:junit4]   2> 1139 T2401 oasc.RequestHandlers.initHandlersFromConfig created defaults: solr.StandardRequestHandler
> [junit4:junit4]   2> 1139 T2401 oasc.RequestHandlers.initHandlersFromConfig adding lazy requestHandler: solr.StandardRequestHandler
> [junit4:junit4]   2> 1139 T2401 oasc.RequestHandlers.initHandlersFromConfig created lazy: solr.StandardRequestHandler
> [junit4:junit4]   2> 1140 T2401 oasc.RequestHandlers.initHandlersFromConfig created /update: solr.UpdateRequestHandler
> [junit4:junit4]   2> 1140 T2401 oasc.RequestHandlers.initHandlersFromConfig created /terms: org.apache.solr.handler.component.SearchHandler
> [junit4:junit4]   2> 1140 T2401 oasc.RequestHandlers.initHandlersFromConfig created spellCheckCompRH: org.apache.solr.handler.component.SearchHandler
> [junit4:junit4]   2> 1141 T2401 oasc.RequestHandlers.initHandlersFromConfig created spellCheckCompRH_Direct: org.apache.solr.handler.component.SearchHandler
> [junit4:junit4]   2> 1141 T2401 oasc.RequestHandlers.initHandlersFromConfig created spellCheckWithWordbreak: org.apache.solr.handler.component.SearchHandler
> [junit4:junit4]   2> 1142 T2401 oasc.RequestHandlers.initHandlersFromConfig created spellCheckWithWordbreak_Direct: org.apache.solr.handler.component.SearchHandler
> [junit4:junit4]   2> 1142 T2401 oasc.RequestHandlers.initHandlersFromConfig created spellCheckCompRH1: org.apache.solr.handler.component.SearchHandler
> [junit4:junit4]   2> 1143 T2401 oasc.RequestHandlers.initHandlersFromConfig created tvrh: org.apache.solr.handler.component.SearchHandler
> [junit4:junit4]   2> 1143 T2401 oasc.RequestHandlers.initHandlersFromConfig created /mlt: solr.MoreLikeThisHandler
> [junit4:junit4]   2> 1143 T2401 oasc.RequestHandlers.initHandlersFromConfig created /debug/dump: solr.DumpRequestHandler
> [junit4:junit4]   2> 1146 T2401 oashl.XMLLoader.init xsltCacheLifetimeSeconds=60
> [junit4:junit4]   2> 1149 T2401 oasc.SolrCore.initDeprecatedSupport WARNING solrconfig.xml uses deprecated <admin/gettableFiles>, Please update your config to use the ShowFileRequestHandler.
> [junit4:junit4]   2> 1150 T2401 oasc.SolrCore.initDeprecatedSupport WARNING adding ShowFileRequestHandler with hidden files: [SCHEMA.XML, OLD_SYNONYMS.TXT, STOPWORDS.TXT, PROTWORDS.TXT, OPEN-EXCHANGE-RATES.JSON, SYNONYMS.TXT, CURRENCY.XML, MAPPING-ISOLATIN1ACCENT.TXT]
> [junit4:junit4]   2> 1153 T2401 oass.SolrIndexSearcher.<init> Opening Searcher@6ffdefd2 main
> [junit4:junit4]   2> 1154 T2401 oasu.CommitTracker.<init> Hard AutoCommit: disabled
> [junit4:junit4]   2> 1154 T2401 oasu.CommitTracker.<init> Soft AutoCommit: disabled
> [junit4:junit4]   2> 1155 T2401 oashc.SpellCheckComponent.inform Initializing spell checkers
> [junit4:junit4]   2> 1169 T2401 oass.DirectSolrSpellChecker.init init: {name=direct,classname=DirectSolrSpellChecker,field=lowerfilt,minQueryLength=3}
> [junit4:junit4]   2> 1217 T2424 oasc.SolrCore.registerSearcher [collection1] Registered new searcher Searcher@6ffdefd2 main{StandardDirectoryReader(segments_1:1)}
> [junit4:junit4]   2> 1220 T2406 oazs.PrepRequestProcessor.pRequest Got user-level KeeperException when processing sessionid:0x139d2148c5f0002 type:create cxid:0x53 zxid:0xfffffffffffffffe txntype:unknown reqpath:n/a Error Path:/solr/overseer/queue Error:KeeperErrorCode = NoNode for /solr/overseer/queue
> [junit4:junit4]   2> 1231 T2401 oasc.CoreContainer.register registering core: collection1
> [junit4:junit4]   2> 1232 T2401 oasc.ZkController.register Register shard - core:collection1 address:http://127.0.0.1:49264/solr shardId:control_shard
> [junit4:junit4]   2> 1232 T2401 oascc.SolrZkClient.makePath makePath: /collections/control_collection/leader_elect/control_shard/election
> [junit4:junit4]   2> 1249 T2406 oazs.PrepRequestProcessor.pRequest Got user-level KeeperException when processing sessionid:0x139d2148c5f0002 type:delete cxid:0x62 zxid:0xfffffffffffffffe txntype:unknown reqpath:n/a Error Path:/solr/collections/control_collection/leaders Error:KeeperErrorCode = NoNode for /solr/collections/control_collection/leaders
> [junit4:junit4]   2> 1249 T2401 oasc.ShardLeaderElectionContext.runLeaderProcess Running the leader process.
> [junit4:junit4]   2> 1250 T2406 oazs.PrepRequestProcessor.pRequest Got user-level KeeperException when processing sessionid:0x139d2148c5f0002 type:create cxid:0x63 zxid:0xfffffffffffffffe txntype:unknown reqpath:n/a Error Path:/solr/overseer Error:KeeperErrorCode = NodeExists for /solr/overseer
> [junit4:junit4]   2> 1460 T2422 oascc.ZkStateReader.updateClusterState Updating cloud state from ZooKeeper... 
> [junit4:junit4]   2> 1460 T2406 oazs.PrepRequestProcessor.pRequest Got user-level KeeperException when processing sessionid:0x139d2148c5f0002 type:create cxid:0x6a zxid:0xfffffffffffffffe txntype:unknown reqpath:n/a Error Path:/solr/overseer/queue-work Error:KeeperErrorCode = NoNode for /solr/overseer/queue-work
> [junit4:junit4]   2> 1476 T2421 oascc.ZkStateReader$2.process A cluster state change has occurred - updating...
> [junit4:junit4]   2> 1758 T2401 oasc.ShardLeaderElectionContext.waitForReplicasToComeUp Enough replicas found to continue.
> [junit4:junit4]   2> 1759 T2401 oasc.ShardLeaderElectionContext.runLeaderProcess I may be the new leader - try and sync
> [junit4:junit4]   2> 1759 T2401 oasc.SyncStrategy.sync Sync replicas to http://127.0.0.1:49264/solr/collection1/
> [junit4:junit4]   2> 1760 T2401 oasc.SyncStrategy.syncReplicas Sync Success - now sync replicas to me
> [junit4:junit4]   2> 1760 T2401 oasc.SyncStrategy.syncToMe http://127.0.0.1:49264/solr/collection1/ has no replicas
> [junit4:junit4]   2> 1761 T2401 oasc.ShardLeaderElectionContext.runLeaderProcess I am the new leader: http://127.0.0.1:49264/solr/collection1/
> [junit4:junit4]   2> 1761 T2401 oascc.SolrZkClient.makePath makePath: /collections/control_collection/leaders/control_shard
> [junit4:junit4]   2> 1776 T2406 oazs.PrepRequestProcessor.pRequest Got user-level KeeperException when processing sessionid:0x139d2148c5f0002 type:create cxid:0x88 zxid:0xfffffffffffffffe txntype:unknown reqpath:n/a Error Path:/solr/overseer Error:KeeperErrorCode = NodeExists for /solr/overseer
> [junit4:junit4]   2> 1980 T2422 oascc.ZkStateReader.updateClusterState Updating cloud state from ZooKeeper... 
> [junit4:junit4]   2> 1994 T2421 oascc.ZkStateReader$2.process A cluster state change has occurred - updating...
> [junit4:junit4]   2> 2034 T2401 oasc.ZkController.register We are http://127.0.0.1:49264/solr/collection1/ and leader is http://127.0.0.1:49264/solr/collection1/
> [junit4:junit4]   2> 2034 T2401 oasc.ZkController.register No LogReplay needed for core=collection1 baseURL=http://127.0.0.1:49264/solr
> [junit4:junit4]   2> 2035 T2401 oasc.ZkController.checkRecovery I am the leader, no recovery necessary
> [junit4:junit4]   2> 2037 T2401 oascc.ZkStateReader.updateClusterState Updating cloud state from ZooKeeper... 
> [junit4:junit4]   2> 2038 T2401 oass.SolrDispatchFilter.init user.dir=/usr/home/hudson/hudson-slave/workspace/Lucene-Solr-Tests-4.x-Java6/solr/build/solr-core/test/J1
> [junit4:junit4]   2> 2038 T2401 oass.SolrDispatchFilter.init SolrDispatchFilter.init() done
> [junit4:junit4]   2> 2039 T2401 oascsi.HttpClientUtil.createClient Creating new http client, config:maxConnections=128&maxConnectionsPerHost=32&followRedirects=false
> [junit4:junit4]   2> 2497 T2422 oascc.ZkStateReader.updateClusterState Updating cloud state from ZooKeeper... 
> [junit4:junit4]   2> 2504 T2401 oejs.Server.doStart jetty-8.1.2.v20120308
> [junit4:junit4]   2> 2507 T2401 oejs.AbstractConnector.doStart Started SocketConnector@0.0.0.0:49269
> [junit4:junit4]   2> 2508 T2401 oasc.SolrResourceLoader.locateSolrHome JNDI not configured for solr (NoInitialContextEx)
> [junit4:junit4]   2> 2509 T2401 oasc.SolrResourceLoader.locateSolrHome using system property solr.solr.home: /usr/home/hudson/hudson-slave/workspace/Lucene-Solr-Tests-4.x-Java6/solr/build/solr-core/test/J1/./solrtest-jetty1-1347849327705
> [junit4:junit4]   2> 2509 T2401 oasc.SolrResourceLoader.<init> new SolrResourceLoader for deduced Solr Home: '/usr/home/hudson/hudson-slave/workspace/Lucene-Solr-Tests-4.x-Java6/solr/build/solr-core/test/J1/./solrtest-jetty1-1347849327705/'
> [junit4:junit4]   2> 2519 T2421 oascc.ZkStateReader$2.process A cluster state change has occurred - updating...
> [junit4:junit4]   2> 2542 T2401 oass.SolrDispatchFilter.init SolrDispatchFilter.init()
> [junit4:junit4]   2> 2542 T2401 oasc.SolrResourceLoader.locateSolrHome JNDI not configured for solr (NoInitialContextEx)
> [junit4:junit4]   2> 2543 T2401 oasc.SolrResourceLoader.locateSolrHome using system property solr.solr.home: /usr/home/hudson/hudson-slave/workspace/Lucene-Solr-Tests-4.x-Java6/solr/build/solr-core/test/J1/./solrtest-jetty1-1347849327705
> [junit4:junit4]   2> 2543 T2401 oasc.CoreContainer$Initializer.initialize looking for solr.xml: /usr/home/hudson/hudson-slave/workspace/Lucene-Solr-Tests-4.x-Java6/solr/build/solr-core/test/J1/./solrtest-jetty1-1347849327705/solr.xml
> [junit4:junit4]   2> 2544 T2401 oasc.CoreContainer.<init> New CoreContainer 643285165
> [junit4:junit4]   2> 2544 T2401 oasc.CoreContainer.load Loading CoreContainer using Solr Home: '/usr/home/hudson/hudson-slave/workspace/Lucene-Solr-Tests-4.x-Java6/solr/build/solr-core/test/J1/./solrtest-jetty1-1347849327705/'
> [junit4:junit4]   2> 2545 T2401 oasc.SolrResourceLoader.<init> new SolrResourceLoader for directory: '/usr/home/hudson/hudson-slave/workspace/Lucene-Solr-Tests-4.x-Java6/solr/build/solr-core/test/J1/./solrtest-jetty1-1347849327705/'
> [junit4:junit4]   2> 2568 T2401 oasc.CoreContainer.load Registering Log Listener
> [junit4:junit4]   2> 2582 T2401 oasc.CoreContainer.initZooKeeper Zookeeper client=127.0.0.1:49261/solr
> [junit4:junit4]   2> 2583 T2401 oaz.ZooKeeper.<init> Initiating client connection, connectString=127.0.0.1:49261/solr sessionTimeout=5000 watcher=org.apache.solr.common.cloud.ConnectionManager@5fecb950
> [junit4:junit4]   2> 2584 T2434 oaz.ClientCnxn$SendThread.startConnect Opening socket connection to server /127.0.0.1:49261
> [junit4:junit4]   2> 2584 T2401 oascc.ConnectionManager.waitForConnected Waiting for client to connect to ZooKeeper
> [junit4:junit4]   2> 2584 T2434 oaz.ClientCnxn$SendThread.primeConnection Socket connection established to localhost/127.0.0.1:49261, initiating session
> [junit4:junit4]   2> 2585 T2403 oazs.NIOServerCnxn$Factory.run Accepted socket connection from /140.211.11.196:49270
> [junit4:junit4]   2> 2585 T2403 oazs.NIOServerCnxn.readConnectRequest Client attempting to establish new session at /140.211.11.196:49270
> [junit4:junit4]   2> 2586 T2405 oazs.NIOServerCnxn.finishSessionInit Established session 0x139d2148c5f0003 with negotiated timeout 5000 for client /140.211.11.196:49270
> [junit4:junit4]   2> 2586 T2434 oaz.ClientCnxn$SendThread.readConnectResult Session establishment complete on server localhost/127.0.0.1:49261, sessionid = 0x139d2148c5f0003, negotiated timeout = 5000
> [junit4:junit4]   2> 2587 T2435 oascc.ConnectionManager.process Watcher org.apache.solr.common.cloud.ConnectionManager@5fecb950 name:ZooKeeperConnection Watcher:127.0.0.1:49261/solr got event WatchedEvent state:SyncConnected type:None path:null path:null type:None
> [junit4:junit4]   2> 2587 T2401 oascc.ConnectionManager.waitForConnected Client is connected to ZooKeeper
> [junit4:junit4]   2> 2588 T2406 oazs.PrepRequestProcessor.pRequest Got user-level KeeperException when processing sessionid:0x139d2148c5f0003 type:create cxid:0x1 zxid:0xfffffffffffffffe txntype:unknown reqpath:n/a Error Path:/solr/overseer Error:KeeperErrorCode = NodeExists for /solr/overseer
> [junit4:junit4]   2> 2589 T2406 oazs.PrepRequestProcessor.pRequest Got user-level KeeperException when processing sessionid:0x139d2148c5f0003 type:create cxid:0x2 zxid:0xfffffffffffffffe txntype:unknown reqpath:n/a Error Path:/solr/overseer Error:KeeperErrorCode = NodeExists for /solr/overseer
> [junit4:junit4]   2> 2598 T2401 oasc.ZkController.createEphemeralLiveNode Register node as live in ZooKeeper:/live_nodes/127.0.0.1:49269_solr
> [junit4:junit4]   2> 2599 T2406 oazs.PrepRequestProcessor.pRequest Got user-level KeeperException when processing sessionid:0x139d2148c5f0003 type:delete cxid:0x4 zxid:0xfffffffffffffffe txntype:unknown reqpath:n/a Error Path:/solr/live_nodes/127.0.0.1:49269_solr Error:KeeperErrorCode = NoNode for /solr/live_nodes/127.0.0.1:49269_solr
> [junit4:junit4]   2> 2600 T2401 oascc.SolrZkClient.makePath makePath: /live_nodes/127.0.0.1:49269_solr
> [junit4:junit4]   2> 2602 T2421 oascc.ZkStateReader$3.process Updating live nodes
> [junit4:junit4]   2> 2602 T2401 oashc.HttpShardHandlerFactory.getParameter Setting socketTimeout to: 0
> [junit4:junit4]   2> 2603 T2401 oashc.HttpShardHandlerFactory.getParameter Setting urlScheme to: http://
> [junit4:junit4]   2> 2603 T2401 oashc.HttpShardHandlerFactory.getParameter Setting connTimeout to: 0
> [junit4:junit4]   2> 2604 T2401 oashc.HttpShardHandlerFactory.getParameter Setting maxConnectionsPerHost to: 20
> [junit4:junit4]   2> 2604 T2401 oashc.HttpShardHandlerFactory.getParameter Setting corePoolSize to: 0
> [junit4:junit4]   2> 2605 T2401 oashc.HttpShardHandlerFactory.getParameter Setting maximumPoolSize to: 2147483647
> [junit4:junit4]   2> 2605 T2401 oashc.HttpShardHandlerFactory.getParameter Setting maxThreadIdleTime to: 5
> [junit4:junit4]   2> 2605 T2401 oashc.HttpShardHandlerFactory.getParameter Setting sizeOfQueue to: -1
> [junit4:junit4]   2> 2606 T2401 oashc.HttpShardHandlerFactory.getParameter Setting fairnessPolicy to: false
> [junit4:junit4]   2> 2606 T2401 oascsi.HttpClientUtil.createClient Creating new http client, config:maxConnectionsPerHost=20&maxConnections=10000&socketTimeout=0&connTimeout=0&retry=false
> [junit4:junit4]   2> 2621 T2401 oascc.ZkStateReader.createClusterStateWatchersAndUpdate Updating cluster state from ZooKeeper... 
> [junit4:junit4]   2> 2626 T2401 oasc.CoreContainer.create Creating SolrCore 'collection1' using instanceDir: /usr/home/hudson/hudson-slave/workspace/Lucene-Solr-Tests-4.x-Java6/solr/build/solr-core/test/J1/./solrtest-jetty1-1347849327705/collection1
> [junit4:junit4]   2> 2627 T2401 oasc.ZkController.createCollectionZkNode Check for collection zkNode:collection1
> [junit4:junit4]   2> 2627 T2401 oasc.ZkController.createCollectionZkNode Collection zkNode exists
> [junit4:junit4]   2> 2628 T2401 oasc.ZkController.readConfigName Load collection config from:/collections/collection1
> [junit4:junit4]   2> 2629 T2401 oasc.SolrResourceLoader.<init> new SolrResourceLoader for directory: '/usr/home/hudson/hudson-slave/workspace/Lucene-Solr-Tests-4.x-Java6/solr/build/solr-core/test/J1/./solrtest-jetty1-1347849327705/collection1/'
> [junit4:junit4]   2> 2630 T2401 oasc.SolrResourceLoader.replaceClassLoader Adding 'file:/usr/home/hudson/hudson-slave/workspace/Lucene-Solr-Tests-4.x-Java6/solr/build/solr-core/test/J1/solrtest-jetty1-1347849327705/collection1/lib/classes/' to classloader
> [junit4:junit4]   2> 2631 T2401 oasc.SolrResourceLoader.replaceClassLoader Adding 'file:/usr/home/hudson/hudson-slave/workspace/Lucene-Solr-Tests-4.x-Java6/solr/build/solr-core/test/J1/solrtest-jetty1-1347849327705/collection1/lib/README' to classloader
> [junit4:junit4]   2> 2677 T2401 oasc.SolrConfig.<init> Using Lucene MatchVersion: LUCENE_40
> [junit4:junit4]   2> 2743 T2401 oasc.SolrConfig.<init> Loaded SolrConfig: solrconfig.xml
> [junit4:junit4]   2> 2844 T2401 oass.IndexSchema.readSchema Reading Solr Schema
> [junit4:junit4]   2> 2852 T2401 oass.IndexSchema.readSchema Schema name=test
> [junit4:junit4]   2> 3438 T2401 oass.OpenExchangeRatesOrgProvider.init Initialized with rates=open-exchange-rates.json, refreshInterval=1440.
> [junit4:junit4]   2> 3449 T2401 oass.IndexSchema.readSchema default search field in schema is text
> [junit4:junit4]   2> 3454 T2401 oass.IndexSchema.readSchema unique key field: id
> [junit4:junit4]   2> 3465 T2401 oass.FileExchangeRateProvider.reload Reloading exchange rates from file currency.xml
> [junit4:junit4]   2> 3470 T2401 oass.FileExchangeRateProvider.reload Reloading exchange rates from file currency.xml
> [junit4:junit4]   2> 3474 T2401 oass.OpenExchangeRatesOrgProvider.reload Reloading exchange rates from open-exchange-rates.json
> [junit4:junit4]   2> 3475 T2401 oass.OpenExchangeRatesOrgProvider.reload Reloading exchange rates from open-exchange-rates.json
> [junit4:junit4]   2> 3476 T2401 oasc.SolrCore.<init> [collection1] Opening new SolrCore at /usr/home/hudson/hudson-slave/workspace/Lucene-Solr-Tests-4.x-Java6/solr/build/solr-core/test/J1/./solrtest-jetty1-1347849327705/collection1/, dataDir=./org.apache.solr.cloud.BasicDistributedZk2Test-1347849325656/jetty1/
> [junit4:junit4]   2> 3477 T2401 oasc.JmxMonitoredMap.<init> JMX monitoring is enabled. Adding Solr mbeans to JMX Server: com.sun.jmx.mbeanserver.JmxMBeanServer@35ecfe07
> [junit4:junit4]   2> 3478 T2401 oasc.SolrCore.getNewIndexDir WARNING New index directory detected: old=null new=./org.apache.solr.cloud.BasicDistributedZk2Test-1347849325656/jetty1/index/
> [junit4:junit4]   2> 3479 T2401 oasc.SolrCore.initIndex WARNING [collection1] Solr index directory './org.apache.solr.cloud.BasicDistributedZk2Test-1347849325656/jetty1/index' doesn't exist. Creating new index...
> [junit4:junit4]   2> 3480 T2401 oasc.CachingDirectoryFactory.get return new directory for /usr/home/hudson/hudson-slave/workspace/Lucene-Solr-Tests-4.x-Java6/solr/build/solr-core/test/J1/./org.apache.solr.cloud.BasicDistributedZk2Test-1347849325656/jetty1/index forceNew:false
> [junit4:junit4]   2> 3486 T2401 oasc.SolrDeletionPolicy.onCommit SolrDeletionPolicy.onCommit: commits:num=1
> [junit4:junit4]   2>        commit{dir=NRTCachingDirectory(org.apache.lucene.store.NIOFSDirectory@/usr/home/hudson/hudson-slave/workspace/Lucene-Solr-Tests-4.x-Java6/solr/build/solr-core/test/J1/org.apache.solr.cloud.BasicDistributedZk2Test-1347849325656/jetty1/index lockFactory=org.apache.lucene.store.NativeFSLockFactory@4d00a29a; maxCacheMB=48.0 maxMergeSizeMB=4.0),segFN=segments_1,generation=1,filenames=[segments_1]
> [junit4:junit4]   2> 3487 T2401 oasc.SolrDeletionPolicy.updateCommits newest commit = 1
> [junit4:junit4]   2> 3488 T2401 oasc.SolrCore.initWriters created xml: solr.XMLResponseWriter
> [junit4:junit4]   2> 3490 T2401 oasup.UpdateRequestProcessorChain.init inserting DistributedUpdateProcessorFactory into updateRequestProcessorChain "dedupe"
> [junit4:junit4]   2> 3490 T2401 oasup.UpdateRequestProcessorChain.init inserting DistributedUpdateProcessorFactory into updateRequestProcessorChain "dedupe-allfields"
> [junit4:junit4]   2> 3491 T2401 oasup.UpdateRequestProcessorChain.init inserting DistributedUpdateProcessorFactory into updateRequestProcessorChain "stored_sig"
> [junit4:junit4]   2> 3492 T2401 oasup.UpdateRequestProcessorChain.init inserting DistributedUpdateProcessorFactory into updateRequestProcessorChain "uniq-fields"
> [junit4:junit4]   2> 3492 T2401 oasup.UpdateRequestProcessorChain.init inserting DistributedUpdateProcessorFactory into updateRequestProcessorChain "distrib-dup-test-chain-implicit"
> [junit4:junit4]   2> 3493 T2401 oasc.RequestHandlers.initHandlersFromConfig adding lazy requestHandler: solr.ReplicationHandler
> [junit4:junit4]   2> 3493 T2401 oasc.RequestHandlers.initHandlersFromConfig created /replication: solr.ReplicationHandler
> [junit4:junit4]   2> 3494 T2401 oasc.RequestHandlers.initHandlersFromConfig created standard: solr.StandardRequestHandler
> [junit4:junit4]   2> 3495 T2401 oasc.RequestHandlers.initHandlersFromConfig created /get: solr.RealTimeGetHandler
> [junit4:junit4]   2> 3495 T2401 oasc.RequestHandlers.initHandlersFromConfig created dismax: solr.SearchHandler
> [junit4:junit4]   2> 3496 T2401 oasc.RequestHandlers.initHandlersFromConfig created mock: org.apache.solr.core.MockQuerySenderListenerReqHandler
> [junit4:junit4]   2> 3497 T2401 oasc.RequestHandlers.initHandlersFromConfig created /admin/: org.apache.solr.handler.admin.AdminHandlers
> [junit4:junit4]   2> 3497 T2401 oasc.RequestHandlers.initHandlersFromConfig created defaults: solr.StandardRequestHandler
> [junit4:junit4]   2> 3498 T2401 oasc.RequestHandlers.initHandlersFromConfig adding lazy requestHandler: solr.StandardRequestHandler
> [junit4:junit4]   2> 3498 T2401 oasc.RequestHandlers.initHandlersFromConfig created lazy: solr.StandardRequestHandler
> [junit4:junit4]   2> 3499 T2401 oasc.RequestHandlers.initHandlersFromConfig created /update: solr.UpdateRequestHandler
> [junit4:junit4]   2> 3500 T2401 oasc.RequestHandlers.initHandlersFromConfig created /terms: org.apache.solr.handler.component.SearchHandler
> [junit4:junit4]   2> 3500 T2401 oasc.RequestHandlers.initHandlersFromConfig created spellCheckCompRH: org.apache.solr.handler.component.SearchHandler
> [junit4:junit4]   2> 3501 T2401 oasc.RequestHandlers.initHandlersFromConfig created spellCheckCompRH_Direct: org.apache.solr.handler.component.SearchHandler
> [junit4:junit4]   2> 3502 T2401 oasc.RequestHandlers.initHandlersFromConfig created spellCheckWithWordbreak: org.apache.solr.handler.component.SearchHandler
> [junit4:junit4]   2> 3502 T2401 oasc.RequestHandlers.initHandlersFromConfig created spellCheckWithWordbreak_Direct: org.apache.solr.handler.component.SearchHandler
> [junit4:junit4]   2> 3503 T2401 oasc.RequestHandlers.initHandlersFromConfig created spellCheckCompRH1: org.apache.solr.handler.component.SearchHandler
> [junit4:junit4]   2> 3503 T2401 oasc.RequestHandlers.initHandlersFromConfig created tvrh: org.apache.solr.handler.component.SearchHandler
> [junit4:junit4]   2> 3504 T2401 oasc.RequestHandlers.initHandlersFromConfig created /mlt: solr.MoreLikeThisHandler
> [junit4:junit4]   2> 3505 T2401 oasc.RequestHandlers.initHandlersFromConfig created /debug/dump: solr.DumpRequestHandler
> [junit4:junit4]   2> 3508 T2401 oashl.XMLLoader.init xsltCacheLifetimeSeconds=60
> [junit4:junit4]   2> 3513 T2401 oasc.SolrCore.initDeprecatedSupport WARNING solrconfig.xml uses deprecated <admin/gettableFiles>, Please update your config to use the ShowFileRequestHandler.
> [junit4:junit4]   2> 3514 T2401 oasc.SolrCore.initDeprecatedSupport WARNING adding ShowFileRequestHandler with hidden files: [SCHEMA.XML, OLD_SYNONYMS.TXT, STOPWORDS.TXT, PROTWORDS.TXT, OPEN-EXCHANGE-RATES.JSON, SYNONYMS.TXT, CURRENCY.XML, MAPPING-ISOLATIN1ACCENT.TXT]
> [junit4:junit4]   2> 3517 T2401 oass.SolrIndexSearcher.<init> Opening Searcher@756225ed main
> [junit4:junit4]   2> 3519 T2401 oasu.CommitTracker.<init> Hard AutoCommit: disabled
> [junit4:junit4]   2> 3519 T2401 oasu.CommitTracker.<init> Soft AutoCommit: disabled
> [junit4:junit4]   2> 3520 T2401 oashc.SpellCheckComponent.inform Initializing spell checkers
> [junit4:junit4]   2> 3527 T2401 oass.DirectSolrSpellChecker.init init: {name=direct,classname=DirectSolrSpellChecker,field=lowerfilt,minQueryLength=3}
> [junit4:junit4]   2> 3645 T2436 oasc.SolrCore.registerSearcher [collection1] Registered new searcher Searcher@756225ed main{StandardDirectoryReader(segments_1:1)}
> [junit4:junit4]   2> 4024 T2422 oascc.ZkStateReader.updateClusterState Updating cloud state from ZooKeeper... 
> [junit4:junit4]   2> 4045 T2435 oascc.ZkStateReader$2.process A cluster state change has occurred - updating...
> [junit4:junit4]   2> 4045 T2421 oascc.ZkStateReader$2.process A cluster state change has occurred - updating...
> [junit4:junit4]   2> 4151 T2401 oasc.CoreContainer.register registering core: collection1
> [junit4:junit4]   2> 4151 T2401 oasc.ZkController.register Register shard - core:collection1 address:http://127.0.0.1:49269/solr shardId:shard1
> [junit4:junit4]   2> 4152 T2401 oascc.SolrZkClient.makePath makePath: /collections/collection1/leader_elect/shard1/election
> [junit4:junit4]   2> 4163 T2406 oazs.PrepRequestProcessor.pRequest Got user-level KeeperException when processing sessionid:0x139d2148c5f0003 type:delete cxid:0x42 zxid:0xfffffffffffffffe txntype:unknown reqpath:n/a Error Path:/solr/collections/collection1/leaders Error:KeeperErrorCode = NoNode for /solr/collections/collection1/leaders
> [junit4:junit4]   2> 4164 T2401 oasc.ShardLeaderElectionContext.runLeaderProcess Running the leader process.
> [junit4:junit4]   2> 4164 T2406 oazs.PrepRequestProcessor.pRequest Got user-level KeeperException when processing sessionid:0x139d2148c5f0003 type:create cxid:0x43 zxid:0xfffffffffffffffe txntype:unknown reqpath:n/a Error Path:/solr/overseer Error:KeeperErrorCode = NodeExists for /solr/overseer
> [junit4:junit4]   2> 4174 T2401 oasc.ShardLeaderElectionContext.waitForReplicasToComeUp Enough replicas found to continue.
> [junit4:junit4]   2> 4174 T2401 oasc.ShardLeaderElectionContext.runLeaderProcess I may be the new leader - try and sync
> [junit4:junit4]   2> 4175 T2401 oasc.SyncStrategy.sync Sync replicas to http://127.0.0.1:49269/solr/collection1/
> [junit4:junit4]   2> 4175 T2401 oasc.SyncStrategy.syncReplicas Sync Success - now sync replicas to me
> [junit4:junit4]   2> 4175 T2401 oasc.SyncStrategy.syncToMe http://127.0.0.1:49269/solr/collection1/ has no replicas
> [junit4:junit4]   2> 4176 T2401 oasc.ShardLeaderElectionContext.runLeaderProcess I am the new leader: http://127.0.0.1:49269/solr/collection1/
> [junit4:junit4]   2> 4176 T2401 oascc.SolrZkClient.makePath makePath: /collections/collection1/leaders/shard1
> [junit4:junit4]   2> 4185 T2406 oazs.PrepRequestProcessor.pRequest Got user-level KeeperException when processing sessionid:0x139d2148c5f0003 type:create cxid:0x4d zxid:0xfffffffffffffffe txntype:unknown reqpath:n/a Error Path:/solr/overseer Error:KeeperErrorCode = NodeExists for /solr/overseer
> [junit4:junit4]   2> 4548 T2422 oascc.ZkStateReader.updateClusterState Updating cloud state from ZooKeeper... 
> [junit4:junit4]   2> 4564 T2421 oascc.ZkStateReader$2.process A cluster state change has occurred - updating...
> [junit4:junit4]   2> 4564 T2435 oascc.ZkStateReader$2.process A cluster state change has occurred - updating...
> [junit4:junit4]   2> 4594 T2401 oasc.ZkController.register We are http://127.0.0.1:49269/solr/collection1/ and leader is http://127.0.0.1:49269/solr/collection1/
> [junit4:junit4]   2> 4594 T2401 oasc.ZkController.register No LogReplay needed for core=collection1 baseURL=http://127.0.0.1:49269/solr
> [junit4:junit4]   2> 4594 T2401 oasc.ZkController.checkRecovery I am the leader, no recovery necessary
> [junit4:junit4]   2> 4596 T2401 oascc.ZkStateReader.updateClusterState Updating cloud state from ZooKeeper... 
> [junit4:junit4]   2> 4596 T2401 oass.SolrDispatchFilter.init user.dir=/usr/home/hudson/hudson-slave/workspace/Lucene-Solr-Tests-4.x-Java6/solr/build/solr-core/test/J1
> [junit4:junit4]   2> 4597 T2401 oass.SolrDispatchFilter.init SolrDispatchFilter.init() done
> [junit4:junit4]   2> 4597 T2401 oascsi.HttpClientUtil.createClient Creating new http client, config:maxConnections=128&maxConnectionsPerHost=32&followRedirects=false
> [junit4:junit4]   2> 4910 T2401 oejs.Server.doStart jetty-8.1.2.v20120308
> [junit4:junit4]   2> 4912 T2401 oejs.AbstractConnector.doStart Started SocketConnector@0.0.0.0:49272
> [junit4:junit4]   2> 4913 T2401 oasc.SolrResourceLoader.locateSolrHome JNDI not configured for solr (NoInitialContextEx)
> [junit4:junit4]   2> 4913 T2401 oasc.SolrResourceLoader.locateSolrHome using system property solr.solr.home: /usr/home/hudson/hudson-slave/workspace/Lucene-Solr-Tests-4.x-Java6/solr/build/solr-core/test/J1/./solrtest-jetty2-1347849330259
> [junit4:junit4]   2> 4913 T2401 oasc.SolrResourceLoader.<init> new SolrResourceLoader for deduced Solr Home: '/usr/home/hudson/hudson-slave/workspace/Lucene-Solr-Tests-4.x-Java6/solr/build/solr-core/test/J1/./solrtest-jetty2-1347849330259/'
> [junit4:junit4]   2> 4937 T2401 oass.SolrDispatchFilter.init SolrDispatchFilter.init()
> [junit4:junit4]   2> 4937 T2401 oasc.SolrResourceLoader.locateSolrHome JNDI not configured for solr (NoInitialContextEx)
> [junit4:junit4]   2> 4938 T2401 oasc.SolrResourceLoader.locateSolrHome using system property solr.solr.home: /usr/home/hudson/hudson-slave/workspace/Lucene-Solr-Tests-4.x-Java6/solr/build/solr-core/test/J1/./solrtest-jetty2-1347849330259
> [junit4:junit4]   2> 4938 T2401 oasc.CoreContainer$Initializer.initialize looking for solr.xml: /usr/home/hudson/hudson-slave/workspace/Lucene-Solr-Tests-4.x-Java6/solr/build/solr-core/test/J1/./solrtest-jetty2-1347849330259/solr.xml
> [junit4:junit4]   2> 4938 T2401 oasc.CoreContainer.<init> New CoreContainer 1952075263
> [junit4:junit4]   2> 4939 T2401 oasc.CoreContainer.load Loading CoreContainer using Solr Home: '/usr/home/hudson/hudson-slave/workspace/Lucene-Solr-Tests-4.x-Java6/solr/build/solr-core/test/J1/./solrtest-jetty2-1347849330259/'
> [junit4:junit4]   2> 4939 T2401 oasc.SolrResourceLoader.<init> new SolrResourceLoader for directory: '/usr/home/hudson/hudson-slave/workspace/Lucene-Solr-Tests-4.x-Java6/solr/build/solr-core/test/J1/./solrtest-jetty2-1347849330259/'
> [junit4:junit4]   2> 4956 T2401 oasc.CoreContainer.load Registering Log Listener
> [junit4:junit4]   2> 4967 T2401 oasc.CoreContainer.initZooKeeper Zookeeper client=127.0.0.1:49261/solr
> [junit4:junit4]   2> 4967 T2401 oaz.ZooKeeper.<init> Initiating client connection, connectString=127.0.0.1:49261/solr sessionTimeout=5000 watcher=org.apache.solr.common.cloud.ConnectionManager@3127395d
> [junit4:junit4]   2> 4968 T2446 oaz.ClientCnxn$SendThread.startConnect Opening socket connection to server /127.0.0.1:49261
> [junit4:junit4]   2> 4968 T2401 oascc.ConnectionManager.waitForConnected Waiting for client to connect to ZooKeeper
> [junit4:junit4]   2> 4969 T2446 oaz.ClientCnxn$SendThread.primeConnection Socket connection established to localhost/127.0.0.1:49261, initiating session
> [junit4:junit4]   2> 4969 T2403 oazs.NIOServerCnxn$Factory.run Accepted socket connection from /140.211.11.196:49273
> [junit4:junit4]   2> 4970 T2403 oazs.NIOServerCnxn.readConnectRequest Client attempting to establish new session at /140.211.11.196:49273
> [junit4:junit4]   2> 4972 T2405 oazs.NIOServerCnxn.finishSessionInit Established session 0x139d2148c5f0004 with negotiated timeout 5000 for client /140.211.11.196:49273
> [junit4:junit4]   2> 4972 T2446 oaz.ClientCnxn$SendThread.readConnectResult Session establishment complete on server localhost/127.0.0.1:49261, sessionid = 0x139d2148c5f0004, negotiated timeout = 5000
> [junit4:junit4]   2> 4972 T2447 oascc.ConnectionManager.process Watcher org.apache.solr.common.cloud.ConnectionManager@3127395d name:ZooKeeperConnection Watcher:127.0.0.1:49261/solr got event WatchedEvent state:SyncConnected type:None path:null path:null type:None
> [junit4:junit4]   2> 4972 T2401 oascc.ConnectionManager.waitForConnected Client is connected to ZooKeeper
> [junit4:junit4]   2> 4973 T2406 oazs.PrepRequestProcessor.pRequest Got user-level KeeperException when processing sessionid:0x139d2148c5f0004 type:create cxid:0x1 zxid:0xfffffffffffffffe txntype:unknown reqpath:n/a Error Path:/solr/overseer Error:KeeperErrorCode = NodeExists for /solr/overseer
> [junit4:junit4]   2> 4974 T2406 oazs.PrepRequestProcessor.pRequest Got user-level KeeperException when processing sessionid:0x139d2148c5f0004 type:create cxid:0x2 zxid:0xfffffffffffffffe txntype:unknown reqpath:n/a Error Path:/solr/overseer Error:KeeperErrorCode = NodeExists for /solr/overseer
> [junit4:junit4]   2> 4975 T2401 oasc.ZkController.createEphemeralLiveNode Register node as live in ZooKeeper:/live_nodes/127.0.0.1:49272_solr
> [junit4:junit4]   2> 4976 T2406 oazs.PrepRequestProcessor.pRequest Got user-level KeeperException when processing sessionid:0x139d2148c5f0004 type:delete cxid:0x4 zxid:0xfffffffffffffffe txntype:unknown reqpath:n/a Error Path:/solr/live_nodes/127.0.0.1:49272_solr Error:KeeperErrorCode = NoNode for /solr/live_nodes/127.0.0.1:49272_solr
> [junit4:junit4]   2> 4976 T2401 oascc.SolrZkClient.makePath makePath: /live_nodes/127.0.0.1:49272_solr
> [junit4:junit4]   2> 4978 T2421 oascc.ZkStateReader$3.process Updating live nodes
> [junit4:junit4]   2> 4978 T2435 oascc.ZkStateReader$3.process Updating live nodes
> [junit4:junit4]   2> 4979 T2401 oashc.HttpShardHandlerFactory.getParameter Setting socketTimeout to: 0
> [junit4:junit4]   2> 4979 T2401 oashc.HttpShardHandlerFactory.getParameter Setting urlScheme to: http://
> [junit4:junit4]   2> 4979 T2401 oashc.HttpShardHandlerFactory.getParameter Setting connTimeout to: 0
> [junit4:junit4]   2> 4980 T2401 oashc.HttpShardHandlerFactory.getParameter Setting maxConnectionsPerHost to: 20
> [junit4:junit4]   2> 4980 T2401 oashc.HttpShardHandlerFactory.getParameter Setting corePoolSize to: 0
> [junit4:junit4]   2> 4980 T2401 oashc.HttpShardHandlerFactory.getParameter Setting maximumPoolSize to: 2147483647
> [junit4:junit4]   2> 4981 T2401 oashc.HttpShardHandlerFactory.getParameter Setting maxThreadIdleTime to: 5
> [junit4:junit4]   2> 4981 T2401 oashc.HttpShardHandlerFactory.getParameter Setting sizeOfQueue to: -1
> [junit4:junit4]   2> 4981 T2401 oashc.HttpShardHandlerFactory.getParameter Setting fairnessPolicy to: false
> [junit4:junit4]   2> 4982 T2401 oascsi.HttpClientUtil.createClient Creating new http client, config:maxConnectionsPerHost=20&maxConnections=10000&socketTimeout=0&connTimeout=0&retry=false
> [junit4:junit4]   2> 4993 T2401 oascc.ZkStateReader.createClusterStateWatchersAndUpdate Updating cluster state from ZooKeeper... 
> [junit4:junit4]   2> 4998 T2401 oasc.CoreContainer.create Creating SolrCore 'collection1' using instanceDir: /usr/home/hudson/hudson-slave/workspace/Lucene-Solr-Tests-4.x-Java6/solr/build/solr-core/test/J1/./solrtest-jetty2-1347849330259/collection1
> [junit4:junit4]   2> 4998 T2401 oasc.ZkController.createCollectionZkNode Check for collection zkNode:collection1
> [junit4:junit4]   2> 4999 T2401 oasc.ZkController.createCollectionZkNode Collection zkNode exists
> [junit4:junit4]   2> 4999 T2401 oasc.ZkController.readConfigName Load collection config from:/collections/collection1
> [junit4:junit4]   2> 5000 T2401 oasc.SolrResourceLoader.<init> new SolrResourceLoader for directory: '/usr/home/hudson/hudson-slave/workspace/Lucene-Solr-Tests-4.x-Java6/solr/build/solr-core/test/J1/./solrtest-jetty2-1347849330259/collection1/'
> [junit4:junit4]   2> 5001 T2401 oasc.SolrResourceLoader.replaceClassLoader Adding 'file:/usr/home/hudson/hudson-slave/workspace/Lucene-Solr-Tests-4.x-Java6/solr/build/solr-core/test/J1/solrtest-jetty2-1347849330259/collection1/lib/README' to classloader
> [junit4:junit4]   2> 5001 T2401 oasc.SolrResourceLoader.replaceClassLoader Adding 'file:/usr/home/hudson/hudson-slave/workspace/Lucene-Solr-Tests-4.x-Java6/solr/build/solr-core/test/J1/solrtest-jetty2-1347849330259/collection1/lib/classes/' to classloader
> [junit4:junit4]   2> 5035 T2401 oasc.SolrConfig.<init> Using Lucene MatchVersion: LUCENE_40
> [junit4:junit4]   2> 5068 T2422 oascc.ZkStateReader.updateClusterState Updating cloud state from ZooKeeper... 
> [junit4:junit4]   2> 5072 T2421 oascc.ZkStateReader$2.process A cluster state change has occurred - updating...
> [junit4:junit4]   2> 5072 T2447 oascc.ZkStateReader$2.process A cluster state change has occurred - updating...
> [junit4:junit4]   2> 5072 T2435 oascc.ZkStateReader$2.process A cluster state change has occurred - updating...
> [junit4:junit4]   2> 5083 T2401 oasc.SolrConfig.<init> Loaded SolrConfig: solrconfig.xml
> [junit4:junit4]   2> 5183 T2401 oass.IndexSchema.readSchema Reading Solr Schema
> [junit4:junit4]   2> 5188 T2401 oass.IndexSchema.readSchema Schema name=test
> [junit4:junit4]   2> 5610 T2401 oass.OpenExchangeRatesOrgProvider.init Initialized with rates=open-exchange-rates.json, refreshInterval=1440.
> [junit4:junit4]   2> 5618 T2401 oass.IndexSchema.readSchema default search field in schema is text
> [junit4:junit4]   2> 5621 T2401 oass.IndexSchema.readSchema unique key field: id
> [junit4:junit4]   2> 5630 T2401 oass.FileExchangeRateProvider.reload Reloading exchange rates from file currency.xml
> [junit4:junit4]   2> 5634 T2401 oass.FileExchangeRateProvider.reload Reloading exchange rates from file currency.xml
> [junit4:junit4]   2> 5637 T2401 oass.OpenExchangeRatesOrgProvider.reload Reloading exchange rates from open-exchange-rates.json
> [junit4:junit4]   2> 5638 T2401 oass.OpenExchangeRatesOrgProvider.reload Reloading exchange rates from open-exchange-rates.json
> [junit4:junit4]   2> 5639 T2401 oasc.SolrCore.<init> [collection1] Opening new SolrCore at /usr/home/hudson/hudson-slave/workspace/Lucene-Solr-Tests-4.x-Java6/solr/build/solr-core/test/J1/./solrtest-jetty2-1347849330259/collection1/, dataDir=./org.apache.solr.cloud.BasicDistributedZk2Test-1347849325656/jetty2/
> [junit4:junit4]   2> 5639 T2401 oasc.JmxMonitoredMap.<init> JMX monitoring is enabled. Adding Solr mbeans to JMX Server: com.sun.jmx.mbeanserver.JmxMBeanServer@35ecfe07
> [junit4:junit4]   2> 5640 T2401 oasc.SolrCore.getNewIndexDir WARNING New index directory detected: old=null new=./org.apache.solr.cloud.BasicDistributedZk2Test-1347849325656/jetty2/index/
> [junit4:junit4]   2> 5641 T2401 oasc.SolrCore.initIndex WARNING [collection1] Solr index directory './org.apache.solr.cloud.BasicDistributedZk2Test-1347849325656/jetty2/index' doesn't exist. Creating new index...
> [junit4:junit4]   2> 5642 T2401 oasc.CachingDirectoryFactory.get return new directory for /usr/home/hudson/hudson-slave/workspace/Lucene-Solr-Tests-4.x-Java6/solr/build/solr-core/test/J1/./org.apache.solr.cloud.BasicDistributedZk2Test-1347849325656/jetty2/index forceNew:false
> [junit4:junit4]   2> 5673 T2401 oasc.SolrDeletionPolicy.onCommit SolrDeletionPolicy.onCommit: commits:num=1
> [junit4:junit4]   2>        commit{dir=NRTCachingDirectory(org.apache.lucene.store.NIOFSDirectory@/usr/home/hudson/hudson-slave/workspace/Lucene-Solr-Tests-4.x-Java6/solr/build/solr-core/test/J1/org.apache.solr.cloud.BasicDistributedZk2Test-1347849325656/jetty2/index lockFactory=org.apache.lucene.store.NativeFSLockFactory@1b3ee2f4; maxCacheMB=48.0 maxMergeSizeMB=4.0),segFN=segments_1,generation=1,filenames=[segments_1]
> [junit4:junit4]   2> 5673 T2401 oasc.SolrDeletionPolicy.updateCommits newest commit = 1
> [junit4:junit4]   2> 5674 T2401 oasc.SolrCore.initWriters created xml: solr.XMLResponseWriter
> [junit4:junit4]   2> 5677 T2401 oasup.UpdateRequestProcessorChain.init inserting DistributedUpdateProcessorFactory into updateRequestProcessorChain "dedupe"
> [junit4:junit4]   2> 5678 T2401 oasup.UpdateRequestProcessorChain.init inserting DistributedUpdateProcessorFactory into updateRequestProcessorChain "dedupe-allfields"
> [junit4:junit4]   2> 5678 T2401 oasup.UpdateRequestProcessorChain.init inserting DistributedUpdateProcessorFactory into updateRequestProcessorChain "stored_sig"
> [junit4:junit4]   2> 5679 T2401 oasup.UpdateRequestProcessorChain.init inserting DistributedUpdateProcessorFactory into updateRequestProcessorChain "uniq-fields"
> [junit4:junit4]   2> 5680 T2401 oasup.UpdateRequestProcessorChain.init inserting DistributedUpdateProcessorFactory into updateRequestProcessorChain "distrib-dup-test-chain-implicit"
> [junit4:junit4]   2> 5680 T2401 oasc.RequestHandlers.initHandlersFromConfig adding lazy requestHandler: solr.ReplicationHandler
> [junit4:junit4]   2> 5681 T2401 oasc.RequestHandlers.initHandlersFromConfig created /replication: solr.ReplicationHandler
> [junit4:junit4]   2> 5682 T2401 oasc.RequestHandlers.initHandlersFromConfig created standard: solr.StandardRequestHandler
> [junit4:junit4]   2> 5682 T2401 oasc.RequestHandlers.initHandlersFromConfig created /get: solr.RealTimeGetHandler
> [junit4:junit4]   2> 5683 T2401 oasc.RequestHandlers.initHandlersFromConfig created dismax: solr.SearchHandler
> [junit4:junit4]   2> 5684 T2401 oasc.RequestHandlers.initHandlersFromConfig created mock: org.apache.solr.core.MockQuerySenderListenerReqHandler
> [junit4:junit4]   2> 5685 T2401 oasc.RequestHandlers.initHandlersFromConfig created /admin/: org.apache.solr.handler.admin.AdminHandlers
> [junit4:junit4]   2> 5685 T2401 oasc.RequestHandlers.initHandlersFromConfig created defaults: solr.StandardRequestHandler
> [junit4:junit4]   2> 5686 T2401 oasc.RequestHandlers.initHandlersFromConfig adding lazy requestHandler: solr.StandardRequestHandler
> [junit4:junit4]   2> 5686 T2401 oasc.RequestHandlers.initHandlersFromConfig created lazy: solr.StandardRequestHandler
> [junit4:junit4]   2> 5687 T2401 oasc.RequestHandlers.initHandlersFromConfig created /update: solr.UpdateRequestHandler
> [junit4:junit4]   2> 5688 T2401 oasc.RequestHandlers.initHandlersFromConfig created /terms: org.apache.solr.handler.component.SearchHandler
> [junit4:junit4]   2> 5688 T2401 oasc.RequestHandlers.initHandlersFromConfig created spellCheckCompRH: org.apache.solr.handler.component.SearchHandler
> [junit4:junit4]   2> 5689 T2401 oasc.RequestHandlers.initHandlersFromConfig created spellCheckCompRH_Direct: org.apache.solr.handler.component.SearchHandler
> [junit4:junit4]   2> 5690 T2401 oasc.RequestHandlers.initHandlersFromConfig created spellCheckWithWordbreak: org.apache.solr.handler.component.SearchHandler
> [junit4:junit4]   2> 5691 T2401 oasc.RequestHandlers.initHandlersFromConfig created spellCheckWithWordbreak_Direct: org.apache.solr.handler.component.SearchHandler
> [junit4:junit4]   2> 5691 T2401 oasc.RequestHandlers.initHandlersFromConfig created spellCheckCompRH1: org.apache.solr.handler.component.SearchHandler
> [junit4:junit4]   2> 5692 T2401 oasc.RequestHandlers.initHandlersFromConfig created tvrh: org.apache.solr.handler.component.SearchHandler
> [junit4:junit4]   2> 5693 T2401 oasc.RequestHandlers.initHandlersFromConfig created /mlt: solr.MoreLikeThisHandler
> [junit4:junit4]   2> 5694 T2401 oasc.RequestHandlers.initHandlersFromConfig created /debug/dump: solr.DumpRequestHandler
> [junit4:junit4]   2> 5697 T2401 oashl.XMLLoader.init xsltCacheLifetimeSeconds=60
> [junit4:junit4]   2> 5702 T2401 oasc.SolrCore.initDeprecatedSupport WARNING solrconfig.xml uses deprecated <admin/gettableFiles>, Please update your config to use the ShowFileRequestHandler.
> [junit4:junit4]   2> 5704 T2401 oasc.SolrCore.initDeprecatedSupport WARNING adding ShowFileRequestHandler with hidden files: [SCHEMA.XML, OLD_SYNONYMS.TXT, STOPWORDS.TXT, PROTWORDS.TXT, OPEN-EXCHANGE-RATES.JSON, SYNONYMS.TXT, CURRENCY.XML, MAPPING-ISOLATIN1ACCENT.TXT]
> [junit4:junit4]   2> 5708 T2401 oass.SolrIndexSearcher.<init> Opening Searcher@79ae9b24 main
> [junit4:junit4]   2> 5709 T2401 oasu.CommitTracker.<init> Hard AutoCommit: disabled
> [junit4:junit4]   2> 5710 T2401 oasu.CommitTracker.<init> Soft AutoCommit: disabled
> [junit4:junit4]   2> 5710 T2401 oashc.SpellCheckComponent.inform Initializing spell checkers
> [junit4:junit4]   2> 5718 T2401 oass.DirectSolrSpellChecker.init init: {name=direct,classname=DirectSolrSpellChecker,field=lowerfilt,minQueryLength=3}
> [junit4:junit4]   2> 5767 T2448 oasc.SolrCore.registerSearcher [collection1] Registered new searcher Searcher@79ae9b24 main{StandardDirectoryReader(segments_1:1)}
> [junit4:junit4]   2> 6077 T2422 oascc.ZkStateReader.updateClusterState Updating cloud state from ZooKeeper... 
> [junit4:junit4]   2> 6090 T2421 oascc.ZkStateReader$2.process A cluster state change has occurred - updating...
> [junit4:junit4]   2> 6090 T2447 oascc.ZkStateReader$2.process A cluster state change has occurred - updating...
> [junit4:junit4]   2> 6090 T2435 oascc.ZkStateReader$2.process A cluster state change has occurred - updating...
> [junit4:junit4]   2> 6273 T2401 oasc.CoreContainer.register registering core: collection1
> [junit4:junit4]   2> 6273 T2401 oasc.ZkController.register Register shard - core:collection1 address:http://127.0.0.1:49272/solr shardId:shard2
> [junit4:junit4]   2> 6274 T2401 oascc.SolrZkClient.makePath makePath: /collections/collection1/leader_elect/shard2/election
> [junit4:junit4]   2> 6288 T2406 oazs.PrepRequestProcessor.pRequest Got user-level KeeperException when processing sessionid:0x139d2148c5f0004 type:delete cxid:0x42 zxid:0xfffffffffffffffe txntype:unknown reqpath:n/a Error Path:/solr/collections/collection1/leaders/shard2 Error:KeeperErrorCode = NoNode for /solr/collections/collection1/leaders/shard2
> [junit4:junit4]   2> 6289 T2401 oasc.ShardLeaderElectionContext.runLeaderProcess Running the leader process.
> [junit4:junit4]   2> 6289 T2406 oazs.PrepRequestProcessor.pRequest Got user-level KeeperException when processing sessionid:0x139d2148c5f0004 type:create cxid:0x43 zxid:0xfffffffffffffffe txntype:unknown reqpath:n/a Error Path:/solr/overseer Error:KeeperErrorCode = NodeExists for /solr/overseer
> [junit4:junit4]   2> 6291 T2401 oasc.ShardLeaderElectionContext.waitForReplicasToComeUp Enough replicas found to continue.
> [junit4:junit4]   2> 6291 T2401 oasc.ShardLeaderElectionContext.runLeaderProcess I may be the new leader - try and sync
> [junit4:junit4]   2> 6292 T2401 oasc.SyncStrategy.sync Sync replicas to http://127.0.0.1:49272/solr/collection1/
> [junit4:junit4]   2> 6292 T2401 oasc.SyncStrategy.syncReplicas Sync Success - now sync replicas to me
> [junit4:junit4]   2> 6292 T2401 oasc.SyncStrategy.syncToMe http://127.0.0.1:49272/solr/collection1/ has no replicas
> [junit4:junit4]   2> 6293 T2401 oasc.ShardLeaderElectionContext.runLeaderProcess I am the new leader: http://127.0.0.1:49272/solr/collection1/
> [junit4:junit4]   2> 6293 T2401 oascc.SolrZkClient.makePath makePath: /collections/collection1/leaders/shard2
> [junit4:junit4]   2> 6295 T2406 oazs.PrepRequestProcessor.pRequest Got user-level KeeperException when processing sessionid:0x139d2148c5f0004 type:create cxid:0x4c zxid:0xfffffffffffffffe txntype:unknown reqpath:n/a Error Path:/solr/overseer Error:KeeperErrorCode = NodeExists for /solr/overseer
> [junit4:junit4]   2> 6594 T2422 oascc.ZkStateReader.updateClusterState Updating cloud state from ZooKeeper... 
> [junit4:junit4]   2> 6609 T2435 oascc.ZkStateReader$2.process A cluster state change has occurred - updating...
> [junit4:junit4]   2> 6609 T2447 oascc.ZkStateReader$2.process A cluster state change has occurred - updating...
> [junit4:junit4]   2> 6609 T2421 oascc.ZkStateReader$2.process A cluster state change has occurred - updating...
> [junit4:junit4]   2> 6654 T2401 oasc.ZkController.register We are http://127.0.0.1:49272/solr/collection1/ and leader is http://127.0.0.1:49272/solr/collection1/
> [junit4:junit4]   2> 6654 T2401 oasc.ZkController.register No LogReplay needed for core=collection1 baseURL=http://127.0.0.1:49272/solr
> [junit4:junit4]   2> 6654 T2401 oasc.ZkController.checkRecovery I am the leader, no recovery necessary
> [junit4:junit4]   2> 6656 T2401 oascc.ZkStateReader.updateClusterState Updating cloud state from ZooKeeper... 
> [junit4:junit4]   2> 6656 T2401 oass.SolrDispatchFilter.init user.dir=/usr/home/hudson/hudson-slave/workspace/Lucene-Solr-Tests-4.x-Java6/solr/build/solr-core/test/J1
> [junit4:junit4]   2> 6657 T2401 oass.SolrDispatchFilter.init SolrDispatchFilter.init() done
> [junit4:junit4]   2> 6657 T2401 oascsi.HttpClientUtil.createClient Creating new http client, config:maxConnections=128&maxConnectionsPerHost=32&followRedirects=false
> [junit4:junit4]   2> 6969 T2401 oejs.Server.doStart jetty-8.1.2.v20120308
> [junit4:junit4]   2> 6972 T2401 oejs.AbstractConnector.doStart Started SocketConnector@0.0.0.0:49275
> [junit4:junit4]   2> 6973 T2401 oasc.SolrResourceLoader.locateSolrHome JNDI not configured for solr (NoInitialContextEx)
> [junit4:junit4]   2> 6973 T2401 oasc.SolrResourceLoader.locateSolrHome using system property solr.solr.home: /usr/home/hudson/hudson-slave/workspace/Lucene-Solr-Tests-4.x-Java6/solr/build/solr-core/test/J1/./solrtest-jetty3-1347849332319
> [junit4:junit4]   2> 6973 T2401 oasc.SolrResourceLoader.<init> new SolrResourceLoader for deduced Solr Home: '/usr/home/hudson/hudson-slave/workspace/Lucene-Solr-Tests-4.x-Java6/solr/build/solr-core/test/J1/./solrtest-jetty3-1347849332319/'
> [junit4:junit4]   2> 6997 T2401 oass.SolrDispatchFilter.init SolrDispatchFilter.init()
> [junit4:junit4]   2> 6997 T2401 oasc.SolrResourceLoader.locateSolrHome JNDI not configured for solr (NoInitialContextEx)
> [junit4:junit4]   2> 6997 T2401 oasc.SolrResourceLoader.locateSolrHome using system property solr.solr.home: /usr/home/hudson/hudson-slave/workspace/Lucene-Solr-Tests-4.x-Java6/solr/build/solr-core/test/J1/./solrtest-jetty3-1347849332319
> [junit4:junit4]   2> 6998 T2401 oasc.CoreContainer$Initializer.initialize looking for solr.xml: /usr/home/hudson/hudson-slave/workspace/Lucene-Solr-Tests-4.x-Java6/solr/build/solr-core/test/J1/./solrtest-jetty3-1347849332319/solr.xml
> [junit4:junit4]   2> 6998 T2401 oasc.CoreContainer.<init> New CoreContainer 1434603518
> [junit4:junit4]   2> 6999 T2401 oasc.CoreContainer.load Loading CoreContainer using Solr Home: '/usr/home/hudson/hudson-slave/workspace/Lucene-Solr-Tests-4.x-Java6/solr/build/solr-core/test/J1/./solrtest-jetty3-1347849332319/'
> [junit4:junit4]   2> 6999 T2401 oasc.SolrResourceLoader.<init> new SolrResourceLoader for directory: '/usr/home/hudson/hudson-slave/workspace/Lucene-Solr-Tests-4.x-Java6/solr/build/solr-core/test/J1/./solrtest-jetty3-1347849332319/'
> [junit4:junit4]   2> 7016 T2401 oasc.CoreContainer.load Registering Log Listener
> [junit4:junit4]   2> 7027 T2401 oasc.CoreContainer.initZooKeeper Zookeeper client=127.0.0.1:49261/solr
> [junit4:junit4]   2> 7028 T2401 oaz.ZooKeeper.<init> Initiating client connection, connectString=127.0.0.1:49261/solr sessionTimeout=5000 watcher=org.apache.solr.common.cloud.ConnectionManager@4f60415b
> [junit4:junit4]   2> 7028 T2458 oaz.ClientCnxn$SendThread.startConnect Opening socket connection to server /127.0.0.1:49261
> [junit4:junit4]   2> 7028 T2401 oascc.ConnectionManager.waitForConnected Waiting for client to connect to ZooKeeper
> [junit4:junit4]   2> 7029 T2458 oaz.ClientCnxn$SendThread.primeConnection Socket connection established to localhost/127.0.0.1:49261, initiating session
> [junit4:junit4]   2> 7030 T2403 oazs.NIOServerCnxn$Factory.run Accepted socket connection from /140.211.11.196:49276
> [junit4:junit4]   2> 7030 T2403 oazs.NIOServerCnxn.readConnectRequest Client attempting to establish new session at /140.211.11.196:49276
> [junit4:junit4]   2> 7032 T2405 oazs.NIOServerCnxn.finishSessionInit Established session 0x139d2148c5f0005 with negotiated timeout 5000 for client /140.211.11.196:49276
> [junit4:junit4]   2> 7032 T2458 oaz.ClientCnxn$SendThread.readConnectResult Session establishment complete on server localhost/127.0.0.1:49261, sessionid = 0x139d2148c5f0005, negotiated timeout = 5000
> [junit4:junit4]   2> 7032 T2459 oascc.ConnectionManager.process Watcher org.apache.solr.common.cloud.ConnectionManager@4f60415b name:ZooKeeperConnection Watcher:127.0.0.1:49261/solr got event WatchedEvent state:SyncConnected type:None path:null path:null type:None
> [junit4:junit4]   2> 7033 T2401 oascc.ConnectionManager.waitForConnected Client is connected to ZooKeeper
> [junit4:junit4]   2> 7033 T2406 oazs.PrepRequestProcessor.pRequest Got user-level KeeperException when processing sessionid:0x139d2148c5f0005 type:create cxid:0x1 zxid:0xfffffffffffffffe txntype:unknown reqpath:n/a Error Path:/solr/overseer Error:KeeperErrorCode = NodeExists for /solr/overseer
> [junit4:junit4]   2> 7050 T2406 oazs.PrepRequestProcessor.pRequest Got user-level KeeperException when processing sessionid:0x139d2148c5f0005 type:create cxid:0x2 zxid:0xfffffffffffffffe txntype:unknown reqpath:n/a Error Path:/solr/overseer Error:KeeperErrorCode = NodeExists for /solr/overseer
> [junit4:junit4]   2> 7051 T2401 oasc.ZkController.createEphemeralLiveNode Register node as live in ZooKeeper:/live_nodes/127.0.0.1:49275_solr
> [junit4:junit4]   2> 7052 T2406 oazs.PrepRequestProcessor.pRequest Got user-level KeeperException when processing sessionid:0x139d2148c5f0005 type:delete cxid:0x4 zxid:0xfffffffffffffffe txntype:unknown reqpath:n/a Error Path:/solr/live_nodes/127.0.0.1:49275_solr Error:KeeperErrorCode = NoNode for /solr/live_nodes/127.0.0.1:49275_solr
> [junit4:junit4]   2> 7053 T2401 oascc.SolrZkClient.makePath makePath: /live_nodes/127.0.0.1:49275_solr
> [junit4:junit4]   2> 7054 T2435 oascc.ZkStateReader$3.process Updating live nodes
> [junit4:junit4]   2> 7054 T2447 oascc.ZkStateReader$3.process Updating live nodes
> [junit4:junit4]   2> 7054 T2421 oascc.ZkStateReader$3.process Updating live nodes
> [junit4:junit4]   2> 7055 T2401 oashc.HttpShardHandlerFactory.getParameter Setting socketTimeout to: 0
> [junit4:junit4]   2> 7055 T2401 oashc.HttpShardHandlerFactory.getParameter Setting urlScheme to: http://
> [junit4:junit4]   2> 7056 T2401 oashc.HttpShardHandlerFactory.getParameter Setting connTimeout to: 0
> [junit4:junit4]   2> 7056 T2401 oashc.HttpShardHandlerFactory.getParameter Setting maxConnectionsPerHost to: 20
> [junit4:junit4]   2> 7056 T2401 oashc.HttpShardHandlerFactory.getParameter Setting corePoolSize to: 0
> [junit4:junit4]   2> 7057 T2401 oashc.HttpShardHandlerFactory.getParameter Setting maximumPoolSize to: 2147483647
> [junit4:junit4]   2> 7057 T2401 oashc.HttpShardHandlerFactory.getParameter Setting maxThreadIdleTime to: 5
> [junit4:junit4]   2> 7057 T2401 oashc.HttpShardHandlerFactory.getParameter Setting sizeOfQueue to: -1
> [junit4:junit4]   2> 7058 T2401 oashc.HttpShardHandlerFactory.getParameter Setting fairnessPolicy to: false
> [junit4:junit4]   2> 7058 T2401 oascsi.HttpClientUtil.createClient Creating new http client, config:maxConnectionsPerHost=20&maxConnections=10000&socketTimeout=0&connTimeout=0&retry=false
> [junit4:junit4]   2> 7069 T2401 oascc.ZkStateReader.createClusterStateWatchersAndUpdate Updating cluster state from ZooKeeper... 
> [junit4:junit4]   2> 7073 T2401 oasc.CoreContainer.create Creating SolrCore 'collection1' using instanceDir: /usr/home/hudson/hudson-slave/workspace/Lucene-Solr-Tests-4.x-Java6/solr/build/solr-core/test/J1/./solrtest-jetty3-1347849332319/collection1
> [junit4:junit4]   2> 7073 T2401 oasc.ZkController.createCollectionZkNode Check for collection zkNode:collection1
> [junit4:junit4]   2> 7074 T2401 oasc.ZkController.createCollectionZkNode Collection zkNode exists
> [junit4:junit4]   2> 7074 T2401 oasc.ZkController.readConfigName Load collection config from:/collections/collection1
> [junit4:junit4]   2> 7075 T2401 oasc.SolrResourceLoader.<init> new SolrResourceLoader for directory: '/usr/home/hudson/hudson-slave/workspace/Lucene-Solr-Tests-4.x-Java6/solr/build/solr-core/test/J1/./solrtest-jetty3-1347849332319/collection1/'
> [junit4:junit4]   2> 7076 T2401 oasc.SolrResourceLoader.replaceClassLoader Adding 'file:/usr/home/hudson/hudson-slave/workspace/Lucene-Solr-Tests-4.x-Java6/solr/build/solr-core/test/J1/solrtest-jetty3-1347849332319/collection1/lib/README' to classloader
> [junit4:junit4]   2> 7077 T2401 oasc.SolrResourceLoader.replaceClassLoader Adding 'file:/usr/home/hudson/hudson-slave/workspace/Lucene-Solr-Tests-4.x-Java6/solr/build/solr-core/test/J1/solrtest-jetty3-1347849332319/collection1/lib/classes/' to classloader
> [junit4:junit4]   2> 7111 T2401 oasc.SolrConfig.<init> Using Lucene MatchVersion: LUCENE_40
> [junit4:junit4]   2> 7113 T2422 oascc.ZkStateReader.updateClusterState Updating cloud state from ZooKeeper... 
> [junit4:junit4]   2> 7118 T2447 oascc.ZkStateReader$2.process A cluster state change has occurred - updating...
> [junit4:junit4]   2> 7118 T2459 oascc.ZkStateReader$2.process A cluster state change has occurred - updating...
> [junit4:junit4]   2> 7118 T2435 oascc.ZkStateReader$2.process A cluster state change has occurred - updating...
> [junit4:junit4]   2> 7118 T2421 oascc.ZkStateReader$2.process A cluster state change has occurred - updating...
> [junit4:junit4]   2> 7159 T2401 oasc.SolrConfig.<init> Loaded SolrConfig: solrconfig.xml
> [junit4:junit4]   2> 7260 T2401 oass.IndexSchema.readSchema Reading Solr Schema
> [junit4:junit4]   2> 7265 T2401 oass.IndexSchema.readSchema Schema name=test
> [junit4:junit4]   2> 7690 T2401 oass.OpenExchangeRatesOrgProvider.init Initialized with rates=open-exchange-rates.json, refreshInterval=1440.
> [junit4:junit4]   2> 7698 T2401 oass.IndexSchema.readSchema default search field in schema is text
> [junit4:junit4]   2> 7701 T2401 oass.IndexSchema.readSchema unique key field: id
> [junit4:junit4]   2> 7710 T2401 oass.FileExchangeRateProvider.reload Reloading exchange rates from file currency.xml
> [junit4:junit4]   2> 7713 T2401 oass.FileExchangeRateProvider.reload Reloading exchange rates from file currency.xml
> [junit4:junit4]   2> 7716 T2401 oass.OpenExchangeRatesOrgProvider.reload Reloading exchange rates from open-exchange-rates.json
> [junit4:junit4]   2> 7717 T2401 oass.OpenExchangeRatesOrgProvider.reload Reloading exchange rates from open-exchange-rates.json
> [junit4:junit4]   2> 7718 T2401 oasc.SolrCore.<init> [collection1] Opening new SolrCore at /usr/home/hudson/hudson-slave/workspace/Lucene-Solr-Tests-4.x-Java6/solr/build/solr-core/test/J1/./solrtest-jetty3-1347849332319/collection1/, dataDir=./org.apache.solr.cloud.BasicDistributedZk2Test-1347849325656/jetty3/
> [junit4:junit4]   2> 7718 T2401 oasc.JmxMonitoredMap.<init> JMX monitoring is enabled. Adding Solr mbeans to JMX Server: com.sun.jmx.mbeanserver.JmxMBeanServer@35ecfe07
> [junit4:junit4]   2> 7719 T2401 oasc.SolrCore.getNewIndexDir WARNING New index directory detected: old=null new=./org.apache.solr.cloud.BasicDistributedZk2Test-1347849325656/jetty3/index/
> [junit4:junit4]   2> 7720 T2401 oasc.SolrCore.initIndex WARNING [collection1] Solr index directory './org.apache.solr.cloud.BasicDistributedZk2Test-1347849325656/jetty3/index' doesn't exist. Creating new index...
> [junit4:junit4]   2> 7721 T2401 oasc.CachingDirectoryFactory.get return new directory for /usr/home/hudson/hudson-slave/workspace/Lucene-Solr-Tests-4.x-Java6/solr/build/solr-core/test/J1/./org.apache.solr.cloud.BasicDistributedZk2Test-1347849325656/jetty3/index forceNew:false
> [junit4:junit4]   2> 7726 T2401 oasc.SolrDeletionPolicy.onCommit SolrDeletionPolicy.onCommit: commits:num=1
> [junit4:junit4]   2>        commit{dir=NRTCachingDirectory(org.apache.lucene.store.NIOFSDirectory@/usr/home/hudson/hudson-slave/workspace/Lucene-Solr-Tests-4.x-Java6/solr/build/solr-core/test/J1/org.apache.solr.cloud.BasicDistributedZk2Test-1347849325656/jetty3/index lockFactory=org.apache.lucene.store.NativeFSLockFactory@65700089; maxCacheMB=48.0 maxMergeSizeMB=4.0),segFN=segments_1,generation=1,filenames=[segments_1]
> [junit4:junit4]   2> 7726 T2401 oasc.SolrDeletionPolicy.updateCommits newest commit = 1
> [junit4:junit4]   2> 7727 T2401 oasc.SolrCore.initWriters created xml: solr.XMLResponseWriter
> [junit4:junit4]   2> 7729 T2401 oasup.UpdateRequestProcessorChain.init inserting DistributedUpdateProcessorFactory into updateRequestProcessorChain "dedupe"
> [junit4:junit4]   2> 7729 T2401 oasup.UpdateRequestProcessorChain.init inserting DistributedUpdateProcessorFactory into updateRequestProcessorChain "dedupe-allfields"
> [junit4:junit4]   2> 7729 T2401 oasup.UpdateRequestProcessorChain.init inserting DistributedUpdateProcessorFactory into updateRequestProcessorChain "stored_sig"
> [junit4:junit4]   2> 7730 T2401 oasup.UpdateRequestProcessorChain.init inserting DistributedUpdateProcessorFactory into updateRequestProcessorChain "uniq-fields"
> [junit4:junit4]   2> 7730 T2401 oasup.UpdateRequestProcessorChain.init inserting DistributedUpdateProcessorFactory into updateRequestProcessorChain "distrib-dup-test-chain-implicit"
> [junit4:junit4]   2> 7731 T2401 oasc.RequestHandlers.initHandlersFromConfig adding lazy requestHandler: solr.ReplicationHandler
> [junit4:junit4]   2> 7731 T2401 oasc.RequestHandlers.initHandlersFromConfig created /replication: solr.ReplicationHandler
> [junit4:junit4]   2> 7731 T2401 oasc.RequestHandlers.initHandlersFromConfig created standard: solr.StandardRequestHandler
> [junit4:junit4]   2> 7732 T2401 oasc.RequestHandlers.initHandlersFromConfig created /get: solr.RealTimeGetHandler
> [junit4:junit4]   2> 7732 T2401 oasc.RequestHandlers.initHandlersFromConfig created dismax: solr.SearchHandler
> [junit4:junit4]   2> 7733 T2401 oasc.RequestHandlers.initHandlersFromConfig created mock: org.apache.solr.core.MockQuerySenderListenerReqHandler
> [junit4:junit4]   2> 7733 T2401 oasc.RequestHandlers.initHandlersFromConfig created /admin/: org.apache.solr.handler.admin.AdminHandlers
> [junit4:junit4]   2> 7734 T2401 oasc.RequestHandlers.initHandlersFromConfig created defaults: solr.StandardRequestHandler
> [junit4:junit4]   2> 7734 T2401 oasc.RequestHandlers.initHandlersFromConfig adding lazy requestHandler: solr.StandardRequestHandler
> [junit4:junit4]   2> 7735 T2401 oasc.RequestHandlers.initHandlersFromConfig created lazy: solr.StandardRequestHandler
> [junit4:junit4]   2> 7735 T2401 oasc.RequestHandlers.initHandlersFromConfig created /update: solr.UpdateRequestHandler
> [junit4:junit4]   2> 7736 T2401 oasc.RequestHandlers.initHandlersFromConfig created /terms: org.apache.solr.handler.component.SearchHandler
> [junit4:junit4]   2> 7736 T2401 oasc.RequestHandlers.initHandlersFromConfig created spellCheckCompRH: org.apache.solr.handler.component.SearchHandler
> [junit4:junit4]   2> 7736 T2401 oasc.RequestHandlers.initHandlersFromConfig created spellCheckCompRH_Direct: org.apache.solr.handler.component.SearchHandler
> [junit4:junit4]   2> 7737 T2401 oasc.RequestHandlers.initHandlersFromConfig created spellCheckWithWordbreak: org.apache.solr.handler.component.SearchHandler
> [junit4:junit4]   2> 7737 T2401 oasc.RequestHandlers.initHandlersFromConfig created spellCheckWithWordbreak_Direct: org.apache.solr.handler.component.SearchHandler
> [junit4:junit4]   2> 7738 T2401 oasc.RequestHandlers.initHandlersFromConfig created spellCheckCompRH1: org.apache.solr.handler.component.SearchHandler
> [junit4:junit4]   2> 7738 T2401 oasc.RequestHandlers.initHandlersFromConfig created tvrh: org.apache.solr.handler.component.SearchHandler
> [junit4:junit4]   2> 7739 T2401 oasc.RequestHandlers.initHandlersFromConfig created /mlt: solr.MoreLikeThisHandler
> [junit4:junit4]   2> 7739 T2401 oasc.RequestHandlers.initHandlersFromConfig created /debug/dump: solr.DumpRequestHandler
> [junit4:junit4]   2> 7742 T2401 oashl.XMLLoader.init xsltCacheLifetimeSeconds=60
> [junit4:junit4]   2> 7745 T2401 oasc.SolrCore.initDeprecatedSupport WARNING solrconfig.xml uses deprecated <admin/gettableFiles>, Please update your config to use the ShowFileRequestHandler.
> [junit4:junit4]   2> 7746 T2401 oasc.SolrCore.initDeprecatedSupport WARNING adding ShowFileRequestHandler with hidden files: [SCHEMA.XML, OLD_SYNONYMS.TXT, STOPWORDS.TXT, PROTWORDS.TXT, OPEN-EXCHANGE-RATES.JSON, SYNONYMS.TXT, CURRENCY.XML, MAPPING-ISOLATIN1ACCENT.TXT]
> [junit4:junit4]   2> 7749 T2401 oass.SolrIndexSearcher.<init> Opening Searcher@65b3f958 main
> [junit4:junit4]   2> 7750 T2401 oasu.CommitTracker.<init> Hard AutoCommit: disabled
> [junit4:junit4]   2> 7750 T2401 oasu.CommitTracker.<init> Soft AutoCommit: disabled
> [junit4:junit4]   2> 7750 T2401 oashc.SpellCheckComponent.inform Initializing spell checkers
> [junit4:junit4]   2> 7756 T2401 oass.DirectSolrSpellChecker.init init: {name=direct,classname=DirectSolrSpellChecker,field=lowerfilt,minQueryLength=3}
> [junit4:junit4]   2> 7810 T2460 oasc.SolrCore.registerSearcher [collection1] Registered new searcher Searcher@65b3f958 main{StandardDirectoryReader(segments_1:1)}
> [junit4:junit4]   2> 8130 T2422 oascc.ZkStateReader.updateClusterState Updating cloud state from ZooKeeper... 
> [junit4:junit4]   2> 8143 T2459 oascc.ZkStateReader$2.process A cluster state change has occurred - updating...
> [junit4:junit4]   2> 8143 T2435 oascc.ZkStateReader$2.process A cluster state change has occurred - updating...
> [junit4:junit4]   2> 8143 T2421 oascc.ZkStateReader$2.process A cluster state change has occurred - updating...
> [junit4:junit4]   2> 8143 T2447 oascc.ZkStateReader$2.process A cluster state change has occurred - updating...
> [junit4:junit4]   2> 8315 T2401 oasc.CoreContainer.register registering core: collection1
> [junit4:junit4]   2> 8315 T2401 oasc.ZkController.register Register shard - core:collection1 address:http://127.0.0.1:49275/solr shardId:shard1
> [junit4:junit4]   2> 8318 T2401 oasc.ZkController.register We are http://127.0.0.1:49275/solr/collection1/ and leader is http://127.0.0.1:49269/solr/collection1/
> [junit4:junit4]   2> 8318 T2401 oasc.ZkController.register No LogReplay needed for core=collection1 baseURL=http://127.0.0.1:49275/solr
> [junit4:junit4]   2> 8319 T2401 oasc.ZkController.checkRecovery Core needs to recover:collection1
> [junit4:junit4]   2> 8319 T2401 oasu.DefaultSolrCoreState.doRecovery Running recovery - first canceling any ongoing recovery
> [junit4:junit4]   2> ASYNC  NEW_CORE C170 name=collection1 org.apache.solr.core.SolrCore@777870fe url=http://127.0.0.1:49275/solr/collection1 node=127.0.0.1:49275_solr
> [junit4:junit4]   2> 8320 T2461 C170 P49275 oasc.RecoveryStrategy.run Starting recovery process.  core=collection1 recoveringAfterStartup=true
> [junit4:junit4]   2> 8321 T2401 oascc.ZkStateReader.updateClusterState Updating cloud state from ZooKeeper... 
> [junit4:junit4]   2> 8321 T2461 C170 P49275 oasc.RecoveryStrategy.doRecovery ###### startupVersions=[]
> [junit4:junit4]   2> 8322 T2401 oass.SolrDispatchFilter.init user.dir=/usr/home/hudson/hudson-slave/workspace/Lucene-Solr-Tests-4.x-Java6/solr/build/solr-core/test/J1
> [junit4:junit4]   2> 8322 T2401 oass.SolrDispatchFilter.init SolrDispatchFilter.init() done
> [junit4:junit4]   2> 8322 T2461 C170 P49275 oasc.RecoveryStrategy.doRecovery Attempting to PeerSync from http://127.0.0.1:49269/solr/collection1/ core=collection1 - recoveringAfterStartup=true
> [junit4:junit4]   2> 8323 T2461 C170 P49275 oasu.PeerSync.sync PeerSync: core=collection1 url=http://127.0.0.1:49275/solr START replicas=[http://127.0.0.1:49269/solr/collection1/] nUpdates=100
> [junit4:junit4]   2> 8323 T2401 oascsi.HttpClientUtil.createClient Creating new http client, config:maxConnections=128&maxConnectionsPerHost=32&followRedirects=false
> [junit4:junit4]   2> 8323 T2461 C170 P49275 oasu.PeerSync.sync WARNING no frame of reference to tell of we've missed updates
> [junit4:junit4]   2> 8323 T2461 C170 P49275 oasc.RecoveryStrategy.doRecovery PeerSync Recovery was not successful - trying replication. core=collection1
> [junit4:junit4]   2> 8324 T2461 C170 P49275 oasc.RecoveryStrategy.doRecovery Starting Replication Recovery. core=collection1
> [junit4:junit4]   2> 8324 T2461 C170 P49275 oascsi.HttpClientUtil.createClient Creating new http client, config:maxConnections=128&maxConnectionsPerHost=32&followRedirects=false
> [junit4:junit4]   2> ASYNC  NEW_CORE C171 name=collection1 org.apache.solr.core.SolrCore@464d2d7b url=http://127.0.0.1:49269/solr/collection1 node=127.0.0.1:49269_solr
> [junit4:junit4]   2> 8330 T2427 C171 P49269 REQ /get {distrib=false&qt=/get&wt=javabin&version=2&getVersions=100} status=0 QTime=0 
> [junit4:junit4]   2> 8647 T2422 oascc.ZkStateReader.updateClusterState Updating cloud state from ZooKeeper... 
> [junit4:junit4]   2> 8679 T2459 oascc.ZkStateReader$2.process A cluster state change has occurred - updating...
> [junit4:junit4]   2> 8679 T2435 oascc.ZkStateReader$2.process A cluster state change has occurred - updating...
> [junit4:junit4]   2> 8679 T2421 oascc.ZkStateReader$2.process A cluster state change has occurred - updating...
> [junit4:junit4]   2> 8679 T2447 oascc.ZkStateReader$2.process A cluster state change has occurred - updating...
> [junit4:junit4]   2> 8805 T2401 oejs.Server.doStart jetty-8.1.2.v20120308
> [junit4:junit4]   2> 8808 T2401 oejs.AbstractConnector.doStart Started SocketConnector@0.0.0.0:49279
> [junit4:junit4]   2> 8808 T2401 oasc.SolrResourceLoader.locateSolrHome JNDI not configured for solr (NoInitialContextEx)
> [junit4:junit4]   2> 8809 T2401 oasc.SolrResourceLoader.locateSolrHome using system property solr.solr.home: /usr/home/hudson/hudson-slave/workspace/Lucene-Solr-Tests-4.x-Java6/solr/build/solr-core/test/J1/./solrtest-jetty4-1347849333990
> [junit4:junit4]   2> 8809 T2401 oasc.SolrResourceLoader.<init> new SolrResourceLoader for deduced Solr Home: '/usr/home/hudson/hudson-slave/workspace/Lucene-Solr-Tests-4.x-Java6/solr/build/solr-core/test/J1/./solrtest-jetty4-1347849333990/'
> [junit4:junit4]   2> 8845 T2401 oass.SolrDispatchFilter.init SolrDispatchFilter.init()
> [junit4:junit4]   2> 8845 T2401 oasc.SolrResourceLoader.locateSolrHome JNDI not configured for solr (NoInitialContextEx)
> [junit4:junit4]   2> 8846 T2401 oasc.SolrResourceLoader.locateSolrHome using system property solr.solr.home: /usr/home/hudson/hudson-slave/workspace/Lucene-Solr-Tests-4.x-Java6/solr/build/solr-core/test/J1/./solrtest-jetty4-1347849333990
> [junit4:junit4]   2> 8846 T2401 oasc.CoreContainer$Initializer.initialize looking for solr.xml: /usr/home/hudson/hudson-slave/workspace/Lucene-Solr-Tests-4.x-Java6/solr/build/solr-core/test/J1/./solrtest-jetty4-1347849333990/solr.xml
> [junit4:junit4]   2> 8847 T2401 oasc.CoreContainer.<init> New CoreContainer 2014700696
> [junit4:junit4]   2> 8847 T2401 oasc.CoreContainer.load Loading CoreContainer using Solr Home: '/usr/home/hudson/hudson-slave/workspace/Lucene-Solr-Tests-4.x-Java6/solr/build/solr-core/test/J1/./solrtest-jetty4-1347849333990/'
> [junit4:junit4]   2> 8848 T2401 oasc.SolrResourceLoader.<init> new SolrResourceLoader for directory: '/usr/home/hudson/hudson-slave/workspace/Lucene-Solr-Tests-4.x-Java6/solr/build/solr-core/test/J1/./solrtest-jetty4-1347849333990/'
> [junit4:junit4]   2> 8872 T2401 oasc.CoreContainer.load Registering Log Listener
> [junit4:junit4]   2> 8888 T2401 oasc.CoreContainer.initZooKeeper Zookeeper client=127.0.0.1:49261/solr
> [junit4:junit4]   2> 8888 T2401 oaz.ZooKeeper.<init> Initiating client connection, connectString=127.0.0.1:49261/solr sessionTimeout=5000 watcher=org.apache.solr.common.cloud.ConnectionManager@29425b91
> [junit4:junit4]   2> 8889 T2472 oaz.ClientCnxn$SendThread.startConnect Opening socket connection to server /127.0.0.1:49261
> [junit4:junit4]   2> 8889 T2401 oascc.ConnectionManager.waitForConnected Waiting for client to connect to ZooKeeper
> [junit4:junit4]   2> 8890 T2472 oaz.ClientCnxn$SendThread.primeConnection Socket connection established to localhost/127.0.0.1:49261, initiating session
> [junit4:junit4]   2> 8891 T2403 oazs.NIOServerCnxn$Factory.run Accepted socket connection from /140.211.11.196:49280
> [junit4:junit4]   2> 8891 T2403 oazs.NIOServerCnxn.readConnectRequest Client attempting to establish new session at /140.211.11.196:49280
> [junit4:junit4]   2> 8892 T2405 oazs.NIOServerCnxn.finishSessionInit Established session 0x139d2148c5f0006 with negotiated timeout 5000 for client /140.211.11.196:49280
> [junit4:junit4]   2> 8892 T2472 oaz.ClientCnxn$SendThread.readConnectResult Session establishment complete on server localhost/127.0.0.1:49261, sessionid = 0x139d2148c5f0006, negotiated timeout = 5000
> [junit4:junit4]   2> 8893 T2473 oascc.ConnectionManager.process Watcher org.apache.solr.common.cloud.ConnectionManager@29425b91 name:ZooKeeperConnection Watcher:127.0.0.1:49261/solr got event WatchedEvent state:SyncConnected type:None path:null path:null type:None
> [junit4:junit4]   2> 8893 T2401 oascc.ConnectionManager.waitForConnected Client is connected to ZooKeeper
> [junit4:junit4]   2> 8894 T2406 oazs.PrepRequestProcessor.pRequest Got user-level KeeperException when processing sessionid:0x139d2148c5f0006 type:create cxid:0x1 zxid:0xfffffffffffffffe txntype:unknown reqpath:n/a Error Path:/solr/overseer Error:KeeperErrorCode = NodeExists for /solr/overseer
> [junit4:junit4]   2> 8895 T2406 oazs.PrepRequestProcessor.pRequest Got user-level KeeperException when processing sessionid:0x139d2148c5f0006 type:create cxid:0x2 zxid:0xfffffffffffffffe txntype:unknown reqpath:n/a Error Path:/solr/overseer Error:KeeperErrorCode = NodeExists for /solr/overseer
> [junit4:junit4]   2> 8930 T2401 oasc.ZkController.createEphemeralLiveNode Register node as live in ZooKeeper:/live_nodes/127.0.0.1:49279_solr
> [junit4:junit4]   2> 8931 T2406 oazs.PrepRequestProcessor.pRequest Got user-level KeeperException when processing sessionid:0x139d2148c5f0006 type:delete cxid:0x4 zxid:0xfffffffffffffffe txntype:unknown reqpath:n/a Error Path:/solr/live_nodes/127.0.0.1:49279_solr Error:KeeperErrorCode = NoNode for /solr/live_nodes/127.0.0.1:49279_solr
> [junit4:junit4]   2> 8932 T2401 oascc.SolrZkClient.makePath makePath: /live_nodes/127.0.0.1:49279_solr
> [junit4:junit4]   2> 8934 T2459 oascc.ZkStateReader$3.process Updating live nodes
> [junit4:junit4]   2> 8934 T2435 oascc.ZkStateReader$3.process Updating live nodes
> [junit4:junit4]   2> 8934 T2421 oascc.ZkStateReader$3.process Updating live nodes
> [junit4:junit4]   2> 8934 T2447 oascc.ZkStateReader$3.process Updating live nodes
> [junit4:junit4]   2> 8934 T2401 oashc.HttpShardHandlerFactory.getParameter Setting socketTimeout to: 0
> [junit4:junit4]   2> 8935 T2401 oashc.HttpShardHandlerFactory.getParameter Setting urlScheme to: http://
> [junit4:junit4]   2> 8935 T2401 oashc.HttpShardHandlerFactory.getParameter Setting connTimeout to: 0
> [junit4:junit4]   2> 8936 T2401 oashc.HttpShardHandlerFactory.getParameter Setting maxConnectionsPerHost to: 20
> [junit4:junit4]   2> 8936 T2401 oashc.HttpShardHandlerFactory.getParameter Setting corePoolSize to: 0
> [junit4:junit4]   2> 8937 T2401 oashc.HttpShardHandlerFactory.getParameter Setting maximumPoolSize to: 2147483647
> [junit4:junit4]   2> 8937 T2401 oashc.HttpShardHandlerFactory.getParameter Setting maxThreadIdleTime to: 5
> [junit4:junit4]   2> 8938 T2401 oashc.HttpShardHandlerFactory.getParameter Setting sizeOfQueue to: -1
> [junit4:junit4]   2> 8938 T2401 oashc.HttpShardHandlerFactory.getParameter Setting fairnessPolicy to: false
> [junit4:junit4]   2> 8939 T2401 oascsi.HttpClientUtil.createClient Creating new http client, config:maxConnectionsPerHost=20&maxConnections=10000&socketTimeout=0&connTimeout=0&retry=false
> [junit4:junit4]   2> 8956 T2401 oascc.ZkStateReader.createClusterStateWatchersAndUpdate Updating cluster state from ZooKeeper... 
> [junit4:junit4]   2> 8961 T2401 oasc.CoreContainer.create Creating SolrCore 'collection1' using instanceDir: /usr/home/hudson/hudson-slave/workspace/Lucene-Solr-Tests-4.x-Java6/solr/build/solr-core/test/J1/./solrtest-jetty4-1347849333990/collection1
> [junit4:junit4]   2> 8962 T2401 oasc.ZkController.createCollectionZkNode Check for collection zkNode:collection1
> [junit4:junit4]   2> 8962 T2401 oasc.ZkController.createCollectionZkNode Collection zkNode exists
> [junit4:junit4]   2> 8963 T2401 oasc.ZkController.readConfigName Load collection config from:/collections/collection1
> [junit4:junit4]   2> 8964 T2401 oasc.SolrResourceLoader.<init> new SolrResourceLoader for directory: '/usr/home/hudson/hudson-slave/workspace/Lucene-Solr-Tests-4.x-Java6/solr/build/solr-core/test/J1/./solrtest-jetty4-1347849333990/collection1/'
> [junit4:junit4]   2> 8965 T2401 oasc.SolrResourceLoader.replaceClassLoader Adding 'file:/usr/home/hudson/hudson-slave/workspace/Lucene-Solr-Tests-4.x-Java6/solr/build/solr-core/test/J1/solrtest-jetty4-1347849333990/collection1/lib/classes/' to classloader
> [junit4:junit4]   2> 8966 T2401 oasc.SolrResourceLoader.replaceClassLoader Adding 'file:/usr/home/hudson/hudson-slave/workspace/Lucene-Solr-Tests-4.x-Java6/solr/build/solr-core/test/J1/solrtest-jetty4-1347849333990/collection1/lib/README' to classloader
> [junit4:junit4]   2> 9022 T2401 oasc.SolrConfig.<init> Using Lucene MatchVersion: LUCENE_40
> [junit4:junit4]   2> 9094 T2401 oasc.SolrConfig.<init> Loaded SolrConfig: solrconfig.xml
> [junit4:junit4]   2> 9195 T2401 oass.IndexSchema.readSchema Reading Solr Schema
> [junit4:junit4]   2> 9201 T2401 oass.IndexSchema.readSchema Schema name=test
> [junit4:junit4]   2> 9823 T2401 oass.OpenExchangeRatesOrgProvider.init Initialized with rates=open-exchange-rates.json, refreshInterval=1440.
> [junit4:junit4]   2> 9836 T2401 oass.IndexSchema.readSchema default search field in schema is text
> [junit4:junit4]   2> 9840 T2401 oass.IndexSchema.readSchema unique key field: id
> [junit4:junit4]   2> 9850 T2401 oass.FileExchangeRateProvider.reload Reloading exchange rates from file currency.xml
> [junit4:junit4]   2> 9855 T2401 oass.FileExchangeRateProvider.reload Reloading exchange rates from file currency.xml
> [junit4:junit4]   2> 9859 T2401 oass.OpenExchangeRatesOrgProvider.reload Reloading exchange rates from open-exchange-rates.json
> [junit4:junit4]   2> 9860 T2401 oass.OpenExchangeRatesOrgProvider.reload Reloading exchange rates from open-exchange-rates.json
> [junit4:junit4]   2> 9861 T2401 oasc.SolrCore.<init> [collection1] Opening new SolrCore at /usr/home/hudson/hudson-slave/workspace/Lucene-Solr-Tests-4.x-Java6/solr/build/solr-core/test/J1/./solrtest-jetty4-1347849333990/collection1/, dataDir=./org.apache.solr.cloud.BasicDistributedZk2Test-1347849325656/jetty4/
> [junit4:junit4]   2> 9862 T2401 oasc.JmxMonitoredMap.<init> JMX monitoring is enabled. Adding Solr mbeans to JMX Server: com.sun.jmx.mbeanserver.JmxMBeanServer@35ecfe07
> [junit4:junit4]   2> 9863 T2401 oasc.SolrCore.getNewIndexDir WARNING New index directory detected: old=null new=./org.apache.solr.cloud.BasicDistributedZk2Test-1347849325656/jetty4/index/
> [junit4:junit4]   2> 9864 T2401 oasc.SolrCore.initIndex WARNING [collection1] Solr index directory './org.apache.solr.cloud.BasicDistributedZk2Test-1347849325656/jetty4/index' doesn't exist. Creating new index...
> [junit4:junit4]   2> 9865 T2401 oasc.CachingDirectoryFactory.get return new directory for /usr/home/hudson/hudson-slave/workspace/Lucene-Solr-Tests-4.x-Java6/solr/build/solr-core/test/J1/./org.apache.solr.cloud.BasicDistributedZk2Test-1347849325656/jetty4/index forceNew:false
> [junit4:junit4]   2> 9889 T2401 oasc.SolrDeletionPolicy.onCommit SolrDeletionPolicy.onCommit: commits:num=1
> [junit4:junit4]   2>        commit{dir=NRTCachingDirectory(org.apache.lucene.store.NIOFSDirectory@/usr/home/hudson/hudson-slave/workspace/Lucene-Solr-Tests-4.x-Java6/solr/build/solr-core/test/J1/org.apache.solr.cloud.BasicDistributedZk2Test-1347849325656/jetty4/index lockFactory=org.apache.lucene.store.NativeFSLockFactory@1e345bb7; maxCacheMB=48.0 maxMergeSizeMB=4.0),segFN=segments_1,generation=1,filenames=[segments_1]
> [junit4:junit4]   2> 9889 T2401 oasc.SolrDeletionPolicy.updateCommits newest commit = 1
> [junit4:junit4]   2> 9890 T2401 oasc.SolrCore.initWriters created xml: solr.XMLResponseWriter
> [junit4:junit4]   2> 9893 T2401 oasup.UpdateRequestProcessorChain.init inserting DistributedUpdateProcessorFactory into updateRequestProcessorChain "dedupe"
> [junit4:junit4]   2> 9893 T2401 oasup.UpdateRequestProcessorChain.init inserting DistributedUpdateProcessorFactory into updateRequestProcessorChain "dedupe-allfields"
> [junit4:junit4]   2> 9894 T2401 oasup.UpdateRequestProcessorChain.init inserting DistributedUpdateProcessorFactory into updateRequestProcessorChain "stored_sig"
> [junit4:junit4]   2> 9894 T2401 oasup.UpdateRequestProcessorChain.init inserting DistributedUpdateProcessorFactory into updateRequestProcessorChain "uniq-fields"
> [junit4:junit4]   2> 9895 T2401 oasup.UpdateRequestProcessorChain.init inserting DistributedUpdateProcessorFactory into updateRequestProcessorChain "distrib-dup-test-chain-implicit"
> [junit4:junit4]   2> 9896 T2401 oasc.RequestHandlers.initHandlersFromConfig adding lazy requestHandler: solr.ReplicationHandler
> [junit4:junit4]   2> 9896 T2401 oasc.RequestHandlers.initHandlersFromConfig created /replication: solr.ReplicationHandler
> [junit4:junit4]   2> 9897 T2401 oasc.RequestHandlers.initHandlersFromConfig created standard: solr.StandardRequestHandler
> [junit4:junit4]   2> 9898 T2401 oasc.RequestHandlers.initHandlersFromConfig created /get: solr.RealTimeGetHandler
> [junit4:junit4]   2> 9898 T2401 oasc.RequestHandlers.initHandlersFromConfig created dismax: solr.SearchHandler
> [junit4:junit4]   2> 9899 T2401 oasc.RequestHandlers.initHandlersFromConfig created mock: org.apache.solr.core.MockQuerySenderListenerReqHandler
> [junit4:junit4]   2> 9900 T2401 oasc.RequestHandlers.initHandlersFromConfig created /admin/: org.apache.solr.handler.admin.AdminHandlers
> [junit4:junit4]   2> 9900 T2401 oasc.RequestHandlers.initHandlersFromConfig created defaults: solr.StandardRequestHandler
> [junit4:junit4]   2> 9901 T2401 oasc.RequestHandlers.initHandlersFromConfig adding lazy requestHandler: solr.StandardRequestHandler
> [junit4:junit4]   2> 9901 T2401 oasc.RequestHandlers.initHandlersFromConfig created lazy: solr.StandardRequestHandler
> [junit4:junit4]   2> 9902 T2401 oasc.RequestHandlers.initHandlersFromConfig created /update: solr.UpdateRequestHandler
> [junit4:junit4]   2> 9903 T2401 oasc.RequestHandlers.initHandlersFromConfig created /terms: org.apache.solr.handler.component.SearchHandler
> [junit4:junit4]   2> 9904 T2401 oasc.RequestHandlers.initHandlersFromConfig created spellCheckCompRH: org.apache.solr.handler.component.SearchHandler
> [junit4:junit4]   2> 9904 T2401 oasc.RequestHandlers.initHandlersFromConfig created spellCheckCompRH_Direct: org.apache.solr.handler.component.SearchHandler
> [junit4:junit4]   2> 9905 T2401 oasc.RequestHandlers.initHandlersFromConfig created spellCheckWithWordbreak: org.apache.solr.handler.component.SearchHandler
> [junit4:junit4]   2> 9906 T2401 oasc.RequestHandlers.initHandlersFromConfig created spellCheckWithWordbreak_Direct: org.apache.solr.handler.component.SearchHandler
> [junit4:junit4]   2> 9906 T2401 oasc.RequestHandlers.initHandlersFromConfig created spellCheckCompRH1: org.apache.solr.handler.component.SearchHandler
> [junit4:junit4]   2> 9907 T2401 oasc.RequestHandlers.initHandlersFromConfig created tvrh: org.apache.solr.handler.component.SearchHandler
> [junit4:junit4]   2> 9908 T2401 oasc.RequestHandlers.initHandlersFromConfig created /mlt: solr.MoreLikeThisHandler
> [junit4:junit4]   2> 9908 T2401 oasc.RequestHandlers.initHandlersFromConfig created /debug/dump: solr.DumpRequestHandler
> [junit4:junit4]   2> 9912 T2401 oashl.XMLLoader.init xsltCacheLifetimeSeconds=60
> [junit4:junit4]   2> 9917 T2401 oasc.SolrCore.initDeprecatedSupport WARNING solrconfig.xml uses deprecated <admin/gettableFiles>, Please update your config to use the ShowFileRequestHandler.
> [junit4:junit4]   2> 9918 T2401 oasc.SolrCore.initDeprecatedSupport WARNING adding ShowFileRequestHandler with hidden files: [SCHEMA.XML, OLD_SYNONYMS.TXT, STOPWORDS.TXT, PROTWORDS.TXT, OPEN-EXCHANGE-RATES.JSON, SYNONYMS.TXT, CURRENCY.XML, MAPPING-ISOLATIN1ACCENT.TXT]
> [junit4:junit4]   2> 9922 T2401 oass.SolrIndexSearcher.<init> Opening Searcher@4b149f76 main
> [junit4:junit4]   2> 9923 T2401 oasu.CommitTracker.<init> Hard AutoCommit: disabled
> [junit4:junit4]   2> 9924 T2401 oasu.CommitTracker.<init> Soft AutoCommit: disabled
> [junit4:junit4]   2> 9925 T2401 oashc.SpellCheckComponent.inform Initializing spell checkers
> [junit4:junit4]   2> 9932 T2401 oass.DirectSolrSpellChecker.init init: {name=direct,classname=DirectSolrSpellChecker,field=lowerfilt,minQueryLength=3}
> [junit4:junit4]   2> 9983 T2474 oasc.SolrCore.registerSearcher [collection1] Registered new searcher Searcher@4b149f76 main{StandardDirectoryReader(segments_1:1)}
> [junit4:junit4]   2> 10185 T2422 oascc.ZkStateReader.updateClusterState Updating cloud state from ZooKeeper... 
> [junit4:junit4]   2> 10198 T2447 oascc.ZkStateReader$2.process A cluster state change has occurred - updating...
> [junit4:junit4]   2> 10198 T2435 oascc.ZkStateReader$2.process A cluster state change has occurred - updating...
> [junit4:junit4]   2> 10198 T2459 oascc.ZkStateReader$2.process A cluster state change has occurred - updating...
> [junit4:junit4]   2> 10198 T2421 oascc.ZkStateReader$2.process A cluster state change has occurred - updating...
> [junit4:junit4]   2> 10198 T2473 oascc.ZkStateReader$2.process A cluster state change has occurred - updating...
> [junit4:junit4]   2> 10489 T2401 oasc.CoreContainer.register registering core: collection1
> [junit4:junit4]   2> 10489 T2401 oasc.ZkController.register Register shard - core:collection1 address:http://127.0.0.1:49279/solr shardId:shard2
> [junit4:junit4]   2> 10492 T2401 oasc.ZkController.register We are http://127.0.0.1:49279/solr/collection1/ and leader is http://127.0.0.1:49272/solr/collection1/
> [junit4:junit4]   2> 10492 T2401 oasc.ZkController.register No LogReplay needed for core=collection1 baseURL=http://127.0.0.1:49279/solr
> [junit4:junit4]   2> 10492 T2401 oasc.ZkController.checkRecovery Core needs to recover:collection1
> [junit4:junit4]   2> 10492 T2401 oasu.DefaultSolrCoreState.doRecovery Running recovery - first canceling any ongoing recovery
> [junit4:junit4]   2> ASYNC  NEW_CORE C172 name=collection1 org.apache.solr.core.SolrCore@42924ba0 url=http://127.0.0.1:49279/solr/collection1 node=127.0.0.1:49279_solr
> [junit4:junit4]   2> 10493 T2475 C172 P49279 oasc.RecoveryStrategy.run Starting recovery process.  core=collection1 recoveringAfterStartup=true
> [junit4:junit4]   2> 10493 T2401 oascc.ZkStateReader.updateClusterState Updating cloud state from ZooKeeper... 
> [junit4:junit4]   2> 10494 T2475 C172 P49279 oasc.RecoveryStrategy.doRecovery ###### startupVersions=[]
> [junit4:junit4]   2> 10494 T2401 oass.SolrDispatchFilter.init user.dir=/usr/home/hudson/hudson-slave/workspace/Lucene-Solr-Tests-4.x-Java6/solr/build/solr-core/test/J1
> [junit4:junit4]   2> 10495 T2401 oass.SolrDispatchFilter.init SolrDispatchFilter.init() done
> [junit4:junit4]   2> 10495 T2475 C172 P49279 oasc.RecoveryStrategy.doRecovery Attempting to PeerSync from http://127.0.0.1:49272/solr/collection1/ core=collection1 - recoveringAfterStartup=true
> [junit4:junit4]   2> 10495 T2401 oascsi.HttpClientUtil.createClient Creating new http client, config:maxConnections=128&maxConnectionsPerHost=32&followRedirects=false
> [junit4:junit4]   2> 10495 T2475 C172 P49279 oasu.PeerSync.sync PeerSync: core=collection1 url=http://127.0.0.1:49279/solr START replicas=[http://127.0.0.1:49272/solr/collection1/] nUpdates=100
> [junit4:junit4]   2> 10496 T2475 C172 P49279 oasu.PeerSync.sync WARNING no frame of reference to tell of we've missed updates
> [junit4:junit4]   2> 10496 T2475 C172 P49279 oasc.RecoveryStrategy.doRecovery PeerSync Recovery was not successful - trying replication. core=collection1
> [junit4:junit4]   2> 10496 T2475 C172 P49279 oasc.RecoveryStrategy.doRecovery Starting Replication Recovery. core=collection1
> [junit4:junit4]   2> 10497 T2475 C172 P49279 oascsi.HttpClientUtil.createClient Creating new http client, config:maxConnections=128&maxConnectionsPerHost=32&followRedirects=false
> [junit4:junit4]   2> ASYNC  NEW_CORE C173 name=collection1 org.apache.solr.core.SolrCore@5850b563 url=http://127.0.0.1:49272/solr/collection1 node=127.0.0.1:49272_solr
> [junit4:junit4]   2> 10505 T2439 C173 P49272 REQ /get {distrib=false&qt=/get&wt=javabin&version=2&getVersions=100} status=0 QTime=0 
> [junit4:junit4]   2> 10508 T2401 oaz.ZooKeeper.<init> Initiating client connection, connectString=127.0.0.1:49261/solr sessionTimeout=10000 watcher=org.apache.solr.common.cloud.ConnectionManager@92f766b
> [junit4:junit4]   2> 10509 T2477 oaz.ClientCnxn$SendThread.startConnect Opening socket connection to server /127.0.0.1:49261
> [junit4:junit4]   2> 10509 T2401 oascc.ConnectionManager.waitForConnected Waiting for client to connect to ZooKeeper
> [junit4:junit4]   2> 10510 T2477 oaz.ClientCnxn$SendThread.primeConnection Socket connection established to localhost/127.0.0.1:49261, initiating session
> [junit4:junit4]   2> 10510 T2403 oazs.NIOServerCnxn$Factory.run Accepted socket connection from /140.211.11.196:49283
> [junit4:junit4]   2> 10510 T2403 oazs.NIOServerCnxn.readConnectRequest Client attempting to establish new session at /140.211.11.196:49283
> [junit4:junit4]   2> 10511 T2405 oazs.NIOServerCnxn.finishSessionInit Established session 0x139d2148c5f0007 with negotiated timeout 10000 for client /140.211.11.196:49283
> [junit4:junit4]   2> 10511 T2477 oaz.ClientCnxn$SendThread.readConnectResult Session establishment complete on server localhost/127.0.0.1:49261, sessionid = 0x139d2148c5f0007, negotiated timeout = 10000
> [junit4:junit4]   2> 10511 T2478 oascc.ConnectionManager.process Watcher org.apache.solr.common.cloud.ConnectionManager@92f766b name:ZooKeeperConnection Watcher:127.0.0.1:49261/solr got event WatchedEvent state:SyncConnected type:None path:null path:null type:None
> [junit4:junit4]   2> 10512 T2401 oascc.ConnectionManager.waitForConnected Client is connected to ZooKeeper
> [junit4:junit4]   2> 10512 T2401 oascc.ZkStateReader.createClusterStateWatchersAndUpdate Updating cluster state from ZooKeeper... 
> [junit4:junit4]   2> 10513 T2401 oasc.ChaosMonkey.monkeyLog monkey: init - expire sessions:true cause connection loss:true
> [junit4:junit4]   2> 10514 T2401 oascsi.HttpClientUtil.createClient Creating new http client, config:
> [junit4:junit4]   2> 10521 T2401 oascc.ZkStateReader.updateClusterState Updating cloud state from ZooKeeper... 
> [junit4:junit4]   2> ASYNC  NEW_CORE C174 name=collection1 org.apache.solr.core.SolrCore@25468ed8 url=http://127.0.0.1:49264/solr/collection1 node=127.0.0.1:49264_solr
> [junit4:junit4]   2> 10539 T2413 C174 P49264 oasc.SolrDeletionPolicy.onInit SolrDeletionPolicy.onInit: commits:num=1
> [junit4:junit4]   2>        commit{dir=NRTCachingDirectory(org.apache.lucene.store.NIOFSDirectory@/usr/home/hudson/hudson-slave/workspace/Lucene-Solr-Tests-4.x-Java6/solr/build/solr-core/test/J1/org.apache.solr.cloud.BasicDistributedZk2Test-1347849325656/control/data/index lockFactory=org.apache.lucene.store.NativeFSLockFactory@6c16417a; maxCacheMB=48.0 maxMergeSizeMB=4.0),segFN=segments_1,generation=1,filenames=[segments_1]
> [junit4:junit4]   2> 10539 T2413 C174 P49264 oasc.SolrDeletionPolicy.updateCommits newest commit = 1
> [junit4:junit4]   2> 10544 T2413 C174 P49264 /update {wt=javabin&version=2} {add=[1 (1413322465535328256)]} 0 16
> [junit4:junit4]   2> 10545 T2401 oaz.ZooKeeper.<init> Initiating client connection, connectString=127.0.0.1:49261/solr sessionTimeout=10000 watcher=org.apache.solr.common.cloud.ConnectionManager@144e8b6d
> [junit4:junit4]   2> 10546 T2479 oaz.ClientCnxn$SendThread.startConnect Opening socket connection to server /127.0.0.1:49261
> [junit4:junit4]   2> 10546 T2401 oascc.ConnectionManager.waitForConnected Waiting for client to connect to ZooKeeper
> [junit4:junit4]   2> 10547 T2479 oaz.ClientCnxn$SendThread.primeConnection Socket connection established to localhost/127.0.0.1:49261, initiating session
> [junit4:junit4]   2> 10547 T2403 oazs.NIOServerCnxn$Factory.run Accepted socket connection from /140.211.11.196:49286
> [junit4:junit4]   2> 10547 T2403 oazs.NIOServerCnxn.readConnectRequest Client attempting to establish new session at /140.211.11.196:49286
> [junit4:junit4]   2> 10548 T2405 oazs.NIOServerCnxn.finishSessionInit Established session 0x139d2148c5f0008 with negotiated timeout 10000 for client /140.211.11.196:49286
> [junit4:junit4]   2> 10548 T2479 oaz.ClientCnxn$SendThread.readConnectResult Session establishment complete on server localhost/127.0.0.1:49261, sessionid = 0x139d2148c5f0008, negotiated timeout = 10000
> [junit4:junit4]   2> 10548 T2480 oascc.ConnectionManager.process Watcher org.apache.solr.common.cloud.ConnectionManager@144e8b6d name:ZooKeeperConnection Watcher:127.0.0.1:49261/solr got event WatchedEvent state:SyncConnected type:None path:null path:null type:None
> [junit4:junit4]   2> 10549 T2401 oascc.ConnectionManager.waitForConnected Client is connected to ZooKeeper
> [junit4:junit4]   2> 10549 T2401 oascc.ZkStateReader.createClusterStateWatchersAndUpdate Updating cluster state from ZooKeeper... 
> [junit4:junit4]   2> 10556 T2429 C171 P49269 oasc.SolrDeletionPolicy.onInit SolrDeletionPolicy.onInit: commits:num=1
> [junit4:junit4]   2>        commit{dir=NRTCachingDirectory(org.apache.lucene.store.NIOFSDirectory@/usr/home/hudson/hudson-slave/workspace/Lucene-Solr-Tests-4.x-Java6/solr/build/solr-core/test/J1/org.apache.solr.cloud.BasicDistributedZk2Test-1347849325656/jetty1/index lockFactory=org.apache.lucene.store.NativeFSLockFactory@4d00a29a; maxCacheMB=48.0 maxMergeSizeMB=4.0),segFN=segments_1,generation=1,filenames=[segments_1]
> [junit4:junit4]   2> 10556 T2429 C171 P49269 oasc.SolrDeletionPolicy.updateCommits newest commit = 1
> [junit4:junit4]   2>  C170_STATE=coll:collection1 core:collection1 props:{shard=shard1, roles=null, state=recovering, core=collection1, collection=collection1, node_name=127.0.0.1:49275_solr, base_url=http://127.0.0.1:49275/solr}
> [junit4:junit4]   2> 10570 T2451 C170 P49275 oasc.SolrDeletionPolicy.onInit SolrDeletionPolicy.onInit: commits:num=1
> [junit4:junit4]   2>        commit{dir=NRTCachingDirectory(org.apache.lucene.store.NIOFSDirectory@/usr/home/hudson/hudson-slave/workspace/Lucene-Solr-Tests-4.x-Java6/solr/build/solr-core/test/J1/org.apache.solr.cloud.BasicDistributedZk2Test-1347849325656/jetty3/index lockFactory=org.apache.lucene.store.NativeFSLockFactory@65700089; maxCacheMB=48.0 maxMergeSizeMB=4.0),segFN=segments_1,generation=1,filenames=[segments_1]
> [junit4:junit4]   2> 10571 T2451 C170 P49275 oasc.SolrDeletionPolicy.updateCommits newest commit = 1
> [junit4:junit4]   2> 10574 T2451 C170 P49275 REQ /update {distrib.from=http://127.0.0.1:49269/solr/collection1/&update.distrib=FROMLEADER&wt=javabin&version=2} status=0 QTime=7 
> [junit4:junit4]   2> 10575 T2429 C171 P49269 /update {wt=javabin&version=2} {add=[1 (1413322465560494080)]} 0 24
> [junit4:junit4]   2> 10575 T2401 oasc.AbstractDistribZkTestBase.waitForRecoveriesToFinish Wait for recoveries to finish - collection: collection1 failOnTimeout:true timeout (sec):1800
> [junit4:junit4]   2> 10576 T2401 oascc.ZkStateReader.updateClusterState Updating cloud state from ZooKeeper... 
> [junit4:junit4]   2> 10701 T2422 oascc.ZkStateReader.updateClusterState Updating cloud state from ZooKeeper... 
> [junit4:junit4]   2> 10714 T2480 oascc.ZkStateReader$2.process A cluster state change has occurred - updating...
> [junit4:junit4]   2> 10714 T2459 oascc.ZkStateReader$2.process A cluster state change has occurred - updating...
> [junit4:junit4]   2> 10714 T2435 oascc.ZkStateReader$2.process A cluster state change has occurred - updating...
> [junit4:junit4]   2> 10714 T2473 oascc.ZkStateReader$2.process A cluster state change has occurred - updating...
> [junit4:junit4]   2> 10714 T2421 oascc.ZkStateReader$2.process A cluster state change has occurred - updating...
> [junit4:junit4]   2> 10714 T2447 oascc.ZkStateReader$2.process A cluster state change has occurred - updating...
> [junit4:junit4]   2> 10714 T2478 oascc.ZkStateReader$2.process A cluster state change has occurred - updating...
> [junit4:junit4]   2> 11340 T2461 C170 P49275 oasc.RecoveryStrategy.doRecovery Begin buffering updates. core=collection1
> [junit4:junit4]   2> 11340 T2461 C170 P49275 oasu.UpdateLog.bufferUpdates Starting to buffer updates. FSUpdateLog{state=ACTIVE, tlog=tlog{file=./org.apache.solr.cloud.BasicDistributedZk2Test-1347849325656/jetty3/tlog/tlog.0000000000000000000 refcount=1}}
> [junit4:junit4]   2> 11341 T2461 C170 P49275 oasc.RecoveryStrategy.replicate Attempting to replicate from http://127.0.0.1:49269/solr/collection1/. core=collection1
> [junit4:junit4]   2> 11341 T2461 C170 P49275 oascsi.HttpClientUtil.createClient Creating new http client, config:maxConnections=128&maxConnectionsPerHost=32&followRedirects=false
> [junit4:junit4]   2> 11351 T2430 C171 P49269 oasu.DirectUpdateHandler2.commit start commit{flags=0,_version_=0,optimize=false,openSearcher=true,waitSearcher=true,expungeDeletes=false,softCommit=false}
> [junit4:junit4]   2> 11378 T2430 C171 P49269 oasc.SolrDeletionPolicy.onCommit SolrDeletionPolicy.onCommit: commits:num=2
> [junit4:junit4]   2>        commit{dir=NRTCachingDirectory(org.apache.lucene.store.NIOFSDirectory@/usr/home/hudson/hudson-slave/workspace/Lucene-Solr-Tests-4.x-Java6/solr/build/solr-core/test/J1/org.apache.solr.cloud.BasicDistributedZk2Test-1347849325656/jetty1/index lockFactory=org.apache.lucene.store.NativeFSLockFactory@4d00a29a; maxCacheMB=48.0 maxMergeSizeMB=4.0),segFN=segments_1,generation=1,filenames=[segments_1]
> [junit4:junit4]   2>        commit{dir=NRTCachingDirectory(org.apache.lucene.store.NIOFSDirectory@/usr/home/hudson/hudson-slave/workspace/Lucene-Solr-Tests-4.x-Java6/solr/build/solr-core/test/J1/org.apache.solr.cloud.BasicDistributedZk2Test-1347849325656/jetty1/index lockFactory=org.apache.lucene.store.NativeFSLockFactory@4d00a29a; maxCacheMB=48.0 maxMergeSizeMB=4.0),segFN=segments_2,generation=2,filenames=[_0.fnm, _0.frq, _0.tim, _0_nrm.cfe, segments_2, _0.fdx, _0_nrm.cfs, _0.si, _0.prx, _0.tip, _0.fdt]
> [junit4:junit4]   2> 11379 T2430 C171 P49269 oasc.SolrDeletionPolicy.updateCommits newest commit = 2
> [junit4:junit4]   2> 11385 T2430 C171 P49269 oass.SolrIndexSearcher.<init> Opening Searcher@1552dc19 main
> [junit4:junit4]   2> 11386 T2430 C171 P49269 oasu.DirectUpdateHandler2.commit end_commit_flush
> [junit4:junit4]   2> 11387 T2436 oasc.SolrCore.registerSearcher [collection1] Registered new searcher Searcher@1552dc19 main{StandardDirectoryReader(segments_2:3 _0(4.0.0.2):C1)}
> [junit4:junit4]   2> 11387 T2430 C171 P49269 /update {waitSearcher=true&commit=true&commit_end_point=true&wt=javabin&softCommit=false&version=2} {commit=} 0 36
> [junit4:junit4]   2> 11388 T2461 C170 P49275 oash.ReplicationHandler.inform Commits will be reserved for  10000
> [junit4:junit4]   2> 11388 T2461 C170 P49275 oash.SnapPuller.<init>  No value set for 'pollInterval'. Timer Task not started.
> [junit4:junit4]   2> 11390 T2431 C171 P49269 oash.ReplicationHandler.inform Commits will be reserved for  10000
> [junit4:junit4]   2> 11390 T2431 C171 P49269 REQ /replication {command=indexversion&wt=javabin&qt=/replication&version=2} status=0 QTime=1 
> [junit4:junit4]   2> 11391 T2461 C170 P49275 oash.SnapPuller.fetchLatestIndex Master's generation: 2
> [junit4:junit4]   2> 11391 T2461 C170 P49275 oash.SnapPuller.fetchLatestIndex Slave's generation: 1
> [junit4:junit4]   2> 11391 T2461 C170 P49275 oash.SnapPuller.fetchLatestIndex Starting replication process
> [junit4:junit4]   2> 11394 T2431 C171 P49269 REQ /replication {command=filelist&generation=2&wt=javabin&qt=/replication&version=2} status=0 QTime=1 
> [junit4:junit4]   2> 11394 T2461 C170 P49275 oash.SnapPuller.fetchLatestIndex Number of files in latest index in master: 11
> [junit4:junit4]   2> 11398 T2461 C170 P49275 oash.SnapPuller.fetchLatestIndex Starting download to ./org.apache.solr.cloud.BasicDistributedZk2Test-1347849325656/jetty3/index.20120917113537048 fullCopy=true
> [junit4:junit4]   2> 11401 T2431 C171 P49269 REQ /replication {file=_0.fnm&command=filecontent&checksum=true&generation=2&qt=/replication&wt=filestream} status=0 QTime=0 
> [junit4:junit4]   2> 11406 T2431 C171 P49269 REQ /replication {file=_0_nrm.cfe&command=filecontent&checksum=true&generation=2&qt=/replication&wt=filestream} status=0 QTime=0 
> [junit4:junit4]   2> 11410 T2431 C171 P49269 REQ /replication {file=_0.tim&command=filecontent&checksum=true&generation=2&qt=/replication&wt=filestream} status=0 QTime=0 
> [junit4:junit4]   2> 11414 T2431 C171 P49269 REQ /replication {file=_0.frq&command=filecontent&checksum=true&generation=2&qt=/replication&wt=filestream} status=0 QTime=0 
> [junit4:junit4]   2> 11418 T2431 C171 P49269 REQ /replication {file=segments_2&command=filecontent&checksum=true&generation=2&qt=/replication&wt=filestream} status=0 QTime=0 
> [junit4:junit4]   2> 11422 T2431 C171 P49269 REQ /replication {file=_0.fdx&command=filecontent&checksum=true&generation=2&qt=/replication&wt=filestream} status=0 QTime=0 
> [junit4:junit4]   2> 11426 T2431 C171 P49269 REQ /replication {file=_0_nrm.cfs&command=filecontent&checksum=true&generation=2&qt=/replication&wt=filestream} status=0 QTime=0 
> [junit4:junit4]   2> 11430 T2431 C171 P49269 REQ /replication {file=_0.si&command=filecontent&checksum=true&generation=2&qt=/replication&wt=filestream} status=0 QTime=0 
> [junit4:junit4]   2> 11434 T2431 C171 P49269 REQ /replication {file=_0.tip&command=filecontent&checksum=true&generation=2&qt=/replication&wt=filestream} status=0 QTime=0 
> [junit4:junit4]   2> 11438 T2431 C171 P49269 REQ /replication {file=_0.prx&command=filecontent&checksum=true&generation=2&qt=/replication&wt=filestream} status=0 QTime=0 
> [junit4:junit4]   2> 11442 T2431 C171 P49269 REQ /replication {file=_0.fdt&command=filecontent&checksum=true&generation=2&qt=/replication&wt=filestream} status=0 QTime=0 
> [junit4:junit4]   2> 11443 T2461 C170 P49275 oash.SnapPuller.fetchLatestIndex Total time taken for download : 0 secs
> [junit4:junit4]   2> 11444 T2461 C170 P49275 oash.SnapPuller.modifyIndexProps New index installed. Updating index properties... index=index.20120917113537048
> [junit4:junit4]   2> 11445 T2461 C170 P49275 oasu.DefaultSolrCoreState.newIndexWriter Creating new IndexWriter...
> [junit4:junit4]   2> 11446 T2461 C170 P49275 oasu.DefaultSolrCoreState.newIndexWriter Waiting until IndexWriter is unused... core=collection1
> [junit4:junit4]   2> 11446 T2461 C170 P49275 oasu.DefaultSolrCoreState.newIndexWriter Rollback old IndexWriter... core=collection1
> [junit4:junit4]   2> 11451 T2461 C170 P49275 oasc.SolrCore.getNewIndexDir WARNING New index directory detected: old=./org.apache.solr.cloud.BasicDistributedZk2Test-1347849325656/jetty3/index/ new=./org.apache.solr.cloud.BasicDistributedZk2Test-1347849325656/jetty3/index.20120917113537048
> [junit4:junit4]   2> 11451 T2461 C170 P49275 oasc.CachingDirectoryFactory.get return new directory for /usr/home/hudson/hudson-slave/workspace/Lucene-Solr-Tests-4.x-Java6/solr/build/solr-core/test/J1/./org.apache.solr.cloud.BasicDistributedZk2Test-1347849325656/jetty3/index.20120917113537048 forceNew:true
> [junit4:junit4]   2> 11458 T2461 C170 P49275 oasc.SolrDeletionPolicy.onInit SolrDeletionPolicy.onInit: commits:num=1
> [junit4:junit4]   2>        commit{dir=NRTCachingDirectory(org.apache.lucene.store.NIOFSDirectory@/usr/home/hudson/hudson-slave/workspace/Lucene-Solr-Tests-4.x-Java6/solr/build/solr-core/test/J1/org.apache.solr.cloud.BasicDistributedZk2Test-1347849325656/jetty3/index.20120917113537048 lockFactory=org.apache.lucene.store.NativeFSLockFactory@2f6b0d19; maxCacheMB=48.0 maxMergeSizeMB=4.0),segFN=segments_2,generation=2,filenames=[_0.fnm, _0_nrm.cfe, _0.tim, _0.frq, segments_2, _0.fdx, _0_nrm.cfs, _0.si, _0.tip, _0.prx, _0.fdt]
> [junit4:junit4]   2> 11458 T2461 C170 P49275 oasc.SolrDeletionPolicy.updateCommits newest commit = 2
> [junit4:junit4]   2> 11459 T2461 C170 P49275 oasu.DefaultSolrCoreState.newIndexWriter New IndexWriter is ready to be used.
> [junit4:junit4]   2> 11461 T2461 C170 P49275 oass.SolrIndexSearcher.<init> Opening Searcher@4e99e5eb main
> [junit4:junit4]   2> 11463 T2460 oasc.SolrCore.registerSearcher [collection1] Registered new searcher Searcher@4e99e5eb main{StandardDirectoryReader(segments_2:3:nrt _0(4.0.0.2):C1)}
> [junit4:junit4]   2> 11463 T2460 oasc.CachingDirectoryFactory.close Closing directory:/usr/home/hudson/hudson-slave/workspace/Lucene-Solr-Tests-4.x-Java6/solr/build/solr-core/test/J1/./org.apache.solr.cloud.BasicDistributedZk2Test-1347849325656/jetty3/index
> [junit4:junit4]   2> 11463 T2460 oash.SnapPuller$2.onClose removing old index directory ./org.apache.solr.cloud.BasicDistributedZk2Test-1347849325656/jetty3/index
> [junit4:junit4]   2> 11465 T2461 C170 P49275 oasu.DirectUpdateHandler2.commit start commit{flags=0,_version_=0,optimize=false,openSearcher=false,waitSearcher=false,expungeDeletes=false,softCommit=false}
> [junit4:junit4]   2> 11466 T2461 C170 P49275 oasu.DirectUpdateHandler2.commit end_commit_flush
> [junit4:junit4]   2> 11467 T2461 C170 P49275 oasc.RecoveryStrategy.replay Replaying buffered documents. core=collection1
> [junit4:junit4]   2> 11467 T2483 C170 P49275 oasu.UpdateLog$LogReplayer.doReplay WARNING Starting log replay tlog{file=./org.apache.solr.cloud.BasicDistributedZk2Test-1347849325656/jetty3/tlog/tlog.0000000000000000000 refcount=2} active=true starting pos=430
> [junit4:junit4]   2> 11467 T2483 C170 P49275 oasu.DirectUpdateHandler2.commit start commit{flags=2,_version_=0,optimize=false,openSearcher=true,waitSearcher=true,expungeDeletes=false,softCommit=false}
> [junit4:junit4]   2> 11468 T2483 C170 P49275 oass.SolrIndexSearcher.<init> Opening Searcher@32abf8c9 main
> [junit4:junit4]   2> 11469 T2483 C170 P49275 oasu.DirectUpdateHandler2.commit end_commit_flush
> [junit4:junit4]   2> 11470 T2460 oasc.SolrCore.registerSearcher [collection1] Registered new searcher Searcher@32abf8c9 main{StandardDirectoryReader(segments_2:3:nrt _0(4.0.0.2):C1)}
> [junit4:junit4]   2> 11471 T2483 C170 P49275 oasu.UpdateLog$LogReplayer.run WARNING Log replay finished. recoveryInfo=RecoveryInfo{adds=0 deletes=0 deleteByQuery=0 errors=0 positionOfStart=430}
> [junit4:junit4]   2> 11471 T2461 C170 P49275 oasc.RecoveryStrategy.doRecovery Replication Recovery was successful - registering as Active. core=collection1
> [junit4:junit4]   2> 11472 T2461 C170 P49275 oasc.RecoveryStrategy.doRecovery Finished recovery process. core=collection1
> [junit4:junit4]   2> 11577 T2401 oascc.ZkStateReader.updateClusterState Updating cloud state from ZooKeeper... 
> [junit4:junit4]   2> 11719 T2422 oascc.ZkStateReader.updateClusterState Updating cloud state from ZooKeeper... 
> [junit4:junit4]   2> 11732 T2421 oascc.ZkStateReader$2.process A cluster state change has occurred - updating...
> [junit4:junit4]   2> 11732 T2447 oascc.ZkStateReader$2.process A cluster state change has occurred - updating...
> [junit4:junit4]   2> 11732 T2435 oascc.ZkStateReader$2.process A cluster state change has occurred - updating...
> [junit4:junit4]   2> 11732 T2480 oascc.ZkStateReader$2.process A cluster state change has occurred - updating...
> [junit4:junit4]   2> 11732 T2459 oascc.ZkStateReader$2.process A cluster state change has occurred - updating...
> [junit4:junit4]   2> 11732 T2473 oascc.ZkStateReader$2.process A cluster state change has occurred - updating...
> [junit4:junit4]   2> 11732 T2478 oascc.ZkStateReader$2.process A cluster state change has occurred - updating...
> [junit4:junit4]   2> 12579 T2401 oascc.ZkStateReader.updateClusterState Updating cloud state from ZooKeeper... 
> [junit4:junit4]   2>  C172_STATE=coll:collection1 core:collection1 props:{shard=shard2, roles=null, state=recovering, core=collection1, collection=collection1, node_name=127.0.0.1:49279_solr, base_url=http://127.0.0.1:49279/solr}
> [junit4:junit4]   2> 13513 T2475 C172 P49279 oasc.RecoveryStrategy.doRecovery Begin buffering updates. core=collection1
> [junit4:junit4]   2> 13513 T2475 C172 P49279 oasu.UpdateLog.bufferUpdates Starting to buffer updates. FSUpdateLog{state=ACTIVE, tlog=null}
> [junit4:junit4]   2> 13513 T2475 C172 P49279 oasc.RecoveryStrategy.replicate Attempting to replicate from http://127.0.0.1:49272/solr/collection1/. core=collection1
> [junit4:junit4]   2> 13513 T2475 C172 P49279 oascsi.HttpClientUtil.createClient Creating new http client, config:maxConnections=128&maxConnectionsPerHost=32&followRedirects=false
> [junit4:junit4]   2> 13528 T2441 C173 P49272 oasu.DirectUpdateHandler2.commit start commit{flags=0,_version_=0,optimize=false,openSearcher=true,waitSearcher=true,expungeDeletes=false,softCommit=false}
> [junit4:junit4]   2> 13533 T2441 C173 P49272 oasc.SolrDeletionPolicy.onInit SolrDeletionPolicy.onInit: commits:num=1
> [junit4:junit4]   2>        commit{dir=NRTCachingDirectory(org.apache.lucene.store.NIOFSDirectory@/usr/home/hudson/hudson-slave/workspace/Lucene-Solr-Tests-4.x-Java6/solr/build/solr-core/test/J1/org.apache.solr.cloud.BasicDistributedZk2Test-1347849325656/jetty2/index lockFactory=org.apache.lucene.store.NativeFSLockFactory@1b3ee2f4; maxCacheMB=48.0 maxMergeSizeMB=4.0),segFN=segments_1,generation=1,filenames=[segments_1]
> [junit4:junit4]   2> 13533 T2441 C173 P49272 oasc.SolrDeletionPolicy.updateCommits newest commit = 1
> [junit4:junit4]   2> 13535 T2441 C173 P49272 oass.SolrIndexSearcher.<init> Opening Searcher@24e5d3f2 main
> [junit4:junit4]   2> 13535 T2441 C173 P49272 oasu.DirectUpdateHandler2.commit end_commit_flush
> [junit4:junit4]   2> 13537 T2448 oasc.SolrCore.registerSearcher [collection1] Registered new searcher Searcher@24e5d3f2 main{StandardDirectoryReader(segments_1:1)}
> [junit4:junit4]   2> 13537 T2441 C173 P49272 /update {waitSearcher=true&commit=true&commit_end_point=true&wt=javabin&softCommit=false&version=2} {commit=} 0 9
> [junit4:junit4]   2> 13538 T2475 C172 P49279 oash.ReplicationHandler.inform Commits will be reserved for  10000
> [junit4:junit4]   2> 13538 T2475 C172 P49279 oash.SnapPuller.<init>  No value set for 'pollInterval'. Timer Task not started.
> [junit4:junit4]   2> 13540 T2442 C173 P49272 oash.ReplicationHandler.inform Commits will be reserved for  10000
> [junit4:junit4]   2> 13540 T2442 C173 P49272 REQ /replication {command=indexversion&wt=javabin&qt=/replication&version=2} status=0 QTime=1 
> [junit4:junit4]   2> 13544 T2475 C172 P49279 oasc.SolrDeletionPolicy.onInit SolrDeletionPolicy.onInit: commits:num=1
> [junit4:junit4]   2>        commit{dir=NRTCachingDirectory(org.apache.lucene.store.NIOFSDirectory@/usr/home/hudson/hudson-slave/workspace/Lucene-Solr-Tests-4.x-Java6/solr/build/solr-core/test/J1/org.apache.solr.cloud.BasicDistributedZk2Test-1347849325656/jetty4/index lockFactory=org.apache.lucene.store.NativeFSLockFactory@1e345bb7; maxCacheMB=48.0 maxMergeSizeMB=4.0),segFN=segments_1,generation=1,filenames=[segments_1]
> [junit4:junit4]   2> 13544 T2475 C172 P49279 oasc.SolrDeletionPolicy.updateCommits newest commit = 1
> [junit4:junit4]   2> 13545 T2475 C172 P49279 oasu.DirectUpdateHandler2.commit start commit{flags=0,_version_=0,optimize=false,openSearcher=true,waitSearcher=true,expungeDeletes=false,softCommit=false}
> [junit4:junit4]   2> 13549 T2475 C172 P49279 oasc.SolrDeletionPolicy.onCommit SolrDeletionPolicy.onCommit: commits:num=2
> [junit4:junit4]   2>        commit{dir=NRTCachingDirectory(org.apache.lucene.store.NIOFSDirectory@/usr/home/hudson/hudson-slave/workspace/Lucene-Solr-Tests-4.x-Java6/solr/build/solr-core/test/J1/org.apache.solr.cloud.BasicDistributedZk2Test-1347849325656/jetty4/index lockFactory=org.apache.lucene.store.NativeFSLockFactory@1e345bb7; maxCacheMB=48.0 maxMergeSizeMB=4.0),segFN=segments_1,generation=1,filenames=[segments_1]
> [junit4:junit4]   2>        commit{dir=NRTCachingDirectory(org.apache.lucene.store.NIOFSDirectory@/usr/home/hudson/hudson-slave/workspace/Lucene-Solr-Tests-4.x-Java6/solr/build/solr-core/test/J1/org.apache.solr.cloud.BasicDistributedZk2Test-1347849325656/jetty4/index lockFactory=org.apache.lucene.store.NativeFSLockFactory@1e345bb7; maxCacheMB=48.0 maxMergeSizeMB=4.0),segFN=segments_2,generation=2,filenames=[segments_2]
> [junit4:junit4]   2> 13550 T2475 C172 P49279 oasc.SolrDeletionPolicy.updateCommits newest commit = 2
> [junit4:junit4]   2> 13553 T2475 C172 P49279 oass.SolrIndexSearcher.<init> Opening Searcher@1c9e944 main
> [junit4:junit4]   2> 13553 T2475 C172 P49279 oasu.DirectUpdateHandler2.commit end_commit_flush
> [junit4:junit4]   2> 13554 T2474 oasc.SolrCore.registerSearcher [collection1] Registered new searcher Searcher@1c9e944 main{StandardDirectoryReader(segments_2:2)}
> [junit4:junit4]   2> 13554 T2475 C172 P49279 oasc.RecoveryStrategy.replay No replay needed. core=collection1
> [junit4:junit4]   2> 13555 T2475 C172 P49279 oasc.RecoveryStrategy.doRecovery Replication Recovery was successful - registering as Active. core=collection1
> [junit4:junit4]   2> 13564 T2475 C172 P49279 oasc.RecoveryStrategy.doRecovery Finished recovery process. core=collection1
> [junit4:junit4]   2> 13581 T2401 oascc.ZkStateReader.updateClusterState Updating cloud state from ZooKeeper... 
> [junit4:junit4]   2> 13738 T2422 oascc.ZkStateReader.updateClusterState Updating cloud state from ZooKeeper... 
> [junit4:junit4]   2> 13767 T2473 oascc.ZkStateReader$2.process A cluster state change has occurred - updating...
> [junit4:junit4]   2> 13767 T2435 oascc.ZkStateReader$2.process A cluster state change has occurred - updating...
> [junit4:junit4]   2> 13767 T2459 oascc.ZkStateReader$2.process A cluster state change has occurred - updating...
> [junit4:junit4]   2> 13767 T2421 oascc.ZkStateReader$2.process A cluster state change has occurred - updating...
> [junit4:junit4]   2> 13767 T2478 oascc.ZkStateReader$2.process A cluster state change has occurred - updating...
> [junit4:junit4]   2> 13767 T2447 oascc.ZkStateReader$2.process A cluster state change has occurred - updating...
> [junit4:junit4]   2> 13767 T2480 oascc.ZkStateReader$2.process A cluster state change has occurred - updating...
> [junit4:junit4]   2> 14583 T2401 oascc.ZkStateReader.updateClusterState Updating cloud state from ZooKeeper... 
> [junit4:junit4]   2> 14586 T2413 C174 P49264 oasu.DirectUpdateHandler2.commit start commit{flags=0,_version_=0,optimize=false,openSearcher=true,waitSearcher=true,expungeDeletes=false,softCommit=false}
> [junit4:junit4]   2> 14649 T2413 C174 P49264 oasc.SolrDeletionPolicy.onCommit SolrDeletionPolicy.onCommit: commits:num=2
> [junit4:junit4]   2>        commit{dir=NRTCachingDirectory(org.apache.lucene.store.NIOFSDirectory@/usr/home/hudson/hudson-slave/workspace/Lucene-Solr-Tests-4.x-Java6/solr/build/solr-core/test/J1/org.apache.solr.cloud.BasicDistributedZk2Test-1347849325656/control/data/index lockFactory=org.apache.lucene.store.NativeFSLockFactory@6c16417a; maxCacheMB=48.0 maxMergeSizeMB=4.0),segFN=segments_1,generation=1,filenames=[segments_1]
> [junit4:junit4]   2>        commit{dir=NRTCachingDirectory(org.apache.lucene.store.NIOFSDirectory@/usr/home/hudson/hudson-slave/workspace/Lucene-Solr-Tests-4.x-Java6/solr/build/solr-core/test/J1/org.apache.solr.cloud.BasicDistributedZk2Test-1347849325656/control/data/index lockFactory=org.apache.lucene.store.NativeFSLockFactory@6c16417a; maxCacheMB=48.0 maxMergeSizeMB=4.0),segFN=segments_2,generation=2,filenames=[_0.fnm, _0.frq, _0.tim, _0_nrm.cfe, segments_2, _0.fdx, _0_nrm.cfs, _0.si, _0.prx, _0.tip, _0.fdt]
> [junit4:junit4]   2> 14650 T2413 C174 P49264 oasc.SolrDeletionPolicy.updateCommits newest commit = 2
> [junit4:junit4]   2> 14659 T2413 C174 P49264 oass.SolrIndexSearcher.<init> Opening Searcher@72bfd23d main
> [junit4:junit4]   2> 14660 T2413 C174 P49264 oasu.DirectUpdateHandler2.commit end_commit_flush
> [junit4:junit4]   2> 14661 T2424 oasc.SolrCore.registerSearcher [collection1] Registered new searcher Searcher@72bfd23d main{StandardDirectoryReader(segments_2:3 _0(4.0.0.2):C1)}
> [junit4:junit4]   2> 14661 T2413 C174 P49264 /update {waitSearcher=true&wt=javabin&commit=true&softCommit=false&version=2} {commit=} 0 75
> [junit4:junit4]   2> 14663 T2443 C173 P49272 oasu.DirectUpdateHandler2.commit start commit{flags=0,_version_=0,optimize=false,openSearcher=true,waitSearcher=true,expungeDeletes=false,softCommit=false}
> [junit4:junit4]   2> 14667 T2443 C173 P49272 oass.SolrIndexSearcher.<init> Opening Searcher@78508f6e main
> [junit4:junit4]   2> 14667 T2443 C173 P49272 oasu.DirectUpdateHandler2.commit end_commit_flush
> [junit4:junit4]   2> 14669 T2448 oasc.SolrCore.registerSearcher [collection1] Registered new searcher Searcher@78508f6e main{StandardDirectoryReader(segments_1:1)}
> [junit4:junit4]   2> 14669 T2443 C173 P49272 oasu.SolrCmdDistributor.distribCommit Distrib commit to:[StdNode: http://127.0.0.1:49269/solr/collection1/, StdNode: http://127.0.0.1:49275/solr/collection1/, StdNode: http://127.0.0.1:49279/solr/collection1/]
> [junit4:junit4]   2> 14671 T2432 C171 P49269 oasu.DirectUpdateHandler2.commit start commit{flags=0,_version_=0,optimize=false,openSearcher=true,waitSearcher=true,expungeDeletes=false,softCommit=false}
> [junit4:junit4]   2>  C170_STATE=coll:collection1 core:collection1 props:{shard=shard1, roles=null, state=active, core=collection1, collection=collection1, node_name=127.0.0.1:49275_solr, base_url=http://127.0.0.1:49275/solr}
> [junit4:junit4]   2> 14672 T2451 C170 P49275 oasu.DirectUpdateHandler2.commit start commit{flags=0,_version_=0,optimize=false,openSearcher=true,waitSearcher=true,expungeDeletes=false,softCommit=false}
> [junit4:junit4]   2> 14674 T2451 C170 P49275 oass.SolrIndexSearcher.<init> Opening Searcher@26a0cbe0 main
> [junit4:junit4]   2> 14674 T2451 C170 P49275 oasu.DirectUpdateHandler2.commit end_commit_flush
> [junit4:junit4]   2> 14676 T2460 oasc.SolrCore.registerSearcher [collection1] Registered new searcher Searcher@26a0cbe0 main{StandardDirectoryReader(segments_2:3:nrt _0(4.0.0.2):C1)}
> [junit4:junit4]   2> 14677 T2451 C170 P49275 /update {waitSearcher=true&commit=true&wt=javabin&commit_end_point=true&expungeDeletes=false&softCommit=false&version=2} {commit=} 0 5
> [junit4:junit4]   2> 14678 T2432 C171 P49269 oass.SolrIndexSearcher.<init> Opening Searcher@3de56dfa main
> [junit4:junit4]   2> 14678 T2432 C171 P49269 oasu.DirectUpdateHandler2.commit end_commit_flush
> [junit4:junit4]   2> 14679 T2436 oasc.SolrCore.registerSearcher [collection1] Registered new searcher Searcher@3de56dfa main{StandardDirectoryReader(segments_2:3 _0(4.0.0.2):C1)}
> [junit4:junit4]   2> 14680 T2432 C171 P49269 /update {waitSearcher=true&commit=true&wt=javabin&commit_end_point=true&expungeDeletes=false&softCommit=false&version=2} {commit=} 0 9
> [junit4:junit4]   2>  C172_STATE=coll:collection1 core:collection1 props:{shard=shard2, roles=null, state=active, core=collection1, collection=collection1, node_name=127.0.0.1:49279_solr, base_url=http://127.0.0.1:49279/solr}
> [junit4:junit4]   2> 14682 T2465 C172 P49279 oasu.DirectUpdateHandler2.commit start commit{flags=0,_version_=0,optimize=false,openSearcher=true,waitSearcher=true,expungeDeletes=false,softCommit=false}
> [junit4:junit4]   2> 14685 T2465 C172 P49279 oass.SolrIndexSearcher.<init> Opening Searcher@127cf3c main
> [junit4:junit4]   2> 14686 T2465 C172 P49279 oasu.DirectUpdateHandler2.commit end_commit_flush
> [junit4:junit4]   2> 14687 T2474 oasc.SolrCore.registerSearcher [collection1] Registered new searcher Searcher@127cf3c main{StandardDirectoryReader(segments_2:2)}
> [junit4:junit4]   2> 14687 T2465 C172 P49279 /update {waitSearcher=true&commit=true&wt=javabin&commit_end_point=true&expungeDeletes=false&softCommit=false&version=2} {commit=} 0 5
> [junit4:junit4]   2> 14688 T2443 C173 P49272 /update {waitSearcher=true&wt=javabin&commit=true&softCommit=false&version=2} {commit=} 0 25
> [junit4:junit4]   2> 14693 T2414 C174 P49264 REQ /select {fl=id,score&shard.url=127.0.0.1:49264/solr/collection1/&NOW=1347849340343&start=0&q=*:*&distrib=false&isShard=true&wt=javabin&fsv=true&rows=10&version=2} hits=1 status=0 QTime=0 
> [junit4:junit4]   2> 14696 T2414 C174 P49264 REQ /select {shard.url=127.0.0.1:49264/solr/collection1/&NOW=1347849340343&q=*:*&ids=1&distrib=false&isShard=true&wt=javabin&version=2} status=0 QTime=0 
> [junit4:junit4]   2> 14697 T2413 C174 P49264 REQ /select {wt=javabin&q=*:*&version=2} hits=1 status=0 QTime=7 
> [junit4:junit4]   2> 14698 T2401 oaz.ZooKeeper.<init> Initiating client connection, connectString=127.0.0.1:49261/solr sessionTimeout=10000 watcher=org.apache.solr.common.cloud.ConnectionManager@1fbac2c1
> [junit4:junit4]   2> 14699 T2488 oaz.ClientCnxn$SendThread.startConnect Opening socket connection to server /127.0.0.1:49261
> [junit4:junit4]   2> 14699 T2401 oascc.ConnectionManager.waitForConnected Waiting for client to connect to ZooKeeper
> [junit4:junit4]   2> 14699 T2488 oaz.ClientCnxn$SendThread.primeConnection Socket connection established to localhost/127.0.0.1:49261, initiating session
> [junit4:junit4]   2> 14700 T2403 oazs.NIOServerCnxn$Factory.run Accepted socket connection from /140.211.11.196:49300
> [junit4:junit4]   2> 14700 T2403 oazs.NIOServerCnxn.readConnectRequest Client attempting to establish new session at /140.211.11.196:49300
> [junit4:junit4]   2> 14701 T2405 oazs.NIOServerCnxn.finishSessionInit Established session 0x139d2148c5f0009 with negotiated timeout 10000 for client /140.211.11.196:49300
> [junit4:junit4]   2> 14701 T2488 oaz.ClientCnxn$SendThread.readConnectResult Session establishment complete on server localhost/127.0.0.1:49261, sessionid = 0x139d2148c5f0009, negotiated timeout = 10000
> [junit4:junit4]   2> 14701 T2489 oascc.ConnectionManager.process Watcher org.apache.solr.common.cloud.ConnectionManager@1fbac2c1 name:ZooKeeperConnection Watcher:127.0.0.1:49261/solr got event WatchedEvent state:SyncConnected type:None path:null path:null type:None
> [junit4:junit4]   2> 14702 T2401 oascc.ConnectionManager.waitForConnected Client is connected to ZooKeeper
> [junit4:junit4]   2> 14702 T2401 oascc.ZkStateReader.createClusterStateWatchersAndUpdate Updating cluster state from ZooKeeper... 
> [junit4:junit4]   2> 14703 T2406 oazs.PrepRequestProcessor.pRequest Processed session termination for sessionid: 0x139d2148c5f0009
> [junit4:junit4]   2> 14704 T2489 oaz.ClientCnxn$EventThread.run EventThread shut down
> [junit4:junit4]   2> 14704 T2401 oaz.ZooKeeper.close Session: 0x139d2148c5f0009 closed
> [junit4:junit4]   2> 14704 T2403 oazs.NIOServerCnxn.closeSock Closed socket connection for client /140.211.11.196:49300 which had sessionid 0x139d2148c5f0009
> [junit4:junit4]   2> 14706 T2433 C171 P49269 REQ /select {distrib=false&wt=javabin&q=*:*&version=2} hits=1 status=0 QTime=0 
> [junit4:junit4]   2> 14708 T2444 C173 P49272 REQ /select {distrib=false&wt=javabin&q=*:*&version=2} hits=0 status=0 QTime=0 
> [junit4:junit4]   2> 14712 T2428 C171 P49269 REQ /select {fl=id,score&shard.url=127.0.0.1:49269/solr/collection1/|127.0.0.1:49275/solr/collection1/&NOW=1347849340362&start=0&q=*:*&distrib=false&isShard=true&wt=javabin&fsv=true&rows=10&version=2} hits=1 status=0 QTime=0 
> [junit4:junit4]   2> 14712 T2445 C173 P49272 REQ /select {fl=id,score&shard.url=127.0.0.1:49272/solr/collection1/|127.0.0.1:49279/solr/collection1/&NOW=1347849340362&start=0&q=*:*&distrib=false&isShard=true&wt=javabin&fsv=true&rows=10&version=2} hits=0 status=0 QTime=0 
> [junit4:junit4]   2> 14715 T2428 C171 P49269 REQ /select {shard.url=127.0.0.1:49269/solr/collection1/|127.0.0.1:49275/solr/collection1/&NOW=1347849340362&q=*:*&ids=1&distrib=false&isShard=true&wt=javabin&version=2} status=0 QTime=0 
> [junit4:junit4]   2> 14716 T2466 C172 P49279 REQ /select {wt=javabin&q=*:*&version=2} hits=1 status=0 QTime=7 
> [junit4:junit4]   2> 14723 T2413 C174 P49264 /update {wt=javabin&version=2} {add=[2 (1413322469929910272)]} 0 4
> [junit4:junit4]   2> 14736 T2465 C172 P49279 REQ /update {distrib.from=http://127.0.0.1:49272/solr/collection1/&update.distrib=FROMLEADER&wt=javabin&version=2} status=0 QTime=4 
> [junit4:junit4]   2> 14736 T2443 C173 P49272 /update {wt=javabin&version=2} {add=[2 (1413322469937250304)]} 0 10
> [junit4:junit4]   2> 14741 T2413 C174 P49264 /update {wt=javabin&version=2} {add=[3 (1413322469950881792)]} 0 2
> [junit4:junit4]   2> 14749 T2465 C172 P49279 REQ /update {distrib.from=http://127.0.0.1:49272/solr/collection1/&update.distrib=FROMLEADER&wt=javabin&version=2} status=0 QTime=2 
> [junit4:junit4]   2> 14749 T2443 C173 P49272 /update {wt=javabin&version=2} {add=[3 (1413322469955076096)]} 0 6
> [junit4:junit4]   2> 14754 T2413 C174 P49264 /update {wt=javabin&version=2} {add=[4 (1413322469964513280)]} 0 2
> [junit4:junit4]   2> 14766 T2451 C170 P49275 REQ /update {update.distrib=FROMLEADER&distrib.from=http://127.0.0.1:49269/solr/collection1/&wt=javabin&version=2} status=0 QTime=3 
> [junit4:junit4]   2> 14766 T2432 C171 P49269 REQ /update {distrib.from=http://127.0.0.1:49272/solr/collection1/&update.distrib=TOLEADER&wt=javabin&version=2} status=0 QTime=8 
> [junit4:junit4]   2> 14767 T2443 C173 P49272 /update {wt=javabin&version=2} {add=[4]} 0 11
> [junit4:junit4]   2> 14771 T2413 C174 P49264 /update {wt=javabin&version=2} {add=[5 (1413322469982339072)]} 0 2
> [junit4:junit4]   2> 14779 T2465 C172 P49279 REQ /update {distrib.from=http://127.0.0.1:49272/solr/collection1/&update.distrib=FROMLEADER&wt=javabin&version=2} status=0 QTime=2 
> [junit4:junit4]   2> 14780 T2443 C173 P49272 /update {wt=javabin&version=2} {add=[5 (1413322469986533376)]} 0 7
> [junit4:junit4]   2> 14784 T2413 C174 P49264 /update {wt=javabin&version=2} {add=[6 (1413322469995970560)]} 0 2
> [junit4:junit4]   2> 14794 T2465 C172 P49279 REQ /update {update.distrib=FROMLEADER&distrib.from=http://127.0.0.1:49272/solr/collection1/&wt=javabin&version=2} status=0 QTime=2 
> [junit4:junit4]   2> 14795 T2440 C173 P49272 REQ /update {distrib.from=http://127.0.0.1:49269/solr/collection1/&update.distrib=TOLEADER&wt=javabin&version=2} status=0 QTime=7 
> [junit4:junit4]   2> 14795 T2429 C171 P49269 /update {wt=javabin&version=2} {add=[6]} 0 9
> [junit4:junit4]   2> 14800 T2413 C174 P49264 /update {wt=javabin&version=2} {add=[7 (1413322470012747776)]} 0 2
> [junit4:junit4]   2> 14809 T2465 C172 P49279 REQ /update {distrib.from=http://127.0.0.1:49272/solr/collection1/&update.distrib=FROMLEADER&wt=javabin&version=2} status=0 QTime=2 
> [junit4:junit4]   2> 14810 T2443 C173 P49272 /update {wt=javabin&version=2} {add=[7 (1413322470017990656)]} 0 7
> [junit4:junit4]   2> 14814 T2413 C174 P49264 /update {wt=javabin&version=2} {add=[8 (1413322470027427840)]} 0 2
> [junit4:junit4]   2> 14826 T2451 C170 P49275 REQ /update {distrib.from=http://127.0.0.1:49269/solr/collection1/&update.distrib=FROMLEADER&wt=javabin&version=2} status=0 QTime=1 
> [junit4:junit4]   2> 14827 T2429 C171 P49269 /update {wt=javabin&version=2} {add=[8 (1413322470032670720)]} 0 10
> [junit4:junit4]   2> 14831 T2413 C174 P49264 /update {wt=javabin&version=2} {add=[9 (1413322470046302208)]} 0 1
> [junit4:junit4]   2> 14841 T2465 C172 P49279 REQ /update {update.distrib=FROMLEADER&distrib.from=http://127.0.0.1:49272/solr/collection1/&wt=javabin&version=2} status=0 QTime=1 
> [junit4:junit4]   2> 14842 T2440 C173 P49272 REQ /update {distrib.from=http://127.0.0.1:49269/solr/collection1/&update.distrib=TOLEADER&wt=javabin&version=2} status=0 QTime=6 
> [junit4:junit4]   2> 14842 T2429 C171 P49269 /update {wt=javabin&version=2} {add=[9]} 0 8
> [junit4:junit4]   2> 14847 T2413 C174 P49264 /update {wt=javabin&version=2} {add=[10 (1413322470062030848)]} 0 2
> [junit4:junit4]   2> 14854 T2451 C170 P49275 REQ /update {distrib.from=http://127.0.0.1:49269/solr/collection1/&update.distrib=FROMLEADER&wt=javabin&version=2} status=0 QTime=1 
> [junit4:junit4]   2> 14855 T2429 C171 P49269 /update {wt=javabin&version=2} {add=[10 (1413322470067273728)]} 0 5
> [junit4:junit4]   2> 14862 T2413 C174 P49264 /update {wt=javabin&version=2} {add=[11 (1413322470074613760)]} 0 5
> [junit4:junit4]   2> 14872 T2451 C170 P49275 REQ /update {update.distrib=FROMLEADER&distrib.from=http://127.0.0.1:49269/solr/collection1/&wt=javabin&version=2} status=0 QTime=1 
> [junit4:junit4]   2> 14872 T2432 C171 P49269 REQ /update {distrib.from=http://127.0.0.1:49272/solr/collection1/&update.distrib=TOLEADER&wt=javabin&version=2} status=0 QTime=5 
> [junit4:junit4]   2> 14873 T2443 C173 P49272 /update {wt=javabin&version=2} {add=[11]} 0 8
> [junit4:junit4]   2> 14877 T2413 C174 P49264 /update {wt=javabin&version=2} {add=[12 (1413322470093488128)]} 0 2
> [junit4:junit4]   2> 14884 T2451 C170 P49275 REQ /update {distrib.from=http://127.0.0.1:49269/solr/collection1/&update.distrib=FROMLEADER&wt=javabin&version=2} status=0 QTime=1 
> [junit4:junit4]   2> 14884 T2429 C171 P49269 /update {wt=javabin&version=2} {add=[12 (1413322470097682432)]} 0 5
> [junit4:junit4]   2> 14888 T2413 C174 P49264 /update {wt=javabin&version=2} {add=[13 (1413322470106071040)]} 0 1
> [junit4:junit4]   2> 14895 T2451 C170 P49275 REQ /update {distrib.from=http://127.0.0.1:49269/solr/collection1/&update.distrib=FROMLEADER&wt=javabin&version=2} status=0 QTime=1 
> [junit4:junit4]   2> 14895 T2429 C171 P49269 /update {wt=javabin&version=2} {add=[13 (1413322470110265344)]} 0 4
> [junit4:junit4]   2> 14899 T2413 C174 P49264 /update {wt=javabin&version=2} {add=[14 (1413322470117605376)]} 0 1
> [junit4:junit4]   2> 14909 T2451 C170 P49275 REQ /update {update.distrib=FROMLEADER&distrib.from=http://127.0.0.1:49269/solr/collection1/&wt=javabin&version=2} status=0 QTime=2 
> [junit4:junit4]   2> 14909 T2432 C171 P49269 REQ /update {distrib.from=http://127.0.0.1:49272/solr/collection1/&update.distrib=TOLEADER&wt=javabin&version=2} status=0 QTime=6 
> [junit4:junit4]   2> 14910 T2443 C173 P49272 /update {wt=javabin&version=2} {add=[14]} 0 9
> [junit4:junit4]   2> 14914 T2413 C174 P49264 /update {wt=javabin&version=2} {add=[15 (1413322470133334016)]} 0 1
> [junit4:junit4]   2> 14922 T2451 C170 P49275 REQ /update {distrib.from=http://127.0.0.1:49269/solr/collection1/&update.distrib=FROMLEADER&wt=javabin&version=2} status=0 QTime=2 
> [junit4:junit4]   2> 14922 T2429 C171 P49269 /update {wt=javabin&version=2} {add=[15 (1413322470137528320)]} 0 5
> [junit4:junit4]   2> 14926 T2413 C174 P49264 /update {wt=javabin&version=2} {add=[16 (1413322470145916928)]} 0 1
> [junit4:junit4]   2> 14934 T2451 C170 P49275 REQ /update {distrib.from=http://127.0.0.1:49269/solr/collection1/&update.distrib=FROMLEADER&wt=javabin&version=2} status=0 QTime=2 
> [junit4:junit4]   2> 14934 T2429 C171 P49269 /update {wt=javabin&version=2} {add=[16 (1413322470150111232)]} 0 5
> [junit4:junit4]   2> 14941 T2413 C174 P49264 /update {wt=javabin&version=2} {add=[17 (1413322470159548416)]} 0 4
> [junit4:junit4]   2> 14952 T2465 C172 P49279 REQ /update {distrib.from=http://127.0.0.1:49272/solr/collection1/&update.distrib=FROMLEADER&wt=javabin&version=2} status=0 QTime=3 
> [junit4:junit4]   2> 14952 T2443 C173 P49272 /update {wt=javabin&version=2} {add=[17 (1413322470166888448)]} 0 8
> [junit4:junit4]   2> 14956 T2413 C174 P49264 /update {wt=javabin&version=2} {add=[100 (1413322470177374208)]} 0 1
> [junit4:junit4]   2> 14971 T2451 C170 P49275 REQ /update {distrib.from=http://127.0.0.1:49269/solr/collection1/&update.distrib=FROMLEADER&wt=javabin&version=2} status=0 QTime=5 
> [junit4:junit4]   2> 14971 T2429 C171 P49269 /update {wt=javabin&version=2} {add=[100 (1413322470180519936)]} 0 13
> [junit4:junit4]   2> 14975 T2413 C174 P49264 /update {wt=javabin&version=2} {add=[101 (1413322470197297152)]} 0 1
> [junit4:junit4]   2> 14987 T2451 C170 P49275 REQ /update {update.distrib=FROMLEADER&distrib.from=http://127.0.0.1:49269/solr/collection1/&wt=javabin&version=2} status=0 QTime=2 
> [junit4:junit4]   2> 14987 T2432 C171 P49269 REQ /update {distrib.from=http://127.0.0.1:49272/solr/collection1/&update.distrib=TOLEADER&wt=javabin&version=2} status=0 QTime=7 
> [junit4:junit4]   2> 14988 T2443 C173 P49272 /update {wt=javabin&version=2} {add=[101]} 0 10
> [junit4:junit4]   2> 14991 T2413 C174 P49264 /update {wt=javabin&version=2} {add=[102 (1413322470214074368)]} 0 1
> [junit4:junit4]   2> 14997 T2451 C170 P49275 REQ /update {distrib.from=http://127.0.0.1:49269/solr/collection1/&update.distrib=FROMLEADER&wt=javabin&version=2} status=0 QTime=1 
> [junit4:junit4]   2> 14997 T2429 C171 P49269 /update {wt=javabin&version=2} {add=[102 (1413322470217220096)]} 0 4
> [junit4:junit4]   2> 15005 T2413 C174 P49264 /update {wt=javabin&version=2} {add=[103 (1413322470224560128)]} 0 5
> [junit4:junit4]   2> 15013 T2465 C172 P49279 REQ /update {distrib.from=http://127.0.0.1:49272/solr/collection1/&update.distrib=FROMLEADER&wt=javabin&version=2} status=0 QTime=1 
> [junit4:junit4]   2> 15014 T2443 C173 P49272 /update {wt=javabin&version=2} {add=[103 (1413322470232948736)]} 0 6
> [junit4:junit4]   2> 15018 T2413 C174 P49264 /update {wt=javabin&version=2} {add=[104 (1413322470241337344)]} 0 2
> [junit4:junit4]   2> 15024 T2465 C172 P49279 REQ /update {distrib.from=http://127.0.0.1:49272/solr/collection1/&update.distrib=FROMLEADER&wt=javabin&version=2} status=0 QTime=1 
> [junit4:junit4]   2> 15024 T2443 C173 P49272 /update {wt=javabin&version=2} {add=[104 (1413322470245531648)]} 0 4
> [junit4:junit4]   2> 15028 T2413 C174 P49264 /update {wt=javabin&version=2} {add=[105 (1413322470252871680)]} 0 1
> [junit4:junit4]   2> 15043 T2465 C172 P49279 REQ /update {distrib.from=http://127.0.0.1:49272/solr/collection1/&update.distrib=FROMLEADER&wt=javabin&version=2} status=0 QTime=5 
> [junit4:junit4]   2> 15043 T2443 C173 P49272 /update {wt=javabin&version=2} {add=[105 (1413322470256017408)]} 0 13
> [junit4:junit4]   2> 15047 T2413 C174 P49264 /update {wt=javabin&version=2} {add=[106 (1413322470272794624)]} 0 1
> [junit4:junit4]   2> 15056 T2465 C172 P49279 REQ /update {update.distrib=FROMLEADER&distrib.from=http://127.0.0.1:49272/solr/collection1/&wt=javabin&version=2} status=0 QTime=1 
> [junit4:junit4]   2> 15057 T2440 C173 P49272 REQ /update {distrib.from=http://127.0.0.1:49269/solr/collection1/&update.distrib=TOLEADER&wt=javabin&version=2} status=0 QTime=6 
> [junit4:junit4]   2> 15058 T2429 C171 P49269 /update {wt=javabin&version=2} {add=[106]} 0 9
> [junit4:junit4]   2> 15061 T2413 C174 P49264 /update {wt=javabin&version=2} {add=[107 (1413322470287474688)]} 0 1
> [junit4:junit4]   2> 15068 T2451 C170 P49275 REQ /update {distrib.from=http://127.0.0.1:49269/solr/collection1/&update.distrib=FROMLEADER&wt=javabin&version=2} status=0 QTime=2 
> [junit4:junit4]   2> 15068 T2429 C171 P49269 /update {wt=javabin&version=2} {add=[107 (1413322470290620416)]} 0 5
> [junit4:junit4]   2> 15072 T2413 C174 P49264 /update {wt=javabin&version=2} {add=[108 (1413322470299009024)]} 0 1
> [junit4:junit4]   2> 15078 T2451 C170 P49275 REQ /update {distrib.from=http://127.0.0.1:49269/solr/collection1/&update.distrib=FROMLEADER&wt=javabin&version=2} status=0 QTime=1 
> [junit4:junit4]   2> 15078 T2429 C171 P49269 /update {wt=javabin&version=2} {add=[108 (1413322470302154752)]} 0 4
> [junit4:junit4]   2> 15082 T2413 C174 P49264 /update {wt=javabin&version=2} {add=[109 (1413322470309494784)]} 0 1
> [junit4:junit4]   2> 15090 T2451 C170 P49275 REQ /update {update.distrib=FROMLEADER&distrib.from=http://127.0.0.1:49269/solr/collection1/&wt=javabin&version=2} status=0 QTime=1 
> [junit4:junit4]   2> 15090 T2432 C171 P49269 REQ /update {distrib.from=http://127.0.0.1:49272/solr/collection1/&update.distrib=TOLEADER&wt=javabin&version=2} status=0 QTime=4 
> [junit4:junit4]   2> 15091 T2443 C173 P49272 /update {wt=javabin&version=2} {add=[109]} 0 7
> [junit4:junit4]   2> 15094 T2413 C174 P49264 /update {wt=javabin&version=2} {add=[110 (1413322470322077696)]} 0 1
> [junit4:junit4]   2> 15100 T2451 C170 P49275 REQ /update {distrib.from=http://127.0.0.1:49269/solr/collection1/&update.distrib=FROMLEADER&wt=javabin&version=2} status=0 QTime=1 
> [junit4:junit4]   2> 15100 T2429 C171 P49269 /update {wt=javabin&version=2} {add=[110 (1413322470325223424)]} 0 4
> [junit4:junit4]   2> 15104 T2413 C174 P49264 /update {wt=javabin&version=2} {add=[111 (1413322470332563456)]} 0 1
> [junit4:junit4]   2> 15112 T2451 C170 P49275 REQ /update {update.distrib=FROMLEADER&distrib.from=http://127.0.0.1:49269/solr/collection1/&wt=javabin&version=2} status=0 QTime=1 
> [junit4:junit4]   2> 15112 T2432 C171 P49269 REQ /update {distrib.from=http://127.0.0.1:49272/solr/collection1/&update.distrib=TOLEADER&wt=javabin&version=2} status=0 QTime=4 
> [junit4:junit4]   2> 15113 T2443 C173 P49272 /update {wt=javabin&version=2} {add=[111]} 0 7
> [junit4:junit4]   2> 15117 T2413 C174 P49264 /update {wt=javabin&version=2} {add=[112 (1413322470346194944)]} 0 1
> [junit4:junit4]   2> 15126 T2465 C172 P49279 REQ /update {update.distrib=FROMLEADER&distrib.from=http://127.0.0.1:49272/solr/collection1/&wt=javabin&version=2} status=0 QTime=1 
> [junit4:junit4]   2> 15126 T2440 C173 P49272 REQ /update {distrib.from=http://127.0.0.1:49269/solr/collection1/&update.distrib=TOLEADER&wt=javabin&version=2} status=0 QTime=4 
> [junit4:junit4]   2> 15127 T2429 C171 P49269 /update {wt=javabin&version=2} {add=[112]} 0 7
> [junit4:junit4]   2> 15135 T2413 C174 P49264 /update {wt=javabin&version=2} {add=[113 (1413322470360875008)]} 0 5
> [junit4:junit4]   2> 15143 T2451 C170 P49275 REQ /update {distrib.from=http://127.0.0.1:49269/solr/collection1/&update.distrib=FROMLEADER&wt=javabin&version=2} status=0 QTime=1 
> [junit4:junit4]   2> 15144 T2429 C171 P49269 /update {wt=javabin&version=2} {add=[113 (1413322470369263616)]} 0 6
> [junit4:junit4]   2> 15148 T2413 C174 P49264 /update {wt=javabin&version=2} {add=[114 (1413322470377652224)]} 0 2
> [junit4:junit4]   2> 15156 T2451 C170 P49275 REQ /update {update.distrib=FROMLEADER&distrib.from=http://127.0.0.1:49269/solr/collection1/&wt=javabin&version=2} status=0 QTime=1 
> [junit4:junit4]   2> 15156 T2432 C171 P49269 REQ /update {distrib.from=http://127.0.0.1:49272/solr/collection1/&update.distrib=TOLEADER&wt=javabin&version=2} status=0 QTime=4 
> [junit4:junit4]   2> 15157 T2443 C173 P49272 /update {wt=javabin&version=2} {add=[114]} 0 7
> [junit4:junit4]   2> 15161 T2413 C174 P49264 /update {wt=javabin&version=2} {add=[115 (1413322470392332288)]} 0 1
> [junit4:junit4]   2> 15171 T2465 C172 P49279 REQ /update {update.distrib=FROMLEADER&distrib.from=http://127.0.0.1:49272/solr/collection1/&wt=javabin&version=2} status=0 QTime=1 
> [junit4:junit4]   2> 15172 T2440 C173 P49272 REQ /update {distrib.from=http://127.0.0.1:49269/solr/collection1/&update.distrib=TOLEADER&wt=javabin&version=2} status=0 QTime=5 
> [junit4:junit4]   2> 15173 T2429 C171 P49269 /update {wt=javabin&version=2} {add=[115]} 0 9
> [junit4:junit4]   2> 15176 T2413 C174 P49264 /update {wt=javabin&version=2} {add=[116 (1413322470408060928)]} 0 1
> [junit4:junit4]   2> 15183 T2465 C172 P49279 REQ /update {distrib.from=http://127.0.0.1:49272/solr/collection1/&update.distrib=FROMLEADER&wt=javabin&version=2} status=0 QTime=1 
> [junit4:junit4]   2> 15184 T2443 C173 P49272 /update {wt=javabin&version=2} {add=[116 (1413322470412255232)]} 0 5
> [junit4:junit4]   2> 15187 T2413 C174 P49264 /update {wt=javabin&version=2} {add=[117 (1413322470419595264)]} 0 1
> [junit4:junit4]   2> 15193 T2465 C172 P49279 REQ /update {distrib.from=http://127.0.0.1:49272/solr/collection1/&update.distrib=FROMLEADER&wt=javabin&version=2} status=0 QTime=1 
> [junit4:junit4]   2> 15194 T2443 C173 P49272 /update {wt=javabin&version=2} {add=[117 (1413322470422740992)]} 0 5
> [junit4:junit4]   2> 15197 T2413 C174 P49264 /update {wt=javabin&version=2} {add=[118 (1413322470430081024)]} 0 1
> [junit4:junit4]   2> 15213 T2451 C170 P49275 REQ /update {distrib.from=http://127.0.0.1:49269/solr/collection1/&update.distrib=FROMLEADER&wt=javabin&version=2} status=0 QTime=5 
> [junit4:junit4]   2> 15213 T2429 C171 P49269 /update {wt=javabin&version=2} {add=[118 (1413322470433226752)]} 0 14
> [junit4:junit4]   2> 15217 T2413 C174 P49264 /update {wt=javabin&version=2} {add=[119 (1413322470451052544)]} 0 1
> [junit4:junit4]   2> 15224 T2465 C172 P49279 REQ /update {distrib.from=http://127.0.0.1:49272/solr/collection1/&update.distrib=FROMLEADER&wt=javabin&version=2} status=0 QTime=1 
> [junit4:junit4]   2> 15225 T2443 C173 P49272 /update {wt=javabin&version=2} {add=[119 (1413322470455246848)]} 0 5
> [junit4:junit4]   2> 15228 T2413 C174 P49264 /update {wt=javabin&version=2} {add=[120 (1413322470462586880)]} 0 1
> [junit4:junit4]   2> 15234 T2465 C172 P49279 REQ /update {distrib.from=http://127.0.0.1:49272/solr/collection1/&update.distrib=FROMLEADER&wt=javabin&version=2} status=0 QTime=1 
> [junit4:junit4]   2> 15235 T2443 C173 P49272 /update {wt=javabin&version=2} {add=[120 (1413322470465732608)]} 0 5
> [junit4:junit4]   2> 15239 T2413 C174 P49264 /update {wt=javabin&version=2} {add=[121 (1413322470474121216)]} 0 1
> [junit4:junit4]   2> 15248 T2465 C172 P49279 REQ /update {update.distrib=FROMLEADER&distrib.from=http://127.0.0.1:49272/solr/collection1/&wt=javabin&version=2} status=0 QTime=1 
> [junit4:junit4]   2> 15249 T2440 C173 P49272 REQ /update {distrib.from=http://127.0.0.1:49269/solr/collection1/&update.distrib=TOLEADER&wt=javabin&version=2} status=0 QTime=5 
> [junit4:junit4]   2> 15249 T2429 C171 P49269 /update {wt=javabin&version=2} {add=[121]} 0 7
> [junit4:junit4]   2> 15253 T2413 C174 P49264 /update {wt=javabin&version=2} {add=[122 (1413322470488801280)]} 0 1
> [junit4:junit4]   2> 15266 T2451 C170 P49275 REQ /update {update.distrib=FROMLEADER&distrib.from=http://127.0.0.1:49269/solr/collection1/&wt=javabin&version=2} status=0 QTime=2 
> [junit4:junit4]   2> 15266 T2432 C171 P49269 REQ /update {distrib.from=http://127.0.0.1:49272/solr/collection1/&update.distrib=TOLEADER&wt=javabin&version=2} status=0 QTime=8 
> [junit4:junit4]   2> 15267 T2443 C173 P49272 /update {wt=javabin&version=2} {add=[122]} 0 12
> [junit4:junit4]   2> 15275 T2413 C174 P49264 /update {wt=javabin&version=2} {add=[123 (1413322470507675648)]} 0 5
> [junit4:junit4]   2> 15281 T2451 C170 P49275 REQ /update {distrib.from=http://127.0.0.1:49269/solr/collection1/&update.distrib=FROMLEADER&wt=javabin&version=2} status=0 QTime=1 
> [junit4:junit4]   2> 15281 T2429 C171 P49269 /update {wt=javabin&version=2} {add=[123 (1413322470515015680)]} 0 4
> [junit4:junit4]   2> 15285 T2413 C174 P49264 /update {wt=javabin&version=2} {add=[124 (1413322470522355712)]} 0 1
> [junit4:junit4]   2> 15292 T2451 C170 P49275 REQ /update {distrib.from=http://127.0.0.1:49269/solr/collection1/&update.distrib=FROMLEADER&wt=javabin&version=2} status=0 QTime=1 
> [junit4:junit4]   2> 15292 T2429 C171 P49269 /update {wt=javabin&version=2} {add=[124 (1413322470526550016)]} 0 4
> [junit4:junit4]   2> 15296 T2413 C174 P49264 /update {wt=javabin&version=2} {add=[125 (1413322470533890048)]} 0 1
> [junit4:junit4]   2> 15304 T2451 C170 P49275 REQ /update {update.distrib=FROMLEADER&distrib.from=http://127.0.0.1:49269/solr/collection1/&wt=javabin&version=2} status=0 QTime=1 
> [junit4:junit4]   2> 15304 T2432 C171 P49269 REQ /update {distrib.from=http://127.0.0.1:49272/solr/collection1/&update.distrib=TOLEADER&wt=javabin&version=2} status=0 QTime=4 
> [junit4:junit4]   2> 15305 T2443 C173 P49272 /update {wt=javabin&version=2} {add=[125]} 0 7
> [junit4:junit4]   2> 15308 T2413 C174 P49264 /update {wt=javabin&version=2} {add=[126 (1413322470546472960)]} 0 1
> [junit4:junit4]   2> 15314 T2465 C172 P49279 REQ /update {distrib.from=http://127.0.0.1:49272/solr/collection1/&update.distrib=FROMLEADER&wt=javabin&version=2} status=0 QTime=1 
> [junit4:junit4]   2> 15314 T2443 C173 P49272 /update {wt=javabin&version=2} {add=[126 (1413322470549618688)]} 0 4
> [junit4:junit4]   2> 15318 T2413 C174 P49264 /update {wt=javabin&version=2} {add=[127 (1413322470556958720)]} 0 1
> [junit4:junit4]   2> 15330 T2465 C172 P49279 REQ /update {distrib.from=http://127.0.0.1:49272/solr/collection1/&update.distrib=FROMLEADER&wt=javabin&version=2} status=0 QTime=4 
> [junit4:junit4]   2> 15330 T2443 C173 P49272 /update {wt=javabin&version=2} {add=[127 (1413322470560104448)]} 0 10
> [junit4:junit4]   2> 15334 T2413 C174 P49264 /update {wt=javabin&version=2} {add=[128 (1413322470573735936)]} 0 1
> [junit4:junit4]   2> 15345 T2465 C172 P49279 REQ /update {update.distrib=FROMLEADER&distrib.from=http://127.0.0.1:49272/solr/collection1/&wt=javabin&version=2} status=0 QTime=1 
> [junit4:junit4]   2> 15346 T2440 C173 P49272 REQ /update {distrib.from=http://127.0.0.1:49269/solr/collection1/&update.distrib=TOLEADER&wt=javabin&version=2} status=0 QTime=6 
> [junit4:junit4]   2> 15346 T2429 C171 P49269 /update {wt=javabin&version=2} {add=[128]} 0 8
> [junit4:junit4]   2> 15350 T2413 C174 P49264 /update {wt=javabin&version=2} {add=[129 (1413322470590513152)]} 0 1
> [junit4:junit4]   2> 15356 T2451 C170 P49275 REQ /update {distrib.from=http://127.0.0.1:49269/solr/collection1/&update.distrib=FROMLEADER&wt=javabin&version=2} status=0 QTime=1 
> [junit4:junit4]   2> 15356 T2429 C171 P49269 /update {wt=javabin&version=2} {add=[129 (1413322470593658880)]} 0 4
> [junit4:junit4]   2> 15360 T2413 C174 P49264 /update {wt=javabin&version=2} {add=[130 (1413322470600998912)]} 0 1
> [junit4:junit4]   2> 15368 T2465 C172 P49279 REQ /update {update.distrib=FROMLEADER&distrib.from=http://127.0.0.1:49272/solr/collection1/&wt=javabin&version=2} status=0 QTime=1 
> [junit4:junit4]   2> 15368 T2440 C173 P49272 REQ /update {distrib.from=http://127.0.0.1:49269/solr/collection1/&update.distrib=TOLEADER&wt=javabin&version=2} status=0 QTime=4 
> [junit4:junit4]   2> 15369 T2429 C171 P49269 /update {wt=javabin&version=2} {add=[130]} 0 7
> [junit4:junit4]   2> 15372 T2413 C174 P49264 /update {wt=javabin&version=2} {add=[131 (1413322470613581824)]} 0 1
> [junit4:junit4]   2> 15378 T2465 C172 P49279 REQ /update {distrib.from=http://127.0.0.1:49272/solr/collection1/&update.distrib=FROMLEADER&wt=javabin&version=2} status=0 QTime=1 
> [junit4:junit4]   2> 15378 T2443 C173 P49272 /update {wt=javabin&version=2} {add=[131 (1413322470616727552)]} 0 4
> [junit4:junit4]   2> 15382 T2413 C174 P49264 /update {wt=javabin&version=2} {add=[132 (1413322470624067584)]} 0 1
> [junit4:junit4]   2> 15389 T2451 C170 P49275 REQ /update {distrib.from=http://127.0.0.1:49269/solr/collection1/&update.distrib=FROMLEADER&wt=javabin&version=2} status=0 QTime=1 
> [junit4:junit4]   2> 15389 T2429 C171 P49269 /update {wt=javabin&version=2} {add=[132 (1413322470628261888)]} 0 4
> [junit4:junit4]   2> 15398 T2413 C174 P49264 /update {wt=javabin&version=2} {add=[133 (1413322470635601920)]} 0 6
> [junit4:junit4]   2> 15407 T2451 C170 P49275 REQ /update {update.distrib=FROMLEADER&distrib.from=http://127.0.0.1:49269/solr/collection1/&wt=javabin&version=2} status=0 QTime=1 
> [junit4:junit4]   2> 15407 T2432 C171 P49269 REQ /update {distrib.from=http://127.0.0.1:49272/solr/collection1/&update.distrib=TOLEADER&wt=javabin&version=2} status=0 QTime=4 
> [junit4:junit4]   2> 15408 T2443 C173 P49272 /update {wt=javabin&version=2} {add=[133]} 0 7
> [junit4:junit4]   2> 15412 T2413 C174 P49264 /update {wt=javabin&version=2} {add=[134 (1413322470655524864)]} 0 1
> [junit4:junit4]   2> 15421 T2465 C172 P49279 REQ /update {update.distrib=FROMLEADER&distrib.from=http://127.0.0.1:49272/solr/collection1/&wt=javabin&version=2} status=0 QTime=1 
> [junit4:junit4]   2> 15421 T2440 C173 P49272 REQ /update {distrib.from=http://127.0.0.1:49269/solr/collection1/&update.distrib=TOLEADER&wt=javabin&version=2} status=0 QTime=4 
> [junit4:junit4]   2> 15422 T2429 C171 P49269 /update {wt=javabin&version=2} {add=[134]} 0 7
> [junit4:junit4]   2> 15425 T2413 C174 P49264 /update {wt=javabin&version=2} {add=[135 (1413322470669156352)]} 0 1
> [junit4:junit4]   2> 15432 T2451 C170 P49275 REQ /update {distrib.from=http://127.0.0.1:49269/solr/collection1/&update.distrib=FROMLEADER&wt=javabin&version=2} status=0 QTime=1 
> [junit4:junit4]   2> 15432 T2429 C171 P49269 /update {wt=javabin&version=2} {add=[135 (1413322470673350656)]} 0 4
> [junit4:junit4]   2> 15436 T2413 C174 P49264 /update {wt=javabin&version=2} {add=[136 (1413322470680690688)]} 0 1
> [junit4:junit4]   2> 15443 T2465 C172 P49279 REQ /update {distrib.from=http://127.0.0.1:49272/solr/collection1/&update.distrib=FROMLEADER&wt=javabin&version=2} status=0 QTime=1 
> [junit4:junit4]   2> 15443 T2443 C173 P49272 /update {wt=javabin&version=2} {add=[136 (1413322470684884992)]} 0 4
> [junit4:junit4]   2> 15447 T2413 C174 P49264 /update {wt=javabin&version=2} {add=[137 (1413322470692225024)]} 0 1
> [junit4:junit4]   2> 15455 T2465 C172 P49279 REQ /update {update.distrib=FROMLEADER&distrib.from=http://127.0.0.1:49272/solr/collection1/&wt=javabin&version=2} status=0 QTime=1 
> [junit4:junit4]   2> 15455 T2440 C173 P49272 REQ /update {distrib.from=http://127.0.0.1:49269/solr/collection1/&update.distrib=TOLEADER&wt=javabin&version=2} status=0 QTime=4 
> [junit4:junit4]   2> 15456 T2429 C171 P49269 /update {wt=javabin&version=2} {add=[137]} 0 7
> [junit4:junit4]   2> 15460 T2413 C174 P49264 /update {wt=javabin&version=2} {add=[138 (1413322470705856512)]} 0 1
> [junit4:junit4]   2> 15466 T2451 C170 P49275 REQ /update {distrib.from=http://127.0.0.1:49269/solr/collection1/&update.distrib=FROMLEADER&wt=javabin&version=2} status=0 QTime=1 
> [junit4:junit4]   2> 15466 T2429 C171 P49269 /update {wt=javabin&version=2} {add=[138 (1413322470709002240)]} 0 4
> [junit4:junit4]   2> 15470 T2413 C174 P49264 /update {wt=javabin&version=2} {add=[139 (1413322470716342272)]} 0 1
> [junit4:junit4]   2> 15478 T2465 C172 P49279 REQ /update {update.distrib=FROMLEADER&distrib.from=http://127.0.0.1:49272/solr/collection1/&wt=javabin&version=2} status=0 QTime=1 
> [junit4:junit4]   2> 15479 T2440 C173 P49272 REQ /update {distrib.from=http://127.0.0.1:49269/solr/collection1/&update.distrib=TOLEADER&wt=javabin&version=2} status=0 QTime=5 
> [junit4:junit4]   2> 15480 T2429 C171 P49269 /update {wt=javabin&version=2} {add=[139]} 0 8
> [junit4:junit4]   2> 15484 T2413 C174 P49264 /update {wt=javabin&version=2} {add=[140 (1413322470731022336)]} 0 1
> [junit4:junit4]   2> 15497 T2465 C172 P49279 REQ /update {update.distrib=FROMLEADER&distrib.from=http://127.0.0.1:49272/solr/collection1/&wt=javabin&version=2} status=0 QTime=1 
> [junit4:junit4]   2> 15498 T2440 C173 P49272 REQ /update {distrib.from=http://127.0.0.1:49269/solr/collection1/&update.distrib=TOLEADER&wt=javabin&version=2} status=0 QTime=10 
> [junit4:junit4]   2> 15499 T2429 C171 P49269 /update {wt=javabin&version=2} {add=[140]} 0 13
> [junit4:junit4]   2> 15503 T2413 C174 P49264 /update {wt=javabin&version=2} {add=[141 (1413322470750945280)]} 0 1
> [junit4:junit4]   2> 15510 T2465 C172 P49279 REQ /update {distrib.from=http://127.0.0.1:49272/solr/collection1/&update.distrib=FROMLEADER&wt=javabin&version=2} status=0 QTime=1 
> [junit4:junit4]   2> 15511 T2443 C173 P49272 /update {wt=javabin&version=2} {add=[141 (1413322470755139584)]} 0 5
> [junit4:junit4]   2> 15514 T2413 C174 P49264 /update {wt=javabin&version=2} {add=[142 (1413322470762479616)]} 0 1
> [junit4:junit4]   2> 15532 T2465 C172 P49279 REQ /update {update.distrib=FROMLEADER&distrib.from=http://127.0.0.1:49272/solr/collection1/&wt=javabin&version=2} status=0 QTime=6 
> [junit4:junit4]   2> 15532 T2440 C173 P49272 REQ /update {distrib.from=http://127.0.0.1:49269/solr/collection1/&update.distrib=TOLEADER&wt=javabin&version=2} status=0 QTime=14 
> [junit4:junit4]   2> 15533 T2429 C171 P49269 /update {wt=javabin&version=2} {add=[142]} 0 17
> [junit4:junit4]   2> 15540 T2413 C174 P49264 /update {wt=javabin&version=2} {add=[143 (1413322470786596864)]} 0 4
> [junit4:junit4]   2> 15549 T2465 C172 P49279 REQ /update {distrib.from=http://127.0.0.1:49272/solr/collection1/&update.distrib=FROMLEADER&wt=javabin&version=2} status=0 QTime=2 
> [junit4:junit4]   2> 15549 T2443 C173 P49272 /update {wt=javabin&version=2} {add=[143 (1413322470793936896)]} 0 6
> [junit4:junit4]   2> 15554 T2413 C174 P49264 /update {wt=javabin&version=2} {add=[144 (1413322470803374080)]} 0 2
> [junit4:junit4]   2> 15560 T2465 C172 P49279 REQ /update {distrib.from=http://127.0.0.1:49272/solr/collection1/&update.distrib=FROMLEADER&wt=javabin&version=2} status=0 QTime=1 
> [junit4:junit4]   2> 15560 T2443 C173 P49272 /update {wt=javabin&version=2} {add=[144 (1413322470807568384)]} 0 4
> [junit4:junit4]   2> 15564 T2413 C174 P49264 /update {wt=javabin&version=2} {add=[145 (1413322470814908416)]} 0 1
> [junit4:junit4]   2> 15587 T2465 C172 P49279 REQ /update {distrib.from=http://127.0.0.1:49272/solr/collection1/&update.distrib=FROMLEADER&wt=javabin&version=2} status=0 QTime=1 
> [junit4:junit4]   2> 15588 T2443 C173 P49272 /update {wt=javabin&version=2} {add=[145 (1413322470835879936)]} 0 5
> [junit4:junit4]   2> 15591 T2413 C174 P49264 /update {wt=javabin&version=2} {add=[146 (1413322470843219968)]} 0 1
> [junit4:junit4]   2> 15605 T2451 C170 P49275 REQ /update {distrib.from=http://127.0.0.1:49269/solr/collection1/&update.distrib=FROMLEADER&wt=javabin&version=2} status=0 QTime=4 
> [junit4:junit4]   2> 15606 T2429 C171 P49269 /update {wt=javabin&version=2} {add=[146 (1413322470846365696)]} 0 13
> [junit4:junit4]   2> 15610 T2413 C174 P49264 /update {wt=javabin&version=2} {add=[147 (1413322470863142912)]} 0 1
> [junit4:junit4]   2> 15616 T2465 C172 P49279 REQ /update {distrib.from=http://127.0.0.1:49272/solr/collection1/&update.distrib=FROMLEADER&wt=javabin&version=2} status=0 QTime=1 
> [junit4:junit4]   2> 15617 T2443 C173 P49272 /update {wt=javabin&version=2} {add=[147 (1413322470866288640)]} 0 5
> [junit4:junit4]   2> 15621 T2413 C174 P49264 /update {wt=javabin&version=2} {add=[148 (1413322470874677248)]} 0 1
> [junit4:junit4]   2> 15628 T2451 C170 P49275 REQ /update {distrib.from=http://127.0.0.1:49269/solr/collection1/&update.distrib=FROMLEADER&wt=javabin&version=2} status=0 QTime=1 
> [junit4:junit4]   2> 15629 T2429 C171 P49269 /update {wt=javabin&version=2} {add=[148 (1413322470877822976)]} 0 6
> [junit4:junit4]   2> 15633 T2413 C174 P49264 /update {wt=javabin&version=2} {add=[149 (1413322470887260160)]} 0 1
> [junit4:junit4]   2> 15639 T2465 C172 P49279 REQ /update {distrib.from=http://127.0.0.1:49272/solr/collection1/&update.distrib=FROMLEADER&wt=javabin&version=2} status=0 QTime=1 
> [junit4:junit4]   2> 15639 T2443 C173 P49272 /update {wt=javabin&version=2} {add=[149 (1413322470890405888)]} 0 4
> [junit4:junit4]   2> 15640 T2401 oasc.AbstractDistribZkTestBase.waitForRecoveriesToFinish Wait for recoveries to finish - collection: collection1 failOnTimeout:true timeout (sec):1800
> [junit4:junit4]   2> 15641 T2401 oascc.ZkStateReader.updateClusterState Updating cloud state from ZooKeeper... 
> [junit4:junit4]   2> 15644 T2413 C174 P49264 oasu.DirectUpdateHandler2.commit start commit{flags=0,_version_=0,optimize=false,openSearcher=true,waitSearcher=true,expungeDeletes=false,softCommit=false}
> [junit4:junit4]   2> 15944 T2413 C174 P49264 oasc.SolrDeletionPolicy.onCommit SolrDeletionPolicy.onCommit: commits:num=2
> [junit4:junit4]   2>        commit{dir=NRTCachingDirectory(org.apache.lucene.store.NIOFSDirectory@/usr/home/hudson/hudson-slave/workspace/Lucene-Solr-Tests-4.x-Java6/solr/build/solr-core/test/J1/org.apache.solr.cloud.BasicDistributedZk2Test-1347849325656/control/data/index lockFactory=org.apache.lucene.store.NativeFSLockFactory@6c16417a; maxCacheMB=48.0 maxMergeSizeMB=4.0),segFN=segments_2,generation=2,filenames=[_0.fnm, _0.frq, _0.tim, _0_nrm.cfe, segments_2, _0.fdx, _0_nrm.cfs, _0.si, _0.prx, _0.tip, _0.fdt]
> [junit4:junit4]   2>        commit{dir=NRTCachingDirectory(org.apache.lucene.store.NIOFSDirectory@/usr/home/hudson/hudson-slave/workspace/Lucene-Solr-Tests-4.x-Java6/solr/build/solr-core/test/J1/org.apache.solr.cloud.BasicDistributedZk2Test-1347849325656/control/data/index lockFactory=org.apache.lucene.store.NativeFSLockFactory@6c16417a; maxCacheMB=48.0 maxMergeSizeMB=4.0),segFN=segments_3,generation=3,filenames=[_5_nrm.cfe, _3_nrm.cfe, _5.fdt, _5.prx, _1.frq, _4.prx, _7.si, _4.fnm, _4_nrm.cfe, _3.fdt, _1.fnm, _2.tim, _4.fdx, _7.fnm, _5.tip, _5.tim, _4.frq, _7.frq, _7.tim, _0.prx, _7.tip, _0.fnm, _2.prx, _2.frq, _2.fdt, _7.fdx, _3.prx, _2.fdx, _7.fdt, _5.si, _2.tip, _1.fdx, _1.prx, _3_nrm.cfs, _5_nrm.cfs, _1.fdt, _0.tim, _0.frq, _4_nrm.cfs, _3.si, _6.fdt, _0.tip, _2.si, _3.frq, _6.frq, _3.tim, _6.fdx, _3.fnm, _2_nrm.cfe, _6.tip, _6_nrm.cfs, _7_nrm.cfs, _6.tim, _4.tip, _0.si, _2_nrm.cfs, _1.tip, _1.tim, _1_nrm.cfs, _5.fnm, _7_nrm.cfe, _4.tim, _6_nrm.cfe, _5.frq, _4.si, _4.fdt, _0_nrm.cfs, _1_nrm.cfe, _2.fnm, _7.prx, _3.fdx, _6.prx, _1.si, _0_nrm.cfe, _5.fdx, _6.si, _6.fnm, _0.fdx, _3.tip, segments_3, _0.fdt]
> [junit4:junit4]   2> 15945 T2413 C174 P49264 oasc.SolrDeletionPolicy.updateCommits newest commit = 3
> [junit4:junit4]   2> 15992 T2413 C174 P49264 oass.SolrIndexSearcher.<init> Opening Searcher@794a7ea7 main
> [junit4:junit4]   2> 15993 T2413 C174 P49264 oasu.DirectUpdateHandler2.commit end_commit_flush
> [junit4:junit4]   2> 15994 T2424 oasc.SolrCore.registerSearcher [collection1] Registered new searcher Searcher@794a7ea7 main{StandardDirectoryReader(segments_3:17 _0(4.0.0.2):C1 _1(4.0.0.2):C10 _2(4.0.0.2):C10 _3(4.0.0.2):C10 _4(4.0.0.2):C10 _5(4.0.0.2):C10 _6(4.0.0.2):C10 _7(4.0.0.2):C6)}
> [junit4:junit4]   2> 15995 T2413 C174 P49264 /update {waitSearcher=true&wt=javabin&commit=true&softCommit=false&version=2} {commit=} 0 351
> [junit4:junit4]   2> 15998 T2429 C171 P49269 oasu.DirectUpdateHandler2.commit start commit{flags=0,_version_=0,optimize=false,openSearcher=true,waitSearcher=true,expungeDeletes=false,softCommit=false}
> [junit4:junit4]   2> 16188 T2429 C171 P49269 oasc.SolrDeletionPolicy.onCommit SolrDeletionPolicy.onCommit: commits:num=2
> [junit4:junit4]   2>        commit{dir=NRTCachingDirectory(org.apache.lucene.store.NIOFSDirectory@/usr/home/hudson/hudson-slave/workspace/Lucene-Solr-Tests-4.x-Java6/solr/build/solr-core/test/J1/org.apache.solr.cloud.BasicDistributedZk2Test-1347849325656/jetty1/index lockFactory=org.apache.lucene.store.NativeFSLockFactory@4d00a29a; maxCacheMB=48.0 maxMergeSizeMB=4.0),segFN=segments_2,generation=2,filenames=[_0.fnm, _0.frq, _0.tim, _0_nrm.cfe, segments_2, _0.fdx, _0_nrm.cfs, _0.si, _0.prx, _0.tip, _0.fdt]
> [junit4:junit4]   2>        commit{dir=NRTCachingDirectory(org.apache.lucene.store.NIOFSDirectory@/usr/home/hudson/hudson-slave/workspace/Lucene-Solr-Tests-4.x-Java6/solr/build/solr-core/test/J1/org.apache.solr.cloud.BasicDistributedZk2Test-1347849325656/jetty1/index lockFactory=org.apache.lucene.store.NativeFSLockFactory@4d00a29a; maxCacheMB=48.0 maxMergeSizeMB=4.0),segFN=segments_3,generation=3,filenames=[_3_nrm.cfe, _1.frq, _4.prx, _4.fnm, _4_nrm.cfe, _3.fdt, _1.fnm, _2.tim, _4.fdx, _4.frq, _0.prx, _0.fnm, _2.prx, _2.frq, _2.fdt, _3.prx, _2.fdx, _2.tip, _1.fdx, _1.prx, _3_nrm.cfs, _1.fdt, _0.tim, _0.frq, _4_nrm.cfs, _3.si, _0.tip, _2.si, _3.frq, _3.tim, _3.fnm, _2_nrm.cfe, _4.tip, _0.si, _2_nrm.cfs, _1.tip, _1.tim, _1_nrm.cfs, _4.tim, _4.si, _4.fdt, _0_nrm.cfs, _1_nrm.cfe, _2.fnm, _3.fdx, _1.si, _0_nrm.cfe, _0.fdx, _3.tip, segments_3, _0.fdt]
> [junit4:junit4]   2> 16188 T2429 C171 P49269 oasc.SolrDeletionPolicy.updateCommits newest commit = 3
> [junit4:junit4]   2> 16217 T2429 C171 P49269 oass.SolrIndexSearcher.<init> Opening Searcher@2753217d main
> [junit4:junit4]   2> 16218 T2429 C171 P49269 oasu.DirectUpdateHandler2.commit end_commit_flush
> [junit4:junit4]   2> 16219 T2436 oasc.SolrCore.registerSearcher [collection1] Registered new searcher Searcher@2753217d main{StandardDirectoryReader(segments_3:11 _0(4.0.0.2):C1 _1(4.0.0.2):C10 _2(4.0.0.2):C10 _3(4.0.0.2):C10 _4(4.0.0.2):C1)}
> [junit4:junit4]   2> 16220 T2429 C171 P49269 oasu.SolrCmdDistributor.distribCommit Distrib commit to:[StdNode: http://127.0.0.1:49275/solr/collection1/, StdNode: http://127.0.0.1:49272/solr/collection1/, StdNode: http://127.0.0.1:49279/solr/collection1/]
> [junit4:junit4]   2> 16223 T2440 C173 P49272 oasu.DirectUpdateHandler2.commit start commit{flags=0,_version_=0,optimize=false,openSearcher=true,waitSearcher=true,expungeDeletes=false,softCommit=false}
> [junit4:junit4]   2> 16223 T2465 C172 P49279 oasu.DirectUpdateHandler2.commit start commit{flags=0,_version_=0,optimize=false,openSearcher=true,waitSearcher=true,expungeDeletes=false,softCommit=false}
> [junit4:junit4]   2> 16223 T2451 C170 P49275 oasu.DirectUpdateHandler2.commit start commit{flags=0,_version_=0,optimize=false,openSearcher=true,waitSearcher=true,expungeDeletes=false,softCommit=false}
> [junit4:junit4]   2> 16563 T2451 C170 P49275 oasc.SolrDeletionPolicy.onCommit SolrDeletionPolicy.onCommit: commits:num=2
> [junit4:junit4]   2>        commit{dir=NRTCachingDirectory(org.apache.lucene.store.NIOFSDirectory@/usr/home/hudson/hudson-slave/workspace/Lucene-Solr-Tests-4.x-Java6/solr/build/solr-core/test/J1/org.apache.solr.cloud.BasicDistributedZk2Test-1347849325656/jetty3/index.20120917113537048 lockFactory=org.apache.lucene.store.NativeFSLockFactory@2f6b0d19; maxCacheMB=48.0 maxMergeSizeMB=4.0),segFN=segments_2,generation=2,filenames=[_0.fnm, _0_nrm.cfe, _0.tim, _0.frq, segments_2, _0.fdx, _0_nrm.cfs, _0.si, _0.tip, _0.prx, _0.fdt]
> [junit4:junit4]   2>        commit{dir=NRTCachingDirectory(org.apache.lucene.store.NIOFSDirectory@/usr/home/hudson/hudson-slave/workspace/Lucene-Solr-Tests-4.x-Java6/solr/build/solr-core/test/J1/org.apache.solr.cloud.BasicDistributedZk2Test-1347849325656/jetty3/index.20120917113537048 lockFactory=org.apache.lucene.store.NativeFSLockFactory@2f6b0d19; maxCacheMB=48.0 maxMergeSizeMB=4.0),segFN=segments_3,generation=3,filenames=[_3_nrm.cfe, _1.frq, _4.prx, _4.fnm, _4_nrm.cfe, _3.fdt, _1.fnm, _2.tim, _4.fdx, _4.frq, _0.prx, _0.fnm, _2.prx, _2.frq, _2.fdt, _3.prx, _2.fdx, _2.tip, _1.fdx, _1.prx, _3_nrm.cfs, _1.fdt, _0.frq, _0.tim, _4_nrm.cfs, _3.si, _0.tip, _2.si, _3.frq, _3.tim, _3.fnm, _2_nrm.cfe, _4.tip, _0.si, _2_nrm.cfs, _1.tip, _1.tim, _1_nrm.cfs, _4.tim, _4.si, _4.fdt, _0_nrm.cfs, _1_nrm.cfe, _2.fnm, _3.fdx, _1.si, _0_nrm.cfe, _0.fdx, _3.tip, segments_3, _0.fdt]
> [junit4:junit4]   2> 16564 T2451 C170 P49275 oasc.SolrDeletionPolicy.updateCommits newest commit = 3
> [junit4:junit4]   2> 16569 T2451 C170 P49275 oass.SolrIndexSearcher.<init> Opening Searcher@7f5bbb70 main
> [junit4:junit4]   2> 16570 T2451 C170 P49275 oasu.DirectUpdateHandler2.commit end_commit_flush
> [junit4:junit4]   2> 16571 T2465 C172 P49279 oasc.SolrDeletionPolicy.onCommit SolrDeletionPolicy.onCommit: commits:num=2
> [junit4:junit4]   2>        commit{dir=NRTCachingDirectory(org.apache.lucene.store.NIOFSDirectory@/usr/home/hudson/hudson-slave/workspace/Lucene-Solr-Tests-4.x-Java6/solr/build/solr-core/test/J1/org.apache.solr.cloud.BasicDistributedZk2Test-1347849325656/jetty4/index lockFactory=org.apache.lucene.store.NativeFSLockFactory@1e345bb7; maxCacheMB=48.0 maxMergeSizeMB=4.0),segFN=segments_2,generation=2,filenames=[segments_2]
> [junit4:junit4]   2>        commit{dir=NRTCachingDirectory(org.apache.lucene.store.NIOFSDirectory@/usr/home/hudson/hudson-slave/workspace/Lucene-Solr-Tests-4.x-Java6/solr/build/solr-core/test/J1/org.apache.solr.cloud.BasicDistributedZk2Test-1347849325656/jetty4/index lockFactory=org.apache.lucene.store.NativeFSLockFactory@1e345bb7; maxCacheMB=48.0 maxMergeSizeMB=4.0),segFN=segments_3,generation=3,filenames=[_3_nrm.cfe, _2.si, _3.frq, _1.frq, _3.tim, _3.fdt, _3.fnm, _1.fnm, _2.tim, _2_nrm.cfe, _2_nrm.cfs, _0.si, _0.prx, _1.tip, _1.tim, _1_nrm.cfs, _0.fnm, _2.prx, _2.fdt, _2.frq, _3.prx, _0_nrm.cfs, _2.fdx, _2.fnm, _1_nrm.cfe, _3.fdx, _3_nrm.cfs, _1.prx, _1.fdx, _2.tip, _1.fdt, _1.si, _0.frq, _0.tim, _0_nrm.cfe, _3.si, _3.tip, _0.fdx, _0.tip, _0.fdt, segments_3]
> [junit4:junit4]   2> 16572 T2460 oasc.SolrCore.registerSearcher [collection1] Registered new searcher Searcher@7f5bbb70 main{StandardDirectoryReader(segments_3:11:nrt _0(4.0.0.2):C1 _1(4.0.0.2):C10 _2(4.0.0.2):C10 _3(4.0.0.2):C10 _4(4.0.0.2):C1)}
> [junit4:junit4]   2> 16572 T2465 C172 P49279 oasc.SolrDeletionPolicy.updateCommits newest commit = 3
> [junit4:junit4]   2> 16572 T2451 C170 P49275 /update {waitSearcher=true&commit=true&wt=javabin&commit_end_point=true&expungeDeletes=false&softCommit=false&version=2} {commit=} 0 349
> [junit4:junit4]   2> 16596 T2465 C172 P49279 oass.SolrIndexSearcher.<init> Opening Searcher@73fcafa5 main
> [junit4:junit4]   2> 16597 T2465 C172 P49279 oasu.DirectUpdateHandler2.commit end_commit_flush
> [junit4:junit4]   2> 16597 T2440 C173 P49272 oasc.SolrDeletionPolicy.onCommit SolrDeletionPolicy.onCommit: commits:num=2
> [junit4:junit4]   2>        commit{dir=NRTCachingDirectory(org.apache.lucene.store.NIOFSDirectory@/usr/home/hudson/hudson-slave/workspace/Lucene-Solr-Tests-4.x-Java6/solr/build/solr-core/test/J1/org.apache.solr.cloud.BasicDistributedZk2Test-1347849325656/jetty2/index lockFactory=org.apache.lucene.store.NativeFSLockFactory@1b3ee2f4; maxCacheMB=48.0 maxMergeSizeMB=4.0),segFN=segments_1,generation=1,filenames=[segments_1]
> [junit4:junit4]   2>        commit{dir=NRTCachingDirectory(org.apache.lucene.store.NIOFSDirectory@/usr/home/hudson/hudson-slave/workspace/Lucene-Solr-Tests-4.x-Java6/solr/build/solr-core/test/J1/org.apache.solr.cloud.BasicDistributedZk2Test-1347849325656/jetty2/index lockFactory=org.apache.lucene.store.NativeFSLockFactory@1b3ee2f4; maxCacheMB=48.0 maxMergeSizeMB=4.0),segFN=segments_2,generation=2,filenames=[_3_nrm.cfe, _2.si, _3.frq, _1.frq, _3.tim, _3.fdt, _3.fnm, _1.fnm, _2.tim, _2_nrm.cfe, _2_nrm.cfs, _0.si, _0.prx, _1.tip, _1.tim, _1_nrm.cfs, _0.fnm, _2.prx, _2.fdt, _2.frq, 
> 
> [...truncated too long message...]
> 
> toredMap.java:174)
> [junit4:junit4]   2>    at org.apache.solr.core.JmxMonitoredMap.clear(JmxMonitoredMap.java:116)
> [junit4:junit4]   2>    at org.apache.solr.core.SolrCore.close(SolrCore.java:864)
> [junit4:junit4]   2>    at org.apache.solr.cloud.ShardLeaderElectionContext.runLeaderProcess(ElectionContext.java:213)
> [junit4:junit4]   2>    at org.apache.solr.cloud.LeaderElector.runIamLeaderProcess(LeaderElector.java:158)
> [junit4:junit4]   2>    at org.apache.solr.cloud.LeaderElector.checkIfIamLeader(LeaderElector.java:102)
> [junit4:junit4]   2>    at org.apache.solr.cloud.LeaderElector.access$000(LeaderElector.java:56)
> [junit4:junit4]   2>    at org.apache.solr.cloud.LeaderElector$1.process(LeaderElector.java:131)
> [junit4:junit4]   2>    at org.apache.zookeeper.ClientCnxn$EventThread.processEvent(ClientCnxn.java:526)
> [junit4:junit4]   2>    at org.apache.zookeeper.ClientCnxn$EventThread.run(ClientCnxn.java:502)
> [junit4:junit4]   2> 
> [junit4:junit4]   2> 305628 T2473 oasc.JmxMonitoredMap$SolrDynamicMBean.getMBeanInfo WARNING Could not getStatistics on info bean Lazy[solr.ReplicationHandler] java.lang.IllegalArgumentException: /usr/home/hudson/hudson-slave/workspace/Lucene-Solr-Tests-4.x-Java6/solr/build/solr-core/test/J1/org.apache.solr.cloud.BasicDistributedZk2Test-1347849325656/jetty4/index does not exist
> [junit4:junit4]   2>    at org.apache.commons.io.FileUtils.sizeOfDirectory(FileUtils.java:2074)
> [junit4:junit4]   2>    at org.apache.solr.handler.ReplicationHandler.getIndexSize(ReplicationHandler.java:477)
> [junit4:junit4]   2>    at org.apache.solr.handler.ReplicationHandler.getStatistics(ReplicationHandler.java:525)
> [junit4:junit4]   2>    at org.apache.solr.core.RequestHandlers$LazyRequestHandlerWrapper.getStatistics(RequestHandlers.java:310)
> [junit4:junit4]   2>    at org.apache.solr.core.JmxMonitoredMap$SolrDynamicMBean.getMBeanInfo(JmxMonitoredMap.java:231)
> [junit4:junit4]   2>    at com.sun.jmx.interceptor.DefaultMBeanServerInterceptor.getClassName(DefaultMBeanServerInterceptor.java:1824)
> [junit4:junit4]   2>    at com.sun.jmx.interceptor.DefaultMBeanServerInterceptor.safeGetClassName(DefaultMBeanServerInterceptor.java:1661)
> [junit4:junit4]   2>    at com.sun.jmx.interceptor.DefaultMBeanServerInterceptor.checkMBeanPermission(DefaultMBeanServerInterceptor.java:1833)
> [junit4:junit4]   2>    at com.sun.jmx.interceptor.DefaultMBeanServerInterceptor.exclusiveUnregisterMBean(DefaultMBeanServerInterceptor.java:436)
> [junit4:junit4]   2>    at com.sun.jmx.interceptor.DefaultMBeanServerInterceptor.unregisterMBean(DefaultMBeanServerInterceptor.java:421)
> [junit4:junit4]   2>    at com.sun.jmx.mbeanserver.JmxMBeanServer.unregisterMBean(JmxMBeanServer.java:540)
> [junit4:junit4]   2>    at org.apache.solr.core.JmxMonitoredMap.unregister(JmxMonitoredMap.java:175)
> [junit4:junit4]   2>    at org.apache.solr.core.JmxMonitoredMap.clear(JmxMonitoredMap.java:116)
> [junit4:junit4]   2>    at org.apache.solr.core.SolrCore.close(SolrCore.java:864)
> [junit4:junit4]   2>    at org.apache.solr.cloud.ShardLeaderElectionContext.runLeaderProcess(ElectionContext.java:213)
> [junit4:junit4]   2>    at org.apache.solr.cloud.LeaderElector.runIamLeaderProcess(LeaderElector.java:158)
> [junit4:junit4]   2>    at org.apache.solr.cloud.LeaderElector.checkIfIamLeader(LeaderElector.java:102)
> [junit4:junit4]   2>    at org.apache.solr.cloud.LeaderElector.access$000(LeaderElector.java:56)
> [junit4:junit4]   2>    at org.apache.solr.cloud.LeaderElector$1.process(LeaderElector.java:131)
> [junit4:junit4]   2>    at org.apache.zookeeper.ClientCnxn$EventThread.processEvent(ClientCnxn.java:526)
> [junit4:junit4]   2>    at org.apache.zookeeper.ClientCnxn$EventThread.run(ClientCnxn.java:502)
> [junit4:junit4]   2> 
> [junit4:junit4]   2> 305633 T2473 oasc.SolrCore.closeSearcher [collection1] Closing main searcher on request.
> [junit4:junit4]   2> 305634 T2473 oasu.DirectUpdateHandler2.close closing DirectUpdateHandler2{commits=5,autocommits=0,soft autocommits=0,optimizes=0,rollbacks=0,expungeDeletes=0,docsPending=0,adds=0,deletesById=0,deletesByQuery=0,errors=0,cumulative_adds=35,cumulative_deletesById=0,cumulative_deletesByQuery=0,cumulative_errors=0}
> [junit4:junit4]   2> 305635 T2473 oasu.DefaultSolrCoreState.decref SolrCoreState ref count has reached 0 - closing IndexWriter
> [junit4:junit4]   2> 305637 T2473 oasu.DefaultSolrCoreState.decref Closing SolrCoreState - canceling any ongoing recovery
> [junit4:junit4]   2> 305637 T2473 oascc.ZkStateReader$3.process Updating live nodes
> [junit4:junit4]   2> 305637 T2473 oascc.ZkStateReader$3.process WARNING ZooKeeper watch triggered, but Solr cannot talk to ZK
> [junit4:junit4]   2> 305637 T2473 oascc.ZkStateReader$2.process A cluster state change has occurred - updating...
> [junit4:junit4]   2> 305637 T2473 oascc.ZkStateReader$2.process WARNING ZooKeeper watch triggered, but Solr cannot talk to ZK
> [junit4:junit4]   2> 305638 T2473 oascc.ConnectionManager.process Watcher org.apache.solr.common.cloud.ConnectionManager@29425b91 name:ZooKeeperConnection Watcher:127.0.0.1:49261/solr got event WatchedEvent state:Disconnected type:None path:null path:null type:None
> [junit4:junit4]   2> 305638 T2473 oascc.ConnectionManager.process Client->ZooKeeper status change trigger but we are already closed
> [junit4:junit4]   2> 305638 T2473 oaz.ClientCnxn$EventThread.run EventThread shut down
> [junit4:junit4]   2> NOTE: test params are: codec=Asserting, sim=RandomSimilarityProvider(queryNorm=false,coord=yes): {}, locale=ru_RU, timezone=Pacific/Palau
> [junit4:junit4]   2> NOTE: FreeBSD 9.0-RELEASE amd64/Sun Microsystems Inc. 1.6.0_32 (64-bit)/cpus=16,threads=2,free=48531008,total=190906368
> [junit4:junit4]   2> NOTE: All tests run in this JVM: [ZkNodePropsTest, TestSolrDeletionPolicy2, TestUtils, BasicFunctionalityTest, MultiTermTest, UpdateParamsTest, IndexSchemaRuntimeFieldTest, PolyFieldTest, DisMaxRequestHandlerTest, DebugComponentTest, ConvertedLegacyTest, URLClassifyProcessorTest, TestSurroundQueryParser, DirectSolrSpellCheckerTest, TestSolrDeletionPolicy1, DocumentBuilderTest, StatelessScriptUpdateProcessorFactoryTest, ClusterStateUpdateTest, RequiredFieldsTest, BadIndexSchemaTest, XmlUpdateRequestHandlerTest, SolrInfoMBeanTest, TimeZoneUtilsTest, PeerSyncTest, ReturnFieldsTest, SignatureUpdateProcessorFactoryTest, EchoParamsTest, TestQueryUtils, TestCSVLoader, ShowFileRequestHandlerTest, OverseerTest, SolrCoreTest, QueryEqualityTest, OutputWriterTest, TestPropInject, TestWriterPerf, TestDocumentBuilder, TestQuerySenderListener, SolrIndexConfigTest, TestReversedWildcardFilterFactory, TestMultiCoreConfBootstrap, DOMUtilTest, TestDocSet, TestJmxIntegration, TestBinaryField, ScriptEngineTest, TestCodecSupport, TestArbitraryIndexDir, LukeRequestHandlerTest, TestStressRecovery, DistributedQueryElevationComponentTest, TestDFRSimilarityFactory, TestPluginEnable, TestRTGBase, TestMergePolicyConfig, RecoveryZkTest, SpellCheckComponentTest, FullSolrCloudDistribCmdsTest, TestReplicationHandler, LeaderElectionIntegrationTest, LeaderElectionTest, DistributedSpellCheckComponentTest, TestDistributedGrouping, SoftAutoCommitTest, AutoCommitTest, BasicZkTest, ZkSolrClientTest, TestHashPartitioner, DistributedTermsComponentTest, StatsComponentTest, TestRecovery, TestJoin, QueryElevationComponentTest, TestBinaryResponseWriter, SampleTest, HighlighterTest, TestIndexSearcher, TestFunctionQuery, TestTrie, SolrRequestParserTest, TestRemoteStreaming, CacheHeaderTest, TestCSVResponseWriter, MoreLikeThisHandlerTest, MBeansHandlerTest, IndexSchemaTest, BinaryUpdateRequestHandlerTest, QueryParsingTest, DistanceFunctionTest, XsltUpdateRequestHandlerTest, StandardRequestHandlerTest, TestPHPSerializedResponseWriter, FieldAnalysisRequestHandlerTest, PingRequestHandlerTest, TermVectorComponentTest, SuggesterWFSTTest, DocumentAnalysisRequestHandlerTest, DirectUpdateHandlerOptimizeTest, SolrPluginUtilsTest, TestValueSourceCache, JSONWriterTest, TestOmitPositions, SuggesterFSTTest, CopyFieldTest, SuggesterTSTTest, SuggesterTest, TestSearchPerf, NotRequiredUniqueKeyTest, TestFoldingMultitermQuery, UpdateRequestProcessorFactoryTest, NoCacheHeaderTest, PrimitiveFieldTypeTest, FieldMutatingUpdateProcessorTest, TestUpdate, TestPropInjectDefaults, DefaultValueUpdateProcessorTest, TestXIncludeConfig, TestLFUCache, TestCollationField, IndexReaderFactoryTest, TestSolrCoreProperties, TestJmxMonitoredMap, TestConfig, SpellPossibilityIteratorTest, TestBM25SimilarityFactory, TestPhraseSuggestions, TestLMDirichletSimilarityFactory, TestPerFieldSimilarity, LegacyHTMLStripCharFilterTest, TestFastLRUCache, PrimUtilsTest, OpenExchangeRatesOrgProviderTest, ResourceLoaderTest, FileUtilsTest, TestSystemIdResolver, TestSolrXMLSerializer, DateFieldTest, SpellingQueryConverterTest, TestSuggestSpellingConverter, TestLRUCache, UUIDFieldTest, RAMDirectoryFactoryTest, PreAnalyzedFieldTest, AnalysisAfterCoreReloadTest, PathHierarchyTokenizerFactoryTest, TestCharFilters, TestCollationKeyRangeQueries, BasicDistributedZk2Test]
> [junit4:junit4] Completed on J1 in 305.99s, 1 test, 1 failure <<< FAILURES!
> 
> [...truncated 36 lines...]
> BUILD FAILED
> /usr/home/hudson/hudson-slave/workspace/Lucene-Solr-Tests-4.x-Java6/build.xml:32: The following error occurred while executing this line:
> /usr/home/hudson/hudson-slave/workspace/Lucene-Solr-Tests-4.x-Java6/solr/build.xml:146: The following error occurred while executing this line:
> /usr/home/hudson/hudson-slave/workspace/Lucene-Solr-Tests-4.x-Java6/lucene/module-build.xml:63: The following error occurred while executing this line:
> /usr/home/hudson/hudson-slave/workspace/Lucene-Solr-Tests-4.x-Java6/lucene/common-build.xml:1133: The following error occurred while executing this line:
> /usr/home/hudson/hudson-slave/workspace/Lucene-Solr-Tests-4.x-Java6/lucene/common-build.xml:810: There were test failures: 229 suites, 927 tests, 1 failure, 7 ignored (2 assumptions)
> 
> Total time: 36 minutes 22 seconds
> Build step 'Invoke Ant' marked build as failure
> Recording test results
> Email was triggered for: Failure
> Sending email for trigger: Failure
> 
> 
> 
> ---------------------------------------------------------------------
> To unsubscribe, e-mail: dev-unsubscribe@lucene.apache.org
> For additional commands, e-mail: dev-help@lucene.apache.org

---------------------------------------------------------------------
To unsubscribe, e-mail: dev-unsubscribe@lucene.apache.org
For additional commands, e-mail: dev-help@lucene.apache.org


Mime
View raw message