lucene-dev mailing list archives

Site index · List index
Message view « Date » · « Thread »
Top « Date » · « Thread »
From Apache Jenkins Server <jenk...@builds.apache.org>
Subject [JENKINS] Lucene-Solr-Tests-4.x-java7 - Build # 464 - Still Failing
Date Mon, 17 Sep 2012 21:14:09 GMT
Build: https://builds.apache.org/job/Lucene-Solr-Tests-4.x-java7/464/

1 tests failed.
FAILED:  org.apache.solr.cloud.BasicDistributedZk2Test.testDistribSearch

Error Message:
Timeout occured while waiting response from server at: http://localhost:43889/solr/collection1

Stack Trace:
org.apache.solr.client.solrj.SolrServerException: Timeout occured while waiting response from server at: http://localhost:43889/solr/collection1
	at __randomizedtesting.SeedInfo.seed([8794EE6FCE84DE83:6726077B9DBBEBF]:0)
	at org.apache.solr.client.solrj.impl.HttpSolrServer.request(HttpSolrServer.java:410)
	at org.apache.solr.client.solrj.impl.HttpSolrServer.request(HttpSolrServer.java:182)
	at org.apache.solr.client.solrj.request.AbstractUpdateRequest.process(AbstractUpdateRequest.java:117)
	at org.apache.solr.cloud.AbstractFullDistribZkTestBase.index_specific(AbstractFullDistribZkTestBase.java:521)
	at org.apache.solr.cloud.AbstractFullDistribZkTestBase.checkQueries(AbstractFullDistribZkTestBase.java:693)
	at org.apache.solr.cloud.BasicDistributedZk2Test.doTest(BasicDistributedZk2Test.java:77)
	at org.apache.solr.BaseDistributedSearchTestCase.testDistribSearch(BaseDistributedSearchTestCase.java:695)
	at sun.reflect.NativeMethodAccessorImpl.invoke0(Native Method)
	at sun.reflect.NativeMethodAccessorImpl.invoke(NativeMethodAccessorImpl.java:57)
	at sun.reflect.DelegatingMethodAccessorImpl.invoke(DelegatingMethodAccessorImpl.java:43)
	at java.lang.reflect.Method.invoke(Method.java:601)
	at com.carrotsearch.randomizedtesting.RandomizedRunner.invoke(RandomizedRunner.java:1559)
	at com.carrotsearch.randomizedtesting.RandomizedRunner.access$600(RandomizedRunner.java:79)
	at com.carrotsearch.randomizedtesting.RandomizedRunner$6.evaluate(RandomizedRunner.java:737)
	at com.carrotsearch.randomizedtesting.RandomizedRunner$7.evaluate(RandomizedRunner.java:773)
	at com.carrotsearch.randomizedtesting.RandomizedRunner$8.evaluate(RandomizedRunner.java:787)
	at com.carrotsearch.randomizedtesting.rules.SystemPropertiesRestoreRule$1.evaluate(SystemPropertiesRestoreRule.java:53)
	at org.apache.lucene.util.TestRuleSetupTeardownChained$1.evaluate(TestRuleSetupTeardownChained.java:50)
	at org.apache.lucene.util.TestRuleFieldCacheSanity$1.evaluate(TestRuleFieldCacheSanity.java:51)
	at org.apache.lucene.util.AbstractBeforeAfterRule$1.evaluate(AbstractBeforeAfterRule.java:45)
	at com.carrotsearch.randomizedtesting.rules.SystemPropertiesInvariantRule$1.evaluate(SystemPropertiesInvariantRule.java:55)
	at org.apache.lucene.util.TestRuleThreadAndTestName$1.evaluate(TestRuleThreadAndTestName.java:48)
	at org.apache.lucene.util.TestRuleIgnoreAfterMaxFailures$1.evaluate(TestRuleIgnoreAfterMaxFailures.java:70)
	at org.apache.lucene.util.TestRuleMarkFailure$1.evaluate(TestRuleMarkFailure.java:48)
	at com.carrotsearch.randomizedtesting.rules.StatementAdapter.evaluate(StatementAdapter.java:36)
	at com.carrotsearch.randomizedtesting.ThreadLeakControl$StatementRunner.run(ThreadLeakControl.java:358)
	at com.carrotsearch.randomizedtesting.ThreadLeakControl.forkTimeoutingTask(ThreadLeakControl.java:782)
	at com.carrotsearch.randomizedtesting.ThreadLeakControl$3.evaluate(ThreadLeakControl.java:442)
	at com.carrotsearch.randomizedtesting.RandomizedRunner.runSingleTest(RandomizedRunner.java:746)
	at com.carrotsearch.randomizedtesting.RandomizedRunner$3.evaluate(RandomizedRunner.java:648)
	at com.carrotsearch.randomizedtesting.RandomizedRunner$4.evaluate(RandomizedRunner.java:682)
	at com.carrotsearch.randomizedtesting.RandomizedRunner$5.evaluate(RandomizedRunner.java:693)
	at com.carrotsearch.randomizedtesting.rules.StatementAdapter.evaluate(StatementAdapter.java:36)
	at com.carrotsearch.randomizedtesting.rules.SystemPropertiesRestoreRule$1.evaluate(SystemPropertiesRestoreRule.java:53)
	at org.apache.lucene.util.AbstractBeforeAfterRule$1.evaluate(AbstractBeforeAfterRule.java:45)
	at org.apache.lucene.util.TestRuleStoreClassName$1.evaluate(TestRuleStoreClassName.java:42)
	at com.carrotsearch.randomizedtesting.rules.SystemPropertiesInvariantRule$1.evaluate(SystemPropertiesInvariantRule.java:55)
	at com.carrotsearch.randomizedtesting.rules.NoShadowingOrOverridesOnMethodsRule$1.evaluate(NoShadowingOrOverridesOnMethodsRule.java:39)
	at com.carrotsearch.randomizedtesting.rules.NoShadowingOrOverridesOnMethodsRule$1.evaluate(NoShadowingOrOverridesOnMethodsRule.java:39)
	at com.carrotsearch.randomizedtesting.rules.StatementAdapter.evaluate(StatementAdapter.java:36)
	at org.apache.lucene.util.TestRuleAssertionsRequired$1.evaluate(TestRuleAssertionsRequired.java:43)
	at org.apache.lucene.util.TestRuleMarkFailure$1.evaluate(TestRuleMarkFailure.java:48)
	at org.apache.lucene.util.TestRuleIgnoreAfterMaxFailures$1.evaluate(TestRuleIgnoreAfterMaxFailures.java:70)
	at org.apache.lucene.util.TestRuleIgnoreTestSuites$1.evaluate(TestRuleIgnoreTestSuites.java:55)
	at com.carrotsearch.randomizedtesting.rules.StatementAdapter.evaluate(StatementAdapter.java:36)
	at com.carrotsearch.randomizedtesting.ThreadLeakControl$StatementRunner.run(ThreadLeakControl.java:358)
	at java.lang.Thread.run(Thread.java:722)
Caused by: java.net.SocketTimeoutException: Read timed out
	at java.net.SocketInputStream.socketRead0(Native Method)
	at java.net.SocketInputStream.read(SocketInputStream.java:150)
	at java.net.SocketInputStream.read(SocketInputStream.java:121)
	at org.apache.http.impl.io.AbstractSessionInputBuffer.fillBuffer(AbstractSessionInputBuffer.java:149)
	at org.apache.http.impl.io.SocketInputBuffer.fillBuffer(SocketInputBuffer.java:111)
	at org.apache.http.impl.io.AbstractSessionInputBuffer.readLine(AbstractSessionInputBuffer.java:264)
	at org.apache.http.impl.conn.DefaultResponseParser.parseHead(DefaultResponseParser.java:98)
	at org.apache.http.impl.io.AbstractMessageParser.parse(AbstractMessageParser.java:252)
	at org.apache.http.impl.AbstractHttpClientConnection.receiveResponseHeader(AbstractHttpClientConnection.java:282)
	at org.apache.http.impl.conn.DefaultClientConnection.receiveResponseHeader(DefaultClientConnection.java:247)
	at org.apache.http.impl.conn.AbstractClientConnAdapter.receiveResponseHeader(AbstractClientConnAdapter.java:216)
	at org.apache.http.protocol.HttpRequestExecutor.doReceiveResponse(HttpRequestExecutor.java:298)
	at org.apache.http.protocol.HttpRequestExecutor.execute(HttpRequestExecutor.java:125)
	at org.apache.http.impl.client.DefaultRequestDirector.tryExecute(DefaultRequestDirector.java:647)
	at org.apache.http.impl.client.DefaultRequestDirector.execute(DefaultRequestDirector.java:464)
	at org.apache.http.impl.client.AbstractHttpClient.execute(AbstractHttpClient.java:820)
	at org.apache.http.impl.client.AbstractHttpClient.execute(AbstractHttpClient.java:754)
	at org.apache.http.impl.client.AbstractHttpClient.execute(AbstractHttpClient.java:732)
	at org.apache.solr.client.solrj.impl.HttpSolrServer.request(HttpSolrServer.java:353)
	... 46 more




Build Log:
[...truncated 8536 lines...]
[junit4:junit4] Suite: org.apache.solr.cloud.BasicDistributedZk2Test
[junit4:junit4]   2> 4 T2411 oas.SolrTestCaseJ4.setUp ###Starting testDistribSearch
[junit4:junit4]   2> Creating dataDir: /usr/home/hudson/hudson-slave/workspace/Lucene-Solr-Tests-4.x-java7/solr/build/solr-core/test/J1/./solrtest-BasicDistributedZk2Test-1347916347335
[junit4:junit4]   2> 5 T2411 oasc.ZkTestServer.run STARTING ZK TEST SERVER
[junit4:junit4]   2> 8 T2412 oazs.ZooKeeperServer.setTickTime tickTime set to 1000
[junit4:junit4]   2> 9 T2412 oazs.NIOServerCnxn$Factory.<init> binding to port 0.0.0.0/0.0.0.0:0
[junit4:junit4]   2> 9 T2412 oazsp.FileTxnSnapLog.save Snapshotting: 0
[junit4:junit4]   2> 107 T2411 oasc.ZkTestServer.run start zk server on port:43861
[junit4:junit4]   2> 107 T2411 oaz.ZooKeeper.<init> Initiating client connection, connectString=127.0.0.1:43861 sessionTimeout=10000 watcher=org.apache.solr.common.cloud.ConnectionManager@6d394d60
[junit4:junit4]   2> 108 T2417 oaz.ClientCnxn$SendThread.startConnect Opening socket connection to server /127.0.0.1:43861
[junit4:junit4]   2> 108 T2411 oascc.ConnectionManager.waitForConnected Waiting for client to connect to ZooKeeper
[junit4:junit4]   2> 109 T2417 oaz.ClientCnxn$SendThread.primeConnection Socket connection established to localhost/127.0.0.1:43861, initiating session
[junit4:junit4]   2> 109 T2413 oazs.NIOServerCnxn$Factory.run Accepted socket connection from /140.211.11.196:43862
[junit4:junit4]   2> 109 T2413 oazs.NIOServerCnxn.readConnectRequest Client attempting to establish new session at /140.211.11.196:43862
[junit4:junit4]   2> 110 T2415 oazsp.FileTxnLog.append Creating new log file: log.1
[junit4:junit4]   2> 112 T2415 oazs.NIOServerCnxn.finishSessionInit Established session 0x139d61337cc0000 with negotiated timeout 10000 for client /140.211.11.196:43862
[junit4:junit4]   2> 112 T2417 oaz.ClientCnxn$SendThread.readConnectResult Session establishment complete on server localhost/127.0.0.1:43861, sessionid = 0x139d61337cc0000, negotiated timeout = 10000
[junit4:junit4]   2> 112 T2418 oascc.ConnectionManager.process Watcher org.apache.solr.common.cloud.ConnectionManager@6d394d60 name:ZooKeeperConnection Watcher:127.0.0.1:43861 got event WatchedEvent state:SyncConnected type:None path:null path:null type:None
[junit4:junit4]   2> 112 T2411 oascc.ConnectionManager.waitForConnected Client is connected to ZooKeeper
[junit4:junit4]   2> 113 T2411 oascc.SolrZkClient.makePath makePath: /solr
[junit4:junit4]   2> 115 T2416 oazs.PrepRequestProcessor.pRequest Processed session termination for sessionid: 0x139d61337cc0000
[junit4:junit4]   2> 123 T2418 oaz.ClientCnxn$EventThread.run EventThread shut down
[junit4:junit4]   2> 123 T2411 oaz.ZooKeeper.close Session: 0x139d61337cc0000 closed
[junit4:junit4]   2> 123 T2413 oazs.NIOServerCnxn.closeSock Closed socket connection for client /140.211.11.196:43862 which had sessionid 0x139d61337cc0000
[junit4:junit4]   2> 124 T2411 oaz.ZooKeeper.<init> Initiating client connection, connectString=127.0.0.1:43861/solr sessionTimeout=10000 watcher=org.apache.solr.common.cloud.ConnectionManager@149b7580
[junit4:junit4]   2> 124 T2419 oaz.ClientCnxn$SendThread.startConnect Opening socket connection to server /127.0.0.1:43861
[junit4:junit4]   2> 124 T2411 oascc.ConnectionManager.waitForConnected Waiting for client to connect to ZooKeeper
[junit4:junit4]   2> 125 T2419 oaz.ClientCnxn$SendThread.primeConnection Socket connection established to localhost/127.0.0.1:43861, initiating session
[junit4:junit4]   2> 125 T2413 oazs.NIOServerCnxn$Factory.run Accepted socket connection from /140.211.11.196:43863
[junit4:junit4]   2> 125 T2413 oazs.NIOServerCnxn.readConnectRequest Client attempting to establish new session at /140.211.11.196:43863
[junit4:junit4]   2> 126 T2415 oazs.NIOServerCnxn.finishSessionInit Established session 0x139d61337cc0001 with negotiated timeout 10000 for client /140.211.11.196:43863
[junit4:junit4]   2> 126 T2419 oaz.ClientCnxn$SendThread.readConnectResult Session establishment complete on server localhost/127.0.0.1:43861, sessionid = 0x139d61337cc0001, negotiated timeout = 10000
[junit4:junit4]   2> 127 T2420 oascc.ConnectionManager.process Watcher org.apache.solr.common.cloud.ConnectionManager@149b7580 name:ZooKeeperConnection Watcher:127.0.0.1:43861/solr got event WatchedEvent state:SyncConnected type:None path:null path:null type:None
[junit4:junit4]   2> 127 T2411 oascc.ConnectionManager.waitForConnected Client is connected to ZooKeeper
[junit4:junit4]   2> 127 T2411 oascc.SolrZkClient.makePath makePath: /collections/collection1
[junit4:junit4]   2> 130 T2411 oascc.SolrZkClient.makePath makePath: /collections/collection1/shards
[junit4:junit4]   2> 139 T2411 oascc.SolrZkClient.makePath makePath: /collections/control_collection
[junit4:junit4]   2> 149 T2411 oascc.SolrZkClient.makePath makePath: /collections/control_collection/shards
[junit4:junit4]   2> 151 T2411 oasc.AbstractZkTestCase.putConfig put /usr/home/hudson/hudson-slave/workspace/Lucene-Solr-Tests-4.x-java7/solr/build/solr-core/test-files/solr/collection1/conf/solrconfig.xml to /configs/conf1/solrconfig.xml
[junit4:junit4]   2> 151 T2411 oascc.SolrZkClient.makePath makePath: /configs/conf1/solrconfig.xml
[junit4:junit4]   2> 162 T2411 oasc.AbstractZkTestCase.putConfig put /usr/home/hudson/hudson-slave/workspace/Lucene-Solr-Tests-4.x-java7/solr/build/solr-core/test-files/solr/collection1/conf/schema.xml to /configs/conf1/schema.xml
[junit4:junit4]   2> 163 T2411 oascc.SolrZkClient.makePath makePath: /configs/conf1/schema.xml
[junit4:junit4]   2> 266 T2411 oasc.AbstractZkTestCase.putConfig put /usr/home/hudson/hudson-slave/workspace/Lucene-Solr-Tests-4.x-java7/solr/build/solr-core/test-files/solr/collection1/conf/solrconfig.xml to /configs/conf1/solrconfig.xml
[junit4:junit4]   2> 267 T2411 oascc.SolrZkClient.makePath makePath: /configs/conf1/solrconfig.xml
[junit4:junit4]   2> 269 T2411 oasc.AbstractZkTestCase.putConfig put /usr/home/hudson/hudson-slave/workspace/Lucene-Solr-Tests-4.x-java7/solr/build/solr-core/test-files/solr/collection1/conf/stopwords.txt to /configs/conf1/stopwords.txt
[junit4:junit4]   2> 270 T2411 oascc.SolrZkClient.makePath makePath: /configs/conf1/stopwords.txt
[junit4:junit4]   2> 281 T2411 oasc.AbstractZkTestCase.putConfig put /usr/home/hudson/hudson-slave/workspace/Lucene-Solr-Tests-4.x-java7/solr/build/solr-core/test-files/solr/collection1/conf/protwords.txt to /configs/conf1/protwords.txt
[junit4:junit4]   2> 281 T2411 oascc.SolrZkClient.makePath makePath: /configs/conf1/protwords.txt
[junit4:junit4]   2> 283 T2411 oasc.AbstractZkTestCase.putConfig put /usr/home/hudson/hudson-slave/workspace/Lucene-Solr-Tests-4.x-java7/solr/build/solr-core/test-files/solr/collection1/conf/currency.xml to /configs/conf1/currency.xml
[junit4:junit4]   2> 284 T2411 oascc.SolrZkClient.makePath makePath: /configs/conf1/currency.xml
[junit4:junit4]   2> 291 T2411 oasc.AbstractZkTestCase.putConfig put /usr/home/hudson/hudson-slave/workspace/Lucene-Solr-Tests-4.x-java7/solr/build/solr-core/test-files/solr/collection1/conf/open-exchange-rates.json to /configs/conf1/open-exchange-rates.json
[junit4:junit4]   2> 291 T2411 oascc.SolrZkClient.makePath makePath: /configs/conf1/open-exchange-rates.json
[junit4:junit4]   2> 293 T2411 oasc.AbstractZkTestCase.putConfig put /usr/home/hudson/hudson-slave/workspace/Lucene-Solr-Tests-4.x-java7/solr/build/solr-core/test-files/solr/collection1/conf/mapping-ISOLatin1Accent.txt to /configs/conf1/mapping-ISOLatin1Accent.txt
[junit4:junit4]   2> 294 T2411 oascc.SolrZkClient.makePath makePath: /configs/conf1/mapping-ISOLatin1Accent.txt
[junit4:junit4]   2> 297 T2411 oasc.AbstractZkTestCase.putConfig put /usr/home/hudson/hudson-slave/workspace/Lucene-Solr-Tests-4.x-java7/solr/build/solr-core/test-files/solr/collection1/conf/old_synonyms.txt to /configs/conf1/old_synonyms.txt
[junit4:junit4]   2> 297 T2411 oascc.SolrZkClient.makePath makePath: /configs/conf1/old_synonyms.txt
[junit4:junit4]   2> 299 T2411 oasc.AbstractZkTestCase.putConfig put /usr/home/hudson/hudson-slave/workspace/Lucene-Solr-Tests-4.x-java7/solr/build/solr-core/test-files/solr/collection1/conf/synonyms.txt to /configs/conf1/synonyms.txt
[junit4:junit4]   2> 300 T2411 oascc.SolrZkClient.makePath makePath: /configs/conf1/synonyms.txt
[junit4:junit4]   2> 307 T2416 oazs.PrepRequestProcessor.pRequest Processed session termination for sessionid: 0x139d61337cc0001
[junit4:junit4]   2> 308 T2420 oaz.ClientCnxn$EventThread.run EventThread shut down
[junit4:junit4]   2> 308 T2413 oazs.NIOServerCnxn.closeSock Closed socket connection for client /140.211.11.196:43863 which had sessionid 0x139d61337cc0001
[junit4:junit4]   2> 308 T2411 oaz.ZooKeeper.close Session: 0x139d61337cc0001 closed
[junit4:junit4]   2> 310 T2411 oejs.Server.doStart jetty-8.1.2.v20120308
[junit4:junit4]   2> 314 T2411 oejs.AbstractConnector.doStart Started SocketConnector@0.0.0.0:43864
[junit4:junit4]   2> 315 T2411 oasc.SolrResourceLoader.locateSolrHome JNDI not configured for solr (NoInitialContextEx)
[junit4:junit4]   2> 315 T2411 oasc.SolrResourceLoader.locateSolrHome using system property solr.solr.home: /usr/home/hudson/hudson-slave/workspace/Lucene-Solr-Tests-4.x-java7/solr/build/solr-core/test-files/solr
[junit4:junit4]   2> 316 T2411 oasc.SolrResourceLoader.<init> new SolrResourceLoader for deduced Solr Home: '/usr/home/hudson/hudson-slave/workspace/Lucene-Solr-Tests-4.x-java7/solr/build/solr-core/test-files/solr/'
[junit4:junit4]   2> 346 T2411 oass.SolrDispatchFilter.init SolrDispatchFilter.init()
[junit4:junit4]   2> 346 T2411 oasc.SolrResourceLoader.locateSolrHome JNDI not configured for solr (NoInitialContextEx)
[junit4:junit4]   2> 347 T2411 oasc.SolrResourceLoader.locateSolrHome using system property solr.solr.home: /usr/home/hudson/hudson-slave/workspace/Lucene-Solr-Tests-4.x-java7/solr/build/solr-core/test-files/solr
[junit4:junit4]   2> 347 T2411 oasc.CoreContainer$Initializer.initialize looking for solr.xml: /usr/home/hudson/hudson-slave/workspace/Lucene-Solr-Tests-4.x-java7/solr/build/solr-core/test-files/solr/solr.xml
[junit4:junit4]   2> 347 T2411 oasc.CoreContainer.<init> New CoreContainer 437777984
[junit4:junit4]   2> 348 T2411 oasc.CoreContainer.load Loading CoreContainer using Solr Home: '/usr/home/hudson/hudson-slave/workspace/Lucene-Solr-Tests-4.x-java7/solr/build/solr-core/test-files/solr/'
[junit4:junit4]   2> 348 T2411 oasc.SolrResourceLoader.<init> new SolrResourceLoader for directory: '/usr/home/hudson/hudson-slave/workspace/Lucene-Solr-Tests-4.x-java7/solr/build/solr-core/test-files/solr/'
[junit4:junit4]   2> 372 T2411 oasc.CoreContainer.load Registering Log Listener
[junit4:junit4]   2> 383 T2411 oasc.CoreContainer.initZooKeeper Zookeeper client=127.0.0.1:43861/solr
[junit4:junit4]   2> 384 T2411 oaz.ZooKeeper.<init> Initiating client connection, connectString=127.0.0.1:43861/solr sessionTimeout=5000 watcher=org.apache.solr.common.cloud.ConnectionManager@619f6c4a
[junit4:junit4]   2> 385 T2430 oaz.ClientCnxn$SendThread.startConnect Opening socket connection to server /127.0.0.1:43861
[junit4:junit4]   2> 385 T2411 oascc.ConnectionManager.waitForConnected Waiting for client to connect to ZooKeeper
[junit4:junit4]   2> 386 T2430 oaz.ClientCnxn$SendThread.primeConnection Socket connection established to localhost/127.0.0.1:43861, initiating session
[junit4:junit4]   2> 386 T2413 oazs.NIOServerCnxn$Factory.run Accepted socket connection from /140.211.11.196:43865
[junit4:junit4]   2> 386 T2413 oazs.NIOServerCnxn.readConnectRequest Client attempting to establish new session at /140.211.11.196:43865
[junit4:junit4]   2> 387 T2415 oazs.NIOServerCnxn.finishSessionInit Established session 0x139d61337cc0002 with negotiated timeout 5000 for client /140.211.11.196:43865
[junit4:junit4]   2> 387 T2430 oaz.ClientCnxn$SendThread.readConnectResult Session establishment complete on server localhost/127.0.0.1:43861, sessionid = 0x139d61337cc0002, negotiated timeout = 5000
[junit4:junit4]   2> 388 T2431 oascc.ConnectionManager.process Watcher org.apache.solr.common.cloud.ConnectionManager@619f6c4a name:ZooKeeperConnection Watcher:127.0.0.1:43861/solr got event WatchedEvent state:SyncConnected type:None path:null path:null type:None
[junit4:junit4]   2> 388 T2411 oascc.ConnectionManager.waitForConnected Client is connected to ZooKeeper
[junit4:junit4]   2> 390 T2416 oazs.PrepRequestProcessor.pRequest Got user-level KeeperException when processing sessionid:0x139d61337cc0002 type:create cxid:0x2 zxid:0xfffffffffffffffe txntype:unknown reqpath:n/a Error Path:/solr/overseer Error:KeeperErrorCode = NodeExists for /solr/overseer
[junit4:junit4]   2> 398 T2411 oascc.SolrZkClient.makePath makePath: /live_nodes
[junit4:junit4]   2> 400 T2411 oasc.ZkController.createEphemeralLiveNode Register node as live in ZooKeeper:/live_nodes/127.0.0.1:43864_solr
[junit4:junit4]   2> 400 T2416 oazs.PrepRequestProcessor.pRequest Got user-level KeeperException when processing sessionid:0x139d61337cc0002 type:delete cxid:0x7 zxid:0xfffffffffffffffe txntype:unknown reqpath:n/a Error Path:/solr/live_nodes/127.0.0.1:43864_solr Error:KeeperErrorCode = NoNode for /solr/live_nodes/127.0.0.1:43864_solr
[junit4:junit4]   2> 402 T2411 oascc.SolrZkClient.makePath makePath: /live_nodes/127.0.0.1:43864_solr
[junit4:junit4]   2> 404 T2411 oashc.HttpShardHandlerFactory.getParameter Setting socketTimeout to: 0
[junit4:junit4]   2> 404 T2411 oashc.HttpShardHandlerFactory.getParameter Setting urlScheme to: http://
[junit4:junit4]   2> 404 T2411 oashc.HttpShardHandlerFactory.getParameter Setting connTimeout to: 0
[junit4:junit4]   2> 405 T2411 oashc.HttpShardHandlerFactory.getParameter Setting maxConnectionsPerHost to: 20
[junit4:junit4]   2> 405 T2411 oashc.HttpShardHandlerFactory.getParameter Setting corePoolSize to: 0
[junit4:junit4]   2> 406 T2411 oashc.HttpShardHandlerFactory.getParameter Setting maximumPoolSize to: 2147483647
[junit4:junit4]   2> 406 T2411 oashc.HttpShardHandlerFactory.getParameter Setting maxThreadIdleTime to: 5
[junit4:junit4]   2> 406 T2411 oashc.HttpShardHandlerFactory.getParameter Setting sizeOfQueue to: -1
[junit4:junit4]   2> 407 T2411 oashc.HttpShardHandlerFactory.getParameter Setting fairnessPolicy to: false
[junit4:junit4]   2> 407 T2411 oascsi.HttpClientUtil.createClient Creating new http client, config:maxConnectionsPerHost=20&maxConnections=10000&socketTimeout=0&connTimeout=0&retry=false
[junit4:junit4]   2> 418 T2411 oascc.SolrZkClient.makePath makePath: /overseer_elect/election
[junit4:junit4]   2> 422 T2416 oazs.PrepRequestProcessor.pRequest Got user-level KeeperException when processing sessionid:0x139d61337cc0002 type:delete cxid:0x15 zxid:0xfffffffffffffffe txntype:unknown reqpath:n/a Error Path:/solr/overseer_elect/leader Error:KeeperErrorCode = NoNode for /solr/overseer_elect/leader
[junit4:junit4]   2> 438 T2411 oascc.SolrZkClient.makePath makePath: /overseer_elect/leader
[junit4:junit4]   2> 441 T2411 oasc.Overseer.start Overseer (id=88337045739274242-127.0.0.1:43864_solr-n_0000000000) starting
[junit4:junit4]   2> 441 T2416 oazs.PrepRequestProcessor.pRequest Got user-level KeeperException when processing sessionid:0x139d61337cc0002 type:create cxid:0x1a zxid:0xfffffffffffffffe txntype:unknown reqpath:n/a Error Path:/solr/overseer Error:KeeperErrorCode = NodeExists for /solr/overseer
[junit4:junit4]   2> 442 T2416 oazs.PrepRequestProcessor.pRequest Got user-level KeeperException when processing sessionid:0x139d61337cc0002 type:create cxid:0x1b zxid:0xfffffffffffffffe txntype:unknown reqpath:n/a Error Path:/solr/overseer Error:KeeperErrorCode = NodeExists for /solr/overseer
[junit4:junit4]   2> 444 T2416 oazs.PrepRequestProcessor.pRequest Got user-level KeeperException when processing sessionid:0x139d61337cc0002 type:create cxid:0x1c zxid:0xfffffffffffffffe txntype:unknown reqpath:n/a Error Path:/solr/overseer Error:KeeperErrorCode = NodeExists for /solr/overseer
[junit4:junit4]   2> 454 T2416 oazs.PrepRequestProcessor.pRequest Got user-level KeeperException when processing sessionid:0x139d61337cc0002 type:create cxid:0x1d zxid:0xfffffffffffffffe txntype:unknown reqpath:n/a Error Path:/solr/overseer Error:KeeperErrorCode = NodeExists for /solr/overseer
[junit4:junit4]   2> 455 T2433 oasc.OverseerCollectionProcessor.run Process current queue of collection creations
[junit4:junit4]   2> 455 T2411 oascc.SolrZkClient.makePath makePath: /clusterstate.json
[junit4:junit4]   2> 465 T2411 oascc.ZkStateReader.createClusterStateWatchersAndUpdate Updating cluster state from ZooKeeper... 
[junit4:junit4]   2> 466 T2432 oasc.Overseer$ClusterStateUpdater.run Starting to work on the main queue
[junit4:junit4]   2> 470 T2411 oasc.CoreContainer.create Creating SolrCore 'collection1' using instanceDir: /usr/home/hudson/hudson-slave/workspace/Lucene-Solr-Tests-4.x-java7/solr/build/solr-core/test-files/solr/collection1
[junit4:junit4]   2> 471 T2411 oasc.ZkController.createCollectionZkNode Check for collection zkNode:control_collection
[junit4:junit4]   2> 471 T2411 oasc.ZkController.createCollectionZkNode Collection zkNode exists
[junit4:junit4]   2> 472 T2411 oasc.ZkController.readConfigName Load collection config from:/collections/control_collection
[junit4:junit4]   2> 473 T2411 oasc.SolrResourceLoader.<init> new SolrResourceLoader for directory: '/usr/home/hudson/hudson-slave/workspace/Lucene-Solr-Tests-4.x-java7/solr/build/solr-core/test-files/solr/collection1/'
[junit4:junit4]   2> 474 T2411 oasc.SolrResourceLoader.replaceClassLoader Adding 'file:/usr/home/hudson/hudson-slave/workspace/Lucene-Solr-Tests-4.x-java7/solr/build/solr-core/test-files/solr/collection1/lib/README' to classloader
[junit4:junit4]   2> 474 T2411 oasc.SolrResourceLoader.replaceClassLoader Adding 'file:/usr/home/hudson/hudson-slave/workspace/Lucene-Solr-Tests-4.x-java7/solr/build/solr-core/test-files/solr/collection1/lib/classes/' to classloader
[junit4:junit4]   2> 510 T2411 oasc.SolrConfig.<init> Using Lucene MatchVersion: LUCENE_40
[junit4:junit4]   2> 579 T2411 oasc.SolrConfig.<init> Loaded SolrConfig: solrconfig.xml
[junit4:junit4]   2> 680 T2411 oass.IndexSchema.readSchema Reading Solr Schema
[junit4:junit4]   2> 685 T2411 oass.IndexSchema.readSchema Schema name=test
[junit4:junit4]   2> 1129 T2411 oass.OpenExchangeRatesOrgProvider.init Initialized with rates=open-exchange-rates.json, refreshInterval=1440.
[junit4:junit4]   2> 1137 T2411 oass.IndexSchema.readSchema default search field in schema is text
[junit4:junit4]   2> 1140 T2411 oass.IndexSchema.readSchema unique key field: id
[junit4:junit4]   2> 1149 T2411 oass.FileExchangeRateProvider.reload Reloading exchange rates from file currency.xml
[junit4:junit4]   2> 1153 T2411 oass.FileExchangeRateProvider.reload Reloading exchange rates from file currency.xml
[junit4:junit4]   2> 1157 T2411 oass.OpenExchangeRatesOrgProvider.reload Reloading exchange rates from open-exchange-rates.json
[junit4:junit4]   2> 1158 T2411 oass.OpenExchangeRatesOrgProvider.reload Reloading exchange rates from open-exchange-rates.json
[junit4:junit4]   2> 1158 T2411 oasc.SolrCore.<init> [collection1] Opening new SolrCore at /usr/home/hudson/hudson-slave/workspace/Lucene-Solr-Tests-4.x-java7/solr/build/solr-core/test-files/solr/collection1/, dataDir=./org.apache.solr.cloud.BasicDistributedZk2Test-1347916347334/control/data/
[junit4:junit4]   2> 1159 T2411 oasc.JmxMonitoredMap.<init> JMX monitoring is enabled. Adding Solr mbeans to JMX Server: com.sun.jmx.mbeanserver.JmxMBeanServer@2dbd9f3d
[junit4:junit4]   2> 1160 T2411 oasc.SolrCore.getNewIndexDir WARNING New index directory detected: old=null new=./org.apache.solr.cloud.BasicDistributedZk2Test-1347916347334/control/data/index/
[junit4:junit4]   2> 1161 T2411 oasc.SolrCore.initIndex WARNING [collection1] Solr index directory './org.apache.solr.cloud.BasicDistributedZk2Test-1347916347334/control/data/index' doesn't exist. Creating new index...
[junit4:junit4]   2> 1162 T2411 oasc.CachingDirectoryFactory.get return new directory for /usr/home/hudson/hudson-slave/workspace/Lucene-Solr-Tests-4.x-java7/solr/build/solr-core/test/J1/./org.apache.solr.cloud.BasicDistributedZk2Test-1347916347334/control/data/index forceNew:false
[junit4:junit4]   2> 1167 T2411 oasc.SolrDeletionPolicy.onCommit SolrDeletionPolicy.onCommit: commits:num=1
[junit4:junit4]   2> 		commit{dir=NRTCachingDirectory(org.apache.lucene.store.NIOFSDirectory@/usr/home/hudson/hudson-slave/workspace/Lucene-Solr-Tests-4.x-java7/solr/build/solr-core/test/J1/org.apache.solr.cloud.BasicDistributedZk2Test-1347916347334/control/data/index lockFactory=org.apache.lucene.store.NativeFSLockFactory@12e6df6a; maxCacheMB=48.0 maxMergeSizeMB=4.0),segFN=segments_1,generation=1,filenames=[segments_1]
[junit4:junit4]   2> 1167 T2411 oasc.SolrDeletionPolicy.updateCommits newest commit = 1
[junit4:junit4]   2> 1168 T2411 oasc.SolrCore.initWriters created xml: solr.XMLResponseWriter
[junit4:junit4]   2> 1170 T2411 oasup.UpdateRequestProcessorChain.init inserting DistributedUpdateProcessorFactory into updateRequestProcessorChain "dedupe"
[junit4:junit4]   2> 1170 T2411 oasup.UpdateRequestProcessorChain.init inserting DistributedUpdateProcessorFactory into updateRequestProcessorChain "dedupe-allfields"
[junit4:junit4]   2> 1171 T2411 oasup.UpdateRequestProcessorChain.init inserting DistributedUpdateProcessorFactory into updateRequestProcessorChain "stored_sig"
[junit4:junit4]   2> 1171 T2411 oasup.UpdateRequestProcessorChain.init inserting DistributedUpdateProcessorFactory into updateRequestProcessorChain "uniq-fields"
[junit4:junit4]   2> 1172 T2411 oasup.UpdateRequestProcessorChain.init inserting DistributedUpdateProcessorFactory into updateRequestProcessorChain "distrib-dup-test-chain-implicit"
[junit4:junit4]   2> 1172 T2411 oasc.RequestHandlers.initHandlersFromConfig adding lazy requestHandler: solr.ReplicationHandler
[junit4:junit4]   2> 1173 T2411 oasc.RequestHandlers.initHandlersFromConfig created /replication: solr.ReplicationHandler
[junit4:junit4]   2> 1173 T2411 oasc.RequestHandlers.initHandlersFromConfig created standard: solr.StandardRequestHandler
[junit4:junit4]   2> 1174 T2411 oasc.RequestHandlers.initHandlersFromConfig created /get: solr.RealTimeGetHandler
[junit4:junit4]   2> 1174 T2411 oasc.RequestHandlers.initHandlersFromConfig created dismax: solr.SearchHandler
[junit4:junit4]   2> 1175 T2411 oasc.RequestHandlers.initHandlersFromConfig created mock: org.apache.solr.core.MockQuerySenderListenerReqHandler
[junit4:junit4]   2> 1175 T2411 oasc.RequestHandlers.initHandlersFromConfig created /admin/: org.apache.solr.handler.admin.AdminHandlers
[junit4:junit4]   2> 1176 T2411 oasc.RequestHandlers.initHandlersFromConfig created defaults: solr.StandardRequestHandler
[junit4:junit4]   2> 1176 T2411 oasc.RequestHandlers.initHandlersFromConfig adding lazy requestHandler: solr.StandardRequestHandler
[junit4:junit4]   2> 1176 T2411 oasc.RequestHandlers.initHandlersFromConfig created lazy: solr.StandardRequestHandler
[junit4:junit4]   2> 1177 T2411 oasc.RequestHandlers.initHandlersFromConfig created /update: solr.UpdateRequestHandler
[junit4:junit4]   2> 1177 T2411 oasc.RequestHandlers.initHandlersFromConfig created /terms: org.apache.solr.handler.component.SearchHandler
[junit4:junit4]   2> 1178 T2411 oasc.RequestHandlers.initHandlersFromConfig created spellCheckCompRH: org.apache.solr.handler.component.SearchHandler
[junit4:junit4]   2> 1178 T2411 oasc.RequestHandlers.initHandlersFromConfig created spellCheckCompRH_Direct: org.apache.solr.handler.component.SearchHandler
[junit4:junit4]   2> 1179 T2411 oasc.RequestHandlers.initHandlersFromConfig created spellCheckWithWordbreak: org.apache.solr.handler.component.SearchHandler
[junit4:junit4]   2> 1179 T2411 oasc.RequestHandlers.initHandlersFromConfig created spellCheckWithWordbreak_Direct: org.apache.solr.handler.component.SearchHandler
[junit4:junit4]   2> 1180 T2411 oasc.RequestHandlers.initHandlersFromConfig created spellCheckCompRH1: org.apache.solr.handler.component.SearchHandler
[junit4:junit4]   2> 1180 T2411 oasc.RequestHandlers.initHandlersFromConfig created tvrh: org.apache.solr.handler.component.SearchHandler
[junit4:junit4]   2> 1181 T2411 oasc.RequestHandlers.initHandlersFromConfig created /mlt: solr.MoreLikeThisHandler
[junit4:junit4]   2> 1181 T2411 oasc.RequestHandlers.initHandlersFromConfig created /debug/dump: solr.DumpRequestHandler
[junit4:junit4]   2> 1184 T2411 oashl.XMLLoader.init xsltCacheLifetimeSeconds=60
[junit4:junit4]   2> 1187 T2411 oasc.SolrCore.initDeprecatedSupport WARNING solrconfig.xml uses deprecated <admin/gettableFiles>, Please update your config to use the ShowFileRequestHandler.
[junit4:junit4]   2> 1188 T2411 oasc.SolrCore.initDeprecatedSupport WARNING adding ShowFileRequestHandler with hidden files: [SCHEMA.XML, OLD_SYNONYMS.TXT, STOPWORDS.TXT, PROTWORDS.TXT, OPEN-EXCHANGE-RATES.JSON, SYNONYMS.TXT, CURRENCY.XML, MAPPING-ISOLATIN1ACCENT.TXT]
[junit4:junit4]   2> 1191 T2411 oass.SolrIndexSearcher.<init> Opening Searcher@5921ca36 main
[junit4:junit4]   2> 1192 T2411 oasu.CommitTracker.<init> Hard AutoCommit: disabled
[junit4:junit4]   2> 1193 T2411 oasu.CommitTracker.<init> Soft AutoCommit: disabled
[junit4:junit4]   2> 1193 T2411 oashc.SpellCheckComponent.inform Initializing spell checkers
[junit4:junit4]   2> 1208 T2411 oass.DirectSolrSpellChecker.init init: {name=direct,classname=DirectSolrSpellChecker,field=lowerfilt,minQueryLength=3}
[junit4:junit4]   2> 1260 T2434 oasc.SolrCore.registerSearcher [collection1] Registered new searcher Searcher@5921ca36 main{StandardDirectoryReader(segments_1:1)}
[junit4:junit4]   2> 1263 T2416 oazs.PrepRequestProcessor.pRequest Got user-level KeeperException when processing sessionid:0x139d61337cc0002 type:create cxid:0x53 zxid:0xfffffffffffffffe txntype:unknown reqpath:n/a Error Path:/solr/overseer/queue Error:KeeperErrorCode = NoNode for /solr/overseer/queue
[junit4:junit4]   2> 1275 T2411 oasc.CoreContainer.register registering core: collection1
[junit4:junit4]   2> 1275 T2411 oasc.ZkController.register Register shard - core:collection1 address:http://127.0.0.1:43864/solr shardId:control_shard
[junit4:junit4]   2> 1276 T2411 oascc.SolrZkClient.makePath makePath: /collections/control_collection/leader_elect/control_shard/election
[junit4:junit4]   2> 1292 T2416 oazs.PrepRequestProcessor.pRequest Got user-level KeeperException when processing sessionid:0x139d61337cc0002 type:delete cxid:0x62 zxid:0xfffffffffffffffe txntype:unknown reqpath:n/a Error Path:/solr/collections/control_collection/leaders Error:KeeperErrorCode = NoNode for /solr/collections/control_collection/leaders
[junit4:junit4]   2> 1292 T2411 oasc.ShardLeaderElectionContext.runLeaderProcess Running the leader process.
[junit4:junit4]   2> 1293 T2416 oazs.PrepRequestProcessor.pRequest Got user-level KeeperException when processing sessionid:0x139d61337cc0002 type:create cxid:0x63 zxid:0xfffffffffffffffe txntype:unknown reqpath:n/a Error Path:/solr/overseer Error:KeeperErrorCode = NodeExists for /solr/overseer
[junit4:junit4]   2> 1470 T2432 oascc.ZkStateReader.updateClusterState Updating cloud state from ZooKeeper... 
[junit4:junit4]   2> 1471 T2416 oazs.PrepRequestProcessor.pRequest Got user-level KeeperException when processing sessionid:0x139d61337cc0002 type:create cxid:0x6a zxid:0xfffffffffffffffe txntype:unknown reqpath:n/a Error Path:/solr/overseer/queue-work Error:KeeperErrorCode = NoNode for /solr/overseer/queue-work
[junit4:junit4]   2> 1488 T2431 oascc.ZkStateReader$2.process A cluster state change has occurred - updating...
[junit4:junit4]   2> 1795 T2411 oasc.ShardLeaderElectionContext.waitForReplicasToComeUp Enough replicas found to continue.
[junit4:junit4]   2> 1796 T2411 oasc.ShardLeaderElectionContext.runLeaderProcess I may be the new leader - try and sync
[junit4:junit4]   2> 1796 T2411 oasc.SyncStrategy.sync Sync replicas to http://127.0.0.1:43864/solr/collection1/
[junit4:junit4]   2> 1797 T2411 oasc.SyncStrategy.syncReplicas Sync Success - now sync replicas to me
[junit4:junit4]   2> 1797 T2411 oasc.SyncStrategy.syncToMe http://127.0.0.1:43864/solr/collection1/ has no replicas
[junit4:junit4]   2> 1797 T2411 oasc.ShardLeaderElectionContext.runLeaderProcess I am the new leader: http://127.0.0.1:43864/solr/collection1/
[junit4:junit4]   2> 1798 T2411 oascc.SolrZkClient.makePath makePath: /collections/control_collection/leaders/control_shard
[junit4:junit4]   2> 1801 T2416 oazs.PrepRequestProcessor.pRequest Got user-level KeeperException when processing sessionid:0x139d61337cc0002 type:create cxid:0x88 zxid:0xfffffffffffffffe txntype:unknown reqpath:n/a Error Path:/solr/overseer Error:KeeperErrorCode = NodeExists for /solr/overseer
[junit4:junit4]   2> 1992 T2432 oascc.ZkStateReader.updateClusterState Updating cloud state from ZooKeeper... 
[junit4:junit4]   2> 2004 T2431 oascc.ZkStateReader$2.process A cluster state change has occurred - updating...
[junit4:junit4]   2> 2014 T2411 oasc.ZkController.register We are http://127.0.0.1:43864/solr/collection1/ and leader is http://127.0.0.1:43864/solr/collection1/
[junit4:junit4]   2> 2014 T2411 oasc.ZkController.register No LogReplay needed for core=collection1 baseURL=http://127.0.0.1:43864/solr
[junit4:junit4]   2> 2015 T2411 oasc.ZkController.checkRecovery I am the leader, no recovery necessary
[junit4:junit4]   2> 2016 T2411 oascc.ZkStateReader.updateClusterState Updating cloud state from ZooKeeper... 
[junit4:junit4]   2> 2016 T2411 oass.SolrDispatchFilter.init user.dir=/usr/home/hudson/hudson-slave/workspace/Lucene-Solr-Tests-4.x-java7/solr/build/solr-core/test/J1
[junit4:junit4]   2> 2017 T2411 oass.SolrDispatchFilter.init SolrDispatchFilter.init() done
[junit4:junit4]   2> 2017 T2411 oascsi.HttpClientUtil.createClient Creating new http client, config:maxConnections=128&maxConnectionsPerHost=32&followRedirects=false
[junit4:junit4]   2> 2305 T2411 oejs.Server.doStart jetty-8.1.2.v20120308
[junit4:junit4]   2> 2307 T2411 oejs.AbstractConnector.doStart Started SocketConnector@0.0.0.0:43872
[junit4:junit4]   2> 2308 T2411 oasc.SolrResourceLoader.locateSolrHome JNDI not configured for solr (NoInitialContextEx)
[junit4:junit4]   2> 2308 T2411 oasc.SolrResourceLoader.locateSolrHome using system property solr.solr.home: /usr/home/hudson/hudson-slave/workspace/Lucene-Solr-Tests-4.x-java7/solr/build/solr-core/test/J1/./solrtest-jetty1-1347916349357
[junit4:junit4]   2> 2308 T2411 oasc.SolrResourceLoader.<init> new SolrResourceLoader for deduced Solr Home: '/usr/home/hudson/hudson-slave/workspace/Lucene-Solr-Tests-4.x-java7/solr/build/solr-core/test/J1/./solrtest-jetty1-1347916349357/'
[junit4:junit4]   2> 2339 T2411 oass.SolrDispatchFilter.init SolrDispatchFilter.init()
[junit4:junit4]   2> 2340 T2411 oasc.SolrResourceLoader.locateSolrHome JNDI not configured for solr (NoInitialContextEx)
[junit4:junit4]   2> 2340 T2411 oasc.SolrResourceLoader.locateSolrHome using system property solr.solr.home: /usr/home/hudson/hudson-slave/workspace/Lucene-Solr-Tests-4.x-java7/solr/build/solr-core/test/J1/./solrtest-jetty1-1347916349357
[junit4:junit4]   2> 2341 T2411 oasc.CoreContainer$Initializer.initialize looking for solr.xml: /usr/home/hudson/hudson-slave/workspace/Lucene-Solr-Tests-4.x-java7/solr/build/solr-core/test/J1/./solrtest-jetty1-1347916349357/solr.xml
[junit4:junit4]   2> 2341 T2411 oasc.CoreContainer.<init> New CoreContainer 1855679898
[junit4:junit4]   2> 2342 T2411 oasc.CoreContainer.load Loading CoreContainer using Solr Home: '/usr/home/hudson/hudson-slave/workspace/Lucene-Solr-Tests-4.x-java7/solr/build/solr-core/test/J1/./solrtest-jetty1-1347916349357/'
[junit4:junit4]   2> 2342 T2411 oasc.SolrResourceLoader.<init> new SolrResourceLoader for directory: '/usr/home/hudson/hudson-slave/workspace/Lucene-Solr-Tests-4.x-java7/solr/build/solr-core/test/J1/./solrtest-jetty1-1347916349357/'
[junit4:junit4]   2> 2366 T2411 oasc.CoreContainer.load Registering Log Listener
[junit4:junit4]   2> 2377 T2411 oasc.CoreContainer.initZooKeeper Zookeeper client=127.0.0.1:43861/solr
[junit4:junit4]   2> 2378 T2411 oaz.ZooKeeper.<init> Initiating client connection, connectString=127.0.0.1:43861/solr sessionTimeout=5000 watcher=org.apache.solr.common.cloud.ConnectionManager@5e902bc6
[junit4:junit4]   2> 2379 T2444 oaz.ClientCnxn$SendThread.startConnect Opening socket connection to server /127.0.0.1:43861
[junit4:junit4]   2> 2379 T2411 oascc.ConnectionManager.waitForConnected Waiting for client to connect to ZooKeeper
[junit4:junit4]   2> 2380 T2444 oaz.ClientCnxn$SendThread.primeConnection Socket connection established to localhost/127.0.0.1:43861, initiating session
[junit4:junit4]   2> 2380 T2413 oazs.NIOServerCnxn$Factory.run Accepted socket connection from /140.211.11.196:43875
[junit4:junit4]   2> 2380 T2413 oazs.NIOServerCnxn.readConnectRequest Client attempting to establish new session at /140.211.11.196:43875
[junit4:junit4]   2> 2382 T2415 oazs.NIOServerCnxn.finishSessionInit Established session 0x139d61337cc0003 with negotiated timeout 5000 for client /140.211.11.196:43875
[junit4:junit4]   2> 2382 T2444 oaz.ClientCnxn$SendThread.readConnectResult Session establishment complete on server localhost/127.0.0.1:43861, sessionid = 0x139d61337cc0003, negotiated timeout = 5000
[junit4:junit4]   2> 2382 T2445 oascc.ConnectionManager.process Watcher org.apache.solr.common.cloud.ConnectionManager@5e902bc6 name:ZooKeeperConnection Watcher:127.0.0.1:43861/solr got event WatchedEvent state:SyncConnected type:None path:null path:null type:None
[junit4:junit4]   2> 2383 T2411 oascc.ConnectionManager.waitForConnected Client is connected to ZooKeeper
[junit4:junit4]   2> 2383 T2416 oazs.PrepRequestProcessor.pRequest Got user-level KeeperException when processing sessionid:0x139d61337cc0003 type:create cxid:0x1 zxid:0xfffffffffffffffe txntype:unknown reqpath:n/a Error Path:/solr/overseer Error:KeeperErrorCode = NodeExists for /solr/overseer
[junit4:junit4]   2> 2384 T2416 oazs.PrepRequestProcessor.pRequest Got user-level KeeperException when processing sessionid:0x139d61337cc0003 type:create cxid:0x2 zxid:0xfffffffffffffffe txntype:unknown reqpath:n/a Error Path:/solr/overseer Error:KeeperErrorCode = NodeExists for /solr/overseer
[junit4:junit4]   2> 2386 T2411 oasc.ZkController.createEphemeralLiveNode Register node as live in ZooKeeper:/live_nodes/127.0.0.1:43872_solr
[junit4:junit4]   2> 2387 T2416 oazs.PrepRequestProcessor.pRequest Got user-level KeeperException when processing sessionid:0x139d61337cc0003 type:delete cxid:0x4 zxid:0xfffffffffffffffe txntype:unknown reqpath:n/a Error Path:/solr/live_nodes/127.0.0.1:43872_solr Error:KeeperErrorCode = NoNode for /solr/live_nodes/127.0.0.1:43872_solr
[junit4:junit4]   2> 2394 T2411 oascc.SolrZkClient.makePath makePath: /live_nodes/127.0.0.1:43872_solr
[junit4:junit4]   2> 2396 T2431 oascc.ZkStateReader$3.process Updating live nodes
[junit4:junit4]   2> 2397 T2411 oashc.HttpShardHandlerFactory.getParameter Setting socketTimeout to: 0
[junit4:junit4]   2> 2397 T2411 oashc.HttpShardHandlerFactory.getParameter Setting urlScheme to: http://
[junit4:junit4]   2> 2397 T2411 oashc.HttpShardHandlerFactory.getParameter Setting connTimeout to: 0
[junit4:junit4]   2> 2398 T2411 oashc.HttpShardHandlerFactory.getParameter Setting maxConnectionsPerHost to: 20
[junit4:junit4]   2> 2398 T2411 oashc.HttpShardHandlerFactory.getParameter Setting corePoolSize to: 0
[junit4:junit4]   2> 2398 T2411 oashc.HttpShardHandlerFactory.getParameter Setting maximumPoolSize to: 2147483647
[junit4:junit4]   2> 2399 T2411 oashc.HttpShardHandlerFactory.getParameter Setting maxThreadIdleTime to: 5
[junit4:junit4]   2> 2399 T2411 oashc.HttpShardHandlerFactory.getParameter Setting sizeOfQueue to: -1
[junit4:junit4]   2> 2400 T2411 oashc.HttpShardHandlerFactory.getParameter Setting fairnessPolicy to: false
[junit4:junit4]   2> 2400 T2411 oascsi.HttpClientUtil.createClient Creating new http client, config:maxConnectionsPerHost=20&maxConnections=10000&socketTimeout=0&connTimeout=0&retry=false
[junit4:junit4]   2> 2414 T2411 oascc.ZkStateReader.createClusterStateWatchersAndUpdate Updating cluster state from ZooKeeper... 
[junit4:junit4]   2> 2419 T2411 oasc.CoreContainer.create Creating SolrCore 'collection1' using instanceDir: /usr/home/hudson/hudson-slave/workspace/Lucene-Solr-Tests-4.x-java7/solr/build/solr-core/test/J1/./solrtest-jetty1-1347916349357/collection1
[junit4:junit4]   2> 2420 T2411 oasc.ZkController.createCollectionZkNode Check for collection zkNode:collection1
[junit4:junit4]   2> 2421 T2411 oasc.ZkController.createCollectionZkNode Collection zkNode exists
[junit4:junit4]   2> 2421 T2411 oasc.ZkController.readConfigName Load collection config from:/collections/collection1
[junit4:junit4]   2> 2422 T2411 oasc.SolrResourceLoader.<init> new SolrResourceLoader for directory: '/usr/home/hudson/hudson-slave/workspace/Lucene-Solr-Tests-4.x-java7/solr/build/solr-core/test/J1/./solrtest-jetty1-1347916349357/collection1/'
[junit4:junit4]   2> 2423 T2411 oasc.SolrResourceLoader.replaceClassLoader Adding 'file:/usr/home/hudson/hudson-slave/workspace/Lucene-Solr-Tests-4.x-java7/solr/build/solr-core/test/J1/solrtest-jetty1-1347916349357/collection1/lib/README' to classloader
[junit4:junit4]   2> 2424 T2411 oasc.SolrResourceLoader.replaceClassLoader Adding 'file:/usr/home/hudson/hudson-slave/workspace/Lucene-Solr-Tests-4.x-java7/solr/build/solr-core/test/J1/solrtest-jetty1-1347916349357/collection1/lib/classes/' to classloader
[junit4:junit4]   2> 2463 T2411 oasc.SolrConfig.<init> Using Lucene MatchVersion: LUCENE_40
[junit4:junit4]   2> 2508 T2432 oascc.ZkStateReader.updateClusterState Updating cloud state from ZooKeeper... 
[junit4:junit4]   2> 2517 T2411 oasc.SolrConfig.<init> Loaded SolrConfig: solrconfig.xml
[junit4:junit4]   2> 2522 T2431 oascc.ZkStateReader$2.process A cluster state change has occurred - updating...
[junit4:junit4]   2> 2522 T2445 oascc.ZkStateReader$2.process A cluster state change has occurred - updating...
[junit4:junit4]   2> 2522 T2411 oass.IndexSchema.readSchema Reading Solr Schema
[junit4:junit4]   2> 2527 T2411 oass.IndexSchema.readSchema Schema name=test
[junit4:junit4]   2> 2975 T2411 oass.OpenExchangeRatesOrgProvider.init Initialized with rates=open-exchange-rates.json, refreshInterval=1440.
[junit4:junit4]   2> 2983 T2411 oass.IndexSchema.readSchema default search field in schema is text
[junit4:junit4]   2> 2986 T2411 oass.IndexSchema.readSchema unique key field: id
[junit4:junit4]   2> 2994 T2411 oass.FileExchangeRateProvider.reload Reloading exchange rates from file currency.xml
[junit4:junit4]   2> 2998 T2411 oass.FileExchangeRateProvider.reload Reloading exchange rates from file currency.xml
[junit4:junit4]   2> 3001 T2411 oass.OpenExchangeRatesOrgProvider.reload Reloading exchange rates from open-exchange-rates.json
[junit4:junit4]   2> 3002 T2411 oass.OpenExchangeRatesOrgProvider.reload Reloading exchange rates from open-exchange-rates.json
[junit4:junit4]   2> 3003 T2411 oasc.SolrCore.<init> [collection1] Opening new SolrCore at /usr/home/hudson/hudson-slave/workspace/Lucene-Solr-Tests-4.x-java7/solr/build/solr-core/test/J1/./solrtest-jetty1-1347916349357/collection1/, dataDir=./org.apache.solr.cloud.BasicDistributedZk2Test-1347916347334/jetty1/
[junit4:junit4]   2> 3004 T2411 oasc.JmxMonitoredMap.<init> JMX monitoring is enabled. Adding Solr mbeans to JMX Server: com.sun.jmx.mbeanserver.JmxMBeanServer@2dbd9f3d
[junit4:junit4]   2> 3005 T2411 oasc.SolrCore.getNewIndexDir WARNING New index directory detected: old=null new=./org.apache.solr.cloud.BasicDistributedZk2Test-1347916347334/jetty1/index/
[junit4:junit4]   2> 3005 T2411 oasc.SolrCore.initIndex WARNING [collection1] Solr index directory './org.apache.solr.cloud.BasicDistributedZk2Test-1347916347334/jetty1/index' doesn't exist. Creating new index...
[junit4:junit4]   2> 3006 T2411 oasc.CachingDirectoryFactory.get return new directory for /usr/home/hudson/hudson-slave/workspace/Lucene-Solr-Tests-4.x-java7/solr/build/solr-core/test/J1/./org.apache.solr.cloud.BasicDistributedZk2Test-1347916347334/jetty1/index forceNew:false
[junit4:junit4]   2> 3018 T2411 oasc.SolrDeletionPolicy.onCommit SolrDeletionPolicy.onCommit: commits:num=1
[junit4:junit4]   2> 		commit{dir=NRTCachingDirectory(org.apache.lucene.store.NIOFSDirectory@/usr/home/hudson/hudson-slave/workspace/Lucene-Solr-Tests-4.x-java7/solr/build/solr-core/test/J1/org.apache.solr.cloud.BasicDistributedZk2Test-1347916347334/jetty1/index lockFactory=org.apache.lucene.store.NativeFSLockFactory@33dfb503; maxCacheMB=48.0 maxMergeSizeMB=4.0),segFN=segments_1,generation=1,filenames=[segments_1]
[junit4:junit4]   2> 3018 T2411 oasc.SolrDeletionPolicy.updateCommits newest commit = 1
[junit4:junit4]   2> 3019 T2411 oasc.SolrCore.initWriters created xml: solr.XMLResponseWriter
[junit4:junit4]   2> 3021 T2411 oasup.UpdateRequestProcessorChain.init inserting DistributedUpdateProcessorFactory into updateRequestProcessorChain "dedupe"
[junit4:junit4]   2> 3022 T2411 oasup.UpdateRequestProcessorChain.init inserting DistributedUpdateProcessorFactory into updateRequestProcessorChain "dedupe-allfields"
[junit4:junit4]   2> 3022 T2411 oasup.UpdateRequestProcessorChain.init inserting DistributedUpdateProcessorFactory into updateRequestProcessorChain "stored_sig"
[junit4:junit4]   2> 3023 T2411 oasup.UpdateRequestProcessorChain.init inserting DistributedUpdateProcessorFactory into updateRequestProcessorChain "uniq-fields"
[junit4:junit4]   2> 3023 T2411 oasup.UpdateRequestProcessorChain.init inserting DistributedUpdateProcessorFactory into updateRequestProcessorChain "distrib-dup-test-chain-implicit"
[junit4:junit4]   2> 3024 T2411 oasc.RequestHandlers.initHandlersFromConfig adding lazy requestHandler: solr.ReplicationHandler
[junit4:junit4]   2> 3024 T2411 oasc.RequestHandlers.initHandlersFromConfig created /replication: solr.ReplicationHandler
[junit4:junit4]   2> 3025 T2411 oasc.RequestHandlers.initHandlersFromConfig created standard: solr.StandardRequestHandler
[junit4:junit4]   2> 3025 T2411 oasc.RequestHandlers.initHandlersFromConfig created /get: solr.RealTimeGetHandler
[junit4:junit4]   2> 3026 T2411 oasc.RequestHandlers.initHandlersFromConfig created dismax: solr.SearchHandler
[junit4:junit4]   2> 3026 T2411 oasc.RequestHandlers.initHandlersFromConfig created mock: org.apache.solr.core.MockQuerySenderListenerReqHandler
[junit4:junit4]   2> 3027 T2411 oasc.RequestHandlers.initHandlersFromConfig created /admin/: org.apache.solr.handler.admin.AdminHandlers
[junit4:junit4]   2> 3027 T2411 oasc.RequestHandlers.initHandlersFromConfig created defaults: solr.StandardRequestHandler
[junit4:junit4]   2> 3028 T2411 oasc.RequestHandlers.initHandlersFromConfig adding lazy requestHandler: solr.StandardRequestHandler
[junit4:junit4]   2> 3028 T2411 oasc.RequestHandlers.initHandlersFromConfig created lazy: solr.StandardRequestHandler
[junit4:junit4]   2> 3029 T2411 oasc.RequestHandlers.initHandlersFromConfig created /update: solr.UpdateRequestHandler
[junit4:junit4]   2> 3029 T2411 oasc.RequestHandlers.initHandlersFromConfig created /terms: org.apache.solr.handler.component.SearchHandler
[junit4:junit4]   2> 3030 T2411 oasc.RequestHandlers.initHandlersFromConfig created spellCheckCompRH: org.apache.solr.handler.component.SearchHandler
[junit4:junit4]   2> 3030 T2411 oasc.RequestHandlers.initHandlersFromConfig created spellCheckCompRH_Direct: org.apache.solr.handler.component.SearchHandler
[junit4:junit4]   2> 3031 T2411 oasc.RequestHandlers.initHandlersFromConfig created spellCheckWithWordbreak: org.apache.solr.handler.component.SearchHandler
[junit4:junit4]   2> 3031 T2411 oasc.RequestHandlers.initHandlersFromConfig created spellCheckWithWordbreak_Direct: org.apache.solr.handler.component.SearchHandler
[junit4:junit4]   2> 3032 T2411 oasc.RequestHandlers.initHandlersFromConfig created spellCheckCompRH1: org.apache.solr.handler.component.SearchHandler
[junit4:junit4]   2> 3032 T2411 oasc.RequestHandlers.initHandlersFromConfig created tvrh: org.apache.solr.handler.component.SearchHandler
[junit4:junit4]   2> 3033 T2411 oasc.RequestHandlers.initHandlersFromConfig created /mlt: solr.MoreLikeThisHandler
[junit4:junit4]   2> 3034 T2411 oasc.RequestHandlers.initHandlersFromConfig created /debug/dump: solr.DumpRequestHandler
[junit4:junit4]   2> 3036 T2411 oashl.XMLLoader.init xsltCacheLifetimeSeconds=60
[junit4:junit4]   2> 3039 T2411 oasc.SolrCore.initDeprecatedSupport WARNING solrconfig.xml uses deprecated <admin/gettableFiles>, Please update your config to use the ShowFileRequestHandler.
[junit4:junit4]   2> 3040 T2411 oasc.SolrCore.initDeprecatedSupport WARNING adding ShowFileRequestHandler with hidden files: [SCHEMA.XML, OLD_SYNONYMS.TXT, STOPWORDS.TXT, PROTWORDS.TXT, OPEN-EXCHANGE-RATES.JSON, SYNONYMS.TXT, CURRENCY.XML, MAPPING-ISOLATIN1ACCENT.TXT]
[junit4:junit4]   2> 3043 T2411 oass.SolrIndexSearcher.<init> Opening Searcher@46e2e395 main
[junit4:junit4]   2> 3044 T2411 oasu.CommitTracker.<init> Hard AutoCommit: disabled
[junit4:junit4]   2> 3045 T2411 oasu.CommitTracker.<init> Soft AutoCommit: disabled
[junit4:junit4]   2> 3045 T2411 oashc.SpellCheckComponent.inform Initializing spell checkers
[junit4:junit4]   2> 3057 T2411 oass.DirectSolrSpellChecker.init init: {name=direct,classname=DirectSolrSpellChecker,field=lowerfilt,minQueryLength=3}
[junit4:junit4]   2> 3124 T2446 oasc.SolrCore.registerSearcher [collection1] Registered new searcher Searcher@46e2e395 main{StandardDirectoryReader(segments_1:1)}
[junit4:junit4]   2> 3532 T2432 oascc.ZkStateReader.updateClusterState Updating cloud state from ZooKeeper... 
[junit4:junit4]   2> 3545 T2445 oascc.ZkStateReader$2.process A cluster state change has occurred - updating...
[junit4:junit4]   2> 3545 T2431 oascc.ZkStateReader$2.process A cluster state change has occurred - updating...
[junit4:junit4]   2> 3630 T2411 oasc.CoreContainer.register registering core: collection1
[junit4:junit4]   2> 3630 T2411 oasc.ZkController.register Register shard - core:collection1 address:http://127.0.0.1:43872/solr shardId:shard1
[junit4:junit4]   2> 3631 T2411 oascc.SolrZkClient.makePath makePath: /collections/collection1/leader_elect/shard1/election
[junit4:junit4]   2> 3646 T2416 oazs.PrepRequestProcessor.pRequest Got user-level KeeperException when processing sessionid:0x139d61337cc0003 type:delete cxid:0x43 zxid:0xfffffffffffffffe txntype:unknown reqpath:n/a Error Path:/solr/collections/collection1/leaders Error:KeeperErrorCode = NoNode for /solr/collections/collection1/leaders
[junit4:junit4]   2> 3655 T2411 oasc.ShardLeaderElectionContext.runLeaderProcess Running the leader process.
[junit4:junit4]   2> 3655 T2416 oazs.PrepRequestProcessor.pRequest Got user-level KeeperException when processing sessionid:0x139d61337cc0003 type:create cxid:0x44 zxid:0xfffffffffffffffe txntype:unknown reqpath:n/a Error Path:/solr/overseer Error:KeeperErrorCode = NodeExists for /solr/overseer
[junit4:junit4]   2> 3674 T2411 oasc.ShardLeaderElectionContext.waitForReplicasToComeUp Enough replicas found to continue.
[junit4:junit4]   2> 3675 T2411 oasc.ShardLeaderElectionContext.runLeaderProcess I may be the new leader - try and sync
[junit4:junit4]   2> 3675 T2411 oasc.SyncStrategy.sync Sync replicas to http://127.0.0.1:43872/solr/collection1/
[junit4:junit4]   2> 3676 T2411 oasc.SyncStrategy.syncReplicas Sync Success - now sync replicas to me
[junit4:junit4]   2> 3676 T2411 oasc.SyncStrategy.syncToMe http://127.0.0.1:43872/solr/collection1/ has no replicas
[junit4:junit4]   2> 3677 T2411 oasc.ShardLeaderElectionContext.runLeaderProcess I am the new leader: http://127.0.0.1:43872/solr/collection1/
[junit4:junit4]   2> 3677 T2411 oascc.SolrZkClient.makePath makePath: /collections/collection1/leaders/shard1
[junit4:junit4]   2> 3693 T2416 oazs.PrepRequestProcessor.pRequest Got user-level KeeperException when processing sessionid:0x139d61337cc0003 type:create cxid:0x4e zxid:0xfffffffffffffffe txntype:unknown reqpath:n/a Error Path:/solr/overseer Error:KeeperErrorCode = NodeExists for /solr/overseer
[junit4:junit4]   2> 4048 T2432 oascc.ZkStateReader.updateClusterState Updating cloud state from ZooKeeper... 
[junit4:junit4]   2> 4071 T2431 oascc.ZkStateReader$2.process A cluster state change has occurred - updating...
[junit4:junit4]   2> 4071 T2445 oascc.ZkStateReader$2.process A cluster state change has occurred - updating...
[junit4:junit4]   2> 4116 T2411 oasc.ZkController.register We are http://127.0.0.1:43872/solr/collection1/ and leader is http://127.0.0.1:43872/solr/collection1/
[junit4:junit4]   2> 4116 T2411 oasc.ZkController.register No LogReplay needed for core=collection1 baseURL=http://127.0.0.1:43872/solr
[junit4:junit4]   2> 4117 T2411 oasc.ZkController.checkRecovery I am the leader, no recovery necessary
[junit4:junit4]   2> 4119 T2411 oascc.ZkStateReader.updateClusterState Updating cloud state from ZooKeeper... 
[junit4:junit4]   2> 4120 T2411 oass.SolrDispatchFilter.init user.dir=/usr/home/hudson/hudson-slave/workspace/Lucene-Solr-Tests-4.x-java7/solr/build/solr-core/test/J1
[junit4:junit4]   2> 4120 T2411 oass.SolrDispatchFilter.init SolrDispatchFilter.init() done
[junit4:junit4]   2> 4121 T2411 oascsi.HttpClientUtil.createClient Creating new http client, config:maxConnections=128&maxConnectionsPerHost=32&followRedirects=false
[junit4:junit4]   2> 4547 T2411 oejs.Server.doStart jetty-8.1.2.v20120308
[junit4:junit4]   2> 4550 T2411 oejs.AbstractConnector.doStart Started SocketConnector@0.0.0.0:43885
[junit4:junit4]   2> 4551 T2411 oasc.SolrResourceLoader.locateSolrHome JNDI not configured for solr (NoInitialContextEx)
[junit4:junit4]   2> 4552 T2411 oasc.SolrResourceLoader.locateSolrHome using system property solr.solr.home: /usr/home/hudson/hudson-slave/workspace/Lucene-Solr-Tests-4.x-java7/solr/build/solr-core/test/J1/./solrtest-jetty2-1347916351466
[junit4:junit4]   2> 4552 T2411 oasc.SolrResourceLoader.<init> new SolrResourceLoader for deduced Solr Home: '/usr/home/hudson/hudson-slave/workspace/Lucene-Solr-Tests-4.x-java7/solr/build/solr-core/test/J1/./solrtest-jetty2-1347916351466/'
[junit4:junit4]   2> 4585 T2432 oascc.ZkStateReader.updateClusterState Updating cloud state from ZooKeeper... 
[junit4:junit4]   2> 4595 T2411 oass.SolrDispatchFilter.init SolrDispatchFilter.init()
[junit4:junit4]   2> 4596 T2411 oasc.SolrResourceLoader.locateSolrHome JNDI not configured for solr (NoInitialContextEx)
[junit4:junit4]   2> 4596 T2411 oasc.SolrResourceLoader.locateSolrHome using system property solr.solr.home: /usr/home/hudson/hudson-slave/workspace/Lucene-Solr-Tests-4.x-java7/solr/build/solr-core/test/J1/./solrtest-jetty2-1347916351466
[junit4:junit4]   2> 4597 T2411 oasc.CoreContainer$Initializer.initialize looking for solr.xml: /usr/home/hudson/hudson-slave/workspace/Lucene-Solr-Tests-4.x-java7/solr/build/solr-core/test/J1/./solrtest-jetty2-1347916351466/solr.xml
[junit4:junit4]   2> 4597 T2411 oasc.CoreContainer.<init> New CoreContainer 2017508709
[junit4:junit4]   2> 4598 T2411 oasc.CoreContainer.load Loading CoreContainer using Solr Home: '/usr/home/hudson/hudson-slave/workspace/Lucene-Solr-Tests-4.x-java7/solr/build/solr-core/test/J1/./solrtest-jetty2-1347916351466/'
[junit4:junit4]   2> 4599 T2411 oasc.SolrResourceLoader.<init> new SolrResourceLoader for directory: '/usr/home/hudson/hudson-slave/workspace/Lucene-Solr-Tests-4.x-java7/solr/build/solr-core/test/J1/./solrtest-jetty2-1347916351466/'
[junit4:junit4]   2> 4606 T2431 oascc.ZkStateReader$2.process A cluster state change has occurred - updating...
[junit4:junit4]   2> 4606 T2445 oascc.ZkStateReader$2.process A cluster state change has occurred - updating...
[junit4:junit4]   2> 4631 T2411 oasc.CoreContainer.load Registering Log Listener
[junit4:junit4]   2> 4646 T2411 oasc.CoreContainer.initZooKeeper Zookeeper client=127.0.0.1:43861/solr
[junit4:junit4]   2> 4647 T2411 oaz.ZooKeeper.<init> Initiating client connection, connectString=127.0.0.1:43861/solr sessionTimeout=5000 watcher=org.apache.solr.common.cloud.ConnectionManager@1b38e8c4
[junit4:junit4]   2> 4648 T2456 oaz.ClientCnxn$SendThread.startConnect Opening socket connection to server /127.0.0.1:43861
[junit4:junit4]   2> 4648 T2411 oascc.ConnectionManager.waitForConnected Waiting for client to connect to ZooKeeper
[junit4:junit4]   2> 4649 T2456 oaz.ClientCnxn$SendThread.primeConnection Socket connection established to localhost/127.0.0.1:43861, initiating session
[junit4:junit4]   2> 4649 T2413 oazs.NIOServerCnxn$Factory.run Accepted socket connection from /140.211.11.196:43886
[junit4:junit4]   2> 4649 T2413 oazs.NIOServerCnxn.readConnectRequest Client attempting to establish new session at /140.211.11.196:43886
[junit4:junit4]   2> 4651 T2415 oazs.NIOServerCnxn.finishSessionInit Established session 0x139d61337cc0004 with negotiated timeout 5000 for client /140.211.11.196:43886
[junit4:junit4]   2> 4651 T2456 oaz.ClientCnxn$SendThread.readConnectResult Session establishment complete on server localhost/127.0.0.1:43861, sessionid = 0x139d61337cc0004, negotiated timeout = 5000
[junit4:junit4]   2> 4651 T2457 oascc.ConnectionManager.process Watcher org.apache.solr.common.cloud.ConnectionManager@1b38e8c4 name:ZooKeeperConnection Watcher:127.0.0.1:43861/solr got event WatchedEvent state:SyncConnected type:None path:null path:null type:None
[junit4:junit4]   2> 4652 T2411 oascc.ConnectionManager.waitForConnected Client is connected to ZooKeeper
[junit4:junit4]   2> 4652 T2416 oazs.PrepRequestProcessor.pRequest Got user-level KeeperException when processing sessionid:0x139d61337cc0004 type:create cxid:0x1 zxid:0xfffffffffffffffe txntype:unknown reqpath:n/a Error Path:/solr/overseer Error:KeeperErrorCode = NodeExists for /solr/overseer
[junit4:junit4]   2> 4654 T2416 oazs.PrepRequestProcessor.pRequest Got user-level KeeperException when processing sessionid:0x139d61337cc0004 type:create cxid:0x2 zxid:0xfffffffffffffffe txntype:unknown reqpath:n/a Error Path:/solr/overseer Error:KeeperErrorCode = NodeExists for /solr/overseer
[junit4:junit4]   2> 4655 T2411 oasc.ZkController.createEphemeralLiveNode Register node as live in ZooKeeper:/live_nodes/127.0.0.1:43885_solr
[junit4:junit4]   2> 4656 T2416 oazs.PrepRequestProcessor.pRequest Got user-level KeeperException when processing sessionid:0x139d61337cc0004 type:delete cxid:0x4 zxid:0xfffffffffffffffe txntype:unknown reqpath:n/a Error Path:/solr/live_nodes/127.0.0.1:43885_solr Error:KeeperErrorCode = NoNode for /solr/live_nodes/127.0.0.1:43885_solr
[junit4:junit4]   2> 4663 T2411 oascc.SolrZkClient.makePath makePath: /live_nodes/127.0.0.1:43885_solr
[junit4:junit4]   2> 4665 T2445 oascc.ZkStateReader$3.process Updating live nodes
[junit4:junit4]   2> 4665 T2431 oascc.ZkStateReader$3.process Updating live nodes
[junit4:junit4]   2> 4666 T2411 oashc.HttpShardHandlerFactory.getParameter Setting socketTimeout to: 0
[junit4:junit4]   2> 4667 T2411 oashc.HttpShardHandlerFactory.getParameter Setting urlScheme to: http://
[junit4:junit4]   2> 4667 T2411 oashc.HttpShardHandlerFactory.getParameter Setting connTimeout to: 0
[junit4:junit4]   2> 4668 T2411 oashc.HttpShardHandlerFactory.getParameter Setting maxConnectionsPerHost to: 20
[junit4:junit4]   2> 4668 T2411 oashc.HttpShardHandlerFactory.getParameter Setting corePoolSize to: 0
[junit4:junit4]   2> 4668 T2411 oashc.HttpShardHandlerFactory.getParameter Setting maximumPoolSize to: 2147483647
[junit4:junit4]   2> 4669 T2411 oashc.HttpShardHandlerFactory.getParameter Setting maxThreadIdleTime to: 5
[junit4:junit4]   2> 4669 T2411 oashc.HttpShardHandlerFactory.getParameter Setting sizeOfQueue to: -1
[junit4:junit4]   2> 4670 T2411 oashc.HttpShardHandlerFactory.getParameter Setting fairnessPolicy to: false
[junit4:junit4]   2> 4670 T2411 oascsi.HttpClientUtil.createClient Creating new http client, config:maxConnectionsPerHost=20&maxConnections=10000&socketTimeout=0&connTimeout=0&retry=false
[junit4:junit4]   2> 4687 T2411 oascc.ZkStateReader.createClusterStateWatchersAndUpdate Updating cluster state from ZooKeeper... 
[junit4:junit4]   2> 4693 T2411 oasc.CoreContainer.create Creating SolrCore 'collection1' using instanceDir: /usr/home/hudson/hudson-slave/workspace/Lucene-Solr-Tests-4.x-java7/solr/build/solr-core/test/J1/./solrtest-jetty2-1347916351466/collection1
[junit4:junit4]   2> 4694 T2411 oasc.ZkController.createCollectionZkNode Check for collection zkNode:collection1
[junit4:junit4]   2> 4695 T2411 oasc.ZkController.createCollectionZkNode Collection zkNode exists
[junit4:junit4]   2> 4695 T2411 oasc.ZkController.readConfigName Load collection config from:/collections/collection1
[junit4:junit4]   2> 4697 T2411 oasc.SolrResourceLoader.<init> new SolrResourceLoader for directory: '/usr/home/hudson/hudson-slave/workspace/Lucene-Solr-Tests-4.x-java7/solr/build/solr-core/test/J1/./solrtest-jetty2-1347916351466/collection1/'
[junit4:junit4]   2> 4698 T2411 oasc.SolrResourceLoader.replaceClassLoader Adding 'file:/usr/home/hudson/hudson-slave/workspace/Lucene-Solr-Tests-4.x-java7/solr/build/solr-core/test/J1/solrtest-jetty2-1347916351466/collection1/lib/README' to classloader
[junit4:junit4]   2> 4699 T2411 oasc.SolrResourceLoader.replaceClassLoader Adding 'file:/usr/home/hudson/hudson-slave/workspace/Lucene-Solr-Tests-4.x-java7/solr/build/solr-core/test/J1/solrtest-jetty2-1347916351466/collection1/lib/classes/' to classloader
[junit4:junit4]   2> 4747 T2411 oasc.SolrConfig.<init> Using Lucene MatchVersion: LUCENE_40
[junit4:junit4]   2> 4813 T2411 oasc.SolrConfig.<init> Loaded SolrConfig: solrconfig.xml
[junit4:junit4]   2> 4914 T2411 oass.IndexSchema.readSchema Reading Solr Schema
[junit4:junit4]   2> 4921 T2411 oass.IndexSchema.readSchema Schema name=test
[junit4:junit4]   2> 5587 T2411 oass.OpenExchangeRatesOrgProvider.init Initialized with rates=open-exchange-rates.json, refreshInterval=1440.
[junit4:junit4]   2> 5598 T2411 oass.IndexSchema.readSchema default search field in schema is text
[junit4:junit4]   2> 5602 T2411 oass.IndexSchema.readSchema unique key field: id
[junit4:junit4]   2> 5630 T2411 oass.FileExchangeRateProvider.reload Reloading exchange rates from file currency.xml
[junit4:junit4]   2> 5636 T2411 oass.FileExchangeRateProvider.reload Reloading exchange rates from file currency.xml
[junit4:junit4]   2> 5643 T2411 oass.OpenExchangeRatesOrgProvider.reload Reloading exchange rates from open-exchange-rates.json
[junit4:junit4]   2> 5645 T2411 oass.OpenExchangeRatesOrgProvider.reload Reloading exchange rates from open-exchange-rates.json
[junit4:junit4]   2> 5646 T2411 oasc.SolrCore.<init> [collection1] Opening new SolrCore at /usr/home/hudson/hudson-slave/workspace/Lucene-Solr-Tests-4.x-java7/solr/build/solr-core/test/J1/./solrtest-jetty2-1347916351466/collection1/, dataDir=./org.apache.solr.cloud.BasicDistributedZk2Test-1347916347334/jetty2/
[junit4:junit4]   2> 5646 T2411 oasc.JmxMonitoredMap.<init> JMX monitoring is enabled. Adding Solr mbeans to JMX Server: com.sun.jmx.mbeanserver.JmxMBeanServer@2dbd9f3d
[junit4:junit4]   2> 5648 T2411 oasc.SolrCore.getNewIndexDir WARNING New index directory detected: old=null new=./org.apache.solr.cloud.BasicDistributedZk2Test-1347916347334/jetty2/index/
[junit4:junit4]   2> 5649 T2411 oasc.SolrCore.initIndex WARNING [collection1] Solr index directory './org.apache.solr.cloud.BasicDistributedZk2Test-1347916347334/jetty2/index' doesn't exist. Creating new index...
[junit4:junit4]   2> 5650 T2411 oasc.CachingDirectoryFactory.get return new directory for /usr/home/hudson/hudson-slave/workspace/Lucene-Solr-Tests-4.x-java7/solr/build/solr-core/test/J1/./org.apache.solr.cloud.BasicDistributedZk2Test-1347916347334/jetty2/index forceNew:false
[junit4:junit4]   2> 5691 T2411 oasc.SolrDeletionPolicy.onCommit SolrDeletionPolicy.onCommit: commits:num=1
[junit4:junit4]   2> 		commit{dir=NRTCachingDirectory(org.apache.lucene.store.NIOFSDirectory@/usr/home/hudson/hudson-slave/workspace/Lucene-Solr-Tests-4.x-java7/solr/build/solr-core/test/J1/org.apache.solr.cloud.BasicDistributedZk2Test-1347916347334/jetty2/index lockFactory=org.apache.lucene.store.NativeFSLockFactory@aedf58d; maxCacheMB=48.0 maxMergeSizeMB=4.0),segFN=segments_1,generation=1,filenames=[segments_1]
[junit4:junit4]   2> 5692 T2411 oasc.SolrDeletionPolicy.updateCommits newest commit = 1
[junit4:junit4]   2> 5693 T2411 oasc.SolrCore.initWriters created xml: solr.XMLResponseWriter
[junit4:junit4]   2> 5696 T2411 oasup.UpdateRequestProcessorChain.init inserting DistributedUpdateProcessorFactory into updateRequestProcessorChain "dedupe"
[junit4:junit4]   2> 5696 T2411 oasup.UpdateRequestProcessorChain.init inserting DistributedUpdateProcessorFactory into updateRequestProcessorChain "dedupe-allfields"
[junit4:junit4]   2> 5697 T2411 oasup.UpdateRequestProcessorChain.init inserting DistributedUpdateProcessorFactory into updateRequestProcessorChain "stored_sig"
[junit4:junit4]   2> 5698 T2411 oasup.UpdateRequestProcessorChain.init inserting DistributedUpdateProcessorFactory into updateRequestProcessorChain "uniq-fields"
[junit4:junit4]   2> 5698 T2411 oasup.UpdateRequestProcessorChain.init inserting DistributedUpdateProcessorFactory into updateRequestProcessorChain "distrib-dup-test-chain-implicit"
[junit4:junit4]   2> 5699 T2411 oasc.RequestHandlers.initHandlersFromConfig adding lazy requestHandler: solr.ReplicationHandler
[junit4:junit4]   2> 5699 T2411 oasc.RequestHandlers.initHandlersFromConfig created /replication: solr.ReplicationHandler
[junit4:junit4]   2> 5700 T2411 oasc.RequestHandlers.initHandlersFromConfig created standard: solr.StandardRequestHandler
[junit4:junit4]   2> 5701 T2411 oasc.RequestHandlers.initHandlersFromConfig created /get: solr.RealTimeGetHandler
[junit4:junit4]   2> 5702 T2411 oasc.RequestHandlers.initHandlersFromConfig created dismax: solr.SearchHandler
[junit4:junit4]   2> 5702 T2411 oasc.RequestHandlers.initHandlersFromConfig created mock: org.apache.solr.core.MockQuerySenderListenerReqHandler
[junit4:junit4]   2> 5703 T2411 oasc.RequestHandlers.initHandlersFromConfig created /admin/: org.apache.solr.handler.admin.AdminHandlers
[junit4:junit4]   2> 5704 T2411 oasc.RequestHandlers.initHandlersFromConfig created defaults: solr.StandardRequestHandler
[junit4:junit4]   2> 5705 T2411 oasc.RequestHandlers.initHandlersFromConfig adding lazy requestHandler: solr.StandardRequestHandler
[junit4:junit4]   2> 5706 T2411 oasc.RequestHandlers.initHandlersFromConfig created lazy: solr.StandardRequestHandler
[junit4:junit4]   2> 5706 T2411 oasc.RequestHandlers.initHandlersFromConfig created /update: solr.UpdateRequestHandler
[junit4:junit4]   2> 5707 T2411 oasc.RequestHandlers.initHandlersFromConfig created /terms: org.apache.solr.handler.component.SearchHandler
[junit4:junit4]   2> 5708 T2411 oasc.RequestHandlers.initHandlersFromConfig created spellCheckCompRH: org.apache.solr.handler.component.SearchHandler
[junit4:junit4]   2> 5708 T2411 oasc.RequestHandlers.initHandlersFromConfig created spellCheckCompRH_Direct: org.apache.solr.handler.component.SearchHandler
[junit4:junit4]   2> 5709 T2411 oasc.RequestHandlers.initHandlersFromConfig created spellCheckWithWordbreak: org.apache.solr.handler.component.SearchHandler
[junit4:junit4]   2> 5710 T2411 oasc.RequestHandlers.initHandlersFromConfig created spellCheckWithWordbreak_Direct: org.apache.solr.handler.component.SearchHandler
[junit4:junit4]   2> 5710 T2411 oasc.RequestHandlers.initHandlersFromConfig created spellCheckCompRH1: org.apache.solr.handler.component.SearchHandler
[junit4:junit4]   2> 5711 T2411 oasc.RequestHandlers.initHandlersFromConfig created tvrh: org.apache.solr.handler.component.SearchHandler
[junit4:junit4]   2> 5712 T2411 oasc.RequestHandlers.initHandlersFromConfig created /mlt: solr.MoreLikeThisHandler
[junit4:junit4]   2> 5713 T2411 oasc.RequestHandlers.initHandlersFromConfig created /debug/dump: solr.DumpRequestHandler
[junit4:junit4]   2> 5718 T2411 oashl.XMLLoader.init xsltCacheLifetimeSeconds=60
[junit4:junit4]   2> 5722 T2411 oasc.SolrCore.initDeprecatedSupport WARNING solrconfig.xml uses deprecated <admin/gettableFiles>, Please update your config to use the ShowFileRequestHandler.
[junit4:junit4]   2> 5723 T2411 oasc.SolrCore.initDeprecatedSupport WARNING adding ShowFileRequestHandler with hidden files: [SCHEMA.XML, OLD_SYNONYMS.TXT, STOPWORDS.TXT, PROTWORDS.TXT, OPEN-EXCHANGE-RATES.JSON, SYNONYMS.TXT, CURRENCY.XML, MAPPING-ISOLATIN1ACCENT.TXT]
[junit4:junit4]   2> 5727 T2411 oass.SolrIndexSearcher.<init> Opening Searcher@b1e8132 main
[junit4:junit4]   2> 5729 T2411 oasu.CommitTracker.<init> Hard AutoCommit: disabled
[junit4:junit4]   2> 5729 T2411 oasu.CommitTracker.<init> Soft AutoCommit: disabled
[junit4:junit4]   2> 5730 T2411 oashc.SpellCheckComponent.inform Initializing spell checkers
[junit4:junit4]   2> 5776 T2411 oass.DirectSolrSpellChecker.init init: {name=direct,classname=DirectSolrSpellChecker,field=lowerfilt,minQueryLength=3}
[junit4:junit4]   2> 5999 T2458 oasc.SolrCore.registerSearcher [collection1] Registered new searcher Searcher@b1e8132 main{StandardDirectoryReader(segments_1:1)}
[junit4:junit4]   2> 6122 T2432 oascc.ZkStateReader.updateClusterState Updating cloud state from ZooKeeper... 
[junit4:junit4]   2> 6142 T2457 oascc.ZkStateReader$2.process A cluster state change has occurred - updating...
[junit4:junit4]   2> 6142 T2431 oascc.ZkStateReader$2.process A cluster state change has occurred - updating...
[junit4:junit4]   2> 6143 T2445 oascc.ZkStateReader$2.process A cluster state change has occurred - updating...
[junit4:junit4]   2> 6527 T2411 oasc.CoreContainer.register registering core: collection1
[junit4:junit4]   2> 6528 T2411 oasc.ZkController.register Register shard - core:collection1 address:http://127.0.0.1:43885/solr shardId:shard2
[junit4:junit4]   2> 6529 T2411 oascc.SolrZkClient.makePath makePath: /collections/collection1/leader_elect/shard2/election
[junit4:junit4]   2> 6545 T2416 oazs.PrepRequestProcessor.pRequest Got user-level KeeperException when processing sessionid:0x139d61337cc0004 type:delete cxid:0x41 zxid:0xfffffffffffffffe txntype:unknown reqpath:n/a Error Path:/solr/collections/collection1/leaders/shard2 Error:KeeperErrorCode = NoNode for /solr/collections/collection1/leaders/shard2
[junit4:junit4]   2> 6546 T2411 oasc.ShardLeaderElectionContext.runLeaderProcess Running the leader process.
[junit4:junit4]   2> 6548 T2416 oazs.PrepRequestProcessor.pRequest Got user-level KeeperException when processing sessionid:0x139d61337cc0004 type:create cxid:0x42 zxid:0xfffffffffffffffe txntype:unknown reqpath:n/a Error Path:/solr/overseer Error:KeeperErrorCode = NodeExists for /solr/overseer
[junit4:junit4]   2> 6550 T2411 oasc.ShardLeaderElectionContext.waitForReplicasToComeUp Enough replicas found to continue.
[junit4:junit4]   2> 6551 T2411 oasc.ShardLeaderElectionContext.runLeaderProcess I may be the new leader - try and sync
[junit4:junit4]   2> 6551 T2411 oasc.SyncStrategy.sync Sync replicas to http://127.0.0.1:43885/solr/collection1/
[junit4:junit4]   2> 6552 T2411 oasc.SyncStrategy.syncReplicas Sync Success - now sync replicas to me
[junit4:junit4]   2> 6552 T2411 oasc.SyncStrategy.syncToMe http://127.0.0.1:43885/solr/collection1/ has no replicas
[junit4:junit4]   2> 6553 T2411 oasc.ShardLeaderElectionContext.runLeaderProcess I am the new leader: http://127.0.0.1:43885/solr/collection1/
[junit4:junit4]   2> 6553 T2411 oascc.SolrZkClient.makePath makePath: /collections/collection1/leaders/shard2
[junit4:junit4]   2> 6556 T2416 oazs.PrepRequestProcessor.pRequest Got user-level KeeperException when processing sessionid:0x139d61337cc0004 type:create cxid:0x4b zxid:0xfffffffffffffffe txntype:unknown reqpath:n/a Error Path:/solr/overseer Error:KeeperErrorCode = NodeExists for /solr/overseer
[junit4:junit4]   2> 6646 T2432 oascc.ZkStateReader.updateClusterState Updating cloud state from ZooKeeper... 
[junit4:junit4]   2> 6660 T2445 oascc.ZkStateReader$2.process A cluster state change has occurred - updating...
[junit4:junit4]   2> 6660 T2457 oascc.ZkStateReader$2.process A cluster state change has occurred - updating...
[junit4:junit4]   2> 6660 T2431 oascc.ZkStateReader$2.process A cluster state change has occurred - updating...
[junit4:junit4]   2> 6711 T2411 oasc.ZkController.register We are http://127.0.0.1:43885/solr/collection1/ and leader is http://127.0.0.1:43885/solr/collection1/
[junit4:junit4]   2> 6711 T2411 oasc.ZkController.register No LogReplay needed for core=collection1 baseURL=http://127.0.0.1:43885/solr
[junit4:junit4]   2> 6712 T2411 oasc.ZkController.checkRecovery I am the leader, no recovery necessary
[junit4:junit4]   2> 6714 T2411 oascc.ZkStateReader.updateClusterState Updating cloud state from ZooKeeper... 
[junit4:junit4]   2> 6714 T2411 oass.SolrDispatchFilter.init user.dir=/usr/home/hudson/hudson-slave/workspace/Lucene-Solr-Tests-4.x-java7/solr/build/solr-core/test/J1
[junit4:junit4]   2> 6715 T2411 oass.SolrDispatchFilter.init SolrDispatchFilter.init() done
[junit4:junit4]   2> 6715 T2411 oascsi.HttpClientUtil.createClient Creating new http client, config:maxConnections=128&maxConnectionsPerHost=32&followRedirects=false
[junit4:junit4]   2> 7165 T2432 oascc.ZkStateReader.updateClusterState Updating cloud state from ZooKeeper... 
[junit4:junit4]   2> 7165 T2411 oejs.Server.doStart jetty-8.1.2.v20120308
[junit4:junit4]   2> 7169 T2411 oejs.AbstractConnector.doStart Started SocketConnector@0.0.0.0:43889
[junit4:junit4]   2> 7170 T2411 oasc.SolrResourceLoader.locateSolrHome JNDI not configured for solr (NoInitialContextEx)
[junit4:junit4]   2> 7170 T2411 oasc.SolrResourceLoader.locateSolrHome using system property solr.solr.home: /usr/home/hudson/hudson-slave/workspace/Lucene-Solr-Tests-4.x-java7/solr/build/solr-core/test/J1/./solrtest-jetty3-1347916354060
[junit4:junit4]   2> 7171 T2411 oasc.SolrResourceLoader.<init> new SolrResourceLoader for deduced Solr Home: '/usr/home/hudson/hudson-slave/workspace/Lucene-Solr-Tests-4.x-java7/solr/build/solr-core/test/J1/./solrtest-jetty3-1347916354060/'
[junit4:junit4]   2> 7179 T2445 oascc.ZkStateReader$2.process A cluster state change has occurred - updating...
[junit4:junit4]   2> 7179 T2457 oascc.ZkStateReader$2.process A cluster state change has occurred - updating...
[junit4:junit4]   2> 7179 T2431 oascc.ZkStateReader$2.process A cluster state change has occurred - updating...
[junit4:junit4]   2> 7218 T2411 oass.SolrDispatchFilter.init SolrDispatchFilter.init()
[junit4:junit4]   2> 7219 T2411 oasc.SolrResourceLoader.locateSolrHome JNDI not configured for solr (NoInitialContextEx)
[junit4:junit4]   2> 7219 T2411 oasc.SolrResourceLoader.locateSolrHome using system property solr.solr.home: /usr/home/hudson/hudson-slave/workspace/Lucene-Solr-Tests-4.x-java7/solr/build/solr-core/test/J1/./solrtest-jetty3-1347916354060
[junit4:junit4]   2> 7220 T2411 oasc.CoreContainer$Initializer.initialize looking for solr.xml: /usr/home/hudson/hudson-slave/workspace/Lucene-Solr-Tests-4.x-java7/solr/build/solr-core/test/J1/./solrtest-jetty3-1347916354060/solr.xml
[junit4:junit4]   2> 7220 T2411 oasc.CoreContainer.<init> New CoreContainer 1155731909
[junit4:junit4]   2> 7221 T2411 oasc.CoreContainer.load Loading CoreContainer using Solr Home: '/usr/home/hudson/hudson-slave/workspace/Lucene-Solr-Tests-4.x-java7/solr/build/solr-core/test/J1/./solrtest-jetty3-1347916354060/'
[junit4:junit4]   2> 7222 T2411 oasc.SolrResourceLoader.<init> new SolrResourceLoader for directory: '/usr/home/hudson/hudson-slave/workspace/Lucene-Solr-Tests-4.x-java7/solr/build/solr-core/test/J1/./solrtest-jetty3-1347916354060/'
[junit4:junit4]   2> 7257 T2411 oasc.CoreContainer.load Registering Log Listener
[junit4:junit4]   2> 7275 T2411 oasc.CoreContainer.initZooKeeper Zookeeper client=127.0.0.1:43861/solr
[junit4:junit4]   2> 7276 T2411 oaz.ZooKeeper.<init> Initiating client connection, connectString=127.0.0.1:43861/solr sessionTimeout=5000 watcher=org.apache.solr.common.cloud.ConnectionManager@52098d5a
[junit4:junit4]   2> 7277 T2468 oaz.ClientCnxn$SendThread.startConnect Opening socket connection to server /127.0.0.1:43861
[junit4:junit4]   2> 7277 T2411 oascc.ConnectionManager.waitForConnected Waiting for client to connect to ZooKeeper
[junit4:junit4]   2> 7278 T2468 oaz.ClientCnxn$SendThread.primeConnection Socket connection established to localhost/127.0.0.1:43861, initiating session
[junit4:junit4]   2> 7278 T2413 oazs.NIOServerCnxn$Factory.run Accepted socket connection from /140.211.11.196:43891
[junit4:junit4]   2> 7278 T2413 oazs.NIOServerCnxn.readConnectRequest Client attempting to establish new session at /140.211.11.196:43891
[junit4:junit4]   2> 7280 T2415 oazs.NIOServerCnxn.finishSessionInit Established session 0x139d61337cc0005 with negotiated timeout 5000 for client /140.211.11.196:43891
[junit4:junit4]   2> 7280 T2468 oaz.ClientCnxn$SendThread.readConnectResult Session establishment complete on server localhost/127.0.0.1:43861, sessionid = 0x139d61337cc0005, negotiated timeout = 5000
[junit4:junit4]   2> 7280 T2469 oascc.ConnectionManager.process Watcher org.apache.solr.common.cloud.ConnectionManager@52098d5a name:ZooKeeperConnection Watcher:127.0.0.1:43861/solr got event WatchedEvent state:SyncConnected type:None path:null path:null type:None
[junit4:junit4]   2> 7281 T2411 oascc.ConnectionManager.waitForConnected Client is connected to ZooKeeper
[junit4:junit4]   2> 7281 T2416 oazs.PrepRequestProcessor.pRequest Got user-level KeeperException when processing sessionid:0x139d61337cc0005 type:create cxid:0x1 zxid:0xfffffffffffffffe txntype:unknown reqpath:n/a Error Path:/solr/overseer Error:KeeperErrorCode = NodeExists for /solr/overseer
[junit4:junit4]   2> 7283 T2416 oazs.PrepRequestProcessor.pRequest Got user-level KeeperException when processing sessionid:0x139d61337cc0005 type:create cxid:0x2 zxid:0xfffffffffffffffe txntype:unknown reqpath:n/a Error Path:/solr/overseer Error:KeeperErrorCode = NodeExists for /solr/overseer
[junit4:junit4]   2> 7292 T2411 oasc.ZkController.createEphemeralLiveNode Register node as live in ZooKeeper:/live_nodes/127.0.0.1:43889_solr
[junit4:junit4]   2> 7293 T2416 oazs.PrepRequestProcessor.pRequest Got user-level KeeperException when processing sessionid:0x139d61337cc0005 type:delete cxid:0x4 zxid:0xfffffffffffffffe txntype:unknown reqpath:n/a Error Path:/solr/live_nodes/127.0.0.1:43889_solr Error:KeeperErrorCode = NoNode for /solr/live_nodes/127.0.0.1:43889_solr
[junit4:junit4]   2> 7294 T2411 oascc.SolrZkClient.makePath makePath: /live_nodes/127.0.0.1:43889_solr
[junit4:junit4]   2> 7296 T2431 oascc.ZkStateReader$3.process Updating live nodes
[junit4:junit4]   2> 7296 T2457 oascc.ZkStateReader$3.process Updating live nodes
[junit4:junit4]   2> 7296 T2445 oascc.ZkStateReader$3.process Updating live nodes
[junit4:junit4]   2> 7297 T2411 oashc.HttpShardHandlerFactory.getParameter Setting socketTimeout to: 0
[junit4:junit4]   2> 7297 T2411 oashc.HttpShardHandlerFactory.getParameter Setting urlScheme to: http://
[junit4:junit4]   2> 7298 T2411 oashc.HttpShardHandlerFactory.getParameter Setting connTimeout to: 0
[junit4:junit4]   2> 7298 T2411 oashc.HttpShardHandlerFactory.getParameter Setting maxConnectionsPerHost to: 20
[junit4:junit4]   2> 7299 T2411 oashc.HttpShardHandlerFactory.getParameter Setting corePoolSize to: 0
[junit4:junit4]   2> 7299 T2411 oashc.HttpShardHandlerFactory.getParameter Setting maximumPoolSize to: 2147483647
[junit4:junit4]   2> 7299 T2411 oashc.HttpShardHandlerFactory.getParameter Setting maxThreadIdleTime to: 5
[junit4:junit4]   2> 7300 T2411 oashc.HttpShardHandlerFactory.getParameter Setting sizeOfQueue to: -1
[junit4:junit4]   2> 7300 T2411 oashc.HttpShardHandlerFactory.getParameter Setting fairnessPolicy to: false
[junit4:junit4]   2> 7301 T2411 oascsi.HttpClientUtil.createClient Creating new http client, config:maxConnectionsPerHost=20&maxConnections=10000&socketTimeout=0&connTimeout=0&retry=false
[junit4:junit4]   2> 7320 T2411 oascc.ZkStateReader.createClusterStateWatchersAndUpdate Updating cluster state from ZooKeeper... 
[junit4:junit4]   2> 7327 T2411 oasc.CoreContainer.create Creating SolrCore 'collection1' using instanceDir: /usr/home/hudson/hudson-slave/workspace/Lucene-Solr-Tests-4.x-java7/solr/build/solr-core/test/J1/./solrtest-jetty3-1347916354060/collection1
[junit4:junit4]   2> 7328 T2411 oasc.ZkController.createCollectionZkNode Check for collection zkNode:collection1
[junit4:junit4]   2> 7328 T2411 oasc.ZkController.createCollectionZkNode Collection zkNode exists
[junit4:junit4]   2> 7329 T2411 oasc.ZkController.readConfigName Load collection config from:/collections/collection1
[junit4:junit4]   2> 7330 T2411 oasc.SolrResourceLoader.<init> new SolrResourceLoader for directory: '/usr/home/hudson/hudson-slave/workspace/Lucene-Solr-Tests-4.x-java7/solr/build/solr-core/test/J1/./solrtest-jetty3-1347916354060/collection1/'
[junit4:junit4]   2> 7332 T2411 oasc.SolrResourceLoader.replaceClassLoader Adding 'file:/usr/home/hudson/hudson-slave/workspace/Lucene-Solr-Tests-4.x-java7/solr/build/solr-core/test/J1/solrtest-jetty3-1347916354060/collection1/lib/classes/' to classloader
[junit4:junit4]   2> 7333 T2411 oasc.SolrResourceLoader.replaceClassLoader Adding 'file:/usr/home/hudson/hudson-slave/workspace/Lucene-Solr-Tests-4.x-java7/solr/build/solr-core/test/J1/solrtest-jetty3-1347916354060/collection1/lib/README' to classloader
[junit4:junit4]   2> 7386 T2411 oasc.SolrConfig.<init> Using Lucene MatchVersion: LUCENE_40
[junit4:junit4]   2> 7458 T2411 oasc.SolrConfig.<init> Loaded SolrConfig: solrconfig.xml
[junit4:junit4]   2> 7559 T2411 oass.IndexSchema.readSchema Reading Solr Schema
[junit4:junit4]   2> 7566 T2411 oass.IndexSchema.readSchema Schema name=test
[junit4:junit4]   2> 8178 T2411 oass.OpenExchangeRatesOrgProvider.init Initialized with rates=open-exchange-rates.json, refreshInterval=1440.
[junit4:junit4]   2> 8191 T2411 oass.IndexSchema.readSchema default search field in schema is text
[junit4:junit4]   2> 8196 T2411 oass.IndexSchema.readSchema unique key field: id
[junit4:junit4]   2> 8207 T2411 oass.FileExchangeRateProvider.reload Reloading exchange rates from file currency.xml
[junit4:junit4]   2> 8212 T2411 oass.FileExchangeRateProvider.reload Reloading exchange rates from file currency.xml
[junit4:junit4]   2> 8217 T2411 oass.OpenExchangeRatesOrgProvider.reload Reloading exchange rates from open-exchange-rates.json
[junit4:junit4]   2> 8218 T2411 oass.OpenExchangeRatesOrgProvider.reload Reloading exchange rates from open-exchange-rates.json
[junit4:junit4]   2> 8219 T2411 oasc.SolrCore.<init> [collection1] Opening new SolrCore at /usr/home/hudson/hudson-slave/workspace/Lucene-Solr-Tests-4.x-java7/solr/build/solr-core/test/J1/./solrtest-jetty3-1347916354060/collection1/, dataDir=./org.apache.solr.cloud.BasicDistributedZk2Test-1347916347334/jetty3/
[junit4:junit4]   2> 8219 T2411 oasc.JmxMonitoredMap.<init> JMX monitoring is enabled. Adding Solr mbeans to JMX Server: com.sun.jmx.mbeanserver.JmxMBeanServer@2dbd9f3d
[junit4:junit4]   2> 8220 T2411 oasc.SolrCore.getNewIndexDir WARNING New index directory detected: old=null new=./org.apache.solr.cloud.BasicDistributedZk2Test-1347916347334/jetty3/index/
[junit4:junit4]   2> 8221 T2411 oasc.SolrCore.initIndex WARNING [collection1] Solr index directory './org.apache.solr.cloud.BasicDistributedZk2Test-1347916347334/jetty3/index' doesn't exist. Creating new index...
[junit4:junit4]   2> 8222 T2411 oasc.CachingDirectoryFactory.get return new directory for /usr/home/hudson/hudson-slave/workspace/Lucene-Solr-Tests-4.x-java7/solr/build/solr-core/test/J1/./org.apache.solr.cloud.BasicDistributedZk2Test-1347916347334/jetty3/index forceNew:false
[junit4:junit4]   2> 8228 T2411 oasc.SolrDeletionPolicy.onCommit SolrDeletionPolicy.onCommit: commits:num=1
[junit4:junit4]   2> 		commit{dir=NRTCachingDirectory(org.apache.lucene.store.NIOFSDirectory@/usr/home/hudson/hudson-slave/workspace/Lucene-Solr-Tests-4.x-java7/solr/build/solr-core/test/J1/org.apache.solr.cloud.BasicDistributedZk2Test-1347916347334/jetty3/index lockFactory=org.apache.lucene.store.NativeFSLockFactory@38f0e071; maxCacheMB=48.0 maxMergeSizeMB=4.0),segFN=segments_1,generation=1,filenames=[segments_1]
[junit4:junit4]   2> 8228 T2411 oasc.SolrDeletionPolicy.updateCommits newest commit = 1
[junit4:junit4]   2> 8229 T2411 oasc.SolrCore.initWriters created xml: solr.XMLResponseWriter
[junit4:junit4]   2> 8231 T2411 oasup.UpdateRequestProcessorChain.init inserting DistributedUpdateProcessorFactory into updateRequestProcessorChain "dedupe"
[junit4:junit4]   2> 8232 T2411 oasup.UpdateRequestProcessorChain.init inserting DistributedUpdateProcessorFactory into updateRequestProcessorChain "dedupe-allfields"
[junit4:junit4]   2> 8232 T2411 oasup.UpdateRequestProcessorChain.init inserting DistributedUpdateProcessorFactory into updateRequestProcessorChain "stored_sig"
[junit4:junit4]   2> 8232 T2411 oasup.UpdateRequestProcessorChain.init inserting DistributedUpdateProcessorFactory into updateRequestProcessorChain "uniq-fields"
[junit4:junit4]   2> 8233 T2411 oasup.UpdateRequestProcessorChain.init inserting DistributedUpdateProcessorFactory into updateRequestProcessorChain "distrib-dup-test-chain-implicit"
[junit4:junit4]   2> 8233 T2411 oasc.RequestHandlers.initHandlersFromConfig adding lazy requestHandler: solr.ReplicationHandler
[junit4:junit4]   2> 8234 T2411 oasc.RequestHandlers.initHandlersFromConfig created /replication: solr.ReplicationHandler
[junit4:junit4]   2> 8234 T2411 oasc.RequestHandlers.initHandlersFromConfig created standard: solr.StandardRequestHandler
[junit4:junit4]   2> 8235 T2411 oasc.RequestHandlers.initHandlersFromConfig created /get: solr.RealTimeGetHandler
[junit4:junit4]   2> 8236 T2411 oasc.RequestHandlers.initHandlersFromConfig created dismax: solr.SearchHandler
[junit4:junit4]   2> 8236 T2411 oasc.RequestHandlers.initHandlersFromConfig created mock: org.apache.solr.core.MockQuerySenderListenerReqHandler
[junit4:junit4]   2> 8237 T2411 oasc.RequestHandlers.initHandlersFromConfig created /admin/: org.apache.solr.handler.admin.AdminHandlers
[junit4:junit4]   2> 8237 T2411 oasc.RequestHandlers.initHandlersFromConfig created defaults: solr.StandardRequestHandler
[junit4:junit4]   2> 8238 T2411 oasc.RequestHandlers.initHandlersFromConfig adding lazy requestHandler: solr.StandardRequestHandler
[junit4:junit4]   2> 8238 T2411 oasc.RequestHandlers.initHandlersFromConfig created lazy: solr.StandardRequestHandler
[junit4:junit4]   2> 8239 T2411 oasc.RequestHandlers.initHandlersFromConfig created /update: solr.UpdateRequestHandler
[junit4:junit4]   2> 8239 T2411 oasc.RequestHandlers.initHandlersFromConfig created /terms: org.apache.solr.handler.component.SearchHandler
[junit4:junit4]   2> 8240 T2411 oasc.RequestHandlers.initHandlersFromConfig created spellCheckCompRH: org.apache.solr.handler.component.SearchHandler
[junit4:junit4]   2> 8240 T2411 oasc.RequestHandlers.initHandlersFromConfig created spellCheckCompRH_Direct: org.apache.solr.handler.component.SearchHandler
[junit4:junit4]   2> 8241 T2411 oasc.RequestHandlers.initHandlersFromConfig created spellCheckWithWordbreak: org.apache.solr.handler.component.SearchHandler
[junit4:junit4]   2> 8241 T2411 oasc.RequestHandlers.initHandlersFromConfig created spellCheckWithWordbreak_Direct: org.apache.solr.handler.component.SearchHandler
[junit4:junit4]   2> 8242 T2411 oasc.RequestHandlers.initHandlersFromConfig created spellCheckCompRH1: org.apache.solr.handler.component.SearchHandler
[junit4:junit4]   2> 8242 T2411 oasc.RequestHandlers.initHandlersFromConfig created tvrh: org.apache.solr.handler.component.SearchHandler
[junit4:junit4]   2> 8243 T2411 oasc.RequestHandlers.initHandlersFromConfig created /mlt: solr.MoreLikeThisHandler
[junit4:junit4]   2> 8243 T2411 oasc.RequestHandlers.initHandlersFromConfig created /debug/dump: solr.DumpRequestHandler
[junit4:junit4]   2> 8246 T2411 oashl.XMLLoader.init xsltCacheLifetimeSeconds=60
[junit4:junit4]   2> 8249 T2411 oasc.SolrCore.initDeprecatedSupport WARNING solrconfig.xml uses deprecated <admin/gettableFiles>, Please update your config to use the ShowFileRequestHandler.
[junit4:junit4]   2> 8250 T2411 oasc.SolrCore.initDeprecatedSupport WARNING adding ShowFileRequestHandler with hidden files: [SCHEMA.XML, OLD_SYNONYMS.TXT, STOPWORDS.TXT, PROTWORDS.TXT, OPEN-EXCHANGE-RATES.JSON, SYNONYMS.TXT, CURRENCY.XML, MAPPING-ISOLATIN1ACCENT.TXT]
[junit4:junit4]   2> 8253 T2411 oass.SolrIndexSearcher.<init> Opening Searcher@1b46cbf5 main
[junit4:junit4]   2> 8254 T2411 oasu.CommitTracker.<init> Hard AutoCommit: disabled
[junit4:junit4]   2> 8255 T2411 oasu.CommitTracker.<init> Soft AutoCommit: disabled
[junit4:junit4]   2> 8255 T2411 oashc.SpellCheckComponent.inform Initializing spell checkers
[junit4:junit4]   2> 8261 T2411 oass.DirectSolrSpellChecker.init init: {name=direct,classname=DirectSolrSpellChecker,field=lowerfilt,minQueryLength=3}
[junit4:junit4]   2> 8314 T2470 oasc.SolrCore.registerSearcher [collection1] Registered new searcher Searcher@1b46cbf5 main{StandardDirectoryReader(segments_1:1)}
[junit4:junit4]   2> 8684 T2432 oascc.ZkStateReader.updateClusterState Updating cloud state from ZooKeeper... 
[junit4:junit4]   2> 8697 T2445 oascc.ZkStateReader$2.process A cluster state change has occurred - updating...
[junit4:junit4]   2> 8697 T2469 oascc.ZkStateReader$2.process A cluster state change has occurred - updating...
[junit4:junit4]   2> 8697 T2431 oascc.ZkStateReader$2.process A cluster state change has occurred - updating...
[junit4:junit4]   2> 8697 T2457 oascc.ZkStateReader$2.process A cluster state change has occurred - updating...
[junit4:junit4]   2> 8820 T2411 oasc.CoreContainer.register registering core: collection1
[junit4:junit4]   2> 8820 T2411 oasc.ZkController.register Register shard - core:collection1 address:http://127.0.0.1:43889/solr shardId:shard1
[junit4:junit4]   2> 8823 T2411 oasc.ZkController.register We are http://127.0.0.1:43889/solr/collection1/ and leader is http://127.0.0.1:43872/solr/collection1/
[junit4:junit4]   2> 8824 T2411 oasc.ZkController.register No LogReplay needed for core=collection1 baseURL=http://127.0.0.1:43889/solr
[junit4:junit4]   2> 8824 T2411 oasc.ZkController.checkRecovery Core needs to recover:collection1
[junit4:junit4]   2> 8824 T2411 oasu.DefaultSolrCoreState.doRecovery Running recovery - first canceling any ongoing recovery
[junit4:junit4]   2> ASYNC  NEW_CORE C172 name=collection1 org.apache.solr.core.SolrCore@4fa30bc9 url=http://127.0.0.1:43889/solr/collection1 node=127.0.0.1:43889_solr
[junit4:junit4]   2> 8826 T2471 C172 P43889 oasc.RecoveryStrategy.run Starting recovery process.  core=collection1 recoveringAfterStartup=true
[junit4:junit4]   2> 8826 T2411 oascc.ZkStateReader.updateClusterState Updating cloud state from ZooKeeper... 
[junit4:junit4]   2> 8836 T2471 C172 P43889 oasc.RecoveryStrategy.doRecovery ###### startupVersions=[]
[junit4:junit4]   2> 8837 T2411 oass.SolrDispatchFilter.init user.dir=/usr/home/hudson/hudson-slave/workspace/Lucene-Solr-Tests-4.x-java7/solr/build/solr-core/test/J1
[junit4:junit4]   2> 8837 T2411 oass.SolrDispatchFilter.init SolrDispatchFilter.init() done
[junit4:junit4]   2> 8838 T2471 C172 P43889 oasc.RecoveryStrategy.doRecovery Attempting to PeerSync from http://127.0.0.1:43872/solr/collection1/ core=collection1 - recoveringAfterStartup=true
[junit4:junit4]   2> 8838 T2471 C172 P43889 oasu.PeerSync.sync PeerSync: core=collection1 url=http://127.0.0.1:43889/solr START replicas=[http://127.0.0.1:43872/solr/collection1/] nUpdates=100
[junit4:junit4]   2> 8838 T2411 oascsi.HttpClientUtil.createClient Creating new http client, config:maxConnections=128&maxConnectionsPerHost=32&followRedirects=false
[junit4:junit4]   2> 8838 T2471 C172 P43889 oasu.PeerSync.sync WARNING no frame of reference to tell of we've missed updates
[junit4:junit4]   2> 8839 T2471 C172 P43889 oasc.RecoveryStrategy.doRecovery PeerSync Recovery was not successful - trying replication. core=collection1
[junit4:junit4]   2> 8839 T2471 C172 P43889 oasc.RecoveryStrategy.doRecovery Starting Replication Recovery. core=collection1
[junit4:junit4]   2> 8839 T2471 C172 P43889 oascsi.HttpClientUtil.createClient Creating new http client, config:maxConnections=128&maxConnectionsPerHost=32&followRedirects=false
[junit4:junit4]   2> ASYNC  NEW_CORE C173 name=collection1 org.apache.solr.core.SolrCore@64d455d1 url=http://127.0.0.1:43872/solr/collection1 node=127.0.0.1:43872_solr
[junit4:junit4]   2> 8845 T2437 C173 P43872 REQ /get {distrib=false&qt=/get&wt=javabin&version=2&getVersions=100} status=0 QTime=0 
[junit4:junit4]   2> 9180 T2411 oejs.Server.doStart jetty-8.1.2.v20120308
[junit4:junit4]   2> 9183 T2411 oejs.AbstractConnector.doStart Started SocketConnector@0.0.0.0:43899
[junit4:junit4]   2> 9184 T2411 oasc.SolrResourceLoader.locateSolrHome JNDI not configured for solr (NoInitialContextEx)
[junit4:junit4]   2> 9184 T2411 oasc.SolrResourceLoader.locateSolrHome using system property solr.solr.home: /usr/home/hudson/hudson-slave/workspace/Lucene-Solr-Tests-4.x-java7/solr/build/solr-core/test/J1/./solrtest-jetty4-1347916356185
[junit4:junit4]   2> 9184 T2411 oasc.SolrResourceLoader.<init> new SolrResourceLoader for deduced Solr Home: '/usr/home/hudson/hudson-slave/workspace/Lucene-Solr-Tests-4.x-java7/solr/build/solr-core/test/J1/./solrtest-jetty4-1347916356185/'
[junit4:junit4]   2> 9200 T2432 oascc.ZkStateReader.updateClusterState Updating cloud state from ZooKeeper... 
[junit4:junit4]   2> 9220 T2469 oascc.ZkStateReader$2.process A cluster state change has occurred - updating...
[junit4:junit4]   2> 9220 T2445 oascc.ZkStateReader$2.process A cluster state change has occurred - updating...
[junit4:junit4]   2> 9220 T2457 oascc.ZkStateReader$2.process A cluster state change has occurred - updating...
[junit4:junit4]   2> 9220 T2431 oascc.ZkStateReader$2.process A cluster state change has occurred - updating...
[junit4:junit4]   2> 9223 T2411 oass.SolrDispatchFilter.init SolrDispatchFilter.init()
[junit4:junit4]   2> 9223 T2411 oasc.SolrResourceLoader.locateSolrHome JNDI not configured for solr (NoInitialContextEx)
[junit4:junit4]   2> 9224 T2411 oasc.SolrResourceLoader.locateSolrHome using system property solr.solr.home: /usr/home/hudson/hudson-slave/workspace/Lucene-Solr-Tests-4.x-java7/solr/build/solr-core/test/J1/./solrtest-jetty4-1347916356185
[junit4:junit4]   2> 9224 T2411 oasc.CoreContainer$Initializer.initialize looking for solr.xml: /usr/home/hudson/hudson-slave/workspace/Lucene-Solr-Tests-4.x-java7/solr/build/solr-core/test/J1/./solrtest-jetty4-1347916356185/solr.xml
[junit4:junit4]   2> 9224 T2411 oasc.CoreContainer.<init> New CoreContainer 1725155732
[junit4:junit4]   2> 9225 T2411 oasc.CoreContainer.load Loading CoreContainer using Solr Home: '/usr/home/hudson/hudson-slave/workspace/Lucene-Solr-Tests-4.x-java7/solr/build/solr-core/test/J1/./solrtest-jetty4-1347916356185/'
[junit4:junit4]   2> 9225 T2411 oasc.SolrResourceLoader.<init> new SolrResourceLoader for directory: '/usr/home/hudson/hudson-slave/workspace/Lucene-Solr-Tests-4.x-java7/solr/build/solr-core/test/J1/./solrtest-jetty4-1347916356185/'
[junit4:junit4]   2> 9251 T2411 oasc.CoreContainer.load Registering Log Listener
[junit4:junit4]   2> 9263 T2411 oasc.CoreContainer.initZooKeeper Zookeeper client=127.0.0.1:43861/solr
[junit4:junit4]   2> 9264 T2411 oaz.ZooKeeper.<init> Initiating client connection, connectString=127.0.0.1:43861/solr sessionTimeout=5000 watcher=org.apache.solr.common.cloud.ConnectionManager@63076b28
[junit4:junit4]   2> 9265 T2482 oaz.ClientCnxn$SendThread.startConnect Opening socket connection to server /127.0.0.1:43861
[junit4:junit4]   2> 9265 T2411 oascc.ConnectionManager.waitForConnected Waiting for client to connect to ZooKeeper
[junit4:junit4]   2> 9266 T2482 oaz.ClientCnxn$SendThread.primeConnection Socket connection established to localhost/127.0.0.1:43861, initiating session
[junit4:junit4]   2> 9266 T2413 oazs.NIOServerCnxn$Factory.run Accepted socket connection from /140.211.11.196:43900
[junit4:junit4]   2> 9266 T2413 oazs.NIOServerCnxn.readConnectRequest Client attempting to establish new session at /140.211.11.196:43900
[junit4:junit4]   2> 9267 T2415 oazs.NIOServerCnxn.finishSessionInit Established session 0x139d61337cc0006 with negotiated timeout 5000 for client /140.211.11.196:43900
[junit4:junit4]   2> 9267 T2482 oaz.ClientCnxn$SendThread.readConnectResult Session establishment complete on server localhost/127.0.0.1:43861, sessionid = 0x139d61337cc0006, negotiated timeout = 5000
[junit4:junit4]   2> 9268 T2483 oascc.ConnectionManager.process Watcher org.apache.solr.common.cloud.ConnectionManager@63076b28 name:ZooKeeperConnection Watcher:127.0.0.1:43861/solr got event WatchedEvent state:SyncConnected type:None path:null path:null type:None
[junit4:junit4]   2> 9268 T2411 oascc.ConnectionManager.waitForConnected Client is connected to ZooKeeper
[junit4:junit4]   2> 9269 T2416 oazs.PrepRequestProcessor.pRequest Got user-level KeeperException when processing sessionid:0x139d61337cc0006 type:create cxid:0x1 zxid:0xfffffffffffffffe txntype:unknown reqpath:n/a Error Path:/solr/overseer Error:KeeperErrorCode = NodeExists for /solr/overseer
[junit4:junit4]   2> 9270 T2416 oazs.PrepRequestProcessor.pRequest Got user-level KeeperException when processing sessionid:0x139d61337cc0006 type:create cxid:0x2 zxid:0xfffffffffffffffe txntype:unknown reqpath:n/a Error Path:/solr/overseer Error:KeeperErrorCode = NodeExists for /solr/overseer
[junit4:junit4]   2> 9272 T2411 oasc.ZkController.createEphemeralLiveNode Register node as live in ZooKeeper:/live_nodes/127.0.0.1:43899_solr
[junit4:junit4]   2> 9272 T2416 oazs.PrepRequestProcessor.pRequest Got user-level KeeperException when processing sessionid:0x139d61337cc0006 type:delete cxid:0x4 zxid:0xfffffffffffffffe txntype:unknown reqpath:n/a Error Path:/solr/live_nodes/127.0.0.1:43899_solr Error:KeeperErrorCode = NoNode for /solr/live_nodes/127.0.0.1:43899_solr
[junit4:junit4]   2> 9279 T2411 oascc.SolrZkClient.makePath makePath: /live_nodes/127.0.0.1:43899_solr
[junit4:junit4]   2> 9281 T2445 oascc.ZkStateReader$3.process Updating live nodes
[junit4:junit4]   2> 9281 T2457 oascc.ZkStateReader$3.process Updating live nodes
[junit4:junit4]   2> 9281 T2469 oascc.ZkStateReader$3.process Updating live nodes
[junit4:junit4]   2> 9281 T2431 oascc.ZkStateReader$3.process Updating live nodes
[junit4:junit4]   2> 9281 T2411 oashc.HttpShardHandlerFactory.getParameter Setting socketTimeout to: 0
[junit4:junit4]   2> 9282 T2411 oashc.HttpShardHandlerFactory.getParameter Setting urlScheme to: http://
[junit4:junit4]   2> 9282 T2411 oashc.HttpShardHandlerFactory.getParameter Setting connTimeout to: 0
[junit4:junit4]   2> 9283 T2411 oashc.HttpShardHandlerFactory.getParameter Setting maxConnectionsPerHost to: 20
[junit4:junit4]   2> 9283 T2411 oashc.HttpShardHandlerFactory.getParameter Setting corePoolSize to: 0
[junit4:junit4]   2> 9283 T2411 oashc.HttpShardHandlerFactory.getParameter Setting maximumPoolSize to: 2147483647
[junit4:junit4]   2> 9284 T2411 oashc.HttpShardHandlerFactory.getParameter Setting maxThreadIdleTime to: 5
[junit4:junit4]   2> 9284 T2411 oashc.HttpShardHandlerFactory.getParameter Setting sizeOfQueue to: -1
[junit4:junit4]   2> 9284 T2411 oashc.HttpShardHandlerFactory.getParameter Setting fairnessPolicy to: false
[junit4:junit4]   2> 9285 T2411 oascsi.HttpClientUtil.createClient Creating new http client, config:maxConnectionsPerHost=20&maxConnections=10000&socketTimeout=0&connTimeout=0&retry=false
[junit4:junit4]   2> 9298 T2411 oascc.ZkStateReader.createClusterStateWatchersAndUpdate Updating cluster state from ZooKeeper... 
[junit4:junit4]   2> 9303 T2411 oasc.CoreContainer.create Creating SolrCore 'collection1' using instanceDir: /usr/home/hudson/hudson-slave/workspace/Lucene-Solr-Tests-4.x-java7/solr/build/solr-core/test/J1/./solrtest-jetty4-1347916356185/collection1
[junit4:junit4]   2> 9303 T2411 oasc.ZkController.createCollectionZkNode Check for collection zkNode:collection1
[junit4:junit4]   2> 9304 T2411 oasc.ZkController.createCollectionZkNode Collection zkNode exists
[junit4:junit4]   2> 9304 T2411 oasc.ZkController.readConfigName Load collection config from:/collections/collection1
[junit4:junit4]   2> 9305 T2411 oasc.SolrResourceLoader.<init> new SolrResourceLoader for directory: '/usr/home/hudson/hudson-slave/workspace/Lucene-Solr-Tests-4.x-java7/solr/build/solr-core/test/J1/./solrtest-jetty4-1347916356185/collection1/'
[junit4:junit4]   2> 9306 T2411 oasc.SolrResourceLoader.replaceClassLoader Adding 'file:/usr/home/hudson/hudson-slave/workspace/Lucene-Solr-Tests-4.x-java7/solr/build/solr-core/test/J1/solrtest-jetty4-1347916356185/collection1/lib/classes/' to classloader
[junit4:junit4]   2> 9307 T2411 oasc.SolrResourceLoader.replaceClassLoader Adding 'file:/usr/home/hudson/hudson-slave/workspace/Lucene-Solr-Tests-4.x-java7/solr/build/solr-core/test/J1/solrtest-jetty4-1347916356185/collection1/lib/README' to classloader
[junit4:junit4]   2> 9345 T2411 oasc.SolrConfig.<init> Using Lucene MatchVersion: LUCENE_40
[junit4:junit4]   2> 9397 T2411 oasc.SolrConfig.<init> Loaded SolrConfig: solrconfig.xml
[junit4:junit4]   2> 9498 T2411 oass.IndexSchema.readSchema Reading Solr Schema
[junit4:junit4]   2> 9503 T2411 oass.IndexSchema.readSchema Schema name=test
[junit4:junit4]   2> 9977 T2411 oass.OpenExchangeRatesOrgProvider.init Initialized with rates=open-exchange-rates.json, refreshInterval=1440.
[junit4:junit4]   2> 9985 T2411 oass.IndexSchema.readSchema default search field in schema is text
[junit4:junit4]   2> 9989 T2411 oass.IndexSchema.readSchema unique key field: id
[junit4:junit4]   2> 9997 T2411 oass.FileExchangeRateProvider.reload Reloading exchange rates from file currency.xml
[junit4:junit4]   2> 10001 T2411 oass.FileExchangeRateProvider.reload Reloading exchange rates from file currency.xml
[junit4:junit4]   2> 10005 T2411 oass.OpenExchangeRatesOrgProvider.reload Reloading exchange rates from open-exchange-rates.json
[junit4:junit4]   2> 10005 T2411 oass.OpenExchangeRatesOrgProvider.reload Reloading exchange rates from open-exchange-rates.json
[junit4:junit4]   2> 10006 T2411 oasc.SolrCore.<init> [collection1] Opening new SolrCore at /usr/home/hudson/hudson-slave/workspace/Lucene-Solr-Tests-4.x-java7/solr/build/solr-core/test/J1/./solrtest-jetty4-1347916356185/collection1/, dataDir=./org.apache.solr.cloud.BasicDistributedZk2Test-1347916347334/jetty4/
[junit4:junit4]   2> 10007 T2411 oasc.JmxMonitoredMap.<init> JMX monitoring is enabled. Adding Solr mbeans to JMX Server: com.sun.jmx.mbeanserver.JmxMBeanServer@2dbd9f3d
[junit4:junit4]   2> 10008 T2411 oasc.SolrCore.getNewIndexDir WARNING New index directory detected: old=null new=./org.apache.solr.cloud.BasicDistributedZk2Test-1347916347334/jetty4/index/
[junit4:junit4]   2> 10009 T2411 oasc.SolrCore.initIndex WARNING [collection1] Solr index directory './org.apache.solr.cloud.BasicDistributedZk2Test-1347916347334/jetty4/index' doesn't exist. Creating new index...
[junit4:junit4]   2> 10009 T2411 oasc.CachingDirectoryFactory.get return new directory for /usr/home/hudson/hudson-slave/workspace/Lucene-Solr-Tests-4.x-java7/solr/build/solr-core/test/J1/./org.apache.solr.cloud.BasicDistributedZk2Test-1347916347334/jetty4/index forceNew:false
[junit4:junit4]   2> 10015 T2411 oasc.SolrDeletionPolicy.onCommit SolrDeletionPolicy.onCommit: commits:num=1
[junit4:junit4]   2> 		commit{dir=NRTCachingDirectory(org.apache.lucene.store.NIOFSDirectory@/usr/home/hudson/hudson-slave/workspace/Lucene-Solr-Tests-4.x-java7/solr/build/solr-core/test/J1/org.apache.solr.cloud.BasicDistributedZk2Test-1347916347334/jetty4/index lockFactory=org.apache.lucene.store.NativeFSLockFactory@184d425b; maxCacheMB=48.0 maxMergeSizeMB=4.0),segFN=segments_1,generation=1,filenames=[segments_1]
[junit4:junit4]   2> 10015 T2411 oasc.SolrDeletionPolicy.updateCommits newest commit = 1
[junit4:junit4]   2> 10016 T2411 oasc.SolrCore.initWriters created xml: solr.XMLResponseWriter
[junit4:junit4]   2> 10018 T2411 oasup.UpdateRequestProcessorChain.init inserting DistributedUpdateProcessorFactory into updateRequestProcessorChain "dedupe"
[junit4:junit4]   2> 10018 T2411 oasup.UpdateRequestProcessorChain.init inserting DistributedUpdateProcessorFactory into updateRequestProcessorChain "dedupe-allfields"
[junit4:junit4]   2> 10019 T2411 oasup.UpdateRequestProcessorChain.init inserting DistributedUpdateProcessorFactory into updateRequestProcessorChain "stored_sig"
[junit4:junit4]   2> 10019 T2411 oasup.UpdateRequestProcessorChain.init inserting DistributedUpdateProcessorFactory into updateRequestProcessorChain "uniq-fields"
[junit4:junit4]   2> 10020 T2411 oasup.UpdateRequestProcessorChain.init inserting DistributedUpdateProcessorFactory into updateRequestProcessorChain "distrib-dup-test-chain-implicit"
[junit4:junit4]   2> 10020 T2411 oasc.RequestHandlers.initHandlersFromConfig adding lazy requestHandler: solr.ReplicationHandler
[junit4:junit4]   2> 10021 T2411 oasc.RequestHandlers.initHandlersFromConfig created /replication: solr.ReplicationHandler
[junit4:junit4]   2> 10021 T2411 oasc.RequestHandlers.initHandlersFromConfig created standard: solr.StandardRequestHandler
[junit4:junit4]   2> 10022 T2411 oasc.RequestHandlers.initHandlersFromConfig created /get: solr.RealTimeGetHandler
[junit4:junit4]   2> 10022 T2411 oasc.RequestHandlers.initHandlersFromConfig created dismax: solr.SearchHandler
[junit4:junit4]   2> 10023 T2411 oasc.RequestHandlers.initHandlersFromConfig created mock: org.apache.solr.core.MockQuerySenderListenerReqHandler
[junit4:junit4]   2> 10023 T2411 oasc.RequestHandlers.initHandlersFromConfig created /admin/: org.apache.solr.handler.admin.AdminHandlers
[junit4:junit4]   2> 10024 T2411 oasc.RequestHandlers.initHandlersFromConfig created defaults: solr.StandardRequestHandler
[junit4:junit4]   2> 10024 T2411 oasc.RequestHandlers.initHandlersFromConfig adding lazy requestHandler: solr.StandardRequestHandler
[junit4:junit4]   2> 10025 T2411 oasc.RequestHandlers.initHandlersFromConfig created lazy: solr.StandardRequestHandler
[junit4:junit4]   2> 10025 T2411 oasc.RequestHandlers.initHandlersFromConfig created /update: solr.UpdateRequestHandler
[junit4:junit4]   2> 10026 T2411 oasc.RequestHandlers.initHandlersFromConfig created /terms: org.apache.solr.handler.component.SearchHandler
[junit4:junit4]   2> 10026 T2411 oasc.RequestHandlers.initHandlersFromConfig created spellCheckCompRH: org.apache.solr.handler.component.SearchHandler
[junit4:junit4]   2> 10027 T2411 oasc.RequestHandlers.initHandlersFromConfig created spellCheckCompRH_Direct: org.apache.solr.handler.component.SearchHandler
[junit4:junit4]   2> 10028 T2411 oasc.RequestHandlers.initHandlersFromConfig created spellCheckWithWordbreak: org.apache.solr.handler.component.SearchHandler
[junit4:junit4]   2> 10028 T2411 oasc.RequestHandlers.initHandlersFromConfig created spellCheckWithWordbreak_Direct: org.apache.solr.handler.component.SearchHandler
[junit4:junit4]   2> 10029 T2411 oasc.RequestHandlers.initHandlersFromConfig created spellCheckCompRH1: org.apache.solr.handler.component.SearchHandler
[junit4:junit4]   2> 10029 T2411 oasc.RequestHandlers.initHandlersFromConfig created tvrh: org.apache.solr.handler.component.SearchHandler
[junit4:junit4]   2> 10030 T2411 oasc.RequestHandlers.initHandlersFromConfig created /mlt: solr.MoreLikeThisHandler
[junit4:junit4]   2> 10030 T2411 oasc.RequestHandlers.initHandlersFromConfig created /debug/dump: solr.DumpRequestHandler
[junit4:junit4]   2> 10033 T2411 oashl.XMLLoader.init xsltCacheLifetimeSeconds=60
[junit4:junit4]   2> 10037 T2411 oasc.SolrCore.initDeprecatedSupport WARNING solrconfig.xml uses deprecated <admin/gettableFiles>, Please update your config to use the ShowFileRequestHandler.
[junit4:junit4]   2> 10038 T2411 oasc.SolrCore.initDeprecatedSupport WARNING adding ShowFileRequestHandler with hidden files: [SCHEMA.XML, OLD_SYNONYMS.TXT, STOPWORDS.TXT, PROTWORDS.TXT, OPEN-EXCHANGE-RATES.JSON, SYNONYMS.TXT, CURRENCY.XML, MAPPING-ISOLATIN1ACCENT.TXT]
[junit4:junit4]   2> 10041 T2411 oass.SolrIndexSearcher.<init> Opening Searcher@74b4ec2d main
[junit4:junit4]   2> 10042 T2411 oasu.CommitTracker.<init> Hard AutoCommit: disabled
[junit4:junit4]   2> 10042 T2411 oasu.CommitTracker.<init> Soft AutoCommit: disabled
[junit4:junit4]   2> 10043 T2411 oashc.SpellCheckComponent.inform Initializing spell checkers
[junit4:junit4]   2> 10049 T2411 oass.DirectSolrSpellChecker.init init: {name=direct,classname=DirectSolrSpellChecker,field=lowerfilt,minQueryLength=3}
[junit4:junit4]   2> 10100 T2484 oasc.SolrCore.registerSearcher [collection1] Registered new searcher Searcher@74b4ec2d main{StandardDirectoryReader(segments_1:1)}
[junit4:junit4]   2> 10226 T2432 oascc.ZkStateReader.updateClusterState Updating cloud state from ZooKeeper... 
[junit4:junit4]   2> 10240 T2431 oascc.ZkStateReader$2.process A cluster state change has occurred - updating...
[junit4:junit4]   2> 10240 T2469 oascc.ZkStateReader$2.process A cluster state change has occurred - updating...
[junit4:junit4]   2> 10240 T2457 oascc.ZkStateReader$2.process A cluster state change has occurred - updating...
[junit4:junit4]   2> 10240 T2483 oascc.ZkStateReader$2.process A cluster state change has occurred - updating...
[junit4:junit4]   2> 10240 T2445 oascc.ZkStateReader$2.process A cluster state change has occurred - updating...
[junit4:junit4]   2> 10606 T2411 oasc.CoreContainer.register registering core: collection1
[junit4:junit4]   2> 10606 T2411 oasc.ZkController.register Register shard - core:collection1 address:http://127.0.0.1:43899/solr shardId:shard2
[junit4:junit4]   2> 10619 T2411 oasc.ZkController.register We are http://127.0.0.1:43899/solr/collection1/ and leader is http://127.0.0.1:43885/solr/collection1/
[junit4:junit4]   2> 10620 T2411 oasc.ZkController.register No LogReplay needed for core=collection1 baseURL=http://127.0.0.1:43899/solr
[junit4:junit4]   2> 10621 T2411 oasc.ZkController.checkRecovery Core needs to recover:collection1
[junit4:junit4]   2> 10621 T2411 oasu.DefaultSolrCoreState.doRecovery Running recovery - first canceling any ongoing recovery
[junit4:junit4]   2> ASYNC  NEW_CORE C174 name=collection1 org.apache.solr.core.SolrCore@40febf75 url=http://127.0.0.1:43899/solr/collection1 node=127.0.0.1:43899_solr
[junit4:junit4]   2> 10623 T2485 C174 P43899 oasc.RecoveryStrategy.run Starting recovery process.  core=collection1 recoveringAfterStartup=true
[junit4:junit4]   2> 10624 T2485 C174 P43899 oasc.RecoveryStrategy.doRecovery ###### startupVersions=[]
[junit4:junit4]   2> 10624 T2411 oascc.ZkStateReader.updateClusterState Updating cloud state from ZooKeeper... 
[junit4:junit4]   2> 10684 T2485 C174 P43899 oasc.RecoveryStrategy.doRecovery Attempting to PeerSync from http://127.0.0.1:43885/solr/collection1/ core=collection1 - recoveringAfterStartup=true
[junit4:junit4]   2> 10684 T2485 C174 P43899 oasu.PeerSync.sync PeerSync: core=collection1 url=http://127.0.0.1:43899/solr START replicas=[http://127.0.0.1:43885/solr/collection1/] nUpdates=100
[junit4:junit4]   2> 10684 T2411 oass.SolrDispatchFilter.init user.dir=/usr/home/hudson/hudson-slave/workspace/Lucene-Solr-Tests-4.x-java7/solr/build/solr-core/test/J1
[junit4:junit4]   2> 10685 T2485 C174 P43899 oasu.PeerSync.sync WARNING no frame of reference to tell of we've missed updates
[junit4:junit4]   2> 10685 T2411 oass.SolrDispatchFilter.init SolrDispatchFilter.init() done
[junit4:junit4]   2> 10685 T2485 C174 P43899 oasc.RecoveryStrategy.doRecovery PeerSync Recovery was not successful - trying replication. core=collection1
[junit4:junit4]   2> 10685 T2485 C174 P43899 oasc.RecoveryStrategy.doRecovery Starting Replication Recovery. core=collection1
[junit4:junit4]   2> 10685 T2411 oascsi.HttpClientUtil.createClient Creating new http client, config:maxConnections=128&maxConnectionsPerHost=32&followRedirects=false
[junit4:junit4]   2> 10685 T2485 C174 P43899 oascsi.HttpClientUtil.createClient Creating new http client, config:maxConnections=128&maxConnectionsPerHost=32&followRedirects=false
[junit4:junit4]   2> ASYNC  NEW_CORE C175 name=collection1 org.apache.solr.core.SolrCore@37707e3d url=http://127.0.0.1:43885/solr/collection1 node=127.0.0.1:43885_solr
[junit4:junit4]   2> 10697 T2449 C175 P43885 REQ /get {distrib=false&qt=/get&wt=javabin&version=2&getVersions=100} status=0 QTime=1 
[junit4:junit4]   2> 10699 T2411 oaz.ZooKeeper.<init> Initiating client connection, connectString=127.0.0.1:43861/solr sessionTimeout=10000 watcher=org.apache.solr.common.cloud.ConnectionManager@26574f9c
[junit4:junit4]   2> 10701 T2487 oaz.ClientCnxn$SendThread.startConnect Opening socket connection to server /127.0.0.1:43861
[junit4:junit4]   2> 10701 T2411 oascc.ConnectionManager.waitForConnected Waiting for client to connect to ZooKeeper
[junit4:junit4]   2> 10701 T2487 oaz.ClientCnxn$SendThread.primeConnection Socket connection established to localhost/127.0.0.1:43861, initiating session
[junit4:junit4]   2> 10701 T2413 oazs.NIOServerCnxn$Factory.run Accepted socket connection from /140.211.11.196:43908
[junit4:junit4]   2> 10702 T2413 oazs.NIOServerCnxn.readConnectRequest Client attempting to establish new session at /140.211.11.196:43908
[junit4:junit4]   2> 10704 T2415 oazs.NIOServerCnxn.finishSessionInit Established session 0x139d61337cc0007 with negotiated timeout 10000 for client /140.211.11.196:43908
[junit4:junit4]   2> 10704 T2487 oaz.ClientCnxn$SendThread.readConnectResult Session establishment complete on server localhost/127.0.0.1:43861, sessionid = 0x139d61337cc0007, negotiated timeout = 10000
[junit4:junit4]   2> 10705 T2488 oascc.ConnectionManager.process Watcher org.apache.solr.common.cloud.ConnectionManager@26574f9c name:ZooKeeperConnection Watcher:127.0.0.1:43861/solr got event WatchedEvent state:SyncConnected type:None path:null path:null type:None
[junit4:junit4]   2> 10705 T2411 oascc.ConnectionManager.waitForConnected Client is connected to ZooKeeper
[junit4:junit4]   2> 10706 T2411 oascc.ZkStateReader.createClusterStateWatchersAndUpdate Updating cluster state from ZooKeeper... 
[junit4:junit4]   2> 10707 T2411 oasc.ChaosMonkey.monkeyLog monkey: init - expire sessions:true cause connection loss:true
[junit4:junit4]   2> 10707 T2411 oascsi.HttpClientUtil.createClient Creating new http client, config:
[junit4:junit4]   2> 10715 T2411 oascc.ZkStateReader.updateClusterState Updating cloud state from ZooKeeper... 
[junit4:junit4]   2> ASYNC  NEW_CORE C176 name=collection1 org.apache.solr.core.SolrCore@2f2e055e url=http://127.0.0.1:43864/solr/collection1 node=127.0.0.1:43864_solr
[junit4:junit4]   2> 10729 T2423 C176 P43864 oasc.SolrDeletionPolicy.onInit SolrDeletionPolicy.onInit: commits:num=1
[junit4:junit4]   2> 		commit{dir=NRTCachingDirectory(org.apache.lucene.store.NIOFSDirectory@/usr/home/hudson/hudson-slave/workspace/Lucene-Solr-Tests-4.x-java7/solr/build/solr-core/test/J1/org.apache.solr.cloud.BasicDistributedZk2Test-1347916347334/control/data/index lockFactory=org.apache.lucene.store.NativeFSLockFactory@12e6df6a; maxCacheMB=48.0 maxMergeSizeMB=4.0),segFN=segments_1,generation=1,filenames=[segments_1]
[junit4:junit4]   2> 10730 T2423 C176 P43864 oasc.SolrDeletionPolicy.updateCommits newest commit = 1
[junit4:junit4]   2> 10736 T2423 C176 P43864 /update {wt=javabin&version=2} {add=[1 (1413392743061782528)]} 0 13
[junit4:junit4]   2> 10737 T2411 oaz.ZooKeeper.<init> Initiating client connection, connectString=127.0.0.1:43861/solr sessionTimeout=10000 watcher=org.apache.solr.common.cloud.ConnectionManager@6a9766d5
[junit4:junit4]   2> 10738 T2489 oaz.ClientCnxn$SendThread.startConnect Opening socket connection to server /127.0.0.1:43861
[junit4:junit4]   2> 10738 T2411 oascc.ConnectionManager.waitForConnected Waiting for client to connect to ZooKeeper
[junit4:junit4]   2> 10739 T2489 oaz.ClientCnxn$SendThread.primeConnection Socket connection established to localhost/127.0.0.1:43861, initiating session
[junit4:junit4]   2> 10739 T2413 oazs.NIOServerCnxn$Factory.run Accepted socket connection from /140.211.11.196:43910
[junit4:junit4]   2> 10740 T2413 oazs.NIOServerCnxn.readConnectRequest Client attempting to establish new session at /140.211.11.196:43910
[junit4:junit4]   2> 10747 T2415 oazs.NIOServerCnxn.finishSessionInit Established session 0x139d61337cc0008 with negotiated timeout 10000 for client /140.211.11.196:43910
[junit4:junit4]   2> 10747 T2489 oaz.ClientCnxn$SendThread.readConnectResult Session establishment complete on server localhost/127.0.0.1:43861, sessionid = 0x139d61337cc0008, negotiated timeout = 10000
[junit4:junit4]   2> 10748 T2490 oascc.ConnectionManager.process Watcher org.apache.solr.common.cloud.ConnectionManager@6a9766d5 name:ZooKeeperConnection Watcher:127.0.0.1:43861/solr got event WatchedEvent state:SyncConnected type:None path:null path:null type:None
[junit4:junit4]   2> 10748 T2411 oascc.ConnectionManager.waitForConnected Client is connected to ZooKeeper
[junit4:junit4]   2> 10749 T2432 oascc.ZkStateReader.updateClusterState Updating cloud state from ZooKeeper... 
[junit4:junit4]   2> 10749 T2411 oascc.ZkStateReader.createClusterStateWatchersAndUpdate Updating cluster state from ZooKeeper... 
[junit4:junit4]   2> 10772 T2439 C173 P43872 oasc.SolrDeletionPolicy.onInit SolrDeletionPolicy.onInit: commits:num=1
[junit4:junit4]   2> 		commit{dir=NRTCachingDirectory(org.apache.lucene.store.NIOFSDirectory@/usr/home/hudson/hudson-slave/workspace/Lucene-Solr-Tests-4.x-java7/solr/build/solr-core/test/J1/org.apache.solr.cloud.BasicDistributedZk2Test-1347916347334/jetty1/index lockFactory=org.apache.lucene.store.NativeFSLockFactory@33dfb503; maxCacheMB=48.0 maxMergeSizeMB=4.0),segFN=segments_1,generation=1,filenames=[segments_1]
[junit4:junit4]   2> 10772 T2439 C173 P43872 oasc.SolrDeletionPolicy.updateCommits newest commit = 1
[junit4:junit4]   2>  C172_STATE=coll:collection1 core:collection1 props:{shard=shard1, roles=null, state=recovering, core=collection1, collection=collection1, node_name=127.0.0.1:43889_solr, base_url=http://127.0.0.1:43889/solr}
[junit4:junit4]   2> 10789 T2461 C172 P43889 oasc.SolrDeletionPolicy.onInit SolrDeletionPolicy.onInit: commits:num=1
[junit4:junit4]   2> 		commit{dir=NRTCachingDirectory(org.apache.lucene.store.NIOFSDirectory@/usr/home/hudson/hudson-slave/workspace/Lucene-Solr-Tests-4.x-java7/solr/build/solr-core/test/J1/org.apache.solr.cloud.BasicDistributedZk2Test-1347916347334/jetty3/index lockFactory=org.apache.lucene.store.NativeFSLockFactory@38f0e071; maxCacheMB=48.0 maxMergeSizeMB=4.0),segFN=segments_1,generation=1,filenames=[segments_1]
[junit4:junit4]   2> 10790 T2461 C172 P43889 oasc.SolrDeletionPolicy.updateCommits newest commit = 1
[junit4:junit4]   2> 10793 T2461 C172 P43889 REQ /update {update.distrib=FROMLEADER&distrib.from=http://127.0.0.1:43872/solr/collection1/&wt=javabin&version=2} status=0 QTime=9 
[junit4:junit4]   2> 10794 T2439 C173 P43872 REQ /update {distrib.from=http://127.0.0.1:43885/solr/collection1/&update.distrib=TOLEADER&wt=javabin&version=2} status=0 QTime=26 
[junit4:junit4]   2> 10795 T2451 C175 P43885 /update {wt=javabin&version=2} {add=[1]} 0 29
[junit4:junit4]   2> 10795 T2411 oasc.AbstractDistribZkTestBase.waitForRecoveriesToFinish Wait for recoveries to finish - collection: collection1 failOnTimeout:true timeout (sec):1800
[junit4:junit4]   2> 10808 T2483 oascc.ZkStateReader$2.process A cluster state change has occurred - updating...
[junit4:junit4]   2> 10808 T2445 oascc.ZkStateReader$2.process A cluster state change has occurred - updating...
[junit4:junit4]   2> 10808 T2457 oascc.ZkStateReader$2.process A cluster state change has occurred - updating...
[junit4:junit4]   2> 10808 T2431 oascc.ZkStateReader$2.process A cluster state change has occurred - updating...
[junit4:junit4]   2> 10808 T2469 oascc.ZkStateReader$2.process A cluster state change has occurred - updating...
[junit4:junit4]   2> 10808 T2488 oascc.ZkStateReader$2.process A cluster state change has occurred - updating...
[junit4:junit4]   2> 10808 T2490 oascc.ZkStateReader$2.process A cluster state change has occurred - updating...
[junit4:junit4]   2> 10808 T2411 oascc.ZkStateReader.updateClusterState Updating cloud state from ZooKeeper... 
[junit4:junit4]   2> 11825 T2411 oascc.ZkStateReader.updateClusterState Updating cloud state from ZooKeeper... 
[junit4:junit4]   2> 11858 T2471 C172 P43889 oasc.RecoveryStrategy.doRecovery Begin buffering updates. core=collection1
[junit4:junit4]   2> 11858 T2471 C172 P43889 oasu.UpdateLog.bufferUpdates Starting to buffer updates. FSUpdateLog{state=ACTIVE, tlog=tlog{file=./org.apache.solr.cloud.BasicDistributedZk2Test-1347916347334/jetty3/tlog/tlog.0000000000000000000 refcount=1}}
[junit4:junit4]   2> 11858 T2471 C172 P43889 oasc.RecoveryStrategy.replicate Attempting to replicate from http://127.0.0.1:43872/solr/collection1/. core=collection1
[junit4:junit4]   2> 11858 T2471 C172 P43889 oascsi.HttpClientUtil.createClient Creating new http client, config:maxConnections=128&maxConnectionsPerHost=32&followRedirects=false
[junit4:junit4]   2> 11870 T2440 C173 P43872 oasu.DirectUpdateHandler2.commit start commit{flags=0,_version_=0,optimize=false,openSearcher=true,waitSearcher=true,expungeDeletes=false,softCommit=false}
[junit4:junit4]   2> 12007 T2440 C173 P43872 oasc.SolrDeletionPolicy.onCommit SolrDeletionPolicy.onCommit: commits:num=2
[junit4:junit4]   2> 		commit{dir=NRTCachingDirectory(org.apache.lucene.store.NIOFSDirectory@/usr/home/hudson/hudson-slave/workspace/Lucene-Solr-Tests-4.x-java7/solr/build/solr-core/test/J1/org.apache.solr.cloud.BasicDistributedZk2Test-1347916347334/jetty1/index lockFactory=org.apache.lucene.store.NativeFSLockFactory@33dfb503; maxCacheMB=48.0 maxMergeSizeMB=4.0),segFN=segments_1,generation=1,filenames=[segments_1]
[junit4:junit4]   2> 		commit{dir=NRTCachingDirectory(org.apache.lucene.store.NIOFSDirectory@/usr/home/hudson/hudson-slave/workspace/Lucene-Solr-Tests-4.x-java7/solr/build/solr-core/test/J1/org.apache.solr.cloud.BasicDistributedZk2Test-1347916347334/jetty1/index lockFactory=org.apache.lucene.store.NativeFSLockFactory@33dfb503; maxCacheMB=48.0 maxMergeSizeMB=4.0),segFN=segments_2,generation=2,filenames=[_0_Block_0.tip, _0_Block_0.pos, _0.fnm, _0_Pulsing40_0.tim, _0_Block_0.doc, _0_Block_0.tim, _0_MockVariableIntBlock_0.doc, _0_nrm.cfs, _0_MockVariableIntBlock_0.skp, _0_Pulsing40_0.prx, _0_Pulsing40_0.frq, _0_MockVariableIntBlock_0.pyl, _0_MockVariableIntBlock_0.tib, _0_MockVariableIntBlock_0.frq, _0_SimpleText_0.pst, _0_nrm.cfe, _0_MockVariableIntBlock_0.pos, _0_Pulsing40_0.tip, segments_2, _0.fdx, _0.si, _0_MockVariableIntBlock_0.tii, _0.fdt]
[junit4:junit4]   2> 12008 T2440 C173 P43872 oasc.SolrDeletionPolicy.updateCommits newest commit = 2
[junit4:junit4]   2> 12022 T2440 C173 P43872 oass.SolrIndexSearcher.<init> Opening Searcher@45e7927c main
[junit4:junit4]   2> 12023 T2440 C173 P43872 oasu.DirectUpdateHandler2.commit end_commit_flush
[junit4:junit4]   2> 12024 T2446 oasc.SolrCore.registerSearcher [collection1] Registered new searcher Searcher@45e7927c main{StandardDirectoryReader(segments_2:3 _0(4.0.0.2):C1)}
[junit4:junit4]   2> 12025 T2440 C173 P43872 /update {waitSearcher=true&commit=true&commit_end_point=true&wt=javabin&softCommit=false&version=2} {commit=} 0 155
[junit4:junit4]   2> 12026 T2471 C172 P43889 oash.ReplicationHandler.inform Commits will be reserved for  10000
[junit4:junit4]   2> 12026 T2471 C172 P43889 oash.SnapPuller.<init>  No value set for 'pollInterval'. Timer Task not started.
[junit4:junit4]   2> 12029 T2441 C173 P43872 oash.ReplicationHandler.inform Commits will be reserved for  10000
[junit4:junit4]   2> 12029 T2441 C173 P43872 REQ /replication {command=indexversion&wt=javabin&qt=/replication&version=2} status=0 QTime=2 
[junit4:junit4]   2> 12030 T2471 C172 P43889 oash.SnapPuller.fetchLatestIndex Master's generation: 2
[junit4:junit4]   2> 12030 T2471 C172 P43889 oash.SnapPuller.fetchLatestIndex Slave's generation: 1
[junit4:junit4]   2> 12030 T2471 C172 P43889 oash.SnapPuller.fetchLatestIndex Starting replication process
[junit4:junit4]   2> 12034 T2441 C173 P43872 REQ /replication {command=filelist&generation=2&wt=javabin&qt=/replication&version=2} status=0 QTime=2 
[junit4:junit4]   2> 12035 T2471 C172 P43889 oash.SnapPuller.fetchLatestIndex Number of files in latest index in master: 23
[junit4:junit4]   2> 12040 T2471 C172 P43889 oash.SnapPuller.fetchLatestIndex Starting download to ./org.apache.solr.cloud.BasicDistributedZk2Test-1347916347334/jetty3/index.20120918021239366 fullCopy=true
[junit4:junit4]   2> 12043 T2441 C173 P43872 REQ /replication {file=_0_Block_0.pos&command=filecontent&checksum=true&generation=2&qt=/replication&wt=filestream} status=0 QTime=0 
[junit4:junit4]   2> 12048 T2441 C173 P43872 REQ /replication {file=_0_Block_0.tip&command=filecontent&checksum=true&generation=2&qt=/replication&wt=filestream} status=0 QTime=0 
[junit4:junit4]   2> 12052 T2441 C173 P43872 REQ /replication {file=_0_Block_0.doc&command=filecontent&checksum=true&generation=2&qt=/replication&wt=filestream} status=0 QTime=0 
[junit4:junit4]   2> 12056 T2441 C173 P43872 REQ /replication {file=_0_Pulsing40_0.tim&command=filecontent&checksum=true&generation=2&qt=/replication&wt=filestream} status=0 QTime=0 
[junit4:junit4]   2> 12060 T2441 C173 P43872 REQ /replication {file=_0.fnm&command=filecontent&checksum=true&generation=2&qt=/replication&wt=filestream} status=0 QTime=0 
[junit4:junit4]   2> 12081 T2441 C173 P43872 REQ /replication {file=_0_MockVariableIntBlock_0.doc&command=filecontent&checksum=true&generation=2&qt=/replication&wt=filestream} status=0 QTime=0 
[junit4:junit4]   2> 12086 T2441 C173 P43872 REQ /replication {file=_0_Block_0.tim&command=filecontent&checksum=true&generation=2&qt=/replication&wt=filestream} status=0 QTime=0 
[junit4:junit4]   2> 12090 T2441 C173 P43872 REQ /replication {file=_0_MockVariableIntBlock_0.skp&command=filecontent&checksum=true&generation=2&qt=/replication&wt=filestream} status=0 QTime=0 
[junit4:junit4]   2> 12092 T2471 C172 P43889 oash.SnapPuller$FileFetcher.fetchPackets WARNING No content recieved for file: {name=_0_MockVariableIntBlock_0.skp, lastmodified=1347916359000, size=0}
[junit4:junit4]   2> 12095 T2441 C173 P43872 REQ /replication {file=_0_nrm.cfs&command=filecontent&checksum=true&generation=2&qt=/replication&wt=filestream} status=0 QTime=0 
[junit4:junit4]   2> 12099 T2441 C173 P43872 REQ /replication {file=_0_Pulsing40_0.prx&command=filecontent&checksum=true&generation=2&qt=/replication&wt=filestream} status=0 QTime=0 
[junit4:junit4]   2> 12104 T2441 C173 P43872 REQ /replication {file=_0_Pulsing40_0.frq&command=filecontent&checksum=true&generation=2&qt=/replication&wt=filestream} status=0 QTime=0 
[junit4:junit4]   2> 12110 T2441 C173 P43872 REQ /replication {file=_0_MockVariableIntBlock_0.pyl&command=filecontent&checksum=true&generation=2&qt=/replication&wt=filestream} status=0 QTime=0 
[junit4:junit4]   2> 12112 T2471 C172 P43889 oash.SnapPuller$FileFetcher.fetchPackets WARNING No content recieved for file: {name=_0_MockVariableIntBlock_0.pyl, lastmodified=1347916359000, size=0}
[junit4:junit4]   2> 12147 T2441 C173 P43872 REQ /replication {file=_0_MockVariableIntBlock_0.tib&command=filecontent&checksum=true&generation=2&qt=/replication&wt=filestream} status=0 QTime=0 
[junit4:junit4]   2> 12153 T2441 C173 P43872 REQ /replication {file=_0_nrm.cfe&command=filecontent&checksum=true&generation=2&qt=/replication&wt=filestream} status=0 QTime=0 
[junit4:junit4]   2> 12159 T2441 C173 P43872 REQ /replication {file=_0_SimpleText_0.pst&command=filecontent&checksum=true&generation=2&qt=/replication&wt=filestream} status=0 QTime=0 
[junit4:junit4]   2> 12165 T2441 C173 P43872 REQ /replication {file=_0_MockVariableIntBlock_0.frq&command=filecontent&checksum=true&generation=2&qt=/replication&wt=filestream} status=0 QTime=0 
[junit4:junit4]   2> 12170 T2441 C173 P43872 REQ /replication {file=segments_2&command=filecontent&checksum=true&generation=2&qt=/replication&wt=filestream} status=0 QTime=0 
[junit4:junit4]   2> 12174 T2441 C173 P43872 REQ /replication {file=_0_Pulsing40_0.tip&command=filecontent&checksum=true&generation=2&qt=/replication&wt=filestream} status=0 QTime=0 
[junit4:junit4]   2> 12178 T2441 C173 P43872 REQ /replication {file=_0_MockVariableIntBlock_0.pos&command=filecontent&checksum=true&generation=2&qt=/replication&wt=filestream} status=0 QTime=0 
[junit4:junit4]   2> 12182 T2441 C173 P43872 REQ /replication {file=_0.fdx&command=filecontent&checksum=true&generation=2&qt=/replication&wt=filestream} status=0 QTime=0 
[junit4:junit4]   2> 12186 T2441 C173 P43872 REQ /replication {file=_0.si&command=filecontent&checksum=true&generation=2&qt=/replication&wt=filestream} status=0 QTime=0 
[junit4:junit4]   2> 12190 T2441 C173 P43872 REQ /replication {file=_0.fdt&command=filecontent&checksum=true&generation=2&qt=/replication&wt=filestream} status=0 QTime=0 
[junit4:junit4]   2> 12194 T2441 C173 P43872 REQ /replication {file=_0_MockVariableIntBlock_0.tii&command=filecontent&checksum=true&generation=2&qt=/replication&wt=filestream} status=0 QTime=0 
[junit4:junit4]   2> 12195 T2471 C172 P43889 oash.SnapPuller.fetchLatestIndex Total time taken for download : 0 secs
[junit4:junit4]   2> 12196 T2471 C172 P43889 oash.SnapPuller.modifyIndexProps New index installed. Updating index properties... index=index.20120918021239366
[junit4:junit4]   2> 12197 T2471 C172 P43889 oasu.DefaultSolrCoreState.newIndexWriter Creating new IndexWriter...
[junit4:junit4]   2> 12197 T2471 C172 P43889 oasu.DefaultSolrCoreState.newIndexWriter Waiting until IndexWriter is unused... core=collection1
[junit4:junit4]   2> 12198 T2471 C172 P43889 oasu.DefaultSolrCoreState.newIndexWriter Rollback old IndexWriter... core=collection1
[junit4:junit4]   2> 12201 T2471 C172 P43889 oasc.SolrCore.getNewIndexDir WARNING New index directory detected: old=./org.apache.solr.cloud.BasicDistributedZk2Test-1347916347334/jetty3/index/ new=./org.apache.solr.cloud.BasicDistributedZk2Test-1347916347334/jetty3/index.20120918021239366
[junit4:junit4]   2> 12202 T2471 C172 P43889 oasc.CachingDirectoryFactory.get return new directory for /usr/home/hudson/hudson-slave/workspace/Lucene-Solr-Tests-4.x-java7/solr/build/solr-core/test/J1/./org.apache.solr.cloud.BasicDistributedZk2Test-1347916347334/jetty3/index.20120918021239366 forceNew:true
[junit4:junit4]   2> 12210 T2471 C172 P43889 oasc.SolrDeletionPolicy.onInit SolrDeletionPolicy.onInit: commits:num=1
[junit4:junit4]   2> 		commit{dir=NRTCachingDirectory(org.apache.lucene.store.NIOFSDirectory@/usr/home/hudson/hudson-slave/workspace/Lucene-Solr-Tests-4.x-java7/solr/build/solr-core/test/J1/org.apache.solr.cloud.BasicDistributedZk2Test-1347916347334/jetty3/index.20120918021239366 lockFactory=org.apache.lucene.store.NativeFSLockFactory@18cc00f6; maxCacheMB=48.0 maxMergeSizeMB=4.0),segFN=segments_2,generation=2,filenames=[_0_Block_0.tip, _0_Block_0.pos, _0.fnm, _0_Pulsing40_0.tim, _0_Block_0.doc, _0_Block_0.tim, _0_MockVariableIntBlock_0.doc, _0_nrm.cfs, _0_MockVariableIntBlock_0.skp, _0_Pulsing40_0.prx, _0_Pulsing40_0.frq, _0_MockVariableIntBlock_0.pyl, _0_MockVariableIntBlock_0.tib, _0_nrm.cfe, _0_SimpleText_0.pst, _0_MockVariableIntBlock_0.frq, _0_Pulsing40_0.tip, _0_MockVariableIntBlock_0.pos, segments_2, _0.fdx, _0.si, _0.fdt, _0_MockVariableIntBlock_0.tii]
[junit4:junit4]   2> 12210 T2471 C172 P43889 oasc.SolrDeletionPolicy.updateCommits newest commit = 2
[junit4:junit4]   2> 12210 T2471 C172 P43889 oasu.DefaultSolrCoreState.newIndexWriter New IndexWriter is ready to be used.
[junit4:junit4]   2> 12213 T2471 C172 P43889 oass.SolrIndexSearcher.<init> Opening Searcher@e591b0e main
[junit4:junit4]   2> 12215 T2470 oasc.SolrCore.registerSearcher [collection1] Registered new searcher Searcher@e591b0e main{StandardDirectoryReader(segments_2:3:nrt _0(4.0.0.2):C1)}
[junit4:junit4]   2> 12216 T2470 oasc.CachingDirectoryFactory.close Closing directory:/usr/home/hudson/hudson-slave/workspace/Lucene-Solr-Tests-4.x-java7/solr/build/solr-core/test/J1/./org.apache.solr.cloud.BasicDistributedZk2Test-1347916347334/jetty3/index
[junit4:junit4]   2> 12216 T2470 oash.SnapPuller$2.onClose removing old index directory ./org.apache.solr.cloud.BasicDistributedZk2Test-1347916347334/jetty3/index
[junit4:junit4]   2> 12218 T2471 C172 P43889 oasu.DirectUpdateHandler2.commit start commit{flags=0,_version_=0,optimize=false,openSearcher=false,waitSearcher=false,expungeDeletes=false,softCommit=false}
[junit4:junit4]   2> 12219 T2471 C172 P43889 oasu.DirectUpdateHandler2.commit end_commit_flush
[junit4:junit4]   2> 12219 T2471 C172 P43889 oasc.RecoveryStrategy.replay Replaying buffered documents. core=collection1
[junit4:junit4]   2> 12219 T2494 C172 P43889 oasu.UpdateLog$LogReplayer.doReplay WARNING Starting log replay tlog{file=./org.apache.solr.cloud.BasicDistributedZk2Test-1347916347334/jetty3/tlog/tlog.0000000000000000000 refcount=2} active=true starting pos=435
[junit4:junit4]   2> 12220 T2494 C172 P43889 oasu.DirectUpdateHandler2.commit start commit{flags=2,_version_=0,optimize=false,openSearcher=true,waitSearcher=true,expungeDeletes=false,softCommit=false}
[junit4:junit4]   2> 12221 T2494 C172 P43889 oass.SolrIndexSearcher.<init> Opening Searcher@4f9fe09a main
[junit4:junit4]   2> 12222 T2494 C172 P43889 oasu.DirectUpdateHandler2.commit end_commit_flush
[junit4:junit4]   2> 12223 T2470 oasc.SolrCore.registerSearcher [collection1] Registered new searcher Searcher@4f9fe09a main{StandardDirectoryReader(segments_2:3:nrt _0(4.0.0.2):C1)}
[junit4:junit4]   2> 12224 T2494 C172 P43889 oasu.UpdateLog$LogReplayer.run WARNING Log replay finished. recoveryInfo=RecoveryInfo{adds=0 deletes=0 deleteByQuery=0 errors=0 positionOfStart=435}
[junit4:junit4]   2> 12224 T2471 C172 P43889 oasc.RecoveryStrategy.doRecovery Replication Recovery was successful - registering as Active. core=collection1
[junit4:junit4]   2> 12225 T2471 C172 P43889 oasc.RecoveryStrategy.doRecovery Finished recovery process. core=collection1
[junit4:junit4]   2> 12328 T2432 oascc.ZkStateReader.updateClusterState Updating cloud state from ZooKeeper... 
[junit4:junit4]   2> 12332 T2445 oascc.ZkStateReader$2.process A cluster state change has occurred - updating...
[junit4:junit4]   2> 12332 T2490 oascc.ZkStateReader$2.process A cluster state change has occurred - updating...
[junit4:junit4]   2> 12332 T2488 oascc.ZkStateReader$2.process A cluster state change has occurred - updating...
[junit4:junit4]   2> 12333 T2469 oascc.ZkStateReader$2.process A cluster state change has occurred - updating...
[junit4:junit4]   2> 12333 T2457 oascc.ZkStateReader$2.process A cluster state change has occurred - updating...
[junit4:junit4]   2> 12332 T2483 oascc.ZkStateReader$2.process A cluster state change has occurred - updating...
[junit4:junit4]   2> 12332 T2431 oascc.ZkStateReader$2.process A cluster state change has occurred - updating...
[junit4:junit4]   2> 12827 T2411 oascc.ZkStateReader.updateClusterState Updating cloud state from ZooKeeper... 
[junit4:junit4]   2>  C174_STATE=coll:collection1 core:collection1 props:{shard=shard2, roles=null, state=recovering, core=collection1, collection=collection1, node_name=127.0.0.1:43899_solr, base_url=http://127.0.0.1:43899/solr}
[junit4:junit4]   2> 13702 T2485 C174 P43899 oasc.RecoveryStrategy.doRecovery Begin buffering updates. core=collection1
[junit4:junit4]   2> 13702 T2485 C174 P43899 oasu.UpdateLog.bufferUpdates Starting to buffer updates. FSUpdateLog{state=ACTIVE, tlog=null}
[junit4:junit4]   2> 13702 T2485 C174 P43899 oasc.RecoveryStrategy.replicate Attempting to replicate from http://127.0.0.1:43885/solr/collection1/. core=collection1
[junit4:junit4]   2> 13702 T2485 C174 P43899 oascsi.HttpClientUtil.createClient Creating new http client, config:maxConnections=128&maxConnectionsPerHost=32&followRedirects=false
[junit4:junit4]   2> 13714 T2452 C175 P43885 oasu.DirectUpdateHandler2.commit start commit{flags=0,_version_=0,optimize=false,openSearcher=true,waitSearcher=true,expungeDeletes=false,softCommit=false}
[junit4:junit4]   2> 13718 T2452 C175 P43885 oasc.SolrDeletionPolicy.onInit SolrDeletionPolicy.onInit: commits:num=1
[junit4:junit4]   2> 		commit{dir=NRTCachingDirectory(org.apache.lucene.store.NIOFSDirectory@/usr/home/hudson/hudson-slave/workspace/Lucene-Solr-Tests-4.x-java7/solr/build/solr-core/test/J1/org.apache.solr.cloud.BasicDistributedZk2Test-1347916347334/jetty2/index lockFactory=org.apache.lucene.store.NativeFSLockFactory@aedf58d; maxCacheMB=48.0 maxMergeSizeMB=4.0),segFN=segments_1,generation=1,filenames=[segments_1]
[junit4:junit4]   2> 13719 T2452 C175 P43885 oasc.SolrDeletionPolicy.updateCommits newest commit = 1
[junit4:junit4]   2> 13720 T2452 C175 P43885 oass.SolrIndexSearcher.<init> Opening Searcher@35ada0a6 main
[junit4:junit4]   2> 13720 T2452 C175 P43885 oasu.DirectUpdateHandler2.commit end_commit_flush
[junit4:junit4]   2> 13721 T2458 oasc.SolrCore.registerSearcher [collection1] Registered new searcher Searcher@35ada0a6 main{StandardDirectoryReader(segments_1:1)}
[junit4:junit4]   2> 13722 T2452 C175 P43885 /update {waitSearcher=true&commit=true&commit_end_point=true&wt=javabin&softCommit=false&version=2} {commit=} 0 8
[junit4:junit4]   2> 13723 T2485 C174 P43899 oash.ReplicationHandler.inform Commits will be reserved for  10000
[junit4:junit4]   2> 13723 T2485 C174 P43899 oash.SnapPuller.<init>  No value set for 'pollInterval'. Timer Task not started.
[junit4:junit4]   2> 13725 T2453 C175 P43885 oash.ReplicationHandler.inform Commits will be reserved for  10000
[junit4:junit4]   2> 13725 T2453 C175 P43885 REQ /replication {command=indexversion&wt=javabin&qt=/replication&version=2} status=0 QTime=1 
[junit4:junit4]   2> 13728 T2485 C174 P43899 oasc.SolrDeletionPolicy.onInit SolrDeletionPolicy.onInit: commits:num=1
[junit4:junit4]   2> 		commit{dir=NRTCachingDirectory(org.apache.lucene.store.NIOFSDirectory@/usr/home/hudson/hudson-slave/workspace/Lucene-Solr-Tests-4.x-java7/solr/build/solr-core/test/J1/org.apache.solr.cloud.BasicDistributedZk2Test-1347916347334/jetty4/index lockFactory=org.apache.lucene.store.NativeFSLockFactory@184d425b; maxCacheMB=48.0 maxMergeSizeMB=4.0),segFN=segments_1,generation=1,filenames=[segments_1]
[junit4:junit4]   2> 13729 T2485 C174 P43899 oasc.SolrDeletionPolicy.updateCommits newest commit = 1
[junit4:junit4]   2> 13729 T2485 C174 P43899 oasu.DirectUpdateHandler2.commit start commit{flags=0,_version_=0,optimize=false,openSearcher=true,waitSearcher=true,expungeDeletes=false,softCommit=false}
[junit4:junit4]   2> 13749 T2485 C174 P43899 oasc.SolrDeletionPolicy.onCommit SolrDeletionPolicy.onCommit: commits:num=2
[junit4:junit4]   2> 		commit{dir=NRTCachingDirectory(org.apache.lucene.store.NIOFSDirectory@/usr/home/hudson/hudson-slave/workspace/Lucene-Solr-Tests-4.x-java7/solr/build/solr-core/test/J1/org.apache.solr.cloud.BasicDistributedZk2Test-1347916347334/jetty4/index lockFactory=org.apache.lucene.store.NativeFSLockFactory@184d425b; maxCacheMB=48.0 maxMergeSizeMB=4.0),segFN=segments_1,generation=1,filenames=[segments_1]
[junit4:junit4]   2> 		commit{dir=NRTCachingDirectory(org.apache.lucene.store.NIOFSDirectory@/usr/home/hudson/hudson-slave/workspace/Lucene-Solr-Tests-4.x-java7/solr/build/solr-core/test/J1/org.apache.solr.cloud.BasicDistributedZk2Test-1347916347334/jetty4/index lockFactory=org.apache.lucene.store.NativeFSLockFactory@184d425b; maxCacheMB=48.0 maxMergeSizeMB=4.0),segFN=segments_2,generation=2,filenames=[segments_2]
[junit4:junit4]   2> 13749 T2485 C174 P43899 oasc.SolrDeletionPolicy.updateCommits newest commit = 2
[junit4:junit4]   2> 13752 T2485 C174 P43899 oass.SolrIndexSearcher.<init> Opening Searcher@52f828d2 main
[junit4:junit4]   2> 13752 T2485 C174 P43899 oasu.DirectUpdateHandler2.commit end_commit_flush
[junit4:junit4]   2> 13753 T2484 oasc.SolrCore.registerSearcher [collection1] Registered new searcher Searcher@52f828d2 main{StandardDirectoryReader(segments_2:2)}
[junit4:junit4]   2> 13754 T2485 C174 P43899 oasc.RecoveryStrategy.replay No replay needed. core=collection1
[junit4:junit4]   2> 13754 T2485 C174 P43899 oasc.RecoveryStrategy.doRecovery Replication Recovery was successful - registering as Active. core=collection1
[junit4:junit4]   2> 13756 T2485 C174 P43899 oasc.RecoveryStrategy.doRecovery Finished recovery process. core=collection1
[junit4:junit4]   2> 13838 T2411 oascc.ZkStateReader.updateClusterState Updating cloud state from ZooKeeper... 
[junit4:junit4]   2> 13850 T2432 oascc.ZkStateReader.updateClusterState Updating cloud state from ZooKeeper... 
[junit4:junit4]   2> 13863 T2488 oascc.ZkStateReader$2.process A cluster state change has occurred - updating...
[junit4:junit4]   2> 13863 T2483 oascc.ZkStateReader$2.process A cluster state change has occurred - updating...
[junit4:junit4]   2> 13863 T2457 oascc.ZkStateReader$2.process A cluster state change has occurred - updating...
[junit4:junit4]   2> 13863 T2469 oascc.ZkStateReader$2.process A cluster state change has occurred - updating...
[junit4:junit4]   2> 13863 T2431 oascc.ZkStateReader$2.process A cluster state change has occurred - updating...
[junit4:junit4]   2> 13863 T2445 oascc.ZkStateReader$2.process A cluster state change has occurred - updating...
[junit4:junit4]   2> 13863 T2490 oascc.ZkStateReader$2.process A cluster state change has occurred - updating...
[junit4:junit4]   2> 14840 T2411 oascc.ZkStateReader.updateClusterState Updating cloud state from ZooKeeper... 
[junit4:junit4]   2> 14843 T2423 C176 P43864 oasu.DirectUpdateHandler2.commit start commit{flags=0,_version_=0,optimize=false,openSearcher=true,waitSearcher=true,expungeDeletes=false,softCommit=false}
[junit4:junit4]   2> 14948 T2423 C176 P43864 oasc.SolrDeletionPolicy.onCommit SolrDeletionPolicy.onCommit: commits:num=2
[junit4:junit4]   2> 		commit{dir=NRTCachingDirectory(org.apache.lucene.store.NIOFSDirectory@/usr/home/hudson/hudson-slave/workspace/Lucene-Solr-Tests-4.x-java7/solr/build/solr-core/test/J1/org.apache.solr.cloud.BasicDistributedZk2Test-1347916347334/control/data/index lockFactory=org.apache.lucene.store.NativeFSLockFactory@12e6df6a; maxCacheMB=48.0 maxMergeSizeMB=4.0),segFN=segments_1,generation=1,filenames=[segments_1]
[junit4:junit4]   2> 		commit{dir=NRTCachingDirectory(org.apache.lucene.store.NIOFSDirectory@/usr/home/hudson/hudson-slave/workspace/Lucene-Solr-Tests-4.x-java7/solr/build/solr-core/test/J1/org.apache.solr.cloud.BasicDistributedZk2Test-1347916347334/control/data/index lockFactory=org.apache.lucene.store.NativeFSLockFactory@12e6df6a; maxCacheMB=48.0 maxMergeSizeMB=4.0),segFN=segments_2,generation=2,filenames=[_0_Block_0.tip, _0_Block_0.pos, _0.fnm, _0_Pulsing40_0.tim, _0_Block_0.doc, _0_Block_0.tim, _0_MockVariableIntBlock_0.doc, _0_nrm.cfs, _0_MockVariableIntBlock_0.skp, _0_Pulsing40_0.prx, _0_Pulsing40_0.frq, _0_MockVariableIntBlock_0.pyl, _0_MockVariableIntBlock_0.tib, _0_MockVariableIntBlock_0.frq, _0_SimpleText_0.pst, _0_nrm.cfe, _0_MockVariableIntBlock_0.pos, _0_Pulsing40_0.tip, segments_2, _0.fdx, _0.si, _0_MockVariableIntBlock_0.tii, _0.fdt]
[junit4:junit4]   2> 14948 T2423 C176 P43864 oasc.SolrDeletionPolicy.updateCommits newest commit = 2
[junit4:junit4]   2> 14959 T2423 C176 P43864 oass.SolrIndexSearcher.<init> Opening Searcher@3c04a82c main
[junit4:junit4]   2> 14960 T2423 C176 P43864 oasu.DirectUpdateHandler2.commit end_commit_flush
[junit4:junit4]   2> 14961 T2434 oasc.SolrCore.registerSearcher [collection1] Registered new searcher Searcher@3c04a82c main{StandardDirectoryReader(segments_2:3 _0(4.0.0.2):C1)}
[junit4:junit4]   2> 14961 T2423 C176 P43864 /update {waitSearcher=true&wt=javabin&commit=true&softCommit=false&version=2} {commit=} 0 118
[junit4:junit4]   2> 14964 T2451 C175 P43885 oasu.DirectUpdateHandler2.commit start commit{flags=0,_version_=0,optimize=false,openSearcher=true,waitSearcher=true,expungeDeletes=false,softCommit=false}
[junit4:junit4]   2> 14968 T2451 C175 P43885 oass.SolrIndexSearcher.<init> Opening Searcher@16a2edaa main
[junit4:junit4]   2> 14968 T2451 C175 P43885 oasu.DirectUpdateHandler2.commit end_commit_flush
[junit4:junit4]   2> 14970 T2458 oasc.SolrCore.registerSearcher [collection1] Registered new searcher Searcher@16a2edaa main{StandardDirectoryReader(segments_1:1)}
[junit4:junit4]   2> 14970 T2451 C175 P43885 oasu.SolrCmdDistributor.distribCommit Distrib commit to:[StdNode: http://127.0.0.1:43872/solr/collection1/, StdNode: http://127.0.0.1:43889/solr/collection1/, StdNode: http://127.0.0.1:43899/solr/collection1/]
[junit4:junit4]   2> 14972 T2439 C173 P43872 oasu.DirectUpdateHandler2.commit start commit{flags=0,_version_=0,optimize=false,openSearcher=true,waitSearcher=true,expungeDeletes=false,softCommit=false}
[junit4:junit4]   2>  C172_STATE=coll:collection1 core:collection1 props:{shard=shard1, roles=null, state=active, core=collection1, collection=collection1, node_name=127.0.0.1:43889_solr, base_url=http://127.0.0.1:43889/solr}
[junit4:junit4]   2> 14973 T2461 C172 P43889 oasu.DirectUpdateHandler2.commit start commit{flags=0,_version_=0,optimize=false,openSearcher=true,waitSearcher=true,expungeDeletes=false,softCommit=false}
[junit4:junit4]   2> 14975 T2461 C172 P43889 oass.SolrIndexSearcher.<init> Opening Searcher@4223b111 main
[junit4:junit4]   2> 14976 T2461 C172 P43889 oasu.DirectUpdateHandler2.commit end_commit_flush
[junit4:junit4]   2> 14977 T2470 oasc.SolrCore.registerSearcher [collection1] Registered new searcher Searcher@4223b111 main{StandardDirectoryReader(segments_2:3:nrt _0(4.0.0.2):C1)}
[junit4:junit4]   2> 14977 T2461 C172 P43889 /update {waitSearcher=true&commit=true&wt=javabin&commit_end_point=true&expungeDeletes=false&softCommit=false&version=2} {commit=} 0 4
[junit4:junit4]   2>  C174_STATE=coll:collection1 core:collection1 props:{shard=shard2, roles=null, state=active, core=collection1, collection=collection1, node_name=127.0.0.1:43899_solr, base_url=http://127.0.0.1:43899/solr}
[junit4:junit4]   2> 14978 T2475 C174 P43899 oasu.DirectUpdateHandler2.commit start commit{flags=0,_version_=0,optimize=false,openSearcher=true,waitSearcher=true,expungeDeletes=false,softCommit=false}
[junit4:junit4]   2> 14982 T2475 C174 P43899 oass.SolrIndexSearcher.<init> Opening Searcher@63967b1f main
[junit4:junit4]   2> 14982 T2475 C174 P43899 oasu.DirectUpdateHandler2.commit end_commit_flush
[junit4:junit4]   2> 14983 T2484 oasc.SolrCore.registerSearcher [collection1] Registered new searcher Searcher@63967b1f main{StandardDirectoryReader(segments_2:2)}
[junit4:junit4]   2> 14984 T2475 C174 P43899 /update {waitSearcher=true&commit=true&wt=javabin&commit_end_point=true&expungeDeletes=false&softCommit=false&version=2} {commit=} 0 6
[junit4:junit4]   2> 14986 T2439 C173 P43872 oass.SolrIndexSearcher.<init> Opening Searcher@41926b04 main
[junit4:junit4]   2> 14986 T2439 C173 P43872 oasu.DirectUpdateHandler2.commit end_commit_flush
[junit4:junit4]   2> 14987 T2446 oasc.SolrCore.registerSearcher [collection1] Registered new searcher Searcher@41926b04 main{StandardDirectoryReader(segments_2:3 _0(4.0.0.2):C1)}
[junit4:junit4]   2> 14988 T2439 C173 P43872 /update {waitSearcher=true&commit=true&wt=javabin&commit_end_point=true&expungeDeletes=false&softCommit=false&version=2} {commit=} 0 16
[junit4:junit4]   2> 14988 T2451 C175 P43885 /update {waitSearcher=true&wt=javabin&commit=true&softCommit=false&version=2} {commit=} 0 24
[junit4:junit4]   2> 14993 T2424 C176 P43864 REQ /select {fl=id,score&shard.url=127.0.0.1:43864/solr/collection1/&NOW=1347916362321&start=0&q=*:*&distrib=false&isShard=true&wt=javabin&fsv=true&rows=10&version=2} hits=1 status=0 QTime=0 
[junit4:junit4]   2> 14996 T2424 C176 P43864 REQ /select {shard.url=127.0.0.1:43864/solr/collection1/&NOW=1347916362321&q=*:*&ids=1&distrib=false&isShard=true&wt=javabin&version=2} status=0 QTime=0 
[junit4:junit4]   2> 14997 T2423 C176 P43864 REQ /select {wt=javabin&q=*:*&version=2} hits=1 status=0 QTime=6 
[junit4:junit4]   2> 14998 T2411 oaz.ZooKeeper.<init> Initiating client connection, connectString=127.0.0.1:43861/solr sessionTimeout=10000 watcher=org.apache.solr.common.cloud.ConnectionManager@6df78aad
[junit4:junit4]   2> 14998 T2498 oaz.ClientCnxn$SendThread.startConnect Opening socket connection to server /127.0.0.1:43861
[junit4:junit4]   2> 14998 T2411 oascc.ConnectionManager.waitForConnected Waiting for client to connect to ZooKeeper
[junit4:junit4]   2> 14999 T2498 oaz.ClientCnxn$SendThread.primeConnection Socket connection established to localhost/127.0.0.1:43861, initiating session
[junit4:junit4]   2> 14999 T2413 oazs.NIOServerCnxn$Factory.run Accepted socket connection from /140.211.11.196:43932
[junit4:junit4]   2> 14999 T2413 oazs.NIOServerCnxn.readConnectRequest Client attempting to establish new session at /140.211.11.196:43932
[junit4:junit4]   2> 15008 T2415 oazs.NIOServerCnxn.finishSessionInit Established session 0x139d61337cc0009 with negotiated timeout 10000 for client /140.211.11.196:43932
[junit4:junit4]   2> 15008 T2498 oaz.ClientCnxn$SendThread.readConnectResult Session establishment complete on server localhost/127.0.0.1:43861, sessionid = 0x139d61337cc0009, negotiated timeout = 10000
[junit4:junit4]   2> 15009 T2499 oascc.ConnectionManager.process Watcher org.apache.solr.common.cloud.ConnectionManager@6df78aad name:ZooKeeperConnection Watcher:127.0.0.1:43861/solr got event WatchedEvent state:SyncConnected type:None path:null path:null type:None
[junit4:junit4]   2> 15009 T2411 oascc.ConnectionManager.waitForConnected Client is connected to ZooKeeper
[junit4:junit4]   2> 15010 T2411 oascc.ZkStateReader.createClusterStateWatchersAndUpdate Updating cluster state from ZooKeeper... 
[junit4:junit4]   2> 15011 T2416 oazs.PrepRequestProcessor.pRequest Processed session termination for sessionid: 0x139d61337cc0009
[junit4:junit4]   2> 15015 T2499 oaz.ClientCnxn$EventThread.run EventThread shut down
[junit4:junit4]   2> 15015 T2413 oazs.NIOServerCnxn.closeSock Closed socket connection for client /140.211.11.196:43932 which had sessionid 0x139d61337cc0009
[junit4:junit4]   2> 15015 T2411 oaz.ZooKeeper.close Session: 0x139d61337cc0009 closed
[junit4:junit4]   2> 15017 T2442 C173 P43872 REQ /select {distrib=false&wt=javabin&q=*:*&version=2} hits=1 status=0 QTime=1 
[junit4:junit4]   2> 15018 T2454 C175 P43885 REQ /select {distrib=false&wt=javabin&q=*:*&version=2} hits=0 status=0 QTime=0 
[junit4:junit4]   2> 15022 T2462 C172 P43889 REQ /select {fl=id,score&shard.url=127.0.0.1:43872/solr/collection1/|127.0.0.1:43889/solr/collection1/&NOW=1347916362350&start=0&q=*:*&distrib=false&isShard=true&wt=javabin&fsv=true&rows=10&version=2} hits=1 status=0 QTime=0 
[junit4:junit4]   2> 15022 T2455 C175 P43885 REQ /select {fl=id,score&shard.url=127.0.0.1:43885/solr/collection1/|127.0.0.1:43899/solr/collection1/&NOW=1347916362350&start=0&q=*:*&distrib=false&isShard=true&wt=javabin&fsv=true&rows=10&version=2} hits=0 status=0 QTime=0 
[junit4:junit4]   2> 15025 T2462 C172 P43889 REQ /select {shard.url=127.0.0.1:43872/solr/collection1/|127.0.0.1:43889/solr/collection1/&NOW=1347916362350&q=*:*&ids=1&distrib=false&isShard=true&wt=javabin&version=2} status=0 QTime=0 
[junit4:junit4]   2> 15026 T2476 C174 P43899 REQ /select {wt=javabin&q=*:*&version=2} hits=1 status=0 QTime=6 
[junit4:junit4]   2> 15030 T2423 C176 P43864 /update {wt=javabin&version=2} {add=[2 (1413392747575902208)]} 0 2
[junit4:junit4]   2> 15040 T2475 C174 P43899 REQ /update {distrib.from=http://127.0.0.1:43885/solr/collection1/&update.distrib=FROMLEADER&wt=javabin&version=2} status=0 QTime=2 
[junit4:junit4]   2> 15040 T2451 C175 P43885 /update {wt=javabin&version=2} {add=[2 (1413392747581145088)]} 0 7
[junit4:junit4]   2> 15044 T2423 C176 P43864 /update {wt=javabin&version=2} {add=[3 (1413392747591630848)]} 0 1
[junit4:junit4]   2> 15051 T2475 C174 P43899 REQ /update {update.distrib=FROMLEADER&distrib.from=http://127.0.0.1:43885/solr/collection1/&wt=javabin&version=2} status=0 QTime=1 
[junit4:junit4]   2> 15051 T2450 C175 P43885 REQ /update {distrib.from=http://127.0.0.1:43872/solr/collection1/&update.distrib=TOLEADER&wt=javabin&version=2} status=0 QTime=5 
[junit4:junit4]   2> 15052 T2443 C173 P43872 /update {wt=javabin&version=2} {add=[3]} 0 7
[junit4:junit4]   2> 15055 T2423 C176 P43864 /update {wt=javabin&version=2} {add=[4 (1413392747603165184)]} 0 1
[junit4:junit4]   2> 15066 T2461 C172 P43889 REQ /update {update.distrib=FROMLEADER&distrib.from=http://127.0.0.1:43872/solr/collection1/&wt=javabin&version=2} status=0 QTime=2 
[junit4:junit4]   2> 15067 T2439 C173 P43872 REQ /update {distrib.from=http://127.0.0.1:43885/solr/collection1/&update.distrib=TOLEADER&wt=javabin&version=2} status=0 QTime=8 
[junit4:junit4]   2> 15068 T2451 C175 P43885 /update {wt=javabin&version=2} {add=[4]} 0 11
[junit4:junit4]   2> 15072 T2423 C176 P43864 /update {wt=javabin&version=2} {add=[5 (1413392747620990976)]} 0 1
[junit4:junit4]   2> 15080 T2475 C174 P43899 REQ /update {update.distrib=FROMLEADER&distrib.from=http://127.0.0.1:43885/solr/collection1/&wt=javabin&version=2} status=0 QTime=1 
[junit4:junit4]   2> 15080 T2450 C175 P43885 REQ /update {distrib.from=http://127.0.0.1:43872/solr/collection1/&update.distrib=TOLEADER&wt=javabin&version=2} status=0 QTime=4 
[junit4:junit4]   2> 15081 T2443 C173 P43872 /update {wt=javabin&version=2} {add=[5]} 0 7
[junit4:junit4]   2> 15084 T2423 C176 P43864 /update {wt=javabin&version=2} {add=[6 (1413392747633573888)]} 0 1
[junit4:junit4]   2> 15090 T2475 C174 P43899 REQ /update {distrib.from=http://127.0.0.1:43885/solr/collection1/&update.distrib=FROMLEADER&wt=javabin&version=2} status=0 QTime=1 
[junit4:junit4]   2> 15090 T2451 C175 P43885 /update {wt=javabin&version=2} {add=[6 (1413392747636719616)]} 0 4
[junit4:junit4]   2> 15094 T2423 C176 P43864 /update {wt=javabin&version=2} {add=[7 (1413392747644059648)]} 0 1
[junit4:junit4]   2> 15100 T2475 C174 P43899 REQ /update {distrib.from=http://127.0.0.1:43885/solr/collection1/&update.distrib=FROMLEADER&wt=javabin&version=2} status=0 QTime=1 
[junit4:junit4]   2> 15100 T2451 C175 P43885 /update {wt=javabin&version=2} {add=[7 (1413392747647205376)]} 0 4
[junit4:junit4]   2> 15104 T2423 C176 P43864 /update {wt=javabin&version=2} {add=[8 (1413392747654545408)]} 0 1
[junit4:junit4]   2> 15110 T2461 C172 P43889 REQ /update {distrib.from=http://127.0.0.1:43872/solr/collection1/&update.distrib=FROMLEADER&wt=javabin&version=2} status=0 QTime=1 
[junit4:junit4]   2> 15111 T2443 C173 P43872 /update {wt=javabin&version=2} {add=[8 (1413392747657691136)]} 0 5
[junit4:junit4]   2> 15114 T2423 C176 P43864 /update {wt=javabin&version=2} {add=[9 (1413392747665031168)]} 0 1
[junit4:junit4]   2> 15122 T2475 C174 P43899 REQ /update {update.distrib=FROMLEADER&distrib.from=http://127.0.0.1:43885/solr/collection1/&wt=javabin&version=2} status=0 QTime=1 
[junit4:junit4]   2> 15123 T2450 C175 P43885 REQ /update {distrib.from=http://127.0.0.1:43872/solr/collection1/&update.distrib=TOLEADER&wt=javabin&version=2} status=0 QTime=5 
[junit4:junit4]   2> 15123 T2443 C173 P43872 /update {wt=javabin&version=2} {add=[9]} 0 7
[junit4:junit4]   2> 15127 T2423 C176 P43864 /update {wt=javabin&version=2} {add=[10 (1413392747678662656)]} 0 1
[junit4:junit4]   2> 15135 T2461 C172 P43889 REQ /update {update.distrib=FROMLEADER&distrib.from=http://127.0.0.1:43872/solr/collection1/&wt=javabin&version=2} status=0 QTime=1 
[junit4:junit4]   2> 15135 T2439 C173 P43872 REQ /update {distrib.from=http://127.0.0.1:43885/solr/collection1/&update.distrib=TOLEADER&wt=javabin&version=2} status=0 QTime=4 
[junit4:junit4]   2> 15136 T2451 C175 P43885 /update {wt=javabin&version=2} {add=[10]} 0 7
[junit4:junit4]   2> 15150 T2423 C176 P43864 /update {wt=javabin&version=2} {add=[11 (1413392747692294144)]} 0 11
[junit4:junit4]   2> 15159 T2461 C172 P43889 REQ /update {distrib.from=http://127.0.0.1:43872/solr/collection1/&update.distrib=FROMLEADER&wt=javabin&version=2} status=0 QTime=1 
[junit4:junit4]   2> 15166 T2443 C173 P43872 /update {wt=javabin&version=2} {add=[11 (1413392747706974208)]} 0 13
[junit4:junit4]   2> 15172 T2423 C176 P43864 /update {wt=javabin&version=2} {add=[12 (1413392747723751424)]} 0 3
[junit4:junit4]   2> 15179 T2461 C172 P43889 REQ /update {distrib.from=http://127.0.0.1:43872/solr/collection1/&update.distrib=FROMLEADER&wt=javabin&version=2} status=0 QTime=1 
[junit4:junit4]   2> 15180 T2443 C173 P43872 /update {wt=javabin&version=2} {add=[12 (1413392747730042880)]} 0 5
[junit4:junit4]   2> 15184 T2423 C176 P43864 /update {wt=javabin&version=2} {add=[13 (1413392747738431488)]} 0 1
[junit4:junit4]   2> 15193 T2461 C172 P43889 REQ /update {update.distrib=FROMLEADER&distrib.from=http://127.0.0.1:43872/solr/collection1/&wt=javabin&version=2} status=0 QTime=1 
[junit4:junit4]   2> 15194 T2439 C173 P43872 REQ /update {distrib.from=http://127.0.0.1:43885/solr/collection1/&update.distrib=TOLEADER&wt=javabin&version=2} status=0 QTime=5 
[junit4:junit4]   2> 15195 T2451 C175 P43885 /update {wt=javabin&version=2} {add=[13]} 0 8
[junit4:junit4]   2> 15198 T2423 C176 P43864 /update {wt=javabin&version=2} {add=[14 (1413392747753111552)]} 0 1
[junit4:junit4]   2> 15207 T2461 C172 P43889 REQ /update {update.distrib=FROMLEADER&distrib.from=http://127.0.0.1:43872/solr/collection1/&wt=javabin&version=2} status=0 QTime=1 
[junit4:junit4]   2> 15208 T2439 C173 P43872 REQ /update {distrib.from=http://127.0.0.1:43885/solr/collection1/&update.distrib=TOLEADER&wt=javabin&version=2} status=0 QTime=5 
[junit4:junit4]   2> 15209 T2451 C175 P43885 /update {wt=javabin&version=2} {add=[14]} 0 8
[junit4:junit4]   2> 15213 T2423 C176 P43864 /update {wt=javabin&version=2} {add=[15 (1413392747768840192)]} 0 1
[junit4:junit4]   2> 15220 T2461 C172 P43889 REQ /update {distrib.from=http://127.0.0.1:43872/solr/collection1/&update.distrib=FROMLEADER&wt=javabin&version=2} status=0 QTime=1 
[junit4:junit4]   2> 15221 T2443 C173 P43872 /update {wt=javabin&version=2} {add=[15 (1413392747773034496)]} 0 4
[junit4:junit4]   2> 15224 T2423 C176 P43864 /update {wt=javabin&version=2} {add=[16 (1413392747780374528)]} 0 1
[junit4:junit4]   2> 15231 T2461 C172 P43889 REQ /update {distrib.from=http://127.0.0.1:43872/solr/collection1/&update.distrib=FROMLEADER&wt=javabin&version=2} status=0 QTime=1 
[junit4:junit4]   2> 15231 T2443 C173 P43872 /update {wt=javabin&version=2} {add=[16 (1413392747784568832)]} 0 4
[junit4:junit4]   2> 15238 T2423 C176 P43864 /update {wt=javabin&version=2} {add=[17 (1413392747794006016)]} 0 3
[junit4:junit4]   2> 15252 T2475 C174 P43899 REQ /update {update.distrib=FROMLEADER&distrib.from=http://127.0.0.1:43885/solr/collection1/&wt=javabin&version=2} status=0 QTime=3 
[junit4:junit4]   2> 15253 T2450 C175 P43885 REQ /update {distrib.from=http://127.0.0.1:43872/solr/collection1/&update.distrib=TOLEADER&wt=javabin&version=2} status=0 QTime=9 
[junit4:junit4]   2> 15253 T2443 C173 P43872 /update {wt=javabin&version=2} {add=[17]} 0 12
[junit4:junit4]   2> 15257 T2423 C176 P43864 /update {wt=javabin&version=2} {add=[100 (1413392747814977536)]} 0 1
[junit4:junit4]   2> 15288 T2461 C172 P43889 REQ /update {update.distrib=FROMLEADER&distrib.from=http://127.0.0.1:43872/solr/collection1/&wt=javabin&version=2} status=0 QTime=12 
[junit4:junit4]   2> 15288 T2439 C173 P43872 REQ /update {distrib.from=http://127.0.0.1:43885/solr/collection1/&update.distrib=TOLEADER&wt=javabin&version=2} status=0 QTime=26 
[junit4:junit4]   2> 15289 T2451 C175 P43885 /update {wt=javabin&version=2} {add=[100]} 0 29
[junit4:junit4]   2> 15293 T2423 C176 P43864 /update {wt=javabin&version=2} {add=[101 (1413392747852726272)]} 0 1
[junit4:junit4]   2> 15304 T2461 C172 P43889 REQ /update {update.distrib=FROMLEADER&distrib.from=http://127.0.0.1:43872/solr/collection1/&wt=javabin&version=2} status=0 QTime=2 
[junit4:junit4]   2> 15305 T2439 C173 P43872 REQ /update {distrib.from=http://127.0.0.1:43885/solr/collection1/&update.distrib=TOLEADER&wt=javabin&version=2} status=0 QTime=7 
[junit4:junit4]   2> 15306 T2451 C175 P43885 /update {wt=javabin&version=2} {add=[101]} 0 10
[junit4:junit4]   2> 15309 T2423 C176 P43864 /update {wt=javabin&version=2} {add=[102 (1413392747869503488)]} 0 1
[junit4:junit4]   2> 15318 T2461 C172 P43889 REQ /update {update.distrib=FROMLEADER&distrib.from=http://127.0.0.1:43872/solr/collection1/&wt=javabin&version=2} status=0 QTime=1 
[junit4:junit4]   2> 15319 T2439 C173 P43872 REQ /update {distrib.from=http://127.0.0.1:43885/solr/collection1/&update.distrib=TOLEADER&wt=javabin&version=2} status=0 QTime=5 
[junit4:junit4]   2> 15319 T2451 C175 P43885 /update {wt=javabin&version=2} {add=[102]} 0 7
[junit4:junit4]   2> 15333 T2423 C176 P43864 /update {wt=javabin&version=2} {add=[103 (1413392747884183552)]} 0 11
[junit4:junit4]   2> 15343 T2475 C174 P43899 REQ /update {update.distrib=FROMLEADER&distrib.from=http://127.0.0.1:43885/solr/collection1/&wt=javabin&version=2} status=0 QTime=1 
[junit4:junit4]   2> 15344 T2450 C175 P43885 REQ /update {distrib.from=http://127.0.0.1:43872/solr/collection1/&update.distrib=TOLEADER&wt=javabin&version=2} status=0 QTime=5 
[junit4:junit4]   2> 15344 T2443 C173 P43872 /update {wt=javabin&version=2} {add=[103]} 0 8
[junit4:junit4]   2> 15349 T2423 C176 P43864 /update {wt=javabin&version=2} {add=[104 (1413392747910397952)]} 0 2
[junit4:junit4]   2> 15356 T2475 C174 P43899 REQ /update {distrib.from=http://127.0.0.1:43885/solr/collection1/&update.distrib=FROMLEADER&wt=javabin&version=2} status=0 QTime=1 
[junit4:junit4]   2> 15357 T2451 C175 P43885 /update {wt=javabin&version=2} {add=[104 (1413392747915640832)]} 0 5
[junit4:junit4]   2> 15360 T2423 C176 P43864 /update {wt=javabin&version=2} {add=[105 (1413392747922980864)]} 0 1
[junit4:junit4]   2> 15386 T2475 C174 P43899 REQ /update {update.distrib=FROMLEADER&distrib.from=http://127.0.0.1:43885/solr/collection1/&wt=javabin&version=2} status=0 QTime=8 
[junit4:junit4]   2> 15387 T2450 C175 P43885 REQ /update {distrib.from=http://127.0.0.1:43872/solr/collection1/&update.distrib=TOLEADER&wt=javabin&version=2} status=0 QTime=22 
[junit4:junit4]   2> 15388 T2443 C173 P43872 /update {wt=javabin&version=2} {add=[105]} 0 25
[junit4:junit4]   2> 15391 T2423 C176 P43864 /update {wt=javabin&version=2} {add=[106 (1413392747955486720)]} 0 1
[junit4:junit4]   2> 15401 T2475 C174 P43899 REQ /update {update.distrib=FROMLEADER&distrib.from=http://127.0.0.1:43885/solr/collection1/&wt=javabin&version=2} status=0 QTime=1 
[junit4:junit4]   2> 15402 T2450 C175 P43885 REQ /update {distrib.from=http://127.0.0.1:43872/solr/collection1/&update.distrib=TOLEADER&wt=javabin&version=2} status=0 QTime=6 
[junit4:junit4]   2> 15402 T2443 C173 P43872 /update {wt=javabin&version=2} {add=[106]} 0 8
[junit4:junit4]   2> 15406 T2423 C176 P43864 /update {wt=javabin&version=2} {add=[107 (1413392747971215360)]} 0 1
[junit4:junit4]   2> 15415 T2461 C172 P43889 REQ /update {update.distrib=FROMLEADER&distrib.from=http://127.0.0.1:43872/solr/collection1/&wt=javabin&version=2} status=0 QTime=1 
[junit4:junit4]   2> 15416 T2439 C173 P43872 REQ /update {distrib.from=http://127.0.0.1:43885/solr/collection1/&update.distrib=TOLEADER&wt=javabin&version=2} status=0 QTime=5 
[junit4:junit4]   2> 15416 T2451 C175 P43885 /update {wt=javabin&version=2} {add=[107]} 0 7
[junit4:junit4]   2> 15420 T2423 C176 P43864 /update {wt=javabin&version=2} {add=[108 (1413392747985895424)]} 0 1
[junit4:junit4]   2> 15429 T2461 C172 P43889 REQ /update {update.distrib=FROMLEADER&distrib.from=http://127.0.0.1:43872/solr/collection1/&wt=javabin&version=2} status=0 QTime=1 
[junit4:junit4]   2> 15429 T2439 C173 P43872 REQ /update {distrib.from=http://127.0.0.1:43885/solr/collection1/&update.distrib=TOLEADER&wt=javabin&version=2} status=0 QTime=4 
[junit4:junit4]   2> 15430 T2451 C175 P43885 /update {wt=javabin&version=2} {add=[108]} 0 7
[junit4:junit4]   2> 15433 T2423 C176 P43864 /update {wt=javabin&version=2} {add=[109 (1413392747999526912)]} 0 1
[junit4:junit4]   2> 15440 T2461 C172 P43889 REQ /update {distrib.from=http://127.0.0.1:43872/solr/collection1/&update.distrib=FROMLEADER&wt=javabin&version=2} status=0 QTime=1 
[junit4:junit4]   2> 15441 T2443 C173 P43872 /update {wt=javabin&version=2} {add=[109 (1413392748003721216)]} 0 5
[junit4:junit4]   2> 15444 T2423 C176 P43864 /update {wt=javabin&version=2} {add=[110 (1413392748011061248)]} 0 1
[junit4:junit4]   2> 15451 T2461 C172 P43889 REQ /update {distrib.from=http://127.0.0.1:43872/solr/collection1/&update.distrib=FROMLEADER&wt=javabin&version=2} status=0 QTime=1 
[junit4:junit4]   2> 15452 T2443 C173 P43872 /update {wt=javabin&version=2} {add=[110 (1413392748015255552)]} 0 5
[junit4:junit4]   2> 15456 T2423 C176 P43864 /update {wt=javabin&version=2} {add=[111 (1413392748023644160)]} 0 1
[junit4:junit4]   2> 15463 T2461 C172 P43889 REQ /update {distrib.from=http://127.0.0.1:43872/solr/collection1/&update.distrib=FROMLEADER&wt=javabin&version=2} status=0 QTime=1 
[junit4:junit4]   2> 15464 T2443 C173 P43872 /update {wt=javabin&version=2} {add=[111 (1413392748027838464)]} 0 5
[junit4:junit4]   2> 15468 T2423 C176 P43864 /update {wt=javabin&version=2} {add=[112 (1413392748036227072)]} 0 1
[junit4:junit4]   2> 15477 T2475 C174 P43899 REQ /update {update.distrib=FROMLEADER&distrib.from=http://127.0.0.1:43885/solr/collection1/&wt=javabin&version=2} status=0 QTime=1 
[junit4:junit4]   2> 15478 T2450 C175 P43885 REQ /update {distrib.from=http://127.0.0.1:43872/solr/collection1/&update.distrib=TOLEADER&wt=javabin&version=2} status=0 QTime=5 
[junit4:junit4]   2> 15478 T2443 C173 P43872 /update {wt=javabin&version=2} {add=[112]} 0 7
[junit4:junit4]   2> 15493 T2423 C176 P43864 /update {wt=javabin&version=2} {add=[113 (1413392748050907136)]} 0 12
[junit4:junit4]   2> 15501 T2461 C172 P43889 REQ /update {distrib.from=http://127.0.0.1:43872/solr/collection1/&update.distrib=FROMLEADER&wt=javabin&version=2} status=0 QTime=1 
[junit4:junit4]   2> 15502 T2443 C173 P43872 /update {wt=javabin&version=2} {add=[113 (1413392748066635776)]} 0 6
[junit4:junit4]   2> 15507 T2423 C176 P43864 /update {wt=javabin&version=2} {add=[114 (1413392748076072960)]} 0 2
[junit4:junit4]   2> 15514 T2461 C172 P43889 REQ /update {distrib.from=http://127.0.0.1:43872/solr/collection1/&update.distrib=FROMLEADER&wt=javabin&version=2} status=0 QTime=1 
[junit4:junit4]   2> 15515 T2443 C173 P43872 /update {wt=javabin&version=2} {add=[114 (1413392748081315840)]} 0 5
[junit4:junit4]   2> 15518 T2423 C176 P43864 /update {wt=javabin&version=2} {add=[115 (1413392748088655872)]} 0 1
[junit4:junit4]   2> 15527 T2475 C174 P43899 REQ /update {update.distrib=FROMLEADER&distrib.from=http://127.0.0.1:43885/solr/collection1/&wt=javabin&version=2} status=0 QTime=1 
[junit4:junit4]   2> 15528 T2450 C175 P43885 REQ /update {distrib.from=http://127.0.0.1:43872/solr/collection1/&update.distrib=TOLEADER&wt=javabin&version=2} status=0 QTime=5 
[junit4:junit4]   2> 15528 T2443 C173 P43872 /update {wt=javabin&version=2} {add=[115]} 0 7
[junit4:junit4]   2> 15532 T2423 C176 P43864 /update {wt=javabin&version=2} {add=[116 (1413392748103335936)]} 0 1
[junit4:junit4]   2> 15541 T2475 C174 P43899 REQ /update {update.distrib=FROMLEADER&distrib.from=http://127.0.0.1:43885/solr/collection1/&wt=javabin&version=2} status=0 QTime=1 
[junit4:junit4]   2> 15541 T2450 C175 P43885 REQ /update {distrib.from=http://127.0.0.1:43872/solr/collection1/&update.distrib=TOLEADER&wt=javabin&version=2} status=0 QTime=4 
[junit4:junit4]   2> 15542 T2443 C173 P43872 /update {wt=javabin&version=2} {add=[116]} 0 7
[junit4:junit4]   2> 15545 T2423 C176 P43864 /update {wt=javabin&version=2} {add=[117 (1413392748116967424)]} 0 1
[junit4:junit4]   2> 15554 T2475 C174 P43899 REQ /update {update.distrib=FROMLEADER&distrib.from=http://127.0.0.1:43885/solr/collection1/&wt=javabin&version=2} status=0 QTime=1 
[junit4:junit4]   2> 15555 T2450 C175 P43885 REQ /update {distrib.from=http://127.0.0.1:43872/solr/collection1/&update.distrib=TOLEADER&wt=javabin&version=2} status=0 QTime=5 
[junit4:junit4]   2> 15555 T2443 C173 P43872 /update {wt=javabin&version=2} {add=[117]} 0 7
[junit4:junit4]   2> 15559 T2423 C176 P43864 /update {wt=javabin&version=2} {add=[118 (1413392748131647488)]} 0 1
[junit4:junit4]   2> 15583 T2461 C172 P43889 REQ /update {update.distrib=FROMLEADER&distrib.from=http://127.0.0.1:43872/solr/collection1/&wt=javabin&version=2} status=0 QTime=10 
[junit4:junit4]   2> 15584 T2439 C173 P43872 REQ /update {distrib.from=http://127.0.0.1:43885/solr/collection1/&update.distrib=TOLEADER&wt=javabin&version=2} status=0 QTime=20 
[junit4:junit4]   2> 15585 T2451 C175 P43885 /update {wt=javabin&version=2} {add=[118]} 0 23
[junit4:junit4]   2> 15589 T2423 C176 P43864 /update {wt=javabin&version=2} {add=[119 (1413392748163104768)]} 0 1
[junit4:junit4]   2> 15595 T2475 C174 P43899 REQ /update {distrib.from=http://127.0.0.1:43885/solr/collection1/&update.distrib=FROMLEADER&wt=javabin&version=2} status=0 QTime=1 
[junit4:junit4]   2> 15596 T2451 C175 P43885 /update {wt=javabin&version=2} {add=[119 (1413392748166250496)]} 0 5
[junit4:junit4]   2> 15599 T2423 C176 P43864 /update {wt=javabin&version=2} {add=[120 (1413392748173590528)]} 0 1
[junit4:junit4]   2> 15607 T2475 C174 P43899 REQ /update {update.distrib=FROMLEADER&distrib.from=http://127.0.0.1:43885/solr/collection1/&wt=javabin&version=2} status=0 QTime=1 
[junit4:junit4]   2> 15607 T2450 C175 P43885 REQ /update {distrib.from=http://127.0.0.1:43872/solr/collection1/&update.distrib=TOLEADER&wt=javabin&version=2} status=0 QTime=4 
[junit4:junit4]   2> 15611 T2443 C173 P43872 /update {wt=javabin&version=2} {add=[120]} 0 10
[junit4:junit4]   2> 15615 T2423 C176 P43864 /update {wt=javabin&version=2} {add=[121 (1413392748191416320)]} 0 1
[junit4:junit4]   2> 15622 T2475 C174 P43899 REQ /update {distrib.from=http://127.0.0.1:43885/solr/collection1/&update.distrib=FROMLEADER&wt=javabin&version=2} status=0 QTime=1 
[junit4:junit4]   2> 15623 T2451 C175 P43885 /update {wt=javabin&version=2} {add=[121 (1413392748194562048)]} 0 5
[junit4:junit4]   2> 15627 T2423 C176 P43864 /update {wt=javabin&version=2} {add=[122 (1413392748202950656)]} 0 1
[junit4:junit4]   2> 15638 T2461 C172 P43889 REQ /update {update.distrib=FROMLEADER&distrib.from=http://127.0.0.1:43872/solr/collection1/&wt=javabin&version=2} status=0 QTime=2 
[junit4:junit4]   2> 15639 T2439 C173 P43872 REQ /update {distrib.from=http://127.0.0.1:43885/solr/collection1/&update.distrib=TOLEADER&wt=javabin&version=2} status=0 QTime=7 
[junit4:junit4]   2> 15639 T2451 C175 P43885 /update {wt=javabin&version=2} {add=[122]} 0 9
[junit4:junit4]   2> 15653 T2423 C176 P43864 /update {wt=javabin&version=2} {add=[123 (1413392748219727872)]} 0 11
[junit4:junit4]   2> 15664 T2461 C172 P43889 REQ /update {update.distrib=FROMLEADER&distrib.from=http://127.0.0.1:43872/solr/collection1/&wt=javabin&version=2} status=0 QTime=1 
[junit4:junit4]   2> 15665 T2439 C173 P43872 REQ /update {distrib.from=http://127.0.0.1:43885/solr/collection1/&update.distrib=TOLEADER&wt=javabin&version=2} status=0 QTime=6 
[junit4:junit4]   2> 15665 T2451 C175 P43885 /update {wt=javabin&version=2} {add=[123]} 0 9
[junit4:junit4]   2> 15670 T2423 C176 P43864 /update {wt=javabin&version=2} {add=[124 (1413392748246990848)]} 0 2
[junit4:junit4]   2> 15678 T2461 C172 P43889 REQ /update {update.distrib=FROMLEADER&distrib.from=http://127.0.0.1:43872/solr/collection1/&wt=javabin&version=2} status=0 QTime=1 
[junit4:junit4]   2> 15679 T2439 C173 P43872 REQ /update {distrib.from=http://127.0.0.1:43885/solr/collection1/&update.distrib=TOLEADER&wt=javabin&version=2} status=0 QTime=5 
[junit4:junit4]   2> 15679 T2451 C175 P43885 /update {wt=javabin&version=2} {add=[124]} 0 6
[junit4:junit4]   2> 15683 T2423 C176 P43864 /update {wt=javabin&version=2} {add=[125 (1413392748261670912)]} 0 1
[junit4:junit4]   2> 15692 T2461 C172 P43889 REQ /update {update.distrib=FROMLEADER&distrib.from=http://127.0.0.1:43872/solr/collection1/&wt=javabin&version=2} status=0 QTime=1 
[junit4:junit4]   2> 15693 T2439 C173 P43872 REQ /update {distrib.from=http://127.0.0.1:43885/solr/collection1/&update.distrib=TOLEADER&wt=javabin&version=2} status=0 QTime=5 
[junit4:junit4]   2> 15694 T2451 C175 P43885 /update {wt=javabin&version=2} {add=[125]} 0 8
[junit4:junit4]   2> 15696 T2423 C176 P43864 /update {wt=javabin&version=2} {add=[126 (1413392748275302400)]} 0 1
[junit4:junit4]   2> 15704 T2475 C174 P43899 REQ /update {update.distrib=FROMLEADER&distrib.from=http://127.0.0.1:43885/solr/collection1/&wt=javabin&version=2} status=0 QTime=1 
[junit4:junit4]   2> 15704 T2450 C175 P43885 REQ /update {distrib.from=http://127.0.0.1:43872/solr/collection1/&update.distrib=TOLEADER&wt=javabin&version=2} status=0 QTime=4 
[junit4:junit4]   2> 15705 T2443 C173 P43872 /update {wt=javabin&version=2} {add=[126]} 0 7
[junit4:junit4]   2> 15709 T2423 C176 P43864 /update {wt=javabin&version=2} {add=[127 (1413392748288933888)]} 0 1
[junit4:junit4]   2> 15733 T2475 C174 P43899 REQ /update {distrib.from=http://127.0.0.1:43885/solr/collection1/&update.distrib=FROMLEADER&wt=javabin&version=2} status=0 QTime=8 
[junit4:junit4]   2> 15734 T2451 C175 P43885 /update {wt=javabin&version=2} {add=[127 (1413392748292079616)]} 0 23
[junit4:junit4]   2> 15739 T2423 C176 P43864 /update {wt=javabin&version=2} {add=[128 (1413392748319342592)]} 0 2
[junit4:junit4]   2> 15751 T2475 C174 P43899 REQ /update {update.distrib=FROMLEADER&distrib.from=http://127.0.0.1:43885/solr/collection1/&wt=javabin&version=2} status=0 QTime=2 
[junit4:junit4]   2> 15752 T2450 C175 P43885 REQ /update {distrib.from=http://127.0.0.1:43872/solr/collection1/&update.distrib=TOLEADER&wt=javabin&version=2} status=0 QTime=7 
[junit4:junit4]   2> 15753 T2443 C173 P43872 /update {wt=javabin&version=2} {add=[128]} 0 11
[junit4:junit4]   2> 15757 T2423 C176 P43864 /update {wt=javabin&version=2} {add=[129 (1413392748339265536)]} 0 1
[junit4:junit4]   2> 15764 T2461 C172 P43889 REQ /update {distrib.from=http://127.0.0.1:43872/solr/collection1/&update.distrib=FROMLEADER&wt=javabin&version=2} status=0 QTime=1 
[junit4:junit4]   2> 15765 T2443 C173 P43872 /update {wt=javabin&version=2} {add=[129 (1413392748343459840)]} 0 5
[junit4:junit4]   2> 15769 T2423 C176 P43864 /update {wt=javabin&version=2} {add=[130 (1413392748351848448)]} 0 1
[junit4:junit4]   2> 15776 T2475 C174 P43899 REQ /update {distrib.from=http://127.0.0.1:43885/solr/collection1/&update.distrib=FROMLEADER&wt=javabin&version=2} status=0 QTime=1 
[junit4:junit4]   2> 15777 T2451 C175 P43885 /update {wt=javabin&version=2} {add=[130 (1413392748356042752)]} 0 5
[junit4:junit4]   2> 15781 T2423 C176 P43864 /update {wt=javabin&version=2} {add=[131 (1413392748364431360)]} 0 1
[junit4:junit4]   2> 15790 T2475 C174 P43899 REQ /update {update.distrib=FROMLEADER&distrib.from=http://127.0.0.1:43885/solr/collection1/&wt=javabin&version=2} status=0 QTime=1 
[junit4:junit4]   2> 15791 T2450 C175 P43885 REQ /update {distrib.from=http://127.0.0.1:43872/solr/collection1/&update.distrib=TOLEADER&wt=javabin&version=2} status=0 QTime=5 
[junit4:junit4]   2> 15792 T2443 C173 P43872 /update {wt=javabin&version=2} {add=[131]} 0 8
[junit4:junit4]   2> 15796 T2423 C176 P43864 /update {wt=javabin&version=2} {add=[132 (1413392748380160000)]} 0 1
[junit4:junit4]   2> 15803 T2461 C172 P43889 REQ /update {distrib.from=http://127.0.0.1:43872/solr/collection1/&update.distrib=FROMLEADER&wt=javabin&version=2} status=0 QTime=1 
[junit4:junit4]   2> 15804 T2443 C173 P43872 /update {wt=javabin&version=2} {add=[132 (1413392748384354304)]} 0 5
[junit4:junit4]   2> 15824 T2423 C176 P43864 /update {wt=javabin&version=2} {add=[133 (1413392748392742912)]} 0 17
[junit4:junit4]   2> 15834 T2461 C172 P43889 REQ /update {update.distrib=FROMLEADER&distrib.from=http://127.0.0.1:43872/solr/collection1/&wt=javabin&version=2} status=0 QTime=1 
[junit4:junit4]   2> 15835 T2439 C173 P43872 REQ /update {distrib.from=http://127.0.0.1:43885/solr/collection1/&update.distrib=TOLEADER&wt=javabin&version=2} status=0 QTime=5 
[junit4:junit4]   2> 15835 T2451 C175 P43885 /update {wt=javabin&version=2} {add=[133]} 0 8
[junit4:junit4]   2> 15841 T2423 C176 P43864 /update {wt=javabin&version=2} {add=[134 (1413392748425248768)]} 0 3
[junit4:junit4]   2> 15849 T2475 C174 P43899 REQ /update {distrib.from=http://127.0.0.1:43885/solr/collection1/&update.distrib=FROMLEADER&wt=javabin&version=2} status=0 QTime=1 
[junit4:junit4]   2> 15849 T2451 C175 P43885 /update {wt=javabin&version=2} {add=[134 (1413392748431540224)]} 0 5
[junit4:junit4]   2> 15853 T2423 C176 P43864 /update {wt=javabin&version=2} {add=[135 (1413392748439928832)]} 0 1
[junit4:junit4]   2> 15860 T2461 C172 P43889 REQ /update {distrib.from=http://127.0.0.1:43872/solr/collection1/&update.distrib=FROMLEADER&wt=javabin&version=2} status=0 QTime=1 
[junit4:junit4]   2> 15860 T2443 C173 P43872 /update {wt=javabin&version=2} {add=[135 (1413392748444123136)]} 0 4
[junit4:junit4]   2> 15864 T2423 C176 P43864 /update {wt=javabin&version=2} {add=[136 (1413392748451463168)]} 0 1
[junit4:junit4]   2> 15871 T2475 C174 P43899 REQ /update {distrib.from=http://127.0.0.1:43885/solr/collection1/&update.distrib=FROMLEADER&wt=javabin&version=2} status=0 QTime=1 
[junit4:junit4]   2> 15872 T2451 C175 P43885 /update {wt=javabin&version=2} {add=[136 (1413392748455657472)]} 0 5
[junit4:junit4]   2> 15876 T2423 C176 P43864 /update {wt=javabin&version=2} {add=[137 (1413392748464046080)]} 0 1
[junit4:junit4]   2> 15885 T2475 C174 P43899 REQ /update {update.distrib=FROMLEADER&distrib.from=http://127.0.0.1:43885/solr/collection1/&wt=javabin&version=2} status=0 QTime=1 
[junit4:junit4]   2> 15886 T2450 C175 P43885 REQ /update {distrib.from=http://127.0.0.1:43872/solr/collection1/&update.distrib=TOLEADER&wt=javabin&version=2} status=0 QTime=5 
[junit4:junit4]   2> 15887 T2443 C173 P43872 /update {wt=javabin&version=2} {add=[137]} 0 8
[junit4:junit4]   2> 15892 T2423 C176 P43864 /update {wt=javabin&version=2} {add=[138 (1413392748479774720)]} 0 2
[junit4:junit4]   2> 15899 T2461 C172 P43889 REQ /update {update.distrib=FROMLEADER&distrib.from=http://127.0.0.1:43872/solr/collection1/&wt=javabin&version=2} status=0 QTime=1 
[junit4:junit4]   2> 15900 T2439 C173 P43872 REQ /update {distrib.from=http://127.0.0.1:43885/solr/collection1/&update.distrib=TOLEADER&wt=javabin&version=2} status=0 QTime=5 
[junit4:junit4]   2> 15900 T2451 C175 P43885 /update {wt=javabin&version=2} {add=[138]} 0 7
[junit4:junit4]   2> 15904 T2423 C176 P43864 /update {wt=javabin&version=2} {add=[139 (1413392748493406208)]} 0 1
[junit4:junit4]   2> 15911 T2475 C174 P43899 REQ /update {distrib.from=http://127.0.0.1:43885/solr/collection1/&update.distrib=FROMLEADER&wt=javabin&version=2} status=0 QTime=1 
[junit4:junit4]   2> 15912 T2451 C175 P43885 /update {wt=javabin&version=2} {add=[139 (1413392748497600512)]} 0 5
[junit4:junit4]   2> 15915 T2423 C176 P43864 /update {wt=javabin&version=2} {add=[140 (1413392748504940544)]} 0 1
[junit4:junit4]   2> 15921 T2475 C174 P43899 REQ /update {distrib.from=http://127.0.0.1:43885/solr/collection1/&update.distrib=FROMLEADER&wt=javabin&version=2} status=0 QTime=1 
[junit4:junit4]   2> 15921 T2451 C175 P43885 /update {wt=javabin&version=2} {add=[140 (1413392748508086272)]} 0 4
[junit4:junit4]   2> 15925 T2423 C176 P43864 /update {wt=javabin&version=2} {add=[141 (1413392748515426304)]} 0 1
[junit4:junit4]   2> 15931 T2475 C174 P43899 REQ /update {distrib.from=http://127.0.0.1:43885/solr/collection1/&update.distrib=FROMLEADER&wt=javabin&version=2} status=0 QTime=1 
[junit4:junit4]   2> 15931 T2451 C175 P43885 /update {wt=javabin&version=2} {add=[141 (1413392748518572032)]} 0 4
[junit4:junit4]   2> 15935 T2423 C176 P43864 /update {wt=javabin&version=2} {add=[142 (1413392748525912064)]} 0 1
[junit4:junit4]   2> 15961 T2475 C174 P43899 REQ /update {update.distrib=FROMLEADER&distrib.from=http://127.0.0.1:43885/solr/collection1/&wt=javabin&version=2} status=0 QTime=10 
[junit4:junit4]   2> 15962 T2450 C175 P43885 REQ /update {distrib.from=http://127.0.0.1:43872/solr/collection1/&update.distrib=TOLEADER&wt=javabin&version=2} status=0 QTime=23 
[junit4:junit4]   2> 15963 T2443 C173 P43872 /update {wt=javabin&version=2} {add=[142]} 0 26
[junit4:junit4]   2> 15976 T2423 C176 P43864 /update {wt=javabin&version=2} {add=[143 (1413392748558417920)]} 0 11
[junit4:junit4]   2> 15987 T2475 C174 P43899 REQ /update {update.distrib=FROMLEADER&distrib.from=http://127.0.0.1:43885/solr/collection1/&wt=javabin&version=2} status=0 QTime=2 
[junit4:junit4]   2> 15987 T2450 C175 P43885 REQ /update {distrib.from=http://127.0.0.1:43872/solr/collection1/&update.distrib=TOLEADER&wt=javabin&version=2} status=0 QTime=6 
[junit4:junit4]   2> 15988 T2443 C173 P43872 /update {wt=javabin&version=2} {add=[143]} 0 9
[junit4:junit4]   2> 15993 T2423 C176 P43864 /update {wt=javabin&version=2} {add=[144 (1413392748585680896)]} 0 2
[junit4:junit4]   2> 16001 T2475 C174 P43899 REQ /update {update.distrib=FROMLEADER&distrib.from=http://127.0.0.1:43885/solr/collection1/&wt=javabin&version=2} status=0 QTime=1 
[junit4:junit4]   2> 16001 T2450 C175 P43885 REQ /update {distrib.from=http://127.0.0.1:43872/solr/collection1/&update.distrib=TOLEADER&wt=javabin&version=2} status=0 QTime=4 
[junit4:junit4]   2> 16002 T2443 C173 P43872 /update {wt=javabin&version=2} {add=[144]} 0 7
[junit4:junit4]   2> 16006 T2423 C176 P43864 /update {wt=javabin&version=2} {add=[145 (1413392748600360960)]} 0 1
[junit4:junit4]   2> 16014 T2475 C174 P43899 REQ /update {update.distrib=FROMLEADER&distrib.from=http://127.0.0.1:43885/solr/collection1/&wt=javabin&version=2} status=0 QTime=1 
[junit4:junit4]   2> 16014 T2450 C175 P43885 REQ /update {distrib.from=http://127.0.0.1:43872/solr/collection1/&update.distrib=TOLEADER&wt=javabin&version=2} status=0 QTime=4 
[junit4:junit4]   2> 16015 T2443 C173 P43872 /update {wt=javabin&version=2} {add=[145]} 0 7
[junit4:junit4]   2> 16019 T2423 C176 P43864 /update {wt=javabin&version=2} {add=[146 (1413392748613992448)]} 0 1
[junit4:junit4]   2> 16045 T2461 C172 P43889 REQ /update {update.distrib=FROMLEADER&distrib.from=http://127.0.0.1:43872/solr/collection1/&wt=javabin&version=2} status=0 QTime=7 
[junit4:junit4]   2> 16046 T2439 C173 P43872 REQ /update {distrib.from=http://127.0.0.1:43885/solr/collection1/&update.distrib=TOLEADER&wt=javabin&version=2} status=0 QTime=21 
[junit4:junit4]   2> 16047 T2451 C175 P43885 /update {wt=javabin&version=2} {add=[146]} 0 25
[junit4:junit4]   2> 16050 T2423 C176 P43864 /update {wt=javabin&version=2} {add=[147 (1413392748645449728)]} 0 2
[junit4:junit4]   2> 16058 T2475 C174 P43899 REQ /update {update.distrib=FROMLEADER&distrib.from=http://127.0.0.1:43885/solr/collection1/&wt=javabin&version=2} status=0 QTime=1 
[junit4:junit4]   2> 16059 T2450 C175 P43885 REQ /update {distrib.from=http://127.0.0.1:43872/solr/collection1/&update.distrib=TOLEADER&wt=javabin&version=2} status=0 QTime=5 
[junit4:junit4]   2> 16060 T2443 C173 P43872 /update {wt=javabin&version=2} {add=[147]} 0 8
[junit4:junit4]   2> 16063 T2423 C176 P43864 /update {wt=javabin&version=2} {add=[148 (1413392748660129792)]} 0 1
[junit4:junit4]   2> 16073 T2461 C172 P43889 REQ /update {update.distrib=FROMLEADER&distrib.from=http://127.0.0.1:43872/solr/collection1/&wt=javabin&version=2} status=0 QTime=1 
[junit4:junit4]   2> 16074 T2439 C173 P43872 REQ /update {distrib.from=http://127.0.0.1:43885/solr/collection1/&update.distrib=TOLEADER&wt=javabin&version=2} status=0 QTime=6 
[junit4:junit4]   2> 16075 T2451 C175 P43885 /update {wt=javabin&version=2} {add=[148]} 0 9
[junit4:junit4]   2> 16078 T2423 C176 P43864 /update {wt=javabin&version=2} {add=[149 (1413392748675858432)]} 0 1
[junit4:junit4]   2> 16092 T2475 C174 P43899 REQ /update {update.distrib=FROMLEADER&distrib.from=http://127.0.0.1:43885/solr/collection1/&wt=javabin&version=2} status=0 QTime=1 
[junit4:junit4]   2> 16092 T2450 C175 P43885 REQ /update {distrib.from=http://127.0.0.1:43872/solr/collection1/&update.distrib=TOLEADER&wt=javabin&version=2} status=0 QTime=4 
[junit4:junit4]   2> 16093 T2443 C173 P43872 /update {wt=javabin&version=2} {add=[149]} 0 12
[junit4:junit4]   2> 16094 T2411 oasc.AbstractDistribZkTestBase.waitForRecoveriesToFinish Wait for recoveries to finish - collection: collection1 failOnTimeout:true timeout (sec):1800
[junit4:junit4]   2> 16095 T2411 oascc.ZkStateReader.updateClusterState Updating cloud state from ZooKeeper... 
[junit4:junit4]   2> 16097 T2423 C176 P43864 oasu.DirectUpdateHandler2.commit start commit{flags=0,_version_=0,optimize=false,openSearcher=true,waitSearcher=true,expungeDeletes=false,softCommit=false}
[junit4:junit4]   2> 16678 T2423 C176 P43864 oasc.SolrDeletionPolicy.onCommit SolrDeletionPolicy.onCommit: commits:num=2
[junit4:junit4]   2> 		commit{dir=NRTCachingDirectory(org.apache.lucene.store.NIOFSDirectory@/usr/home/hudson/hudson-slave/workspace/Lucene-Solr-Tests-4.x-java7/solr/build/solr-core/test/J1/org.apache.solr.cloud.BasicDistributedZk2Test-1347916347334/control/data/index lockFactory=org.apache.lucene.store.NativeFSLockFactory@12e6df6a; maxCacheMB=48.0 maxMergeSizeMB=4.0),segFN=segments_2,generation=2,filenames=[_0_Block_0.tip, _0_Block_0.pos, _0.fnm, _0_Pulsing40_0.tim, _0_Block_0.doc, _0_Block_0.tim, _0_MockVariableIntBlock_0.doc, _0_nrm.cfs, _0_MockVariableIntBlock_0.skp, _0_Pulsing40_0.prx, _0_Pulsing40_0.frq, _0_MockVariableIntBlock_0.pyl, _0_MockVariableIntBlock_0.tib, _0_MockVariableIntBlock_0.frq, _0_SimpleText_0.pst, _0_nrm.cfe, _0_MockVariableIntBlock_0.pos, _0_Pulsing40_0.tip, segments_2, _0.fdx, _0.si, _0_MockVariableIntBlock_0.tii, _0.fdt]
[junit4:junit4]   2> 		commit{dir=NRTCachingDirectory(org.apache.lucene.store.NIOFSDirectory@/usr/home/hudson/hudson-slave/workspace/Lucene-Solr-Tests-4.x-java7/solr/build/solr-core/test/J1/org.apache.solr.cloud.BasicDistributedZk2Test-1347916347334/control/data/index lockFactory=org.apache.lucene.store.NativeFSLockFactory@12e6df6a; maxCacheMB=48.0 maxMergeSizeMB=4.0),segFN=segments_3,generation=3,filenames=[_5_nrm.cfe, _2_Block_0.pos, _2_SimpleText_0.pst, _3_MockVariableIntBlock_0.frq, _7.si, _3.fdt, _4_MockVariableIntBlock_0.tii, _0_Pulsing40_0.frq, _7.fnm, _6_Block_0.pos, _0_SimpleText_0.pst, _5_MockVariableIntBlock_0.tii, _5_Pulsing40_0.tip, _6_MockVariableIntBlock_0.tii, _5_Pulsing40_0.tim, _1_Block_0.pos, _1_Block_0.tip, _6_MockVariableIntBlock_0.tib, _0_Pulsing40_0.tim, _1_Block_0.tim, _1_MockVariableIntBlock_0.tii, _4_MockVariableIntBlock_0.doc, _2.fdt, _3_Pulsing40_0.tip, _7.fdx, _7_MockVariableIntBlock_0.fr

[...truncated too long message...]

ementAdapter.evaluate(StatementAdapter.java:36)
[junit4:junit4]    > 	at com.carrotsearch.randomizedtesting.ThreadLeakControl$StatementRunner.run(ThreadLeakControl.java:358)
[junit4:junit4]    > 	at com.carrotsearch.randomizedtesting.ThreadLeakControl.forkTimeoutingTask(ThreadLeakControl.java:782)
[junit4:junit4]    > 	at com.carrotsearch.randomizedtesting.ThreadLeakControl$3.evaluate(ThreadLeakControl.java:442)
[junit4:junit4]    > 	at com.carrotsearch.randomizedtesting.RandomizedRunner.runSingleTest(RandomizedRunner.java:746)
[junit4:junit4]    > 	at com.carrotsearch.randomizedtesting.RandomizedRunner$3.evaluate(RandomizedRunner.java:648)
[junit4:junit4]    > 	at com.carrotsearch.randomizedtesting.RandomizedRunner$4.evaluate(RandomizedRunner.java:682)
[junit4:junit4]    > 	at com.carrotsearch.randomizedtesting.RandomizedRunner$5.evaluate(RandomizedRunner.java:693)
[junit4:junit4]    > 	at com.carrotsearch.randomizedtesting.rules.StatementAdapter.evaluate(StatementAdapter.java:36)
[junit4:junit4]    > 	at com.carrotsearch.randomizedtesting.rules.SystemPropertiesRestoreRule$1.evaluate(SystemPropertiesRestoreRule.java:53)
[junit4:junit4]    > 	at org.apache.lucene.util.AbstractBeforeAfterRule$1.evaluate(AbstractBeforeAfterRule.java:45)
[junit4:junit4]    > 	at org.apache.lucene.util.TestRuleStoreClassName$1.evaluate(TestRuleStoreClassName.java:42)
[junit4:junit4]    > 	at com.carrotsearch.randomizedtesting.rules.SystemPropertiesInvariantRule$1.evaluate(SystemPropertiesInvariantRule.java:55)
[junit4:junit4]    > 	at com.carrotsearch.randomizedtesting.rules.NoShadowingOrOverridesOnMethodsRule$1.evaluate(NoShadowingOrOverridesOnMethodsRule.java:39)
[junit4:junit4]    > 	at com.carrotsearch.randomizedtesting.rules.NoShadowingOrOverridesOnMethodsRule$1.evaluate(NoShadowingOrOverridesOnMethodsRule.java:39)
[junit4:junit4]    > 	at com.carrotsearch.randomizedtesting.rules.StatementAdapter.evaluate(StatementAdapter.java:36)
[junit4:junit4]    > 	at org.apache.lucene.util.TestRuleAssertionsRequired$1.evaluate(TestRuleAssertionsRequired.java:43)
[junit4:junit4]    > 	at org.apache.lucene.util.TestRuleMarkFailure$1.evaluate(TestRuleMarkFailure.java:48)
[junit4:junit4]    > 	at org.apache.lucene.util.TestRuleIgnoreAfterMaxFailures$1.evaluate(TestRuleIgnoreAfterMaxFailures.java:70)
[junit4:junit4]    > 	at org.apache.lucene.util.TestRuleIgnoreTestSuites$1.evaluate(TestRuleIgnoreTestSuites.java:55)
[junit4:junit4]    > 	at com.carrotsearch.randomizedtesting.rules.StatementAdapter.evaluate(StatementAdapter.java:36)
[junit4:junit4]    > 	at com.carrotsearch.randomizedtesting.ThreadLeakControl$StatementRunner.run(ThreadLeakControl.java:358)
[junit4:junit4]    > 	at java.lang.Thread.run(Thread.java:722)
[junit4:junit4]    > Caused by: java.net.SocketTimeoutException: Read timed out
[junit4:junit4]    > 	at java.net.SocketInputStream.socketRead0(Native Method)
[junit4:junit4]    > 	at java.net.SocketInputStream.read(SocketInputStream.java:150)
[junit4:junit4]    > 	at java.net.SocketInputStream.read(SocketInputStream.java:121)
[junit4:junit4]    > 	at org.apache.http.impl.io.AbstractSessionInputBuffer.fillBuffer(AbstractSessionInputBuffer.java:149)
[junit4:junit4]    > 	at org.apache.http.impl.io.SocketInputBuffer.fillBuffer(SocketInputBuffer.java:111)
[junit4:junit4]    > 	at org.apache.http.impl.io.AbstractSessionInputBuffer.readLine(AbstractSessionInputBuffer.java:264)
[junit4:junit4]    > 	at org.apache.http.impl.conn.DefaultResponseParser.parseHead(DefaultResponseParser.java:98)
[junit4:junit4]    > 	at org.apache.http.impl.io.AbstractMessageParser.parse(AbstractMessageParser.java:252)
[junit4:junit4]    > 	at org.apache.http.impl.AbstractHttpClientConnection.receiveResponseHeader(AbstractHttpClientConnection.java:282)
[junit4:junit4]    > 	at org.apache.http.impl.conn.DefaultClientConnection.receiveResponseHeader(DefaultClientConnection.java:247)
[junit4:junit4]    > 	at org.apache.http.impl.conn.AbstractClientConnAdapter.receiveResponseHeader(AbstractClientConnAdapter.java:216)
[junit4:junit4]    > 	at org.apache.http.protocol.HttpRequestExecutor.doReceiveResponse(HttpRequestExecutor.java:298)
[junit4:junit4]    > 	at org.apache.http.protocol.HttpRequestExecutor.execute(HttpRequestExecutor.java:125)
[junit4:junit4]    > 	at org.apache.http.impl.client.DefaultRequestDirector.tryExecute(DefaultRequestDirector.java:647)
[junit4:junit4]    > 	at org.apache.http.impl.client.DefaultRequestDirector.execute(DefaultRequestDirector.java:464)
[junit4:junit4]    > 	at org.apache.http.impl.client.AbstractHttpClient.execute(AbstractHttpClient.java:820)
[junit4:junit4]    > 	at org.apache.http.impl.client.AbstractHttpClient.execute(AbstractHttpClient.java:754)
[junit4:junit4]    > 	at org.apache.http.impl.client.AbstractHttpClient.execute(AbstractHttpClient.java:732)
[junit4:junit4]    > 	at org.apache.solr.client.solrj.impl.HttpSolrServer.request(HttpSolrServer.java:353)
[junit4:junit4]    > 	... 46 more
[junit4:junit4]   2> 86705 T2411 oas.SolrTestCaseJ4.deleteCore ###deleteCore
[junit4:junit4]   2> NOTE: test params are: codec=Lucene40: {n_f1=MockVariableIntBlock(baseBlockSize=111), foo_b=Block(blocksize=128), foo_d=Pulsing40(freqCutoff=19 minBlockSize=54 maxBlockSize=205), foo_f=Block(blocksize=128), n_tl1=MockVariableIntBlock(baseBlockSize=111), n_d1=PostingsFormat(name=SimpleText), rnd_b=Pulsing40(freqCutoff=19 minBlockSize=54 maxBlockSize=205), intDefault=PostingsFormat(name=SimpleText), n_td1=MockVariableIntBlock(baseBlockSize=111), timestamp=PostingsFormat(name=SimpleText), id=Pulsing40(freqCutoff=19 minBlockSize=54 maxBlockSize=205), range_facet_sl=Block(blocksize=128), range_facet_si=MockVariableIntBlock(baseBlockSize=111), oddField_s=Block(blocksize=128), multiDefault=MockVariableIntBlock(baseBlockSize=111), n_tf1=PostingsFormat(name=SimpleText), n_dt1=MockVariableIntBlock(baseBlockSize=111), n_ti1=Pulsing40(freqCutoff=19 minBlockSize=54 maxBlockSize=205), range_facet_l=PostingsFormat(name=SimpleText), text=Block(blocksize=128), _version_=PostingsFormat(name=SimpleText), SubjectTerms_mfacet=PostingsFormat(name=SimpleText), a_t=PostingsFormat(name=SimpleText), n_tdt1=PostingsFormat(name=SimpleText), other_tl1=PostingsFormat(name=SimpleText), n_l1=PostingsFormat(name=SimpleText), a_si=MockVariableIntBlock(baseBlockSize=111)}, sim=DefaultSimilarity, locale=bg_BG, timezone=Asia/Ashgabat
[junit4:junit4]   2> NOTE: FreeBSD 9.0-RELEASE amd64/Oracle Corporation 1.7.0_06 (64-bit)/cpus=16,threads=3,free=226432752,total=382730240
[junit4:junit4]   2> NOTE: All tests run in this JVM: [ScriptEngineTest, TestDocumentBuilder, TestReversedWildcardFilterFactory, TestDFRSimilarityFactory, TestHashPartitioner, IndexReaderFactoryTest, TestOmitPositions, ShowFileRequestHandlerTest, IndexSchemaTest, SuggesterTSTTest, TestDistributedGrouping, TestReplicationHandler, TestFoldingMultitermQuery, PrimitiveFieldTypeTest, OutputWriterTest, TestLRUCache, TestUpdate, FieldMutatingUpdateProcessorTest, LukeRequestHandlerTest, DebugComponentTest, TestArbitraryIndexDir, TestQueryUtils, RAMDirectoryFactoryTest, UUIDFieldTest, StatelessScriptUpdateProcessorFactoryTest, SuggesterTest, OverseerTest, QueryParsingTest, RequiredFieldsTest, TestSolrDeletionPolicy1, ZkNodePropsTest, DirectUpdateHandlerTest, PingRequestHandlerTest, TestReload, PrimUtilsTest, TestBinaryField, BasicZkTest, TestCSVLoader, TestRecovery, TestRTGBase, TestDistributedSearch, TestStressLucene, TestTrie, DisMaxRequestHandlerTest, ClusterStateUpdateTest, BadIndexSchemaTest, TestWriterPerf, TestMergePolicyConfig, SyncSliceTest, TestFunctionQuery, ReturnFieldsTest, DocumentBuilderTest, StatsComponentTest, TestBM25SimilarityFactory, RecoveryZkTest, SpellCheckComponentTest, LeaderElectionIntegrationTest, LeaderElectionTest, TestRealTimeGet, ZkControllerTest, SoftAutoCommitTest, AutoCommitTest, ZkSolrClientTest, WordBreakSolrSpellCheckerTest, DistributedTermsComponentTest, SolrCoreTest, TestMultiCoreConfBootstrap, TestSort, DirectSolrSpellCheckerTest, TestFiltering, PeerSyncTest, SignatureUpdateProcessorFactoryTest, TestJmxIntegration, TestIndexSearcher, SolrRequestParserTest, PolyFieldTest, MoreLikeThisHandlerTest, DistributedQueryElevationComponentTest, BinaryUpdateRequestHandlerTest, SolrInfoMBeanTest, StandardRequestHandlerTest, XmlUpdateRequestHandlerTest, TermVectorComponentTest, TestSurroundQueryParser, IndexSchemaRuntimeFieldTest, SolrPluginUtilsTest, FastVectorHighlighterTest, SolrCmdDistributorTest, TestPropInject, AlternateDirectoryTest, TestSolrDeletionPolicy2, TestDocSet, TestQuerySenderListener, NumericFieldsTest, MultiTermTest, SpellPossibilityIteratorTest, TestLMDirichletSimilarityFactory, TestPluginEnable, TestLMJelinekMercerSimilarityFactory, TestDefaultSimilarityFactory, URLClassifyProcessorTest, TestSystemIdResolver, SpellingQueryConverterTest, DOMUtilTest, TestUtils, PathHierarchyTokenizerFactoryTest, TestCharFilters, BasicDistributedZk2Test]
[junit4:junit4] Completed on J1 in 86.73s, 1 test, 1 error <<< FAILURES!

[...truncated 5 lines...]
BUILD FAILED
/usr/home/hudson/hudson-slave/workspace/Lucene-Solr-Tests-4.x-java7/build.xml:32: The following error occurred while executing this line:
/usr/home/hudson/hudson-slave/workspace/Lucene-Solr-Tests-4.x-java7/solr/build.xml:146: The following error occurred while executing this line:
/usr/home/hudson/hudson-slave/workspace/Lucene-Solr-Tests-4.x-java7/lucene/module-build.xml:63: The following error occurred while executing this line:
/usr/home/hudson/hudson-slave/workspace/Lucene-Solr-Tests-4.x-java7/lucene/common-build.xml:1133: The following error occurred while executing this line:
/usr/home/hudson/hudson-slave/workspace/Lucene-Solr-Tests-4.x-java7/lucene/common-build.xml:810: There were test failures: 230 suites, 951 tests, 1 error, 8 ignored (2 assumptions)

Total time: 32 minutes 15 seconds
Build step 'Invoke Ant' marked build as failure
Recording test results
Email was triggered for: Failure
Sending email for trigger: Failure



Mime
View raw message