lucene-dev mailing list archives

Site index · List index
Message view « Date » · « Thread »
Top « Date » · « Thread »
From Apache Jenkins Server <jenk...@builds.apache.org>
Subject [JENKINS] Lucene-Solr-NightlyTests-4.x - Build # 37 - Still Failing
Date Mon, 17 Sep 2012 17:08:10 GMT
Build: https://builds.apache.org/job/Lucene-Solr-NightlyTests-4.x/37/

2 tests failed.
REGRESSION:  org.apache.solr.cloud.SyncSliceTest.testDistribSearch

Error Message:
There are still nodes recoverying

Stack Trace:
java.lang.AssertionError: There are still nodes recoverying
	at __randomizedtesting.SeedInfo.seed([5638A91D867C79B6:D7DE2705F123198A]:0)
	at org.junit.Assert.fail(Assert.java:93)
	at org.apache.solr.cloud.AbstractDistribZkTestBase.waitForRecoveriesToFinish(AbstractDistribZkTestBase.java:154)
	at org.apache.solr.cloud.AbstractFullDistribZkTestBase.waitForRecoveriesToFinish(AbstractFullDistribZkTestBase.java:560)
	at org.apache.solr.cloud.AbstractFullDistribZkTestBase.waitForThingsToLevelOut(AbstractFullDistribZkTestBase.java:1135)
	at org.apache.solr.cloud.SyncSliceTest.doTest(SyncSliceTest.java:162)
	at org.apache.solr.BaseDistributedSearchTestCase.testDistribSearch(BaseDistributedSearchTestCase.java:695)
	at sun.reflect.NativeMethodAccessorImpl.invoke0(Native Method)
	at sun.reflect.NativeMethodAccessorImpl.invoke(NativeMethodAccessorImpl.java:57)
	at sun.reflect.DelegatingMethodAccessorImpl.invoke(DelegatingMethodAccessorImpl.java:43)
	at java.lang.reflect.Method.invoke(Method.java:616)
	at com.carrotsearch.randomizedtesting.RandomizedRunner.invoke(RandomizedRunner.java:1559)
	at com.carrotsearch.randomizedtesting.RandomizedRunner.access$600(RandomizedRunner.java:79)
	at com.carrotsearch.randomizedtesting.RandomizedRunner$6.evaluate(RandomizedRunner.java:737)
	at com.carrotsearch.randomizedtesting.RandomizedRunner$7.evaluate(RandomizedRunner.java:773)
	at com.carrotsearch.randomizedtesting.RandomizedRunner$8.evaluate(RandomizedRunner.java:787)
	at com.carrotsearch.randomizedtesting.rules.SystemPropertiesRestoreRule$1.evaluate(SystemPropertiesRestoreRule.java:53)
	at org.apache.lucene.util.TestRuleSetupTeardownChained$1.evaluate(TestRuleSetupTeardownChained.java:50)
	at org.apache.lucene.util.TestRuleFieldCacheSanity$1.evaluate(TestRuleFieldCacheSanity.java:51)
	at org.apache.lucene.util.AbstractBeforeAfterRule$1.evaluate(AbstractBeforeAfterRule.java:45)
	at com.carrotsearch.randomizedtesting.rules.SystemPropertiesInvariantRule$1.evaluate(SystemPropertiesInvariantRule.java:55)
	at org.apache.lucene.util.TestRuleThreadAndTestName$1.evaluate(TestRuleThreadAndTestName.java:48)
	at org.apache.lucene.util.TestRuleIgnoreAfterMaxFailures$1.evaluate(TestRuleIgnoreAfterMaxFailures.java:70)
	at org.apache.lucene.util.TestRuleMarkFailure$1.evaluate(TestRuleMarkFailure.java:48)
	at com.carrotsearch.randomizedtesting.rules.StatementAdapter.evaluate(StatementAdapter.java:36)
	at com.carrotsearch.randomizedtesting.ThreadLeakControl$StatementRunner.run(ThreadLeakControl.java:358)
	at com.carrotsearch.randomizedtesting.ThreadLeakControl.forkTimeoutingTask(ThreadLeakControl.java:782)
	at com.carrotsearch.randomizedtesting.ThreadLeakControl$3.evaluate(ThreadLeakControl.java:442)
	at com.carrotsearch.randomizedtesting.RandomizedRunner.runSingleTest(RandomizedRunner.java:746)
	at com.carrotsearch.randomizedtesting.RandomizedRunner$3.evaluate(RandomizedRunner.java:648)
	at com.carrotsearch.randomizedtesting.RandomizedRunner$4.evaluate(RandomizedRunner.java:682)
	at com.carrotsearch.randomizedtesting.RandomizedRunner$5.evaluate(RandomizedRunner.java:693)
	at com.carrotsearch.randomizedtesting.rules.StatementAdapter.evaluate(StatementAdapter.java:36)
	at com.carrotsearch.randomizedtesting.rules.SystemPropertiesRestoreRule$1.evaluate(SystemPropertiesRestoreRule.java:53)
	at org.apache.lucene.util.AbstractBeforeAfterRule$1.evaluate(AbstractBeforeAfterRule.java:45)
	at org.apache.lucene.util.TestRuleStoreClassName$1.evaluate(TestRuleStoreClassName.java:42)
	at com.carrotsearch.randomizedtesting.rules.SystemPropertiesInvariantRule$1.evaluate(SystemPropertiesInvariantRule.java:55)
	at com.carrotsearch.randomizedtesting.rules.NoShadowingOrOverridesOnMethodsRule$1.evaluate(NoShadowingOrOverridesOnMethodsRule.java:39)
	at com.carrotsearch.randomizedtesting.rules.NoShadowingOrOverridesOnMethodsRule$1.evaluate(NoShadowingOrOverridesOnMethodsRule.java:39)
	at com.carrotsearch.randomizedtesting.rules.StatementAdapter.evaluate(StatementAdapter.java:36)
	at org.apache.lucene.util.TestRuleAssertionsRequired$1.evaluate(TestRuleAssertionsRequired.java:43)
	at org.apache.lucene.util.TestRuleMarkFailure$1.evaluate(TestRuleMarkFailure.java:48)
	at org.apache.lucene.util.TestRuleIgnoreAfterMaxFailures$1.evaluate(TestRuleIgnoreAfterMaxFailures.java:70)
	at org.apache.lucene.util.TestRuleIgnoreTestSuites$1.evaluate(TestRuleIgnoreTestSuites.java:55)
	at com.carrotsearch.randomizedtesting.rules.StatementAdapter.evaluate(StatementAdapter.java:36)
	at com.carrotsearch.randomizedtesting.ThreadLeakControl$StatementRunner.run(ThreadLeakControl.java:358)
	at java.lang.Thread.run(Thread.java:679)


FAILED:  org.apache.solr.cloud.BasicDistributedZk2Test.testDistribSearch

Error Message:
Shard still reported as live in zk

Stack Trace:
java.lang.AssertionError: Shard still reported as live in zk
	at __randomizedtesting.SeedInfo.seed([5638A91D867C79B6:D7DE2705F123198A]:0)
	at org.junit.Assert.fail(Assert.java:93)
	at org.apache.solr.cloud.AbstractFullDistribZkTestBase.waitToSeeNotLive(AbstractFullDistribZkTestBase.java:1220)
	at org.apache.solr.cloud.BasicDistributedZk2Test.brindDownShardIndexSomeDocsAndRecover(BasicDistributedZk2Test.java:190)
	at org.apache.solr.cloud.BasicDistributedZk2Test.doTest(BasicDistributedZk2Test.java:83)
	at org.apache.solr.BaseDistributedSearchTestCase.testDistribSearch(BaseDistributedSearchTestCase.java:695)
	at sun.reflect.NativeMethodAccessorImpl.invoke0(Native Method)
	at sun.reflect.NativeMethodAccessorImpl.invoke(NativeMethodAccessorImpl.java:57)
	at sun.reflect.DelegatingMethodAccessorImpl.invoke(DelegatingMethodAccessorImpl.java:43)
	at java.lang.reflect.Method.invoke(Method.java:616)
	at com.carrotsearch.randomizedtesting.RandomizedRunner.invoke(RandomizedRunner.java:1559)
	at com.carrotsearch.randomizedtesting.RandomizedRunner.access$600(RandomizedRunner.java:79)
	at com.carrotsearch.randomizedtesting.RandomizedRunner$6.evaluate(RandomizedRunner.java:737)
	at com.carrotsearch.randomizedtesting.RandomizedRunner$7.evaluate(RandomizedRunner.java:773)
	at com.carrotsearch.randomizedtesting.RandomizedRunner$8.evaluate(RandomizedRunner.java:787)
	at com.carrotsearch.randomizedtesting.rules.SystemPropertiesRestoreRule$1.evaluate(SystemPropertiesRestoreRule.java:53)
	at org.apache.lucene.util.TestRuleSetupTeardownChained$1.evaluate(TestRuleSetupTeardownChained.java:50)
	at org.apache.lucene.util.TestRuleFieldCacheSanity$1.evaluate(TestRuleFieldCacheSanity.java:51)
	at org.apache.lucene.util.AbstractBeforeAfterRule$1.evaluate(AbstractBeforeAfterRule.java:45)
	at com.carrotsearch.randomizedtesting.rules.SystemPropertiesInvariantRule$1.evaluate(SystemPropertiesInvariantRule.java:55)
	at org.apache.lucene.util.TestRuleThreadAndTestName$1.evaluate(TestRuleThreadAndTestName.java:48)
	at org.apache.lucene.util.TestRuleIgnoreAfterMaxFailures$1.evaluate(TestRuleIgnoreAfterMaxFailures.java:70)
	at org.apache.lucene.util.TestRuleMarkFailure$1.evaluate(TestRuleMarkFailure.java:48)
	at com.carrotsearch.randomizedtesting.rules.StatementAdapter.evaluate(StatementAdapter.java:36)
	at com.carrotsearch.randomizedtesting.ThreadLeakControl$StatementRunner.run(ThreadLeakControl.java:358)
	at com.carrotsearch.randomizedtesting.ThreadLeakControl.forkTimeoutingTask(ThreadLeakControl.java:782)
	at com.carrotsearch.randomizedtesting.ThreadLeakControl$3.evaluate(ThreadLeakControl.java:442)
	at com.carrotsearch.randomizedtesting.RandomizedRunner.runSingleTest(RandomizedRunner.java:746)
	at com.carrotsearch.randomizedtesting.RandomizedRunner$3.evaluate(RandomizedRunner.java:648)
	at com.carrotsearch.randomizedtesting.RandomizedRunner$4.evaluate(RandomizedRunner.java:682)
	at com.carrotsearch.randomizedtesting.RandomizedRunner$5.evaluate(RandomizedRunner.java:693)
	at com.carrotsearch.randomizedtesting.rules.StatementAdapter.evaluate(StatementAdapter.java:36)
	at com.carrotsearch.randomizedtesting.rules.SystemPropertiesRestoreRule$1.evaluate(SystemPropertiesRestoreRule.java:53)
	at org.apache.lucene.util.AbstractBeforeAfterRule$1.evaluate(AbstractBeforeAfterRule.java:45)
	at org.apache.lucene.util.TestRuleStoreClassName$1.evaluate(TestRuleStoreClassName.java:42)
	at com.carrotsearch.randomizedtesting.rules.SystemPropertiesInvariantRule$1.evaluate(SystemPropertiesInvariantRule.java:55)
	at com.carrotsearch.randomizedtesting.rules.NoShadowingOrOverridesOnMethodsRule$1.evaluate(NoShadowingOrOverridesOnMethodsRule.java:39)
	at com.carrotsearch.randomizedtesting.rules.NoShadowingOrOverridesOnMethodsRule$1.evaluate(NoShadowingOrOverridesOnMethodsRule.java:39)
	at com.carrotsearch.randomizedtesting.rules.StatementAdapter.evaluate(StatementAdapter.java:36)
	at org.apache.lucene.util.TestRuleAssertionsRequired$1.evaluate(TestRuleAssertionsRequired.java:43)
	at org.apache.lucene.util.TestRuleMarkFailure$1.evaluate(TestRuleMarkFailure.java:48)
	at org.apache.lucene.util.TestRuleIgnoreAfterMaxFailures$1.evaluate(TestRuleIgnoreAfterMaxFailures.java:70)
	at org.apache.lucene.util.TestRuleIgnoreTestSuites$1.evaluate(TestRuleIgnoreTestSuites.java:55)
	at com.carrotsearch.randomizedtesting.rules.StatementAdapter.evaluate(StatementAdapter.java:36)
	at com.carrotsearch.randomizedtesting.ThreadLeakControl$StatementRunner.run(ThreadLeakControl.java:358)
	at java.lang.Thread.run(Thread.java:679)




Build Log:
[...truncated 7159 lines...]
[junit4:junit4] Suite: org.apache.solr.cloud.BasicDistributedZk2Test
[junit4:junit4]   2> 4 T1006 oas.SolrTestCaseJ4.setUp ###Starting testDistribSearch
[junit4:junit4]   2> Creating dataDir: /usr/home/hudson/hudson-slave/workspace/Lucene-Solr-NightlyTests-4.x/solr/build/solr-core/test/J1/./solrtest-BasicDistributedZk2Test-1347900624551
[junit4:junit4]   2> 5 T1006 oasc.ZkTestServer.run STARTING ZK TEST SERVER
[junit4:junit4]   2> 9 T1007 oazs.ZooKeeperServer.setTickTime tickTime set to 1000
[junit4:junit4]   2> 10 T1007 oazs.NIOServerCnxn$Factory.<init> binding to port 0.0.0.0/0.0.0.0:0
[junit4:junit4]   2> 10 T1007 oazsp.FileTxnSnapLog.save Snapshotting: 0
[junit4:junit4]   2> 107 T1006 oasc.ZkTestServer.run start zk server on port:43688
[junit4:junit4]   2> 107 T1006 oaz.ZooKeeper.<init> Initiating client connection, connectString=127.0.0.1:43688 sessionTimeout=10000 watcher=org.apache.solr.common.cloud.ConnectionManager@25d7b56e
[junit4:junit4]   2> 108 T1012 oaz.ClientCnxn$SendThread.startConnect Opening socket connection to server /127.0.0.1:43688
[junit4:junit4]   2> 108 T1006 oascc.ConnectionManager.waitForConnected Waiting for client to connect to ZooKeeper
[junit4:junit4]   2> 109 T1012 oaz.ClientCnxn$SendThread.primeConnection Socket connection established to localhost/127.0.0.1:43688, initiating session
[junit4:junit4]   2> 109 T1008 oazs.NIOServerCnxn$Factory.run Accepted socket connection from /140.211.11.196:13426
[junit4:junit4]   2> 110 T1008 oazs.NIOServerCnxn.readConnectRequest Client attempting to establish new session at /140.211.11.196:13426
[junit4:junit4]   2> 110 T1010 oazsp.FileTxnLog.append Creating new log file: log.1
[junit4:junit4]   2> 113 T1010 oazs.NIOServerCnxn.finishSessionInit Established session 0x139d5234ead0000 with negotiated timeout 10000 for client /140.211.11.196:13426
[junit4:junit4]   2> 113 T1012 oaz.ClientCnxn$SendThread.readConnectResult Session establishment complete on server localhost/127.0.0.1:43688, sessionid = 0x139d5234ead0000, negotiated timeout = 10000
[junit4:junit4]   2> 113 T1013 oascc.ConnectionManager.process Watcher org.apache.solr.common.cloud.ConnectionManager@25d7b56e name:ZooKeeperConnection Watcher:127.0.0.1:43688 got event WatchedEvent state:SyncConnected type:None path:null path:null type:None
[junit4:junit4]   2> 113 T1006 oascc.ConnectionManager.waitForConnected Client is connected to ZooKeeper
[junit4:junit4]   2> 114 T1006 oascc.SolrZkClient.makePath makePath: /solr
[junit4:junit4]   2> 117 T1011 oazs.PrepRequestProcessor.pRequest Processed session termination for sessionid: 0x139d5234ead0000
[junit4:junit4]   2> 127 T1013 oaz.ClientCnxn$EventThread.run EventThread shut down
[junit4:junit4]   2> 127 T1006 oaz.ZooKeeper.close Session: 0x139d5234ead0000 closed
[junit4:junit4]   2> 127 T1008 oazs.NIOServerCnxn.closeSock Closed socket connection for client /140.211.11.196:13426 which had sessionid 0x139d5234ead0000
[junit4:junit4]   2> 127 T1006 oaz.ZooKeeper.<init> Initiating client connection, connectString=127.0.0.1:43688/solr sessionTimeout=10000 watcher=org.apache.solr.common.cloud.ConnectionManager@6b208eb7
[junit4:junit4]   2> 128 T1014 oaz.ClientCnxn$SendThread.startConnect Opening socket connection to server /127.0.0.1:43688
[junit4:junit4]   2> 128 T1006 oascc.ConnectionManager.waitForConnected Waiting for client to connect to ZooKeeper
[junit4:junit4]   2> 129 T1014 oaz.ClientCnxn$SendThread.primeConnection Socket connection established to localhost/127.0.0.1:43688, initiating session
[junit4:junit4]   2> 129 T1008 oazs.NIOServerCnxn$Factory.run Accepted socket connection from /140.211.11.196:60476
[junit4:junit4]   2> 129 T1008 oazs.NIOServerCnxn.readConnectRequest Client attempting to establish new session at /140.211.11.196:60476
[junit4:junit4]   2> 130 T1010 oazs.NIOServerCnxn.finishSessionInit Established session 0x139d5234ead0001 with negotiated timeout 10000 for client /140.211.11.196:60476
[junit4:junit4]   2> 131 T1014 oaz.ClientCnxn$SendThread.readConnectResult Session establishment complete on server localhost/127.0.0.1:43688, sessionid = 0x139d5234ead0001, negotiated timeout = 10000
[junit4:junit4]   2> 131 T1015 oascc.ConnectionManager.process Watcher org.apache.solr.common.cloud.ConnectionManager@6b208eb7 name:ZooKeeperConnection Watcher:127.0.0.1:43688/solr got event WatchedEvent state:SyncConnected type:None path:null path:null type:None
[junit4:junit4]   2> 131 T1006 oascc.ConnectionManager.waitForConnected Client is connected to ZooKeeper
[junit4:junit4]   2> 135 T1006 oascc.SolrZkClient.makePath makePath: /collections/collection1
[junit4:junit4]   2> 139 T1006 oascc.SolrZkClient.makePath makePath: /collections/collection1/shards
[junit4:junit4]   2> 148 T1006 oascc.SolrZkClient.makePath makePath: /collections/control_collection
[junit4:junit4]   2> 152 T1006 oascc.SolrZkClient.makePath makePath: /collections/control_collection/shards
[junit4:junit4]   2> 156 T1006 oasc.AbstractZkTestCase.putConfig put /usr/home/hudson/hudson-slave/workspace/Lucene-Solr-NightlyTests-4.x/solr/build/solr-core/test-files/solr/collection1/conf/solrconfig.xml to /configs/conf1/solrconfig.xml
[junit4:junit4]   2> 174 T1006 oascc.SolrZkClient.makePath makePath: /configs/conf1/solrconfig.xml
[junit4:junit4]   2> 181 T1006 oasc.AbstractZkTestCase.putConfig put /usr/home/hudson/hudson-slave/workspace/Lucene-Solr-NightlyTests-4.x/solr/build/solr-core/test-files/solr/collection1/conf/schema.xml to /configs/conf1/schema.xml
[junit4:junit4]   2> 182 T1006 oascc.SolrZkClient.makePath makePath: /configs/conf1/schema.xml
[junit4:junit4]   2> 290 T1006 oasc.AbstractZkTestCase.putConfig put /usr/home/hudson/hudson-slave/workspace/Lucene-Solr-NightlyTests-4.x/solr/build/solr-core/test-files/solr/collection1/conf/solrconfig.xml to /configs/conf1/solrconfig.xml
[junit4:junit4]   2> 291 T1006 oascc.SolrZkClient.makePath makePath: /configs/conf1/solrconfig.xml
[junit4:junit4]   2> 295 T1006 oasc.AbstractZkTestCase.putConfig put /usr/home/hudson/hudson-slave/workspace/Lucene-Solr-NightlyTests-4.x/solr/build/solr-core/test-files/solr/collection1/conf/stopwords.txt to /configs/conf1/stopwords.txt
[junit4:junit4]   2> 295 T1006 oascc.SolrZkClient.makePath makePath: /configs/conf1/stopwords.txt
[junit4:junit4]   2> 298 T1006 oasc.AbstractZkTestCase.putConfig put /usr/home/hudson/hudson-slave/workspace/Lucene-Solr-NightlyTests-4.x/solr/build/solr-core/test-files/solr/collection1/conf/protwords.txt to /configs/conf1/protwords.txt
[junit4:junit4]   2> 299 T1006 oascc.SolrZkClient.makePath makePath: /configs/conf1/protwords.txt
[junit4:junit4]   2> 302 T1006 oasc.AbstractZkTestCase.putConfig put /usr/home/hudson/hudson-slave/workspace/Lucene-Solr-NightlyTests-4.x/solr/build/solr-core/test-files/solr/collection1/conf/currency.xml to /configs/conf1/currency.xml
[junit4:junit4]   2> 302 T1006 oascc.SolrZkClient.makePath makePath: /configs/conf1/currency.xml
[junit4:junit4]   2> 306 T1006 oasc.AbstractZkTestCase.putConfig put /usr/home/hudson/hudson-slave/workspace/Lucene-Solr-NightlyTests-4.x/solr/build/solr-core/test-files/solr/collection1/conf/open-exchange-rates.json to /configs/conf1/open-exchange-rates.json
[junit4:junit4]   2> 306 T1006 oascc.SolrZkClient.makePath makePath: /configs/conf1/open-exchange-rates.json
[junit4:junit4]   2> 309 T1006 oasc.AbstractZkTestCase.putConfig put /usr/home/hudson/hudson-slave/workspace/Lucene-Solr-NightlyTests-4.x/solr/build/solr-core/test-files/solr/collection1/conf/mapping-ISOLatin1Accent.txt to /configs/conf1/mapping-ISOLatin1Accent.txt
[junit4:junit4]   2> 310 T1006 oascc.SolrZkClient.makePath makePath: /configs/conf1/mapping-ISOLatin1Accent.txt
[junit4:junit4]   2> 317 T1006 oasc.AbstractZkTestCase.putConfig put /usr/home/hudson/hudson-slave/workspace/Lucene-Solr-NightlyTests-4.x/solr/build/solr-core/test-files/solr/collection1/conf/old_synonyms.txt to /configs/conf1/old_synonyms.txt
[junit4:junit4]   2> 318 T1006 oascc.SolrZkClient.makePath makePath: /configs/conf1/old_synonyms.txt
[junit4:junit4]   2> 321 T1006 oasc.AbstractZkTestCase.putConfig put /usr/home/hudson/hudson-slave/workspace/Lucene-Solr-NightlyTests-4.x/solr/build/solr-core/test-files/solr/collection1/conf/synonyms.txt to /configs/conf1/synonyms.txt
[junit4:junit4]   2> 321 T1006 oascc.SolrZkClient.makePath makePath: /configs/conf1/synonyms.txt
[junit4:junit4]   2> 325 T1011 oazs.PrepRequestProcessor.pRequest Processed session termination for sessionid: 0x139d5234ead0001
[junit4:junit4]   2> 326 T1015 oaz.ClientCnxn$EventThread.run EventThread shut down
[junit4:junit4]   2> 326 T1006 oaz.ZooKeeper.close Session: 0x139d5234ead0001 closed
[junit4:junit4]   2> 326 T1008 oazs.NIOServerCnxn.closeSock Closed socket connection for client /140.211.11.196:60476 which had sessionid 0x139d5234ead0001
[junit4:junit4]   2> 327 T1006 oejs.Server.doStart jetty-8.1.2.v20120308
[junit4:junit4]   2> 330 T1006 oejs.AbstractConnector.doStart Started SocketConnector@0.0.0.0:25025
[junit4:junit4]   2> 330 T1006 oasc.SolrResourceLoader.locateSolrHome JNDI not configured for solr (NoInitialContextEx)
[junit4:junit4]   2> 331 T1006 oasc.SolrResourceLoader.locateSolrHome using system property solr.solr.home: /usr/home/hudson/hudson-slave/workspace/Lucene-Solr-NightlyTests-4.x/solr/build/solr-core/test-files/solr
[junit4:junit4]   2> 331 T1006 oasc.SolrResourceLoader.<init> new SolrResourceLoader for deduced Solr Home: '/usr/home/hudson/hudson-slave/workspace/Lucene-Solr-NightlyTests-4.x/solr/build/solr-core/test-files/solr/'
[junit4:junit4]   2> 355 T1006 oass.SolrDispatchFilter.init SolrDispatchFilter.init()
[junit4:junit4]   2> 355 T1006 oasc.SolrResourceLoader.locateSolrHome JNDI not configured for solr (NoInitialContextEx)
[junit4:junit4]   2> 355 T1006 oasc.SolrResourceLoader.locateSolrHome using system property solr.solr.home: /usr/home/hudson/hudson-slave/workspace/Lucene-Solr-NightlyTests-4.x/solr/build/solr-core/test-files/solr
[junit4:junit4]   2> 355 T1006 oasc.CoreContainer$Initializer.initialize looking for solr.xml: /usr/home/hudson/hudson-slave/workspace/Lucene-Solr-NightlyTests-4.x/solr/build/solr-core/test-files/solr/solr.xml
[junit4:junit4]   2> 356 T1006 oasc.CoreContainer.<init> New CoreContainer 1311465387
[junit4:junit4]   2> 356 T1006 oasc.CoreContainer.load Loading CoreContainer using Solr Home: '/usr/home/hudson/hudson-slave/workspace/Lucene-Solr-NightlyTests-4.x/solr/build/solr-core/test-files/solr/'
[junit4:junit4]   2> 356 T1006 oasc.SolrResourceLoader.<init> new SolrResourceLoader for directory: '/usr/home/hudson/hudson-slave/workspace/Lucene-Solr-NightlyTests-4.x/solr/build/solr-core/test-files/solr/'
[junit4:junit4]   2> 373 T1006 oasc.CoreContainer.load Registering Log Listener
[junit4:junit4]   2> 384 T1006 oasc.CoreContainer.initZooKeeper Zookeeper client=127.0.0.1:43688/solr
[junit4:junit4]   2> 406 T1006 oaz.ZooKeeper.<init> Initiating client connection, connectString=127.0.0.1:43688/solr sessionTimeout=5000 watcher=org.apache.solr.common.cloud.ConnectionManager@506df2a4
[junit4:junit4]   2> 407 T1025 oaz.ClientCnxn$SendThread.startConnect Opening socket connection to server /127.0.0.1:43688
[junit4:junit4]   2> 407 T1006 oascc.ConnectionManager.waitForConnected Waiting for client to connect to ZooKeeper
[junit4:junit4]   2> 408 T1025 oaz.ClientCnxn$SendThread.primeConnection Socket connection established to localhost/127.0.0.1:43688, initiating session
[junit4:junit4]   2> 408 T1008 oazs.NIOServerCnxn$Factory.run Accepted socket connection from /140.211.11.196:20951
[junit4:junit4]   2> 409 T1008 oazs.NIOServerCnxn.readConnectRequest Client attempting to establish new session at /140.211.11.196:20951
[junit4:junit4]   2> 410 T1010 oazs.NIOServerCnxn.finishSessionInit Established session 0x139d5234ead0002 with negotiated timeout 5000 for client /140.211.11.196:20951
[junit4:junit4]   2> 410 T1025 oaz.ClientCnxn$SendThread.readConnectResult Session establishment complete on server localhost/127.0.0.1:43688, sessionid = 0x139d5234ead0002, negotiated timeout = 5000
[junit4:junit4]   2> 411 T1026 oascc.ConnectionManager.process Watcher org.apache.solr.common.cloud.ConnectionManager@506df2a4 name:ZooKeeperConnection Watcher:127.0.0.1:43688/solr got event WatchedEvent state:SyncConnected type:None path:null path:null type:None
[junit4:junit4]   2> 411 T1006 oascc.ConnectionManager.waitForConnected Client is connected to ZooKeeper
[junit4:junit4]   2> 424 T1011 oazs.PrepRequestProcessor.pRequest Got user-level KeeperException when processing sessionid:0x139d5234ead0002 type:create cxid:0x2 zxid:0xfffffffffffffffe txntype:unknown reqpath:n/a Error Path:/solr/overseer Error:KeeperErrorCode = NodeExists for /solr/overseer
[junit4:junit4]   2> 431 T1006 oascc.SolrZkClient.makePath makePath: /live_nodes
[junit4:junit4]   2> 433 T1006 oasc.ZkController.createEphemeralLiveNode Register node as live in ZooKeeper:/live_nodes/127.0.0.1:25025_solr
[junit4:junit4]   2> 437 T1011 oazs.PrepRequestProcessor.pRequest Got user-level KeeperException when processing sessionid:0x139d5234ead0002 type:delete cxid:0x7 zxid:0xfffffffffffffffe txntype:unknown reqpath:n/a Error Path:/solr/live_nodes/127.0.0.1:25025_solr Error:KeeperErrorCode = NoNode for /solr/live_nodes/127.0.0.1:25025_solr
[junit4:junit4]   2> 438 T1006 oascc.SolrZkClient.makePath makePath: /live_nodes/127.0.0.1:25025_solr
[junit4:junit4]   2> 441 T1006 oashc.HttpShardHandlerFactory.getParameter Setting socketTimeout to: 0
[junit4:junit4]   2> 441 T1006 oashc.HttpShardHandlerFactory.getParameter Setting urlScheme to: http://
[junit4:junit4]   2> 442 T1006 oashc.HttpShardHandlerFactory.getParameter Setting connTimeout to: 0
[junit4:junit4]   2> 442 T1006 oashc.HttpShardHandlerFactory.getParameter Setting maxConnectionsPerHost to: 20
[junit4:junit4]   2> 442 T1006 oashc.HttpShardHandlerFactory.getParameter Setting corePoolSize to: 0
[junit4:junit4]   2> 442 T1006 oashc.HttpShardHandlerFactory.getParameter Setting maximumPoolSize to: 2147483647
[junit4:junit4]   2> 443 T1006 oashc.HttpShardHandlerFactory.getParameter Setting maxThreadIdleTime to: 5
[junit4:junit4]   2> 443 T1006 oashc.HttpShardHandlerFactory.getParameter Setting sizeOfQueue to: -1
[junit4:junit4]   2> 443 T1006 oashc.HttpShardHandlerFactory.getParameter Setting fairnessPolicy to: false
[junit4:junit4]   2> 444 T1006 oascsi.HttpClientUtil.createClient Creating new http client, config:maxConnectionsPerHost=20&maxConnections=10000&socketTimeout=0&connTimeout=0&retry=false
[junit4:junit4]   2> 456 T1006 oascc.SolrZkClient.makePath makePath: /overseer_elect/election
[junit4:junit4]   2> 464 T1011 oazs.PrepRequestProcessor.pRequest Got user-level KeeperException when processing sessionid:0x139d5234ead0002 type:delete cxid:0x15 zxid:0xfffffffffffffffe txntype:unknown reqpath:n/a Error Path:/solr/overseer_elect/leader Error:KeeperErrorCode = NoNode for /solr/overseer_elect/leader
[junit4:junit4]   2> 472 T1006 oascc.SolrZkClient.makePath makePath: /overseer_elect/leader
[junit4:junit4]   2> 475 T1006 oasc.Overseer.start Overseer (id=88336015330967554-127.0.0.1:25025_solr-n_0000000000) starting
[junit4:junit4]   2> 475 T1011 oazs.PrepRequestProcessor.pRequest Got user-level KeeperException when processing sessionid:0x139d5234ead0002 type:create cxid:0x1a zxid:0xfffffffffffffffe txntype:unknown reqpath:n/a Error Path:/solr/overseer Error:KeeperErrorCode = NodeExists for /solr/overseer
[junit4:junit4]   2> 485 T1011 oazs.PrepRequestProcessor.pRequest Got user-level KeeperException when processing sessionid:0x139d5234ead0002 type:create cxid:0x1b zxid:0xfffffffffffffffe txntype:unknown reqpath:n/a Error Path:/solr/overseer Error:KeeperErrorCode = NodeExists for /solr/overseer
[junit4:junit4]   2> 486 T1011 oazs.PrepRequestProcessor.pRequest Got user-level KeeperException when processing sessionid:0x139d5234ead0002 type:create cxid:0x1c zxid:0xfffffffffffffffe txntype:unknown reqpath:n/a Error Path:/solr/overseer Error:KeeperErrorCode = NodeExists for /solr/overseer
[junit4:junit4]   2> 490 T1011 oazs.PrepRequestProcessor.pRequest Got user-level KeeperException when processing sessionid:0x139d5234ead0002 type:create cxid:0x1d zxid:0xfffffffffffffffe txntype:unknown reqpath:n/a Error Path:/solr/overseer Error:KeeperErrorCode = NodeExists for /solr/overseer
[junit4:junit4]   2> 497 T1028 oasc.OverseerCollectionProcessor.run Process current queue of collection creations
[junit4:junit4]   2> 497 T1006 oascc.SolrZkClient.makePath makePath: /clusterstate.json
[junit4:junit4]   2> 499 T1006 oascc.ZkStateReader.createClusterStateWatchersAndUpdate Updating cluster state from ZooKeeper... 
[junit4:junit4]   2> 527 T1027 oasc.Overseer$ClusterStateUpdater.run Starting to work on the main queue
[junit4:junit4]   2> 537 T1006 oasc.CoreContainer.create Creating SolrCore 'collection1' using instanceDir: /usr/home/hudson/hudson-slave/workspace/Lucene-Solr-NightlyTests-4.x/solr/build/solr-core/test-files/solr/collection1
[junit4:junit4]   2> 538 T1006 oasc.ZkController.createCollectionZkNode Check for collection zkNode:control_collection
[junit4:junit4]   2> 539 T1006 oasc.ZkController.createCollectionZkNode Collection zkNode exists
[junit4:junit4]   2> 539 T1006 oasc.ZkController.readConfigName Load collection config from:/collections/control_collection
[junit4:junit4]   2> 541 T1006 oasc.SolrResourceLoader.<init> new SolrResourceLoader for directory: '/usr/home/hudson/hudson-slave/workspace/Lucene-Solr-NightlyTests-4.x/solr/build/solr-core/test-files/solr/collection1/'
[junit4:junit4]   2> 542 T1006 oasc.SolrResourceLoader.replaceClassLoader Adding 'file:/usr/home/hudson/hudson-slave/workspace/Lucene-Solr-NightlyTests-4.x/solr/build/solr-core/test-files/solr/collection1/lib/README' to classloader
[junit4:junit4]   2> 543 T1006 oasc.SolrResourceLoader.replaceClassLoader Adding 'file:/usr/home/hudson/hudson-slave/workspace/Lucene-Solr-NightlyTests-4.x/solr/build/solr-core/test-files/solr/collection1/lib/classes/' to classloader
[junit4:junit4]   2> 620 T1006 oasc.SolrConfig.<init> Using Lucene MatchVersion: LUCENE_40
[junit4:junit4]   2> 691 T1006 oasc.SolrConfig.<init> Loaded SolrConfig: solrconfig.xml
[junit4:junit4]   2> 793 T1006 oass.IndexSchema.readSchema Reading Solr Schema
[junit4:junit4]   2> 802 T1006 oass.IndexSchema.readSchema Schema name=test
[junit4:junit4]   2> 1229 T1006 oass.OpenExchangeRatesOrgProvider.init Initialized with rates=open-exchange-rates.json, refreshInterval=1440.
[junit4:junit4]   2> 1237 T1006 oass.IndexSchema.readSchema default search field in schema is text
[junit4:junit4]   2> 1240 T1006 oass.IndexSchema.readSchema unique key field: id
[junit4:junit4]   2> 1254 T1006 oass.FileExchangeRateProvider.reload Reloading exchange rates from file currency.xml
[junit4:junit4]   2> 1258 T1006 oass.FileExchangeRateProvider.reload Reloading exchange rates from file currency.xml
[junit4:junit4]   2> 1261 T1006 oass.OpenExchangeRatesOrgProvider.reload Reloading exchange rates from open-exchange-rates.json
[junit4:junit4]   2> 1264 T1006 oass.OpenExchangeRatesOrgProvider.reload Reloading exchange rates from open-exchange-rates.json
[junit4:junit4]   2> 1265 T1006 oasc.SolrCore.<init> [collection1] Opening new SolrCore at /usr/home/hudson/hudson-slave/workspace/Lucene-Solr-NightlyTests-4.x/solr/build/solr-core/test-files/solr/collection1/, dataDir=./org.apache.solr.cloud.BasicDistributedZk2Test-1347900624551/control/data/
[junit4:junit4]   2> 1265 T1006 oasc.JmxMonitoredMap.<init> JMX monitoring is enabled. Adding Solr mbeans to JMX Server: com.sun.jmx.mbeanserver.JmxMBeanServer@63a5ec6c
[junit4:junit4]   2> 1288 T1006 oasc.SolrCore.getNewIndexDir WARNING New index directory detected: old=null new=./org.apache.solr.cloud.BasicDistributedZk2Test-1347900624551/control/data/index/
[junit4:junit4]   2> 1289 T1006 oasc.SolrCore.initIndex WARNING [collection1] Solr index directory './org.apache.solr.cloud.BasicDistributedZk2Test-1347900624551/control/data/index' doesn't exist. Creating new index...
[junit4:junit4]   2> 1290 T1006 oasc.CachingDirectoryFactory.get return new directory for /usr/home/hudson/hudson-slave/workspace/Lucene-Solr-NightlyTests-4.x/solr/build/solr-core/test/J1/./org.apache.solr.cloud.BasicDistributedZk2Test-1347900624551/control/data/index forceNew:false
[junit4:junit4]   2> 1295 T1006 oasc.SolrDeletionPolicy.onCommit SolrDeletionPolicy.onCommit: commits:num=1
[junit4:junit4]   2> 		commit{dir=NRTCachingDirectory(org.apache.lucene.store.NIOFSDirectory@/usr/home/hudson/hudson-slave/workspace/Lucene-Solr-NightlyTests-4.x/solr/build/solr-core/test/J1/org.apache.solr.cloud.BasicDistributedZk2Test-1347900624551/control/data/index lockFactory=org.apache.lucene.store.NativeFSLockFactory@323af348; maxCacheMB=48.0 maxMergeSizeMB=4.0),segFN=segments_1,generation=1,filenames=[segments_1]
[junit4:junit4]   2> 1295 T1006 oasc.SolrDeletionPolicy.updateCommits newest commit = 1
[junit4:junit4]   2> 1296 T1006 oasc.SolrCore.initWriters created xml: solr.XMLResponseWriter
[junit4:junit4]   2> 1298 T1006 oasup.UpdateRequestProcessorChain.init inserting DistributedUpdateProcessorFactory into updateRequestProcessorChain "dedupe"
[junit4:junit4]   2> 1298 T1006 oasup.UpdateRequestProcessorChain.init inserting DistributedUpdateProcessorFactory into updateRequestProcessorChain "dedupe-allfields"
[junit4:junit4]   2> 1298 T1006 oasup.UpdateRequestProcessorChain.init inserting DistributedUpdateProcessorFactory into updateRequestProcessorChain "stored_sig"
[junit4:junit4]   2> 1299 T1006 oasup.UpdateRequestProcessorChain.init inserting DistributedUpdateProcessorFactory into updateRequestProcessorChain "uniq-fields"
[junit4:junit4]   2> 1299 T1006 oasup.UpdateRequestProcessorChain.init inserting DistributedUpdateProcessorFactory into updateRequestProcessorChain "distrib-dup-test-chain-implicit"
[junit4:junit4]   2> 1300 T1006 oasc.RequestHandlers.initHandlersFromConfig adding lazy requestHandler: solr.ReplicationHandler
[junit4:junit4]   2> 1300 T1006 oasc.RequestHandlers.initHandlersFromConfig created /replication: solr.ReplicationHandler
[junit4:junit4]   2> 1300 T1006 oasc.RequestHandlers.initHandlersFromConfig created standard: solr.StandardRequestHandler
[junit4:junit4]   2> 1301 T1006 oasc.RequestHandlers.initHandlersFromConfig created /get: solr.RealTimeGetHandler
[junit4:junit4]   2> 1301 T1006 oasc.RequestHandlers.initHandlersFromConfig created dismax: solr.SearchHandler
[junit4:junit4]   2> 1302 T1006 oasc.RequestHandlers.initHandlersFromConfig created mock: org.apache.solr.core.MockQuerySenderListenerReqHandler
[junit4:junit4]   2> 1302 T1006 oasc.RequestHandlers.initHandlersFromConfig created /admin/: org.apache.solr.handler.admin.AdminHandlers
[junit4:junit4]   2> 1303 T1006 oasc.RequestHandlers.initHandlersFromConfig created defaults: solr.StandardRequestHandler
[junit4:junit4]   2> 1303 T1006 oasc.RequestHandlers.initHandlersFromConfig adding lazy requestHandler: solr.StandardRequestHandler
[junit4:junit4]   2> 1303 T1006 oasc.RequestHandlers.initHandlersFromConfig created lazy: solr.StandardRequestHandler
[junit4:junit4]   2> 1304 T1006 oasc.RequestHandlers.initHandlersFromConfig created /update: solr.UpdateRequestHandler
[junit4:junit4]   2> 1304 T1006 oasc.RequestHandlers.initHandlersFromConfig created /terms: org.apache.solr.handler.component.SearchHandler
[junit4:junit4]   2> 1304 T1006 oasc.RequestHandlers.initHandlersFromConfig created spellCheckCompRH: org.apache.solr.handler.component.SearchHandler
[junit4:junit4]   2> 1305 T1006 oasc.RequestHandlers.initHandlersFromConfig created spellCheckCompRH_Direct: org.apache.solr.handler.component.SearchHandler
[junit4:junit4]   2> 1305 T1006 oasc.RequestHandlers.initHandlersFromConfig created spellCheckWithWordbreak: org.apache.solr.handler.component.SearchHandler
[junit4:junit4]   2> 1306 T1006 oasc.RequestHandlers.initHandlersFromConfig created spellCheckWithWordbreak_Direct: org.apache.solr.handler.component.SearchHandler
[junit4:junit4]   2> 1306 T1006 oasc.RequestHandlers.initHandlersFromConfig created spellCheckCompRH1: org.apache.solr.handler.component.SearchHandler
[junit4:junit4]   2> 1306 T1006 oasc.RequestHandlers.initHandlersFromConfig created tvrh: org.apache.solr.handler.component.SearchHandler
[junit4:junit4]   2> 1307 T1006 oasc.RequestHandlers.initHandlersFromConfig created /mlt: solr.MoreLikeThisHandler
[junit4:junit4]   2> 1307 T1006 oasc.RequestHandlers.initHandlersFromConfig created /debug/dump: solr.DumpRequestHandler
[junit4:junit4]   2> 1310 T1006 oashl.XMLLoader.init xsltCacheLifetimeSeconds=60
[junit4:junit4]   2> 1313 T1006 oasc.SolrCore.initDeprecatedSupport WARNING solrconfig.xml uses deprecated <admin/gettableFiles>, Please update your config to use the ShowFileRequestHandler.
[junit4:junit4]   2> 1314 T1006 oasc.SolrCore.initDeprecatedSupport WARNING adding ShowFileRequestHandler with hidden files: [SCHEMA.XML, OLD_SYNONYMS.TXT, STOPWORDS.TXT, PROTWORDS.TXT, OPEN-EXCHANGE-RATES.JSON, SYNONYMS.TXT, CURRENCY.XML, MAPPING-ISOLATIN1ACCENT.TXT]
[junit4:junit4]   2> 1317 T1006 oass.SolrIndexSearcher.<init> Opening Searcher@72bb4830 main
[junit4:junit4]   2> 1318 T1006 oasu.CommitTracker.<init> Hard AutoCommit: disabled
[junit4:junit4]   2> 1319 T1006 oasu.CommitTracker.<init> Soft AutoCommit: disabled
[junit4:junit4]   2> 1319 T1006 oashc.SpellCheckComponent.inform Initializing spell checkers
[junit4:junit4]   2> 1335 T1006 oass.DirectSolrSpellChecker.init init: {name=direct,classname=DirectSolrSpellChecker,field=lowerfilt,minQueryLength=3}
[junit4:junit4]   2> 1382 T1029 oasc.SolrCore.registerSearcher [collection1] Registered new searcher Searcher@72bb4830 main{StandardDirectoryReader(segments_1:1)}
[junit4:junit4]   2> 1386 T1011 oazs.PrepRequestProcessor.pRequest Got user-level KeeperException when processing sessionid:0x139d5234ead0002 type:create cxid:0x53 zxid:0xfffffffffffffffe txntype:unknown reqpath:n/a Error Path:/solr/overseer/queue Error:KeeperErrorCode = NoNode for /solr/overseer/queue
[junit4:junit4]   2> 1397 T1006 oasc.CoreContainer.register registering core: collection1
[junit4:junit4]   2> 1397 T1006 oasc.ZkController.register Register shard - core:collection1 address:http://127.0.0.1:25025/solr shardId:control_shard
[junit4:junit4]   2> 1407 T1006 oascsi.HttpClientUtil.createClient Creating new http client, config:maxConnections=10000&maxConnectionsPerHost=20&connTimeout=30000&socketTimeout=30000&retry=false
[junit4:junit4]   2> 1419 T1006 oascc.SolrZkClient.makePath makePath: /collections/control_collection/leader_elect/control_shard/election
[junit4:junit4]   2> 1438 T1011 oazs.PrepRequestProcessor.pRequest Got user-level KeeperException when processing sessionid:0x139d5234ead0002 type:delete cxid:0x62 zxid:0xfffffffffffffffe txntype:unknown reqpath:n/a Error Path:/solr/collections/control_collection/leaders Error:KeeperErrorCode = NoNode for /solr/collections/control_collection/leaders
[junit4:junit4]   2> 1439 T1006 oasc.ShardLeaderElectionContext.runLeaderProcess Running the leader process.
[junit4:junit4]   2> 1439 T1011 oazs.PrepRequestProcessor.pRequest Got user-level KeeperException when processing sessionid:0x139d5234ead0002 type:create cxid:0x63 zxid:0xfffffffffffffffe txntype:unknown reqpath:n/a Error Path:/solr/overseer Error:KeeperErrorCode = NodeExists for /solr/overseer
[junit4:junit4]   2> 1533 T1027 oascc.ZkStateReader.updateClusterState Updating cloud state from ZooKeeper... 
[junit4:junit4]   2> 1544 T1011 oazs.PrepRequestProcessor.pRequest Got user-level KeeperException when processing sessionid:0x139d5234ead0002 type:create cxid:0x6a zxid:0xfffffffffffffffe txntype:unknown reqpath:n/a Error Path:/solr/overseer/queue-work Error:KeeperErrorCode = NoNode for /solr/overseer/queue-work
[junit4:junit4]   2> 1566 T1026 oascc.ZkStateReader$2.process A cluster state change has occurred - updating...
[junit4:junit4]   2> 1948 T1006 oasc.ShardLeaderElectionContext.waitForReplicasToComeUp Enough replicas found to continue.
[junit4:junit4]   2> 1949 T1006 oasc.ShardLeaderElectionContext.runLeaderProcess I may be the new leader - try and sync
[junit4:junit4]   2> 1949 T1006 oasc.SyncStrategy.sync Sync replicas to http://127.0.0.1:25025/solr/collection1/
[junit4:junit4]   2> 1950 T1006 oasc.SyncStrategy.syncReplicas Sync Success - now sync replicas to me
[junit4:junit4]   2> 1950 T1006 oasc.SyncStrategy.syncToMe http://127.0.0.1:25025/solr/collection1/ has no replicas
[junit4:junit4]   2> 1950 T1006 oasc.ShardLeaderElectionContext.runLeaderProcess I am the new leader: http://127.0.0.1:25025/solr/collection1/
[junit4:junit4]   2> 1951 T1006 oascc.SolrZkClient.makePath makePath: /collections/control_collection/leaders/control_shard
[junit4:junit4]   2> 1956 T1011 oazs.PrepRequestProcessor.pRequest Got user-level KeeperException when processing sessionid:0x139d5234ead0002 type:create cxid:0x88 zxid:0xfffffffffffffffe txntype:unknown reqpath:n/a Error Path:/solr/overseer Error:KeeperErrorCode = NodeExists for /solr/overseer
[junit4:junit4]   2> 2086 T1027 oascc.ZkStateReader.updateClusterState Updating cloud state from ZooKeeper... 
[junit4:junit4]   2> 2101 T1026 oascc.ZkStateReader$2.process A cluster state change has occurred - updating...
[junit4:junit4]   2> 2135 T1006 oasc.ZkController.register We are http://127.0.0.1:25025/solr/collection1/ and leader is http://127.0.0.1:25025/solr/collection1/
[junit4:junit4]   2> 2135 T1006 oasc.ZkController.register No LogReplay needed for core=collection1 baseURL=http://127.0.0.1:25025/solr
[junit4:junit4]   2> 2135 T1006 oasc.ZkController.checkRecovery I am the leader, no recovery necessary
[junit4:junit4]   2> 2138 T1006 oascc.ZkStateReader.updateClusterState Updating cloud state from ZooKeeper... 
[junit4:junit4]   2> 2138 T1006 oass.SolrDispatchFilter.init user.dir=/usr/home/hudson/hudson-slave/workspace/Lucene-Solr-NightlyTests-4.x/solr/build/solr-core/test/J1
[junit4:junit4]   2> 2139 T1006 oass.SolrDispatchFilter.init SolrDispatchFilter.init() done
[junit4:junit4]   2> 2139 T1006 oascsi.HttpClientUtil.createClient Creating new http client, config:maxConnections=128&maxConnectionsPerHost=32&followRedirects=false
[junit4:junit4]   2> 2269 T1006 oejs.Server.doStart jetty-8.1.2.v20120308
[junit4:junit4]   2> 2271 T1006 oejs.AbstractConnector.doStart Started SocketConnector@0.0.0.0:52839
[junit4:junit4]   2> 2271 T1006 oasc.SolrResourceLoader.locateSolrHome JNDI not configured for solr (NoInitialContextEx)
[junit4:junit4]   2> 2272 T1006 oasc.SolrResourceLoader.locateSolrHome using system property solr.solr.home: /usr/home/hudson/hudson-slave/workspace/Lucene-Solr-NightlyTests-4.x/solr/build/solr-core/test/J1/./solrtest-jetty1-1347900626694
[junit4:junit4]   2> 2272 T1006 oasc.SolrResourceLoader.<init> new SolrResourceLoader for deduced Solr Home: '/usr/home/hudson/hudson-slave/workspace/Lucene-Solr-NightlyTests-4.x/solr/build/solr-core/test/J1/./solrtest-jetty1-1347900626694/'
[junit4:junit4]   2> 2296 T1006 oass.SolrDispatchFilter.init SolrDispatchFilter.init()
[junit4:junit4]   2> 2296 T1006 oasc.SolrResourceLoader.locateSolrHome JNDI not configured for solr (NoInitialContextEx)
[junit4:junit4]   2> 2297 T1006 oasc.SolrResourceLoader.locateSolrHome using system property solr.solr.home: /usr/home/hudson/hudson-slave/workspace/Lucene-Solr-NightlyTests-4.x/solr/build/solr-core/test/J1/./solrtest-jetty1-1347900626694
[junit4:junit4]   2> 2297 T1006 oasc.CoreContainer$Initializer.initialize looking for solr.xml: /usr/home/hudson/hudson-slave/workspace/Lucene-Solr-NightlyTests-4.x/solr/build/solr-core/test/J1/./solrtest-jetty1-1347900626694/solr.xml
[junit4:junit4]   2> 2297 T1006 oasc.CoreContainer.<init> New CoreContainer 1732594846
[junit4:junit4]   2> 2298 T1006 oasc.CoreContainer.load Loading CoreContainer using Solr Home: '/usr/home/hudson/hudson-slave/workspace/Lucene-Solr-NightlyTests-4.x/solr/build/solr-core/test/J1/./solrtest-jetty1-1347900626694/'
[junit4:junit4]   2> 2298 T1006 oasc.SolrResourceLoader.<init> new SolrResourceLoader for directory: '/usr/home/hudson/hudson-slave/workspace/Lucene-Solr-NightlyTests-4.x/solr/build/solr-core/test/J1/./solrtest-jetty1-1347900626694/'
[junit4:junit4]   2> 2315 T1006 oasc.CoreContainer.load Registering Log Listener
[junit4:junit4]   2> 2325 T1006 oasc.CoreContainer.initZooKeeper Zookeeper client=127.0.0.1:43688/solr
[junit4:junit4]   2> 2325 T1006 oaz.ZooKeeper.<init> Initiating client connection, connectString=127.0.0.1:43688/solr sessionTimeout=5000 watcher=org.apache.solr.common.cloud.ConnectionManager@65426dbb
[junit4:junit4]   2> 2326 T1039 oaz.ClientCnxn$SendThread.startConnect Opening socket connection to server /127.0.0.1:43688
[junit4:junit4]   2> 2326 T1006 oascc.ConnectionManager.waitForConnected Waiting for client to connect to ZooKeeper
[junit4:junit4]   2> 2327 T1039 oaz.ClientCnxn$SendThread.primeConnection Socket connection established to localhost/127.0.0.1:43688, initiating session
[junit4:junit4]   2> 2327 T1008 oazs.NIOServerCnxn$Factory.run Accepted socket connection from /140.211.11.196:21964
[junit4:junit4]   2> 2328 T1008 oazs.NIOServerCnxn.readConnectRequest Client attempting to establish new session at /140.211.11.196:21964
[junit4:junit4]   2> 2330 T1010 oazs.NIOServerCnxn.finishSessionInit Established session 0x139d5234ead0003 with negotiated timeout 5000 for client /140.211.11.196:21964
[junit4:junit4]   2> 2330 T1039 oaz.ClientCnxn$SendThread.readConnectResult Session establishment complete on server localhost/127.0.0.1:43688, sessionid = 0x139d5234ead0003, negotiated timeout = 5000
[junit4:junit4]   2> 2330 T1040 oascc.ConnectionManager.process Watcher org.apache.solr.common.cloud.ConnectionManager@65426dbb name:ZooKeeperConnection Watcher:127.0.0.1:43688/solr got event WatchedEvent state:SyncConnected type:None path:null path:null type:None
[junit4:junit4]   2> 2330 T1006 oascc.ConnectionManager.waitForConnected Client is connected to ZooKeeper
[junit4:junit4]   2> 2331 T1011 oazs.PrepRequestProcessor.pRequest Got user-level KeeperException when processing sessionid:0x139d5234ead0003 type:create cxid:0x1 zxid:0xfffffffffffffffe txntype:unknown reqpath:n/a Error Path:/solr/overseer Error:KeeperErrorCode = NodeExists for /solr/overseer
[junit4:junit4]   2> 2346 T1011 oazs.PrepRequestProcessor.pRequest Got user-level KeeperException when processing sessionid:0x139d5234ead0003 type:create cxid:0x2 zxid:0xfffffffffffffffe txntype:unknown reqpath:n/a Error Path:/solr/overseer Error:KeeperErrorCode = NodeExists for /solr/overseer
[junit4:junit4]   2> 2348 T1006 oasc.ZkController.createEphemeralLiveNode Register node as live in ZooKeeper:/live_nodes/127.0.0.1:52839_solr
[junit4:junit4]   2> 2348 T1011 oazs.PrepRequestProcessor.pRequest Got user-level KeeperException when processing sessionid:0x139d5234ead0003 type:delete cxid:0x4 zxid:0xfffffffffffffffe txntype:unknown reqpath:n/a Error Path:/solr/live_nodes/127.0.0.1:52839_solr Error:KeeperErrorCode = NoNode for /solr/live_nodes/127.0.0.1:52839_solr
[junit4:junit4]   2> 2355 T1006 oascc.SolrZkClient.makePath makePath: /live_nodes/127.0.0.1:52839_solr
[junit4:junit4]   2> 2357 T1026 oascc.ZkStateReader$3.process Updating live nodes
[junit4:junit4]   2> 2357 T1006 oashc.HttpShardHandlerFactory.getParameter Setting socketTimeout to: 0
[junit4:junit4]   2> 2358 T1006 oashc.HttpShardHandlerFactory.getParameter Setting urlScheme to: http://
[junit4:junit4]   2> 2358 T1006 oashc.HttpShardHandlerFactory.getParameter Setting connTimeout to: 0
[junit4:junit4]   2> 2359 T1006 oashc.HttpShardHandlerFactory.getParameter Setting maxConnectionsPerHost to: 20
[junit4:junit4]   2> 2359 T1006 oashc.HttpShardHandlerFactory.getParameter Setting corePoolSize to: 0
[junit4:junit4]   2> 2359 T1006 oashc.HttpShardHandlerFactory.getParameter Setting maximumPoolSize to: 2147483647
[junit4:junit4]   2> 2360 T1006 oashc.HttpShardHandlerFactory.getParameter Setting maxThreadIdleTime to: 5
[junit4:junit4]   2> 2360 T1006 oashc.HttpShardHandlerFactory.getParameter Setting sizeOfQueue to: -1
[junit4:junit4]   2> 2360 T1006 oashc.HttpShardHandlerFactory.getParameter Setting fairnessPolicy to: false
[junit4:junit4]   2> 2360 T1006 oascsi.HttpClientUtil.createClient Creating new http client, config:maxConnectionsPerHost=20&maxConnections=10000&socketTimeout=0&connTimeout=0&retry=false
[junit4:junit4]   2> 2380 T1006 oascc.ZkStateReader.createClusterStateWatchersAndUpdate Updating cluster state from ZooKeeper... 
[junit4:junit4]   2> 2385 T1006 oasc.CoreContainer.create Creating SolrCore 'collection1' using instanceDir: /usr/home/hudson/hudson-slave/workspace/Lucene-Solr-NightlyTests-4.x/solr/build/solr-core/test/J1/./solrtest-jetty1-1347900626694/collection1
[junit4:junit4]   2> 2385 T1006 oasc.ZkController.createCollectionZkNode Check for collection zkNode:collection1
[junit4:junit4]   2> 2385 T1006 oasc.ZkController.createCollectionZkNode Collection zkNode exists
[junit4:junit4]   2> 2386 T1006 oasc.ZkController.readConfigName Load collection config from:/collections/collection1
[junit4:junit4]   2> 2387 T1006 oasc.SolrResourceLoader.<init> new SolrResourceLoader for directory: '/usr/home/hudson/hudson-slave/workspace/Lucene-Solr-NightlyTests-4.x/solr/build/solr-core/test/J1/./solrtest-jetty1-1347900626694/collection1/'
[junit4:junit4]   2> 2388 T1006 oasc.SolrResourceLoader.replaceClassLoader Adding 'file:/usr/home/hudson/hudson-slave/workspace/Lucene-Solr-NightlyTests-4.x/solr/build/solr-core/test/J1/solrtest-jetty1-1347900626694/collection1/lib/classes/' to classloader
[junit4:junit4]   2> 2388 T1006 oasc.SolrResourceLoader.replaceClassLoader Adding 'file:/usr/home/hudson/hudson-slave/workspace/Lucene-Solr-NightlyTests-4.x/solr/build/solr-core/test/J1/solrtest-jetty1-1347900626694/collection1/lib/README' to classloader
[junit4:junit4]   2> 2422 T1006 oasc.SolrConfig.<init> Using Lucene MatchVersion: LUCENE_40
[junit4:junit4]   2> 2469 T1006 oasc.SolrConfig.<init> Loaded SolrConfig: solrconfig.xml
[junit4:junit4]   2> 2570 T1006 oass.IndexSchema.readSchema Reading Solr Schema
[junit4:junit4]   2> 2576 T1006 oass.IndexSchema.readSchema Schema name=test
[junit4:junit4]   2> 2606 T1027 oascc.ZkStateReader.updateClusterState Updating cloud state from ZooKeeper... 
[junit4:junit4]   2> 2619 T1040 oascc.ZkStateReader$2.process A cluster state change has occurred - updating...
[junit4:junit4]   2> 2620 T1026 oascc.ZkStateReader$2.process A cluster state change has occurred - updating...
[junit4:junit4]   2> 3004 T1006 oass.OpenExchangeRatesOrgProvider.init Initialized with rates=open-exchange-rates.json, refreshInterval=1440.
[junit4:junit4]   2> 3013 T1006 oass.IndexSchema.readSchema default search field in schema is text
[junit4:junit4]   2> 3016 T1006 oass.IndexSchema.readSchema unique key field: id
[junit4:junit4]   2> 3029 T1006 oass.FileExchangeRateProvider.reload Reloading exchange rates from file currency.xml
[junit4:junit4]   2> 3033 T1006 oass.FileExchangeRateProvider.reload Reloading exchange rates from file currency.xml
[junit4:junit4]   2> 3036 T1006 oass.OpenExchangeRatesOrgProvider.reload Reloading exchange rates from open-exchange-rates.json
[junit4:junit4]   2> 3037 T1006 oass.OpenExchangeRatesOrgProvider.reload Reloading exchange rates from open-exchange-rates.json
[junit4:junit4]   2> 3038 T1006 oasc.SolrCore.<init> [collection1] Opening new SolrCore at /usr/home/hudson/hudson-slave/workspace/Lucene-Solr-NightlyTests-4.x/solr/build/solr-core/test/J1/./solrtest-jetty1-1347900626694/collection1/, dataDir=./org.apache.solr.cloud.BasicDistributedZk2Test-1347900624551/jetty1/
[junit4:junit4]   2> 3039 T1006 oasc.JmxMonitoredMap.<init> JMX monitoring is enabled. Adding Solr mbeans to JMX Server: com.sun.jmx.mbeanserver.JmxMBeanServer@63a5ec6c
[junit4:junit4]   2> 3039 T1006 oasc.SolrCore.getNewIndexDir WARNING New index directory detected: old=null new=./org.apache.solr.cloud.BasicDistributedZk2Test-1347900624551/jetty1/index/
[junit4:junit4]   2> 3040 T1006 oasc.SolrCore.initIndex WARNING [collection1] Solr index directory './org.apache.solr.cloud.BasicDistributedZk2Test-1347900624551/jetty1/index' doesn't exist. Creating new index...
[junit4:junit4]   2> 3041 T1006 oasc.CachingDirectoryFactory.get return new directory for /usr/home/hudson/hudson-slave/workspace/Lucene-Solr-NightlyTests-4.x/solr/build/solr-core/test/J1/./org.apache.solr.cloud.BasicDistributedZk2Test-1347900624551/jetty1/index forceNew:false
[junit4:junit4]   2> 3046 T1006 oasc.SolrDeletionPolicy.onCommit SolrDeletionPolicy.onCommit: commits:num=1
[junit4:junit4]   2> 		commit{dir=NRTCachingDirectory(org.apache.lucene.store.NIOFSDirectory@/usr/home/hudson/hudson-slave/workspace/Lucene-Solr-NightlyTests-4.x/solr/build/solr-core/test/J1/org.apache.solr.cloud.BasicDistributedZk2Test-1347900624551/jetty1/index lockFactory=org.apache.lucene.store.NativeFSLockFactory@11887eb9; maxCacheMB=48.0 maxMergeSizeMB=4.0),segFN=segments_1,generation=1,filenames=[segments_1]
[junit4:junit4]   2> 3046 T1006 oasc.SolrDeletionPolicy.updateCommits newest commit = 1
[junit4:junit4]   2> 3047 T1006 oasc.SolrCore.initWriters created xml: solr.XMLResponseWriter
[junit4:junit4]   2> 3049 T1006 oasup.UpdateRequestProcessorChain.init inserting DistributedUpdateProcessorFactory into updateRequestProcessorChain "dedupe"
[junit4:junit4]   2> 3049 T1006 oasup.UpdateRequestProcessorChain.init inserting DistributedUpdateProcessorFactory into updateRequestProcessorChain "dedupe-allfields"
[junit4:junit4]   2> 3050 T1006 oasup.UpdateRequestProcessorChain.init inserting DistributedUpdateProcessorFactory into updateRequestProcessorChain "stored_sig"
[junit4:junit4]   2> 3050 T1006 oasup.UpdateRequestProcessorChain.init inserting DistributedUpdateProcessorFactory into updateRequestProcessorChain "uniq-fields"
[junit4:junit4]   2> 3050 T1006 oasup.UpdateRequestProcessorChain.init inserting DistributedUpdateProcessorFactory into updateRequestProcessorChain "distrib-dup-test-chain-implicit"
[junit4:junit4]   2> 3051 T1006 oasc.RequestHandlers.initHandlersFromConfig adding lazy requestHandler: solr.ReplicationHandler
[junit4:junit4]   2> 3051 T1006 oasc.RequestHandlers.initHandlersFromConfig created /replication: solr.ReplicationHandler
[junit4:junit4]   2> 3052 T1006 oasc.RequestHandlers.initHandlersFromConfig created standard: solr.StandardRequestHandler
[junit4:junit4]   2> 3052 T1006 oasc.RequestHandlers.initHandlersFromConfig created /get: solr.RealTimeGetHandler
[junit4:junit4]   2> 3053 T1006 oasc.RequestHandlers.initHandlersFromConfig created dismax: solr.SearchHandler
[junit4:junit4]   2> 3053 T1006 oasc.RequestHandlers.initHandlersFromConfig created mock: org.apache.solr.core.MockQuerySenderListenerReqHandler
[junit4:junit4]   2> 3053 T1006 oasc.RequestHandlers.initHandlersFromConfig created /admin/: org.apache.solr.handler.admin.AdminHandlers
[junit4:junit4]   2> 3054 T1006 oasc.RequestHandlers.initHandlersFromConfig created defaults: solr.StandardRequestHandler
[junit4:junit4]   2> 3054 T1006 oasc.RequestHandlers.initHandlersFromConfig adding lazy requestHandler: solr.StandardRequestHandler
[junit4:junit4]   2> 3055 T1006 oasc.RequestHandlers.initHandlersFromConfig created lazy: solr.StandardRequestHandler
[junit4:junit4]   2> 3055 T1006 oasc.RequestHandlers.initHandlersFromConfig created /update: solr.UpdateRequestHandler
[junit4:junit4]   2> 3055 T1006 oasc.RequestHandlers.initHandlersFromConfig created /terms: org.apache.solr.handler.component.SearchHandler
[junit4:junit4]   2> 3056 T1006 oasc.RequestHandlers.initHandlersFromConfig created spellCheckCompRH: org.apache.solr.handler.component.SearchHandler
[junit4:junit4]   2> 3056 T1006 oasc.RequestHandlers.initHandlersFromConfig created spellCheckCompRH_Direct: org.apache.solr.handler.component.SearchHandler
[junit4:junit4]   2> 3057 T1006 oasc.RequestHandlers.initHandlersFromConfig created spellCheckWithWordbreak: org.apache.solr.handler.component.SearchHandler
[junit4:junit4]   2> 3057 T1006 oasc.RequestHandlers.initHandlersFromConfig created spellCheckWithWordbreak_Direct: org.apache.solr.handler.component.SearchHandler
[junit4:junit4]   2> 3058 T1006 oasc.RequestHandlers.initHandlersFromConfig created spellCheckCompRH1: org.apache.solr.handler.component.SearchHandler
[junit4:junit4]   2> 3058 T1006 oasc.RequestHandlers.initHandlersFromConfig created tvrh: org.apache.solr.handler.component.SearchHandler
[junit4:junit4]   2> 3059 T1006 oasc.RequestHandlers.initHandlersFromConfig created /mlt: solr.MoreLikeThisHandler
[junit4:junit4]   2> 3059 T1006 oasc.RequestHandlers.initHandlersFromConfig created /debug/dump: solr.DumpRequestHandler
[junit4:junit4]   2> 3062 T1006 oashl.XMLLoader.init xsltCacheLifetimeSeconds=60
[junit4:junit4]   2> 3065 T1006 oasc.SolrCore.initDeprecatedSupport WARNING solrconfig.xml uses deprecated <admin/gettableFiles>, Please update your config to use the ShowFileRequestHandler.
[junit4:junit4]   2> 3066 T1006 oasc.SolrCore.initDeprecatedSupport WARNING adding ShowFileRequestHandler with hidden files: [SCHEMA.XML, OLD_SYNONYMS.TXT, STOPWORDS.TXT, PROTWORDS.TXT, OPEN-EXCHANGE-RATES.JSON, SYNONYMS.TXT, CURRENCY.XML, MAPPING-ISOLATIN1ACCENT.TXT]
[junit4:junit4]   2> 3069 T1006 oass.SolrIndexSearcher.<init> Opening Searcher@65212f0f main
[junit4:junit4]   2> 3070 T1006 oasu.CommitTracker.<init> Hard AutoCommit: disabled
[junit4:junit4]   2> 3070 T1006 oasu.CommitTracker.<init> Soft AutoCommit: disabled
[junit4:junit4]   2> 3071 T1006 oashc.SpellCheckComponent.inform Initializing spell checkers
[junit4:junit4]   2> 3077 T1006 oass.DirectSolrSpellChecker.init init: {name=direct,classname=DirectSolrSpellChecker,field=lowerfilt,minQueryLength=3}
[junit4:junit4]   2> 3130 T1041 oasc.SolrCore.registerSearcher [collection1] Registered new searcher Searcher@65212f0f main{StandardDirectoryReader(segments_1:1)}
[junit4:junit4]   2> 3628 T1027 oascc.ZkStateReader.updateClusterState Updating cloud state from ZooKeeper... 
[junit4:junit4]   2> 3673 T1040 oascc.ZkStateReader$2.process A cluster state change has occurred - updating...
[junit4:junit4]   2> 3673 T1026 oascc.ZkStateReader$2.process A cluster state change has occurred - updating...
[junit4:junit4]   2> 4137 T1006 oasc.CoreContainer.register registering core: collection1
[junit4:junit4]   2> 4137 T1006 oasc.ZkController.register Register shard - core:collection1 address:http://127.0.0.1:52839/solr shardId:shard1
[junit4:junit4]   2> 4138 T1006 oascc.SolrZkClient.makePath makePath: /collections/collection1/leader_elect/shard1/election
[junit4:junit4]   2> 4154 T1011 oazs.PrepRequestProcessor.pRequest Got user-level KeeperException when processing sessionid:0x139d5234ead0003 type:delete cxid:0x43 zxid:0xfffffffffffffffe txntype:unknown reqpath:n/a Error Path:/solr/collections/collection1/leaders Error:KeeperErrorCode = NoNode for /solr/collections/collection1/leaders
[junit4:junit4]   2> 4155 T1006 oasc.ShardLeaderElectionContext.runLeaderProcess Running the leader process.
[junit4:junit4]   2> 4156 T1011 oazs.PrepRequestProcessor.pRequest Got user-level KeeperException when processing sessionid:0x139d5234ead0003 type:create cxid:0x44 zxid:0xfffffffffffffffe txntype:unknown reqpath:n/a Error Path:/solr/overseer Error:KeeperErrorCode = NodeExists for /solr/overseer
[junit4:junit4]   2> 4157 T1006 oasc.ShardLeaderElectionContext.waitForReplicasToComeUp Enough replicas found to continue.
[junit4:junit4]   2> 4158 T1006 oasc.ShardLeaderElectionContext.runLeaderProcess I may be the new leader - try and sync
[junit4:junit4]   2> 4158 T1006 oasc.SyncStrategy.sync Sync replicas to http://127.0.0.1:52839/solr/collection1/
[junit4:junit4]   2> 4158 T1006 oasc.SyncStrategy.syncReplicas Sync Success - now sync replicas to me
[junit4:junit4]   2> 4159 T1006 oasc.SyncStrategy.syncToMe http://127.0.0.1:52839/solr/collection1/ has no replicas
[junit4:junit4]   2> 4159 T1006 oasc.ShardLeaderElectionContext.runLeaderProcess I am the new leader: http://127.0.0.1:52839/solr/collection1/
[junit4:junit4]   2> 4159 T1006 oascc.SolrZkClient.makePath makePath: /collections/collection1/leaders/shard1
[junit4:junit4]   2> 4163 T1011 oazs.PrepRequestProcessor.pRequest Got user-level KeeperException when processing sessionid:0x139d5234ead0003 type:create cxid:0x4e zxid:0xfffffffffffffffe txntype:unknown reqpath:n/a Error Path:/solr/overseer Error:KeeperErrorCode = NodeExists for /solr/overseer
[junit4:junit4]   2> 4178 T1027 oascc.ZkStateReader.updateClusterState Updating cloud state from ZooKeeper... 
[junit4:junit4]   2> 4196 T1040 oascc.ZkStateReader$2.process A cluster state change has occurred - updating...
[junit4:junit4]   2> 4196 T1026 oascc.ZkStateReader$2.process A cluster state change has occurred - updating...
[junit4:junit4]   2> 4216 T1006 oasc.ZkController.register We are http://127.0.0.1:52839/solr/collection1/ and leader is http://127.0.0.1:52839/solr/collection1/
[junit4:junit4]   2> 4216 T1006 oasc.ZkController.register No LogReplay needed for core=collection1 baseURL=http://127.0.0.1:52839/solr
[junit4:junit4]   2> 4216 T1006 oasc.ZkController.checkRecovery I am the leader, no recovery necessary
[junit4:junit4]   2> 4218 T1006 oascc.ZkStateReader.updateClusterState Updating cloud state from ZooKeeper... 
[junit4:junit4]   2> 4219 T1006 oass.SolrDispatchFilter.init user.dir=/usr/home/hudson/hudson-slave/workspace/Lucene-Solr-NightlyTests-4.x/solr/build/solr-core/test/J1
[junit4:junit4]   2> 4219 T1006 oass.SolrDispatchFilter.init SolrDispatchFilter.init() done
[junit4:junit4]   2> 4219 T1006 oascsi.HttpClientUtil.createClient Creating new http client, config:maxConnections=128&maxConnectionsPerHost=32&followRedirects=false
[junit4:junit4]   2> 4344 T1006 oejs.Server.doStart jetty-8.1.2.v20120308
[junit4:junit4]   2> 4347 T1006 oejs.AbstractConnector.doStart Started SocketConnector@0.0.0.0:24191
[junit4:junit4]   2> 4347 T1006 oasc.SolrResourceLoader.locateSolrHome JNDI not configured for solr (NoInitialContextEx)
[junit4:junit4]   2> 4348 T1006 oasc.SolrResourceLoader.locateSolrHome using system property solr.solr.home: /usr/home/hudson/hudson-slave/workspace/Lucene-Solr-NightlyTests-4.x/solr/build/solr-core/test/J1/./solrtest-jetty2-1347900628774
[junit4:junit4]   2> 4348 T1006 oasc.SolrResourceLoader.<init> new SolrResourceLoader for deduced Solr Home: '/usr/home/hudson/hudson-slave/workspace/Lucene-Solr-NightlyTests-4.x/solr/build/solr-core/test/J1/./solrtest-jetty2-1347900628774/'
[junit4:junit4]   2> 4382 T1006 oass.SolrDispatchFilter.init SolrDispatchFilter.init()
[junit4:junit4]   2> 4382 T1006 oasc.SolrResourceLoader.locateSolrHome JNDI not configured for solr (NoInitialContextEx)
[junit4:junit4]   2> 4383 T1006 oasc.SolrResourceLoader.locateSolrHome using system property solr.solr.home: /usr/home/hudson/hudson-slave/workspace/Lucene-Solr-NightlyTests-4.x/solr/build/solr-core/test/J1/./solrtest-jetty2-1347900628774
[junit4:junit4]   2> 4383 T1006 oasc.CoreContainer$Initializer.initialize looking for solr.xml: /usr/home/hudson/hudson-slave/workspace/Lucene-Solr-NightlyTests-4.x/solr/build/solr-core/test/J1/./solrtest-jetty2-1347900628774/solr.xml
[junit4:junit4]   2> 4384 T1006 oasc.CoreContainer.<init> New CoreContainer 1469084429
[junit4:junit4]   2> 4384 T1006 oasc.CoreContainer.load Loading CoreContainer using Solr Home: '/usr/home/hudson/hudson-slave/workspace/Lucene-Solr-NightlyTests-4.x/solr/build/solr-core/test/J1/./solrtest-jetty2-1347900628774/'
[junit4:junit4]   2> 4385 T1006 oasc.SolrResourceLoader.<init> new SolrResourceLoader for directory: '/usr/home/hudson/hudson-slave/workspace/Lucene-Solr-NightlyTests-4.x/solr/build/solr-core/test/J1/./solrtest-jetty2-1347900628774/'
[junit4:junit4]   2> 4409 T1006 oasc.CoreContainer.load Registering Log Listener
[junit4:junit4]   2> 4423 T1006 oasc.CoreContainer.initZooKeeper Zookeeper client=127.0.0.1:43688/solr
[junit4:junit4]   2> 4424 T1006 oaz.ZooKeeper.<init> Initiating client connection, connectString=127.0.0.1:43688/solr sessionTimeout=5000 watcher=org.apache.solr.common.cloud.ConnectionManager@316fdd71
[junit4:junit4]   2> 4425 T1051 oaz.ClientCnxn$SendThread.startConnect Opening socket connection to server /127.0.0.1:43688
[junit4:junit4]   2> 4425 T1006 oascc.ConnectionManager.waitForConnected Waiting for client to connect to ZooKeeper
[junit4:junit4]   2> 4426 T1051 oaz.ClientCnxn$SendThread.primeConnection Socket connection established to localhost/127.0.0.1:43688, initiating session
[junit4:junit4]   2> 4426 T1008 oazs.NIOServerCnxn$Factory.run Accepted socket connection from /140.211.11.196:40079
[junit4:junit4]   2> 4426 T1008 oazs.NIOServerCnxn.readConnectRequest Client attempting to establish new session at /140.211.11.196:40079
[junit4:junit4]   2> 4429 T1010 oazs.NIOServerCnxn.finishSessionInit Established session 0x139d5234ead0004 with negotiated timeout 5000 for client /140.211.11.196:40079
[junit4:junit4]   2> 4429 T1051 oaz.ClientCnxn$SendThread.readConnectResult Session establishment complete on server localhost/127.0.0.1:43688, sessionid = 0x139d5234ead0004, negotiated timeout = 5000
[junit4:junit4]   2> 4429 T1052 oascc.ConnectionManager.process Watcher org.apache.solr.common.cloud.ConnectionManager@316fdd71 name:ZooKeeperConnection Watcher:127.0.0.1:43688/solr got event WatchedEvent state:SyncConnected type:None path:null path:null type:None
[junit4:junit4]   2> 4429 T1006 oascc.ConnectionManager.waitForConnected Client is connected to ZooKeeper
[junit4:junit4]   2> 4430 T1011 oazs.PrepRequestProcessor.pRequest Got user-level KeeperException when processing sessionid:0x139d5234ead0004 type:create cxid:0x1 zxid:0xfffffffffffffffe txntype:unknown reqpath:n/a Error Path:/solr/overseer Error:KeeperErrorCode = NodeExists for /solr/overseer
[junit4:junit4]   2> 4440 T1011 oazs.PrepRequestProcessor.pRequest Got user-level KeeperException when processing sessionid:0x139d5234ead0004 type:create cxid:0x2 zxid:0xfffffffffffffffe txntype:unknown reqpath:n/a Error Path:/solr/overseer Error:KeeperErrorCode = NodeExists for /solr/overseer
[junit4:junit4]   2> 4442 T1006 oasc.ZkController.createEphemeralLiveNode Register node as live in ZooKeeper:/live_nodes/127.0.0.1:24191_solr
[junit4:junit4]   2> 4443 T1011 oazs.PrepRequestProcessor.pRequest Got user-level KeeperException when processing sessionid:0x139d5234ead0004 type:delete cxid:0x4 zxid:0xfffffffffffffffe txntype:unknown reqpath:n/a Error Path:/solr/live_nodes/127.0.0.1:24191_solr Error:KeeperErrorCode = NoNode for /solr/live_nodes/127.0.0.1:24191_solr
[junit4:junit4]   2> 4448 T1006 oascc.SolrZkClient.makePath makePath: /live_nodes/127.0.0.1:24191_solr
[junit4:junit4]   2> 4451 T1040 oascc.ZkStateReader$3.process Updating live nodes
[junit4:junit4]   2> 4451 T1026 oascc.ZkStateReader$3.process Updating live nodes
[junit4:junit4]   2> 4452 T1006 oashc.HttpShardHandlerFactory.getParameter Setting socketTimeout to: 0
[junit4:junit4]   2> 4453 T1006 oashc.HttpShardHandlerFactory.getParameter Setting urlScheme to: http://
[junit4:junit4]   2> 4453 T1006 oashc.HttpShardHandlerFactory.getParameter Setting connTimeout to: 0
[junit4:junit4]   2> 4454 T1006 oashc.HttpShardHandlerFactory.getParameter Setting maxConnectionsPerHost to: 20
[junit4:junit4]   2> 4454 T1006 oashc.HttpShardHandlerFactory.getParameter Setting corePoolSize to: 0
[junit4:junit4]   2> 4454 T1006 oashc.HttpShardHandlerFactory.getParameter Setting maximumPoolSize to: 2147483647
[junit4:junit4]   2> 4455 T1006 oashc.HttpShardHandlerFactory.getParameter Setting maxThreadIdleTime to: 5
[junit4:junit4]   2> 4455 T1006 oashc.HttpShardHandlerFactory.getParameter Setting sizeOfQueue to: -1
[junit4:junit4]   2> 4456 T1006 oashc.HttpShardHandlerFactory.getParameter Setting fairnessPolicy to: false
[junit4:junit4]   2> 4456 T1006 oascsi.HttpClientUtil.createClient Creating new http client, config:maxConnectionsPerHost=20&maxConnections=10000&socketTimeout=0&connTimeout=0&retry=false
[junit4:junit4]   2> 4474 T1006 oascc.ZkStateReader.createClusterStateWatchersAndUpdate Updating cluster state from ZooKeeper... 
[junit4:junit4]   2> 4481 T1006 oasc.CoreContainer.create Creating SolrCore 'collection1' using instanceDir: /usr/home/hudson/hudson-slave/workspace/Lucene-Solr-NightlyTests-4.x/solr/build/solr-core/test/J1/./solrtest-jetty2-1347900628774/collection1
[junit4:junit4]   2> 4481 T1006 oasc.ZkController.createCollectionZkNode Check for collection zkNode:collection1
[junit4:junit4]   2> 4482 T1006 oasc.ZkController.createCollectionZkNode Collection zkNode exists
[junit4:junit4]   2> 4482 T1006 oasc.ZkController.readConfigName Load collection config from:/collections/collection1
[junit4:junit4]   2> 4484 T1006 oasc.SolrResourceLoader.<init> new SolrResourceLoader for directory: '/usr/home/hudson/hudson-slave/workspace/Lucene-Solr-NightlyTests-4.x/solr/build/solr-core/test/J1/./solrtest-jetty2-1347900628774/collection1/'
[junit4:junit4]   2> 4485 T1006 oasc.SolrResourceLoader.replaceClassLoader Adding 'file:/usr/home/hudson/hudson-slave/workspace/Lucene-Solr-NightlyTests-4.x/solr/build/solr-core/test/J1/solrtest-jetty2-1347900628774/collection1/lib/classes/' to classloader
[junit4:junit4]   2> 4486 T1006 oasc.SolrResourceLoader.replaceClassLoader Adding 'file:/usr/home/hudson/hudson-slave/workspace/Lucene-Solr-NightlyTests-4.x/solr/build/solr-core/test/J1/solrtest-jetty2-1347900628774/collection1/lib/README' to classloader
[junit4:junit4]   2> 4534 T1006 oasc.SolrConfig.<init> Using Lucene MatchVersion: LUCENE_40
[junit4:junit4]   2> 4603 T1006 oasc.SolrConfig.<init> Loaded SolrConfig: solrconfig.xml
[junit4:junit4]   2> 4704 T1027 oascc.ZkStateReader.updateClusterState Updating cloud state from ZooKeeper... 
[junit4:junit4]   2> 4704 T1006 oass.IndexSchema.readSchema Reading Solr Schema
[junit4:junit4]   2> 4712 T1006 oass.IndexSchema.readSchema Schema name=test
[junit4:junit4]   2> 4920 T1040 oascc.ZkStateReader$2.process A cluster state change has occurred - updating...
[junit4:junit4]   2> 4920 T1026 oascc.ZkStateReader$2.process A cluster state change has occurred - updating...
[junit4:junit4]   2> 4920 T1052 oascc.ZkStateReader$2.process A cluster state change has occurred - updating...
[junit4:junit4]   2> 5461 T1006 oass.OpenExchangeRatesOrgProvider.init Initialized with rates=open-exchange-rates.json, refreshInterval=1440.
[junit4:junit4]   2> 5473 T1006 oass.IndexSchema.readSchema default search field in schema is text
[junit4:junit4]   2> 5478 T1006 oass.IndexSchema.readSchema unique key field: id
[junit4:junit4]   2> 5495 T1006 oass.FileExchangeRateProvider.reload Reloading exchange rates from file currency.xml
[junit4:junit4]   2> 5501 T1006 oass.FileExchangeRateProvider.reload Reloading exchange rates from file currency.xml
[junit4:junit4]   2> 5505 T1006 oass.OpenExchangeRatesOrgProvider.reload Reloading exchange rates from open-exchange-rates.json
[junit4:junit4]   2> 5507 T1006 oass.OpenExchangeRatesOrgProvider.reload Reloading exchange rates from open-exchange-rates.json
[junit4:junit4]   2> 5509 T1006 oasc.SolrCore.<init> [collection1] Opening new SolrCore at /usr/home/hudson/hudson-slave/workspace/Lucene-Solr-NightlyTests-4.x/solr/build/solr-core/test/J1/./solrtest-jetty2-1347900628774/collection1/, dataDir=./org.apache.solr.cloud.BasicDistributedZk2Test-1347900624551/jetty2/
[junit4:junit4]   2> 5509 T1006 oasc.JmxMonitoredMap.<init> JMX monitoring is enabled. Adding Solr mbeans to JMX Server: com.sun.jmx.mbeanserver.JmxMBeanServer@63a5ec6c
[junit4:junit4]   2> 5511 T1006 oasc.SolrCore.getNewIndexDir WARNING New index directory detected: old=null new=./org.apache.solr.cloud.BasicDistributedZk2Test-1347900624551/jetty2/index/
[junit4:junit4]   2> 5511 T1006 oasc.SolrCore.initIndex WARNING [collection1] Solr index directory './org.apache.solr.cloud.BasicDistributedZk2Test-1347900624551/jetty2/index' doesn't exist. Creating new index...
[junit4:junit4]   2> 5512 T1006 oasc.CachingDirectoryFactory.get return new directory for /usr/home/hudson/hudson-slave/workspace/Lucene-Solr-NightlyTests-4.x/solr/build/solr-core/test/J1/./org.apache.solr.cloud.BasicDistributedZk2Test-1347900624551/jetty2/index forceNew:false
[junit4:junit4]   2> 5544 T1006 oasc.SolrDeletionPolicy.onCommit SolrDeletionPolicy.onCommit: commits:num=1
[junit4:junit4]   2> 		commit{dir=NRTCachingDirectory(org.apache.lucene.store.NIOFSDirectory@/usr/home/hudson/hudson-slave/workspace/Lucene-Solr-NightlyTests-4.x/solr/build/solr-core/test/J1/org.apache.solr.cloud.BasicDistributedZk2Test-1347900624551/jetty2/index lockFactory=org.apache.lucene.store.NativeFSLockFactory@4d766b65; maxCacheMB=48.0 maxMergeSizeMB=4.0),segFN=segments_1,generation=1,filenames=[segments_1]
[junit4:junit4]   2> 5544 T1006 oasc.SolrDeletionPolicy.updateCommits newest commit = 1
[junit4:junit4]   2> 5545 T1006 oasc.SolrCore.initWriters created xml: solr.XMLResponseWriter
[junit4:junit4]   2> 5548 T1006 oasup.UpdateRequestProcessorChain.init inserting DistributedUpdateProcessorFactory into updateRequestProcessorChain "dedupe"
[junit4:junit4]   2> 5548 T1006 oasup.UpdateRequestProcessorChain.init inserting DistributedUpdateProcessorFactory into updateRequestProcessorChain "dedupe-allfields"
[junit4:junit4]   2> 5549 T1006 oasup.UpdateRequestProcessorChain.init inserting DistributedUpdateProcessorFactory into updateRequestProcessorChain "stored_sig"
[junit4:junit4]   2> 5549 T1006 oasup.UpdateRequestProcessorChain.init inserting DistributedUpdateProcessorFactory into updateRequestProcessorChain "uniq-fields"
[junit4:junit4]   2> 5550 T1006 oasup.UpdateRequestProcessorChain.init inserting DistributedUpdateProcessorFactory into updateRequestProcessorChain "distrib-dup-test-chain-implicit"
[junit4:junit4]   2> 5551 T1006 oasc.RequestHandlers.initHandlersFromConfig adding lazy requestHandler: solr.ReplicationHandler
[junit4:junit4]   2> 5552 T1006 oasc.RequestHandlers.initHandlersFromConfig created /replication: solr.ReplicationHandler
[junit4:junit4]   2> 5554 T1006 oasc.RequestHandlers.initHandlersFromConfig created standard: solr.StandardRequestHandler
[junit4:junit4]   2> 5555 T1006 oasc.RequestHandlers.initHandlersFromConfig created /get: solr.RealTimeGetHandler
[junit4:junit4]   2> 5556 T1006 oasc.RequestHandlers.initHandlersFromConfig created dismax: solr.SearchHandler
[junit4:junit4]   2> 5557 T1006 oasc.RequestHandlers.initHandlersFromConfig created mock: org.apache.solr.core.MockQuerySenderListenerReqHandler
[junit4:junit4]   2> 5558 T1006 oasc.RequestHandlers.initHandlersFromConfig created /admin/: org.apache.solr.handler.admin.AdminHandlers
[junit4:junit4]   2> 5559 T1006 oasc.RequestHandlers.initHandlersFromConfig created defaults: solr.StandardRequestHandler
[junit4:junit4]   2> 5560 T1006 oasc.RequestHandlers.initHandlersFromConfig adding lazy requestHandler: solr.StandardRequestHandler
[junit4:junit4]   2> 5561 T1006 oasc.RequestHandlers.initHandlersFromConfig created lazy: solr.StandardRequestHandler
[junit4:junit4]   2> 5562 T1006 oasc.RequestHandlers.initHandlersFromConfig created /update: solr.UpdateRequestHandler
[junit4:junit4]   2> 5563 T1006 oasc.RequestHandlers.initHandlersFromConfig created /terms: org.apache.solr.handler.component.SearchHandler
[junit4:junit4]   2> 5564 T1006 oasc.RequestHandlers.initHandlersFromConfig created spellCheckCompRH: org.apache.solr.handler.component.SearchHandler
[junit4:junit4]   2> 5565 T1006 oasc.RequestHandlers.initHandlersFromConfig created spellCheckCompRH_Direct: org.apache.solr.handler.component.SearchHandler
[junit4:junit4]   2> 5566 T1006 oasc.RequestHandlers.initHandlersFromConfig created spellCheckWithWordbreak: org.apache.solr.handler.component.SearchHandler
[junit4:junit4]   2> 5567 T1006 oasc.RequestHandlers.initHandlersFromConfig created spellCheckWithWordbreak_Direct: org.apache.solr.handler.component.SearchHandler
[junit4:junit4]   2> 5568 T1006 oasc.RequestHandlers.initHandlersFromConfig created spellCheckCompRH1: org.apache.solr.handler.component.SearchHandler
[junit4:junit4]   2> 5569 T1006 oasc.RequestHandlers.initHandlersFromConfig created tvrh: org.apache.solr.handler.component.SearchHandler
[junit4:junit4]   2> 5570 T1006 oasc.RequestHandlers.initHandlersFromConfig created /mlt: solr.MoreLikeThisHandler
[junit4:junit4]   2> 5571 T1006 oasc.RequestHandlers.initHandlersFromConfig created /debug/dump: solr.DumpRequestHandler
[junit4:junit4]   2> 5578 T1006 oashl.XMLLoader.init xsltCacheLifetimeSeconds=60
[junit4:junit4]   2> 5585 T1006 oasc.SolrCore.initDeprecatedSupport WARNING solrconfig.xml uses deprecated <admin/gettableFiles>, Please update your config to use the ShowFileRequestHandler.
[junit4:junit4]   2> 5588 T1006 oasc.SolrCore.initDeprecatedSupport WARNING adding ShowFileRequestHandler with hidden files: [SCHEMA.XML, OLD_SYNONYMS.TXT, STOPWORDS.TXT, PROTWORDS.TXT, OPEN-EXCHANGE-RATES.JSON, SYNONYMS.TXT, CURRENCY.XML, MAPPING-ISOLATIN1ACCENT.TXT]
[junit4:junit4]   2> 5596 T1006 oass.SolrIndexSearcher.<init> Opening Searcher@755d3bd main
[junit4:junit4]   2> 5598 T1006 oasu.CommitTracker.<init> Hard AutoCommit: disabled
[junit4:junit4]   2> 5598 T1006 oasu.CommitTracker.<init> Soft AutoCommit: disabled
[junit4:junit4]   2> 5599 T1006 oashc.SpellCheckComponent.inform Initializing spell checkers
[junit4:junit4]   2> 5814 T1006 oass.DirectSolrSpellChecker.init init: {name=direct,classname=DirectSolrSpellChecker,field=lowerfilt,minQueryLength=3}
[junit4:junit4]   2> 5950 T1053 oasc.SolrCore.registerSearcher [collection1] Registered new searcher Searcher@755d3bd main{StandardDirectoryReader(segments_1:1)}
[junit4:junit4]   2> 6434 T1027 oascc.ZkStateReader.updateClusterState Updating cloud state from ZooKeeper... 
[junit4:junit4]   2> 6449 T1040 oascc.ZkStateReader$2.process A cluster state change has occurred - updating...
[junit4:junit4]   2> 6449 T1052 oascc.ZkStateReader$2.process A cluster state change has occurred - updating...
[junit4:junit4]   2> 6449 T1026 oascc.ZkStateReader$2.process A cluster state change has occurred - updating...
[junit4:junit4]   2> 6458 T1006 oasc.CoreContainer.register registering core: collection1
[junit4:junit4]   2> 6458 T1006 oasc.ZkController.register Register shard - core:collection1 address:http://127.0.0.1:24191/solr shardId:shard2
[junit4:junit4]   2> 6459 T1006 oascc.SolrZkClient.makePath makePath: /collections/collection1/leader_elect/shard2/election
[junit4:junit4]   2> 6473 T1011 oazs.PrepRequestProcessor.pRequest Got user-level KeeperException when processing sessionid:0x139d5234ead0004 type:delete cxid:0x42 zxid:0xfffffffffffffffe txntype:unknown reqpath:n/a Error Path:/solr/collections/collection1/leaders/shard2 Error:KeeperErrorCode = NoNode for /solr/collections/collection1/leaders/shard2
[junit4:junit4]   2> 6474 T1006 oasc.ShardLeaderElectionContext.runLeaderProcess Running the leader process.
[junit4:junit4]   2> 6474 T1011 oazs.PrepRequestProcessor.pRequest Got user-level KeeperException when processing sessionid:0x139d5234ead0004 type:create cxid:0x43 zxid:0xfffffffffffffffe txntype:unknown reqpath:n/a Error Path:/solr/overseer Error:KeeperErrorCode = NodeExists for /solr/overseer
[junit4:junit4]   2> 6485 T1006 oasc.ShardLeaderElectionContext.waitForReplicasToComeUp Enough replicas found to continue.
[junit4:junit4]   2> 6485 T1006 oasc.ShardLeaderElectionContext.runLeaderProcess I may be the new leader - try and sync
[junit4:junit4]   2> 6486 T1006 oasc.SyncStrategy.sync Sync replicas to http://127.0.0.1:24191/solr/collection1/
[junit4:junit4]   2> 6486 T1006 oasc.SyncStrategy.syncReplicas Sync Success - now sync replicas to me
[junit4:junit4]   2> 6486 T1006 oasc.SyncStrategy.syncToMe http://127.0.0.1:24191/solr/collection1/ has no replicas
[junit4:junit4]   2> 6486 T1006 oasc.ShardLeaderElectionContext.runLeaderProcess I am the new leader: http://127.0.0.1:24191/solr/collection1/
[junit4:junit4]   2> 6487 T1006 oascc.SolrZkClient.makePath makePath: /collections/collection1/leaders/shard2
[junit4:junit4]   2> 6490 T1011 oazs.PrepRequestProcessor.pRequest Got user-level KeeperException when processing sessionid:0x139d5234ead0004 type:create cxid:0x4c zxid:0xfffffffffffffffe txntype:unknown reqpath:n/a Error Path:/solr/overseer Error:KeeperErrorCode = NodeExists for /solr/overseer
[junit4:junit4]   2> 6953 T1027 oascc.ZkStateReader.updateClusterState Updating cloud state from ZooKeeper... 
[junit4:junit4]   2> 6970 T1040 oascc.ZkStateReader$2.process A cluster state change has occurred - updating...
[junit4:junit4]   2> 6971 T1026 oascc.ZkStateReader$2.process A cluster state change has occurred - updating...
[junit4:junit4]   2> 6971 T1052 oascc.ZkStateReader$2.process A cluster state change has occurred - updating...
[junit4:junit4]   2> 7002 T1006 oasc.ZkController.register We are http://127.0.0.1:24191/solr/collection1/ and leader is http://127.0.0.1:24191/solr/collection1/
[junit4:junit4]   2> 7002 T1006 oasc.ZkController.register No LogReplay needed for core=collection1 baseURL=http://127.0.0.1:24191/solr
[junit4:junit4]   2> 7003 T1006 oasc.ZkController.checkRecovery I am the leader, no recovery necessary
[junit4:junit4]   2> 7005 T1006 oascc.ZkStateReader.updateClusterState Updating cloud state from ZooKeeper... 
[junit4:junit4]   2> 7006 T1006 oass.SolrDispatchFilter.init user.dir=/usr/home/hudson/hudson-slave/workspace/Lucene-Solr-NightlyTests-4.x/solr/build/solr-core/test/J1
[junit4:junit4]   2> 7006 T1006 oass.SolrDispatchFilter.init SolrDispatchFilter.init() done
[junit4:junit4]   2> 7007 T1006 oascsi.HttpClientUtil.createClient Creating new http client, config:maxConnections=128&maxConnectionsPerHost=32&followRedirects=false
[junit4:junit4]   2> 7186 T1006 oejs.Server.doStart jetty-8.1.2.v20120308
[junit4:junit4]   2> 7188 T1006 oejs.AbstractConnector.doStart Started SocketConnector@0.0.0.0:43223
[junit4:junit4]   2> 7189 T1006 oasc.SolrResourceLoader.locateSolrHome JNDI not configured for solr (NoInitialContextEx)
[junit4:junit4]   2> 7189 T1006 oasc.SolrResourceLoader.locateSolrHome using system property solr.solr.home: /usr/home/hudson/hudson-slave/workspace/Lucene-Solr-NightlyTests-4.x/solr/build/solr-core/test/J1/./solrtest-jetty3-1347900631567
[junit4:junit4]   2> 7190 T1006 oasc.SolrResourceLoader.<init> new SolrResourceLoader for deduced Solr Home: '/usr/home/hudson/hudson-slave/workspace/Lucene-Solr-NightlyTests-4.x/solr/build/solr-core/test/J1/./solrtest-jetty3-1347900631567/'
[junit4:junit4]   2> 7224 T1006 oass.SolrDispatchFilter.init SolrDispatchFilter.init()
[junit4:junit4]   2> 7224 T1006 oasc.SolrResourceLoader.locateSolrHome JNDI not configured for solr (NoInitialContextEx)
[junit4:junit4]   2> 7225 T1006 oasc.SolrResourceLoader.locateSolrHome using system property solr.solr.home: /usr/home/hudson/hudson-slave/workspace/Lucene-Solr-NightlyTests-4.x/solr/build/solr-core/test/J1/./solrtest-jetty3-1347900631567
[junit4:junit4]   2> 7225 T1006 oasc.CoreContainer$Initializer.initialize looking for solr.xml: /usr/home/hudson/hudson-slave/workspace/Lucene-Solr-NightlyTests-4.x/solr/build/solr-core/test/J1/./solrtest-jetty3-1347900631567/solr.xml
[junit4:junit4]   2> 7225 T1006 oasc.CoreContainer.<init> New CoreContainer 1113578462
[junit4:junit4]   2> 7226 T1006 oasc.CoreContainer.load Loading CoreContainer using Solr Home: '/usr/home/hudson/hudson-slave/workspace/Lucene-Solr-NightlyTests-4.x/solr/build/solr-core/test/J1/./solrtest-jetty3-1347900631567/'
[junit4:junit4]   2> 7226 T1006 oasc.SolrResourceLoader.<init> new SolrResourceLoader for directory: '/usr/home/hudson/hudson-slave/workspace/Lucene-Solr-NightlyTests-4.x/solr/build/solr-core/test/J1/./solrtest-jetty3-1347900631567/'
[junit4:junit4]   2> 7250 T1006 oasc.CoreContainer.load Registering Log Listener
[junit4:junit4]   2> 7265 T1006 oasc.CoreContainer.initZooKeeper Zookeeper client=127.0.0.1:43688/solr
[junit4:junit4]   2> 7265 T1006 oaz.ZooKeeper.<init> Initiating client connection, connectString=127.0.0.1:43688/solr sessionTimeout=5000 watcher=org.apache.solr.common.cloud.ConnectionManager@685d5a4d
[junit4:junit4]   2> 7266 T1063 oaz.ClientCnxn$SendThread.startConnect Opening socket connection to server /127.0.0.1:43688
[junit4:junit4]   2> 7266 T1006 oascc.ConnectionManager.waitForConnected Waiting for client to connect to ZooKeeper
[junit4:junit4]   2> 7267 T1063 oaz.ClientCnxn$SendThread.primeConnection Socket connection established to localhost/127.0.0.1:43688, initiating session
[junit4:junit4]   2> 7268 T1008 oazs.NIOServerCnxn$Factory.run Accepted socket connection from /140.211.11.196:11614
[junit4:junit4]   2> 7268 T1008 oazs.NIOServerCnxn.readConnectRequest Client attempting to establish new session at /140.211.11.196:11614
[junit4:junit4]   2> 7270 T1010 oazs.NIOServerCnxn.finishSessionInit Established session 0x139d5234ead0005 with negotiated timeout 5000 for client /140.211.11.196:11614
[junit4:junit4]   2> 7270 T1063 oaz.ClientCnxn$SendThread.readConnectResult Session establishment complete on server localhost/127.0.0.1:43688, sessionid = 0x139d5234ead0005, negotiated timeout = 5000
[junit4:junit4]   2> 7271 T1064 oascc.ConnectionManager.process Watcher org.apache.solr.common.cloud.ConnectionManager@685d5a4d name:ZooKeeperConnection Watcher:127.0.0.1:43688/solr got event WatchedEvent state:SyncConnected type:None path:null path:null type:None
[junit4:junit4]   2> 7271 T1006 oascc.ConnectionManager.waitForConnected Client is connected to ZooKeeper
[junit4:junit4]   2> 7272 T1011 oazs.PrepRequestProcessor.pRequest Got user-level KeeperException when processing sessionid:0x139d5234ead0005 type:create cxid:0x1 zxid:0xfffffffffffffffe txntype:unknown reqpath:n/a Error Path:/solr/overseer Error:KeeperErrorCode = NodeExists for /solr/overseer
[junit4:junit4]   2> 7273 T1011 oazs.PrepRequestProcessor.pRequest Got user-level KeeperException when processing sessionid:0x139d5234ead0005 type:create cxid:0x2 zxid:0xfffffffffffffffe txntype:unknown reqpath:n/a Error Path:/solr/overseer Error:KeeperErrorCode = NodeExists for /solr/overseer
[junit4:junit4]   2> 7274 T1006 oasc.ZkController.createEphemeralLiveNode Register node as live in ZooKeeper:/live_nodes/127.0.0.1:43223_solr
[junit4:junit4]   2> 7275 T1011 oazs.PrepRequestProcessor.pRequest Got user-level KeeperException when processing sessionid:0x139d5234ead0005 type:delete cxid:0x4 zxid:0xfffffffffffffffe txntype:unknown reqpath:n/a Error Path:/solr/live_nodes/127.0.0.1:43223_solr Error:KeeperErrorCode = NoNode for /solr/live_nodes/127.0.0.1:43223_solr
[junit4:junit4]   2> 7276 T1006 oascc.SolrZkClient.makePath makePath: /live_nodes/127.0.0.1:43223_solr
[junit4:junit4]   2> 7285 T1040 oascc.ZkStateReader$3.process Updating live nodes
[junit4:junit4]   2> 7285 T1052 oascc.ZkStateReader$3.process Updating live nodes
[junit4:junit4]   2> 7285 T1026 oascc.ZkStateReader$3.process Updating live nodes
[junit4:junit4]   2> 7286 T1006 oashc.HttpShardHandlerFactory.getParameter Setting socketTimeout to: 0
[junit4:junit4]   2> 7286 T1006 oashc.HttpShardHandlerFactory.getParameter Setting urlScheme to: http://
[junit4:junit4]   2> 7287 T1006 oashc.HttpShardHandlerFactory.getParameter Setting connTimeout to: 0
[junit4:junit4]   2> 7287 T1006 oashc.HttpShardHandlerFactory.getParameter Setting maxConnectionsPerHost to: 20
[junit4:junit4]   2> 7287 T1006 oashc.HttpShardHandlerFactory.getParameter Setting corePoolSize to: 0
[junit4:junit4]   2> 7288 T1006 oashc.HttpShardHandlerFactory.getParameter Setting maximumPoolSize to: 2147483647
[junit4:junit4]   2> 7288 T1006 oashc.HttpShardHandlerFactory.getParameter Setting maxThreadIdleTime to: 5
[junit4:junit4]   2> 7288 T1006 oashc.HttpShardHandlerFactory.getParameter Setting sizeOfQueue to: -1
[junit4:junit4]   2> 7288 T1006 oashc.HttpShardHandlerFactory.getParameter Setting fairnessPolicy to: false
[junit4:junit4]   2> 7289 T1006 oascsi.HttpClientUtil.createClient Creating new http client, config:maxConnectionsPerHost=20&maxConnections=10000&socketTimeout=0&connTimeout=0&retry=false
[junit4:junit4]   2> 7302 T1006 oascc.ZkStateReader.createClusterStateWatchersAndUpdate Updating cluster state from ZooKeeper... 
[junit4:junit4]   2> 7306 T1006 oasc.CoreContainer.create Creating SolrCore 'collection1' using instanceDir: /usr/home/hudson/hudson-slave/workspace/Lucene-Solr-NightlyTests-4.x/solr/build/solr-core/test/J1/./solrtest-jetty3-1347900631567/collection1
[junit4:junit4]   2> 7307 T1006 oasc.ZkController.createCollectionZkNode Check for collection zkNode:collection1
[junit4:junit4]   2> 7307 T1006 oasc.ZkController.createCollectionZkNode Collection zkNode exists
[junit4:junit4]   2> 7307 T1006 oasc.ZkController.readConfigName Load collection config from:/collections/collection1
[junit4:junit4]   2> 7309 T1006 oasc.SolrResourceLoader.<init> new SolrResourceLoader for directory: '/usr/home/hudson/hudson-slave/workspace/Lucene-Solr-NightlyTests-4.x/solr/build/solr-core/test/J1/./solrtest-jetty3-1347900631567/collection1/'
[junit4:junit4]   2> 7309 T1006 oasc.SolrResourceLoader.replaceClassLoader Adding 'file:/usr/home/hudson/hudson-slave/workspace/Lucene-Solr-NightlyTests-4.x/solr/build/solr-core/test/J1/solrtest-jetty3-1347900631567/collection1/lib/README' to classloader
[junit4:junit4]   2> 7310 T1006 oasc.SolrResourceLoader.replaceClassLoader Adding 'file:/usr/home/hudson/hudson-slave/workspace/Lucene-Solr-NightlyTests-4.x/solr/build/solr-core/test/J1/solrtest-jetty3-1347900631567/collection1/lib/classes/' to classloader
[junit4:junit4]   2> 7343 T1006 oasc.SolrConfig.<init> Using Lucene MatchVersion: LUCENE_40
[junit4:junit4]   2> 7389 T1006 oasc.SolrConfig.<init> Loaded SolrConfig: solrconfig.xml
[junit4:junit4]   2> 7484 T1027 oascc.ZkStateReader.updateClusterState Updating cloud state from ZooKeeper... 
[junit4:junit4]   2> 7490 T1006 oass.IndexSchema.readSchema Reading Solr Schema
[junit4:junit4]   2> 7495 T1006 oass.IndexSchema.readSchema Schema name=test
[junit4:junit4]   2> 7496 T1040 oascc.ZkStateReader$2.process A cluster state change has occurred - updating...
[junit4:junit4]   2> 7497 T1064 oascc.ZkStateReader$2.process A cluster state change has occurred - updating...
[junit4:junit4]   2> 7496 T1052 oascc.ZkStateReader$2.process A cluster state change has occurred - updating...
[junit4:junit4]   2> 7496 T1026 oascc.ZkStateReader$2.process A cluster state change has occurred - updating...
[junit4:junit4]   2> 7901 T1006 oass.OpenExchangeRatesOrgProvider.init Initialized with rates=open-exchange-rates.json, refreshInterval=1440.
[junit4:junit4]   2> 7909 T1006 oass.IndexSchema.readSchema default search field in schema is text
[junit4:junit4]   2> 7912 T1006 oass.IndexSchema.readSchema unique key field: id
[junit4:junit4]   2> 7925 T1006 oass.FileExchangeRateProvider.reload Reloading exchange rates from file currency.xml
[junit4:junit4]   2> 7929 T1006 oass.FileExchangeRateProvider.reload Reloading exchange rates from file currency.xml
[junit4:junit4]   2> 7932 T1006 oass.OpenExchangeRatesOrgProvider.reload Reloading exchange rates from open-exchange-rates.json
[junit4:junit4]   2> 7933 T1006 oass.OpenExchangeRatesOrgProvider.reload Reloading exchange rates from open-exchange-rates.json
[junit4:junit4]   2> 7934 T1006 oasc.SolrCore.<init> [collection1] Opening new SolrCore at /usr/home/hudson/hudson-slave/workspace/Lucene-Solr-NightlyTests-4.x/solr/build/solr-core/test/J1/./solrtest-jetty3-1347900631567/collection1/, dataDir=./org.apache.solr.cloud.BasicDistributedZk2Test-1347900624551/jetty3/
[junit4:junit4]   2> 7934 T1006 oasc.JmxMonitoredMap.<init> JMX monitoring is enabled. Adding Solr mbeans to JMX Server: com.sun.jmx.mbeanserver.JmxMBeanServer@63a5ec6c
[junit4:junit4]   2> 7935 T1006 oasc.SolrCore.getNewIndexDir WARNING New index directory detected: old=null new=./org.apache.solr.cloud.BasicDistributedZk2Test-1347900624551/jetty3/index/
[junit4:junit4]   2> 7936 T1006 oasc.SolrCore.initIndex WARNING [collection1] Solr index directory './org.apache.solr.cloud.BasicDistributedZk2Test-1347900624551/jetty3/index' doesn't exist. Creating new index...
[junit4:junit4]   2> 7936 T1006 oasc.CachingDirectoryFactory.get return new directory for /usr/home/hudson/hudson-slave/workspace/Lucene-Solr-NightlyTests-4.x/solr/build/solr-core/test/J1/./org.apache.solr.cloud.BasicDistributedZk2Test-1347900624551/jetty3/index forceNew:false
[junit4:junit4]   2> 7941 T1006 oasc.SolrDeletionPolicy.onCommit SolrDeletionPolicy.onCommit: commits:num=1
[junit4:junit4]   2> 		commit{dir=NRTCachingDirectory(org.apache.lucene.store.NIOFSDirectory@/usr/home/hudson/hudson-slave/workspace/Lucene-Solr-NightlyTests-4.x/solr/build/solr-core/test/J1/org.apache.solr.cloud.BasicDistributedZk2Test-1347900624551/jetty3/index lockFactory=org.apache.lucene.store.NativeFSLockFactory@792c68e3; maxCacheMB=48.0 maxMergeSizeMB=4.0),segFN=segments_1,generation=1,filenames=[segments_1]
[junit4:junit4]   2> 7942 T1006 oasc.SolrDeletionPolicy.updateCommits newest commit = 1
[junit4:junit4]   2> 7942 T1006 oasc.SolrCore.initWriters created xml: solr.XMLResponseWriter
[junit4:junit4]   2> 7944 T1006 oasup.UpdateRequestProcessorChain.init inserting DistributedUpdateProcessorFactory into updateRequestProcessorChain "dedupe"
[junit4:junit4]   2> 7944 T1006 oasup.UpdateRequestProcessorChain.init inserting DistributedUpdateProcessorFactory into updateRequestProcessorChain "dedupe-allfields"
[junit4:junit4]   2> 7945 T1006 oasup.UpdateRequestProcessorChain.init inserting DistributedUpdateProcessorFactory into updateRequestProcessorChain "stored_sig"
[junit4:junit4]   2> 7945 T1006 oasup.UpdateRequestProcessorChain.init inserting DistributedUpdateProcessorFactory into updateRequestProcessorChain "uniq-fields"
[junit4:junit4]   2> 7946 T1006 oasup.UpdateRequestProcessorChain.init inserting DistributedUpdateProcessorFactory into updateRequestProcessorChain "distrib-dup-test-chain-implicit"
[junit4:junit4]   2> 7946 T1006 oasc.RequestHandlers.initHandlersFromConfig adding lazy requestHandler: solr.ReplicationHandler
[junit4:junit4]   2> 7946 T1006 oasc.RequestHandlers.initHandlersFromConfig created /replication: solr.ReplicationHandler
[junit4:junit4]   2> 7947 T1006 oasc.RequestHandlers.initHandlersFromConfig created standard: solr.StandardRequestHandler
[junit4:junit4]   2> 7947 T1006 oasc.RequestHandlers.initHandlersFromConfig created /get: solr.RealTimeGetHandler
[junit4:junit4]   2> 7948 T1006 oasc.RequestHandlers.initHandlersFromConfig created dismax: solr.SearchHandler
[junit4:junit4]   2> 7948 T1006 oasc.RequestHandlers.initHandlersFromConfig created mock: org.apache.solr.core.MockQuerySenderListenerReqHandler
[junit4:junit4]   2> 7949 T1006 oasc.RequestHandlers.initHandlersFromConfig created /admin/: org.apache.solr.handler.admin.AdminHandlers
[junit4:junit4]   2> 7949 T1006 oasc.RequestHandlers.initHandlersFromConfig created defaults: solr.StandardRequestHandler
[junit4:junit4]   2> 7949 T1006 oasc.RequestHandlers.initHandlersFromConfig adding lazy requestHandler: solr.StandardRequestHandler
[junit4:junit4]   2> 7950 T1006 oasc.RequestHandlers.initHandlersFromConfig created lazy: solr.StandardRequestHandler
[junit4:junit4]   2> 7950 T1006 oasc.RequestHandlers.initHandlersFromConfig created /update: solr.UpdateRequestHandler
[junit4:junit4]   2> 7951 T1006 oasc.RequestHandlers.initHandlersFromConfig created /terms: org.apache.solr.handler.component.SearchHandler
[junit4:junit4]   2> 7951 T1006 oasc.RequestHandlers.initHandlersFromConfig created spellCheckCompRH: org.apache.solr.handler.component.SearchHandler
[junit4:junit4]   2> 7952 T1006 oasc.RequestHandlers.initHandlersFromConfig created spellCheckCompRH_Direct: org.apache.solr.handler.component.SearchHandler
[junit4:junit4]   2> 7952 T1006 oasc.RequestHandlers.initHandlersFromConfig created spellCheckWithWordbreak: org.apache.solr.handler.component.SearchHandler
[junit4:junit4]   2> 7952 T1006 oasc.RequestHandlers.initHandlersFromConfig created spellCheckWithWordbreak_Direct: org.apache.solr.handler.component.SearchHandler
[junit4:junit4]   2> 7953 T1006 oasc.RequestHandlers.initHandlersFromConfig created spellCheckCompRH1: org.apache.solr.handler.component.SearchHandler
[junit4:junit4]   2> 7953 T1006 oasc.RequestHandlers.initHandlersFromConfig created tvrh: org.apache.solr.handler.component.SearchHandler
[junit4:junit4]   2> 7954 T1006 oasc.RequestHandlers.initHandlersFromConfig created /mlt: solr.MoreLikeThisHandler
[junit4:junit4]   2> 7954 T1006 oasc.RequestHandlers.initHandlersFromConfig created /debug/dump: solr.DumpRequestHandler
[junit4:junit4]   2> 7957 T1006 oashl.XMLLoader.init xsltCacheLifetimeSeconds=60
[junit4:junit4]   2> 7960 T1006 oasc.SolrCore.initDeprecatedSupport WARNING solrconfig.xml uses deprecated <admin/gettableFiles>, Please update your config to use the ShowFileRequestHandler.
[junit4:junit4]   2> 7961 T1006 oasc.SolrCore.initDeprecatedSupport WARNING adding ShowFileRequestHandler with hidden files: [SCHEMA.XML, OLD_SYNONYMS.TXT, STOPWORDS.TXT, PROTWORDS.TXT, OPEN-EXCHANGE-RATES.JSON, SYNONYMS.TXT, CURRENCY.XML, MAPPING-ISOLATIN1ACCENT.TXT]
[junit4:junit4]   2> 7964 T1006 oass.SolrIndexSearcher.<init> Opening Searcher@45d7d2e1 main
[junit4:junit4]   2> 7965 T1006 oasu.CommitTracker.<init> Hard AutoCommit: disabled
[junit4:junit4]   2> 7965 T1006 oasu.CommitTracker.<init> Soft AutoCommit: disabled
[junit4:junit4]   2> 7965 T1006 oashc.SpellCheckComponent.inform Initializing spell checkers
[junit4:junit4]   2> 7971 T1006 oass.DirectSolrSpellChecker.init init: {name=direct,classname=DirectSolrSpellChecker,field=lowerfilt,minQueryLength=3}
[junit4:junit4]   2> 8028 T1065 oasc.SolrCore.registerSearcher [collection1] Registered new searcher Searcher@45d7d2e1 main{StandardDirectoryReader(segments_1:1)}
[junit4:junit4]   2> 8504 T1027 oascc.ZkStateReader.updateClusterState Updating cloud state from ZooKeeper... 
[junit4:junit4]   2> 8517 T1040 oascc.ZkStateReader$2.process A cluster state change has occurred - updating...
[junit4:junit4]   2> 8517 T1052 oascc.ZkStateReader$2.process A cluster state change has occurred - updating...
[junit4:junit4]   2> 8517 T1064 oascc.ZkStateReader$2.process A cluster state change has occurred - updating...
[junit4:junit4]   2> 8517 T1026 oascc.ZkStateReader$2.process A cluster state change has occurred - updating...
[junit4:junit4]   2> 8536 T1006 oasc.CoreContainer.register registering core: collection1
[junit4:junit4]   2> 8536 T1006 oasc.ZkController.register Register shard - core:collection1 address:http://127.0.0.1:43223/solr shardId:shard1
[junit4:junit4]   2> 8539 T1006 oasc.ZkController.register We are http://127.0.0.1:43223/solr/collection1/ and leader is http://127.0.0.1:52839/solr/collection1/
[junit4:junit4]   2> 8540 T1006 oasc.ZkController.register No LogReplay needed for core=collection1 baseURL=http://127.0.0.1:43223/solr
[junit4:junit4]   2> 8540 T1006 oasc.ZkController.checkRecovery Core needs to recover:collection1
[junit4:junit4]   2> 8541 T1006 oasu.DefaultSolrCoreState.doRecovery Running recovery - first canceling any ongoing recovery
[junit4:junit4]   2> ASYNC  NEW_CORE C25 name=collection1 org.apache.solr.core.SolrCore@5c7b2c0c url=http://127.0.0.1:43223/solr/collection1 node=127.0.0.1:43223_solr
[junit4:junit4]   2> 8548 T1066 C25 P43223 oasc.RecoveryStrategy.run Starting recovery process.  core=collection1 recoveringAfterStartup=true
[junit4:junit4]   2> 8548 T1006 oascc.ZkStateReader.updateClusterState Updating cloud state from ZooKeeper... 
[junit4:junit4]   2> 8548 T1066 C25 P43223 oasc.RecoveryStrategy.doRecovery ###### startupVersions=[]
[junit4:junit4]   2> 8549 T1006 oass.SolrDispatchFilter.init user.dir=/usr/home/hudson/hudson-slave/workspace/Lucene-Solr-NightlyTests-4.x/solr/build/solr-core/test/J1
[junit4:junit4]   2> 8549 T1006 oass.SolrDispatchFilter.init SolrDispatchFilter.init() done
[junit4:junit4]   2> 8550 T1066 C25 P43223 oasc.RecoveryStrategy.doRecovery Attempting to PeerSync from http://127.0.0.1:52839/solr/collection1/ core=collection1 - recoveringAfterStartup=true
[junit4:junit4]   2> 8550 T1006 oascsi.HttpClientUtil.createClient Creating new http client, config:maxConnections=128&maxConnectionsPerHost=32&followRedirects=false
[junit4:junit4]   2> 8559 T1066 C25 P43223 oascsi.HttpClientUtil.createClient Creating new http client, config:maxConnectionsPerHost=20&maxConnections=10000&connTimeout=30000&socketTimeout=30000&retry=false
[junit4:junit4]   2> 8580 T1066 C25 P43223 oasu.PeerSync.sync PeerSync: core=collection1 url=http://127.0.0.1:43223/solr START replicas=[http://127.0.0.1:52839/solr/collection1/] nUpdates=100
[junit4:junit4]   2> 8580 T1066 C25 P43223 oasu.PeerSync.sync WARNING no frame of reference to tell of we've missed updates
[junit4:junit4]   2> 8583 T1066 C25 P43223 oasc.RecoveryStrategy.doRecovery PeerSync Recovery was not successful - trying replication. core=collection1
[junit4:junit4]   2> 8584 T1066 C25 P43223 oasc.RecoveryStrategy.doRecovery Starting Replication Recovery. core=collection1
[junit4:junit4]   2> 8584 T1066 C25 P43223 oascsi.HttpClientUtil.createClient Creating new http client, config:maxConnections=128&maxConnectionsPerHost=32&followRedirects=false
[junit4:junit4]   2> ASYNC  NEW_CORE C26 name=collection1 org.apache.solr.core.SolrCore@6561b973 url=http://127.0.0.1:52839/solr/collection1 node=127.0.0.1:52839_solr
[junit4:junit4]   2> 8592 T1032 C26 P52839 REQ /get {distrib=false&qt=/get&wt=javabin&version=2&getVersions=100} status=0 QTime=0 
[junit4:junit4]   2> 8737 T1006 oejs.Server.doStart jetty-8.1.2.v20120308
[junit4:junit4]   2> 8740 T1006 oejs.AbstractConnector.doStart Started SocketConnector@0.0.0.0:43693
[junit4:junit4]   2> 8741 T1006 oasc.SolrResourceLoader.locateSolrHome JNDI not configured for solr (NoInitialContextEx)
[junit4:junit4]   2> 8741 T1006 oasc.SolrResourceLoader.locateSolrHome using system property solr.solr.home: /usr/home/hudson/hudson-slave/workspace/Lucene-Solr-NightlyTests-4.x/solr/build/solr-core/test/J1/./solrtest-jetty4-1347900633112
[junit4:junit4]   2> 8742 T1006 oasc.SolrResourceLoader.<init> new SolrResourceLoader for deduced Solr Home: '/usr/home/hudson/hudson-slave/workspace/Lucene-Solr-NightlyTests-4.x/solr/build/solr-core/test/J1/./solrtest-jetty4-1347900633112/'
[junit4:junit4]   2> 8776 T1006 oass.SolrDispatchFilter.init SolrDispatchFilter.init()
[junit4:junit4]   2> 8776 T1006 oasc.SolrResourceLoader.locateSolrHome JNDI not configured for solr (NoInitialContextEx)
[junit4:junit4]   2> 8776 T1006 oasc.SolrResourceLoader.locateSolrHome using system property solr.solr.home: /usr/home/hudson/hudson-slave/workspace/Lucene-Solr-NightlyTests-4.x/solr/build/solr-core/test/J1/./solrtest-jetty4-1347900633112
[junit4:junit4]   2> 8777 T1006 oasc.CoreContainer$Initializer.initialize looking for solr.xml: /usr/home/hudson/hudson-slave/workspace/Lucene-Solr-NightlyTests-4.x/solr/build/solr-core/test/J1/./solrtest-jetty4-1347900633112/solr.xml
[junit4:junit4]   2> 8777 T1006 oasc.CoreContainer.<init> New CoreContainer 1795095532
[junit4:junit4]   2> 8778 T1006 oasc.CoreContainer.load Loading CoreContainer using Solr Home: '/usr/home/hudson/hudson-slave/workspace/Lucene-Solr-NightlyTests-4.x/solr/build/solr-core/test/J1/./solrtest-jetty4-1347900633112/'
[junit4:junit4]   2> 8778 T1006 oasc.SolrResourceLoader.<init> new SolrResourceLoader for directory: '/usr/home/hudson/hudson-slave/workspace/Lucene-Solr-NightlyTests-4.x/solr/build/solr-core/test/J1/./solrtest-jetty4-1347900633112/'
[junit4:junit4]   2> 8803 T1006 oasc.CoreContainer.load Registering Log Listener
[junit4:junit4]   2> 8817 T1006 oasc.CoreContainer.initZooKeeper Zookeeper client=127.0.0.1:43688/solr
[junit4:junit4]   2> 8818 T1006 oaz.ZooKeeper.<init> Initiating client connection, connectString=127.0.0.1:43688/solr sessionTimeout=5000 watcher=org.apache.solr.common.cloud.ConnectionManager@6479943b
[junit4:junit4]   2> 8819 T1077 oaz.ClientCnxn$SendThread.startConnect Opening socket connection to server /127.0.0.1:43688
[junit4:junit4]   2> 8819 T1006 oascc.ConnectionManager.waitForConnected Waiting for client to connect to ZooKeeper
[junit4:junit4]   2> 8820 T1077 oaz.ClientCnxn$SendThread.primeConnection Socket connection established to localhost/127.0.0.1:43688, initiating session
[junit4:junit4]   2> 8820 T1008 oazs.NIOServerCnxn$Factory.run Accepted socket connection from /140.211.11.196:16468
[junit4:junit4]   2> 8820 T1008 oazs.NIOServerCnxn.readConnectRequest Client attempting to establish new session at /140.211.11.196:16468
[junit4:junit4]   2> 8823 T1010 oazs.NIOServerCnxn.finishSessionInit Established session 0x139d5234ead0006 with negotiated timeout 5000 for client /140.211.11.196:16468
[junit4:junit4]   2> 8823 T1077 oaz.ClientCnxn$SendThread.readConnectResult Session establishment complete on server localhost/127.0.0.1:43688, sessionid = 0x139d5234ead0006, negotiated timeout = 5000
[junit4:junit4]   2> 8823 T1078 oascc.ConnectionManager.process Watcher org.apache.solr.common.cloud.ConnectionManager@6479943b name:ZooKeeperConnection Watcher:127.0.0.1:43688/solr got event WatchedEvent state:SyncConnected type:None path:null path:null type:None
[junit4:junit4]   2> 8823 T1006 oascc.ConnectionManager.waitForConnected Client is connected to ZooKeeper
[junit4:junit4]   2> 8824 T1011 oazs.PrepRequestProcessor.pRequest Got user-level KeeperException when processing sessionid:0x139d5234ead0006 type:create cxid:0x1 zxid:0xfffffffffffffffe txntype:unknown reqpath:n/a Error Path:/solr/overseer Error:KeeperErrorCode = NodeExists for /solr/overseer
[junit4:junit4]   2> 8837 T1011 oazs.PrepRequestProcessor.pRequest Got user-level KeeperException when processing sessionid:0x139d5234ead0006 type:create cxid:0x2 zxid:0xfffffffffffffffe txntype:unknown reqpath:n/a Error Path:/solr/overseer Error:KeeperErrorCode = NodeExists for /solr/overseer
[junit4:junit4]   2> 8838 T1006 oasc.ZkController.createEphemeralLiveNode Register node as live in ZooKeeper:/live_nodes/127.0.0.1:43693_solr
[junit4:junit4]   2> 8839 T1011 oazs.PrepRequestProcessor.pRequest Got user-level KeeperException when processing sessionid:0x139d5234ead0006 type:delete cxid:0x4 zxid:0xfffffffffffffffe txntype:unknown reqpath:n/a Error Path:/solr/live_nodes/127.0.0.1:43693_solr Error:KeeperErrorCode = NoNode for /solr/live_nodes/127.0.0.1:43693_solr
[junit4:junit4]   2> 8840 T1006 oascc.SolrZkClient.makePath makePath: /live_nodes/127.0.0.1:43693_solr
[junit4:junit4]   2> 8842 T1052 oascc.ZkStateReader$3.process Updating live nodes
[junit4:junit4]   2> 8842 T1040 oascc.ZkStateReader$3.process Updating live nodes
[junit4:junit4]   2> 8842 T1064 oascc.ZkStateReader$3.process Updating live nodes
[junit4:junit4]   2> 8842 T1026 oascc.ZkStateReader$3.process Updating live nodes
[junit4:junit4]   2> 8843 T1006 oashc.HttpShardHandlerFactory.getParameter Setting socketTimeout to: 0
[junit4:junit4]   2> 8844 T1006 oashc.HttpShardHandlerFactory.getParameter Setting urlScheme to: http://
[junit4:junit4]   2> 8844 T1006 oashc.HttpShardHandlerFactory.getParameter Setting connTimeout to: 0
[junit4:junit4]   2> 8845 T1006 oashc.HttpShardHandlerFactory.getParameter Setting maxConnectionsPerHost to: 20
[junit4:junit4]   2> 8845 T1006 oashc.HttpShardHandlerFactory.getParameter Setting corePoolSize to: 0
[junit4:junit4]   2> 8845 T1006 oashc.HttpShardHandlerFactory.getParameter Setting maximumPoolSize to: 2147483647
[junit4:junit4]   2> 8846 T1006 oashc.HttpShardHandlerFactory.getParameter Setting maxThreadIdleTime to: 5
[junit4:junit4]   2> 8846 T1006 oashc.HttpShardHandlerFactory.getParameter Setting sizeOfQueue to: -1
[junit4:junit4]   2> 8847 T1006 oashc.HttpShardHandlerFactory.getParameter Setting fairnessPolicy to: false
[junit4:junit4]   2> 8847 T1006 oascsi.HttpClientUtil.createClient Creating new http client, config:maxConnectionsPerHost=20&maxConnections=10000&socketTimeout=0&connTimeout=0&retry=false
[junit4:junit4]   2> 8866 T1006 oascc.ZkStateReader.createClusterStateWatchersAndUpdate Updating cluster state from ZooKeeper... 
[junit4:junit4]   2> 8872 T1006 oasc.CoreContainer.create Creating SolrCore 'collection1' using instanceDir: /usr/home/hudson/hudson-slave/workspace/Lucene-Solr-NightlyTests-4.x/solr/build/solr-core/test/J1/./solrtest-jetty4-1347900633112/collection1
[junit4:junit4]   2> 8873 T1006 oasc.ZkController.createCollectionZkNode Check for collection zkNode:collection1
[junit4:junit4]   2> 8874 T1006 oasc.ZkController.createCollectionZkNode Collection zkNode exists
[junit4:junit4]   2> 8874 T1006 oasc.ZkController.readConfigName Load collection config from:/collections/collection1
[junit4:junit4]   2> 8876 T1006 oasc.SolrResourceLoader.<init> new SolrResourceLoader for directory: '/usr/home/hudson/hudson-slave/workspace/Lucene-Solr-NightlyTests-4.x/solr/build/solr-core/test/J1/./solrtest-jetty4-1347900633112/collection1/'
[junit4:junit4]   2> 8877 T1006 oasc.SolrResourceLoader.replaceClassLoader Adding 'file:/usr/home/hudson/hudson-slave/workspace/Lucene-Solr-NightlyTests-4.x/solr/build/solr-core/test/J1/solrtest-jetty4-1347900633112/collection1/lib/README' to classloader
[junit4:junit4]   2> 8878 T1006 oasc.SolrResourceLoader.replaceClassLoader Adding 'file:/usr/home/hudson/hudson-slave/workspace/Lucene-Solr-NightlyTests-4.x/solr/build/solr-core/test/J1/solrtest-jetty4-1347900633112/collection1/lib/classes/' to classloader
[junit4:junit4]   2> 8926 T1006 oasc.SolrConfig.<init> Using Lucene MatchVersion: LUCENE_40
[junit4:junit4]   2> 8994 T1006 oasc.SolrConfig.<init> Loaded SolrConfig: solrconfig.xml
[junit4:junit4]   2> 9022 T1027 oascc.ZkStateReader.updateClusterState Updating cloud state from ZooKeeper... 
[junit4:junit4]   2> 9028 T1040 oascc.ZkStateReader$2.process A cluster state change has occurred - updating...
[junit4:junit4]   2> 9028 T1064 oascc.ZkStateReader$2.process A cluster state change has occurred - updating...
[junit4:junit4]   2> 9028 T1026 oascc.ZkStateReader$2.process A cluster state change has occurred - updating...
[junit4:junit4]   2> 9028 T1052 oascc.ZkStateReader$2.process A cluster state change has occurred - updating...
[junit4:junit4]   2> 9095 T1078 oascc.ZkStateReader$2.process A cluster state change has occurred - updating...
[junit4:junit4]   2> 9095 T1006 oass.IndexSchema.readSchema Reading Solr Schema
[junit4:junit4]   2> 9104 T1006 oass.IndexSchema.readSchema Schema name=test
[junit4:junit4]   2> 9709 T1006 oass.OpenExchangeRatesOrgProvider.init Initialized with rates=open-exchange-rates.json, refreshInterval=1440.
[junit4:junit4]   2> 9721 T1006 oass.IndexSchema.readSchema default search field in schema is text
[junit4:junit4]   2> 9726 T1006 oass.IndexSchema.readSchema unique key field: id
[junit4:junit4]   2> 9743 T1006 oass.FileExchangeRateProvider.reload Reloading exchange rates from file currency.xml
[junit4:junit4]   2> 9748 T1006 oass.FileExchangeRateProvider.reload Reloading exchange rates from file currency.xml
[junit4:junit4]   2> 9753 T1006 oass.OpenExchangeRatesOrgProvider.reload Reloading exchange rates from open-exchange-rates.json
[junit4:junit4]   2> 9754 T1006 oass.OpenExchangeRatesOrgProvider.reload Reloading exchange rates from open-exchange-rates.json
[junit4:junit4]   2> 9756 T1006 oasc.SolrCore.<init> [collection1] Opening new SolrCore at /usr/home/hudson/hudson-slave/workspace/Lucene-Solr-NightlyTests-4.x/solr/build/solr-core/test/J1/./solrtest-jetty4-1347900633112/collection1/, dataDir=./org.apache.solr.cloud.BasicDistributedZk2Test-1347900624551/jetty4/
[junit4:junit4]   2> 9756 T1006 oasc.JmxMonitoredMap.<init> JMX monitoring is enabled. Adding Solr mbeans to JMX Server: com.sun.jmx.mbeanserver.JmxMBeanServer@63a5ec6c
[junit4:junit4]   2> 9758 T1006 oasc.SolrCore.getNewIndexDir WARNING New index directory detected: old=null new=./org.apache.solr.cloud.BasicDistributedZk2Test-1347900624551/jetty4/index/
[junit4:junit4]   2> 9758 T1006 oasc.SolrCore.initIndex WARNING [collection1] Solr index directory './org.apache.solr.cloud.BasicDistributedZk2Test-1347900624551/jetty4/index' doesn't exist. Creating new index...
[junit4:junit4]   2> 9759 T1006 oasc.CachingDirectoryFactory.get return new directory for /usr/home/hudson/hudson-slave/workspace/Lucene-Solr-NightlyTests-4.x/solr/build/solr-core/test/J1/./org.apache.solr.cloud.BasicDistributedZk2Test-1347900624551/jetty4/index forceNew:false
[junit4:junit4]   2> 9768 T1006 oasc.SolrDeletionPolicy.onCommit SolrDeletionPolicy.onCommit: commits:num=1
[junit4:junit4]   2> 		commit{dir=NRTCachingDirectory(org.apache.lucene.store.NIOFSDirectory@/usr/home/hudson/hudson-slave/workspace/Lucene-Solr-NightlyTests-4.x/solr/build/solr-core/test/J1/org.apache.solr.cloud.BasicDistributedZk2Test-1347900624551/jetty4/index lockFactory=org.apache.lucene.store.NativeFSLockFactory@5aa112de; maxCacheMB=48.0 maxMergeSizeMB=4.0),segFN=segments_1,generation=1,filenames=[segments_1]
[junit4:junit4]   2> 9768 T1006 oasc.SolrDeletionPolicy.updateCommits newest commit = 1
[junit4:junit4]   2> 9769 T1006 oasc.SolrCore.initWriters created xml: solr.XMLResponseWriter
[junit4:junit4]   2> 9772 T1006 oasup.UpdateRequestProcessorChain.init inserting DistributedUpdateProcessorFactory into updateRequestProcessorChain "dedupe"
[junit4:junit4]   2> 9772 T1006 oasup.UpdateRequestProcessorChain.init inserting DistributedUpdateProcessorFactory into updateRequestProcessorChain "dedupe-allfields"
[junit4:junit4]   2> 9773 T1006 oasup.UpdateRequestProcessorChain.init inserting DistributedUpdateProcessorFactory into updateRequestProcessorChain "stored_sig"
[junit4:junit4]   2> 9774 T1006 oasup.UpdateRequestProcessorChain.init inserting DistributedUpdateProcessorFactory into updateRequestProcessorChain "uniq-fields"
[junit4:junit4]   2> 9774 T1006 oasup.UpdateRequestProcessorChain.init inserting DistributedUpdateProcessorFactory into updateRequestProcessorChain "distrib-dup-test-chain-implicit"
[junit4:junit4]   2> 9775 T1006 oasc.RequestHandlers.initHandlersFromConfig adding lazy requestHandler: solr.ReplicationHandler
[junit4:junit4]   2> 9775 T1006 oasc.RequestHandlers.initHandlersFromConfig created /replication: solr.ReplicationHandler
[junit4:junit4]   2> 9776 T1006 oasc.RequestHandlers.initHandlersFromConfig created standard: solr.StandardRequestHandler
[junit4:junit4]   2> 9777 T1006 oasc.RequestHandlers.initHandlersFromConfig created /get: solr.RealTimeGetHandler
[junit4:junit4]   2> 9778 T1006 oasc.RequestHandlers.initHandlersFromConfig created dismax: solr.SearchHandler
[junit4:junit4]   2> 9778 T1006 oasc.RequestHandlers.initHandlersFromConfig created mock: org.apache.solr.core.MockQuerySenderListenerReqHandler
[junit4:junit4]   2> 9779 T1006 oasc.RequestHandlers.initHandlersFromConfig created /admin/: org.apache.solr.handler.admin.AdminHandlers
[junit4:junit4]   2> 9780 T1006 oasc.RequestHandlers.initHandlersFromConfig created defaults: solr.StandardRequestHandler
[junit4:junit4]   2> 9780 T1006 oasc.RequestHandlers.initHandlersFromConfig adding lazy requestHandler: solr.StandardRequestHandler
[junit4:junit4]   2> 9781 T1006 oasc.RequestHandlers.initHandlersFromConfig created lazy: solr.StandardRequestHandler
[junit4:junit4]   2> 9781 T1006 oasc.RequestHandlers.initHandlersFromConfig created /update: solr.UpdateRequestHandler
[junit4:junit4]   2> 9782 T1006 oasc.RequestHandlers.initHandlersFromConfig created /terms: org.apache.solr.handler.component.SearchHandler
[junit4:junit4]   2> 9783 T1006 oasc.RequestHandlers.initHandlersFromConfig created spellCheckCompRH: org.apache.solr.handler.component.SearchHandler
[junit4:junit4]   2> 9784 T1006 oasc.RequestHandlers.initHandlersFromConfig created spellCheckCompRH_Direct: org.apache.solr.handler.component.SearchHandler
[junit4:junit4]   2> 9784 T1006 oasc.RequestHandlers.initHandlersFromConfig created spellCheckWithWordbreak: org.apache.solr.handler.component.SearchHandler
[junit4:junit4]   2> 9785 T1006 oasc.RequestHandlers.initHandlersFromConfig created spellCheckWithWordbreak_Direct: org.apache.solr.handler.component.SearchHandler
[junit4:junit4]   2> 9786 T1006 oasc.RequestHandlers.initHandlersFromConfig created spellCheckCompRH1: org.apache.solr.handler.component.SearchHandler
[junit4:junit4]   2> 9786 T1006 oasc.RequestHandlers.initHandlersFromConfig created tvrh: org.apache.solr.handler.component.SearchHandler
[junit4:junit4]   2> 9787 T1006 oasc.RequestHandlers.initHandlersFromConfig created /mlt: solr.MoreLikeThisHandler
[junit4:junit4]   2> 9788 T1006 oasc.RequestHandlers.initHandlersFromConfig created /debug/dump: solr.DumpRequestHandler
[junit4:junit4]   2> 9792 T1006 oashl.XMLLoader.init xsltCacheLifetimeSeconds=60
[junit4:junit4]   2> 9797 T1006 oasc.SolrCore.initDeprecatedSupport WARNING solrconfig.xml uses deprecated <admin/gettableFiles>, Please update your config to use the ShowFileRequestHandler.
[junit4:junit4]   2> 9798 T1006 oasc.SolrCore.initDeprecatedSupport WARNING adding ShowFileRequestHandler with hidden files: [SCHEMA.XML, OLD_SYNONYMS.TXT, STOPWORDS.TXT, PROTWORDS.TXT, OPEN-EXCHANGE-RATES.JSON, SYNONYMS.TXT, CURRENCY.XML, MAPPING-ISOLATIN1ACCENT.TXT]
[junit4:junit4]   2> 9802 T1006 oass.SolrIndexSearcher.<init> Opening Searcher@5870883 main
[junit4:junit4]   2> 9804 T1006 oasu.CommitTracker.<init> Hard AutoCommit: disabled
[junit4:junit4]   2> 9804 T1006 oasu.CommitTracker.<init> Soft AutoCommit: disabled
[junit4:junit4]   2> 9805 T1006 oashc.SpellCheckComponent.inform Initializing spell checkers
[junit4:junit4]   2> 9813 T1006 oass.DirectSolrSpellChecker.init init: {name=direct,classname=DirectSolrSpellChecker,field=lowerfilt,minQueryLength=3}
[junit4:junit4]   2> 9859 T1079 oasc.SolrCore.registerSearcher [collection1] Registered new searcher Searcher@5870883 main{StandardDirectoryReader(segments_1:1)}
[junit4:junit4]   2> 10042 T1027 oascc.ZkStateReader.updateClusterState Updating cloud state from ZooKeeper... 
[junit4:junit4]   2> 10056 T1040 oascc.ZkStateReader$2.process A cluster state change has occurred - updating...
[junit4:junit4]   2> 10056 T1064 oascc.ZkStateReader$2.process A cluster state change has occurred - updating...
[junit4:junit4]   2> 10056 T1026 oascc.ZkStateReader$2.process A cluster state change has occurred - updating...
[junit4:junit4]   2> 10056 T1078 oascc.ZkStateReader$2.process A cluster state change has occurred - updating...
[junit4:junit4]   2> 10056 T1052 oascc.ZkStateReader$2.process A cluster state change has occurred - updating...
[junit4:junit4]   2> 10368 T1006 oasc.CoreContainer.register registering core: collection1
[junit4:junit4]   2> 10368 T1006 oasc.ZkController.register Register shard - core:collection1 address:http://127.0.0.1:43693/solr shardId:shard2
[junit4:junit4]   2> 10372 T1006 oasc.ZkController.register We are http://127.0.0.1:43693/solr/collection1/ and leader is http://127.0.0.1:24191/solr/collection1/
[junit4:junit4]   2> 10372 T1006 oasc.ZkController.register No LogReplay needed for core=collection1 baseURL=http://127.0.0.1:43693/solr
[junit4:junit4]   2> 10372 T1006 oasc.ZkController.checkRecovery Core needs to recover:collection1
[junit4:junit4]   2> 10372 T1006 oasu.DefaultSolrCoreState.doRecovery Running recovery - first canceling any ongoing recovery
[junit4:junit4]   2> ASYNC  NEW_CORE C27 name=collection1 org.apache.solr.core.SolrCore@2d9d559a url=http://127.0.0.1:43693/solr/collection1 node=127.0.0.1:43693_solr
[junit4:junit4]   2> 10374 T1080 C27 P43693 oasc.RecoveryStrategy.run Starting recovery process.  core=collection1 recoveringAfterStartup=true
[junit4:junit4]   2> 10374 T1080 C27 P43693 oasc.RecoveryStrategy.doRecovery ###### startupVersions=[]
[junit4:junit4]   2> 10374 T1006 oascc.ZkStateReader.updateClusterState Updating cloud state from ZooKeeper... 
[junit4:junit4]   2> 10375 T1080 C27 P43693 oasc.RecoveryStrategy.doRecovery Attempting to PeerSync from http://127.0.0.1:24191/solr/collection1/ core=collection1 - recoveringAfterStartup=true
[junit4:junit4]   2> 10376 T1006 oass.SolrDispatchFilter.init user.dir=/usr/home/hudson/hudson-slave/workspace/Lucene-Solr-NightlyTests-4.x/solr/build/solr-core/test/J1
[junit4:junit4]   2> 10376 T1080 C27 P43693 oasu.PeerSync.sync PeerSync: core=collection1 url=http://127.0.0.1:43693/solr START replicas=[http://127.0.0.1:24191/solr/collection1/] nUpdates=100
[junit4:junit4]   2> 10376 T1006 oass.SolrDispatchFilter.init SolrDispatchFilter.init() done
[junit4:junit4]   2> 10376 T1080 C27 P43693 oasu.PeerSync.sync WARNING no frame of reference to tell of we've missed updates
[junit4:junit4]   2> 10376 T1006 oascsi.HttpClientUtil.createClient Creating new http client, config:maxConnections=128&maxConnectionsPerHost=32&followRedirects=false
[junit4:junit4]   2> 10555 T1080 C27 P43693 oasc.RecoveryStrategy.doRecovery PeerSync Recovery was not successful - trying replication. core=collection1
[junit4:junit4]   2> 10556 T1080 C27 P43693 oasc.RecoveryStrategy.doRecovery Starting Replication Recovery. core=collection1
[junit4:junit4]   2> 10556 T1080 C27 P43693 oascsi.HttpClientUtil.createClient Creating new http client, config:maxConnections=128&maxConnectionsPerHost=32&followRedirects=false
[junit4:junit4]   2> 10561 T1027 oascc.ZkStateReader.updateClusterState Updating cloud state from ZooKeeper... 
[junit4:junit4]   2> ASYNC  NEW_CORE C28 name=collection1 org.apache.solr.core.SolrCore@6c3bc03a url=http://127.0.0.1:24191/solr/collection1 node=127.0.0.1:24191_solr
[junit4:junit4]   2> 10563 T1044 C28 P24191 REQ /get {distrib=false&qt=/get&wt=javabin&version=2&getVersions=100} status=0 QTime=0 
[junit4:junit4]   2> 10576 T1006 oaz.ZooKeeper.<init> Initiating client connection, connectString=127.0.0.1:43688/solr sessionTimeout=10000 watcher=org.apache.solr.common.cloud.ConnectionManager@15cea3eb
[junit4:junit4]   2> 10577 T1082 oaz.ClientCnxn$SendThread.startConnect Opening socket connection to server /127.0.0.1:43688
[junit4:junit4]   2> 10577 T1006 oascc.ConnectionManager.waitForConnected Waiting for client to connect to ZooKeeper
[junit4:junit4]   2> 10578 T1082 oaz.ClientCnxn$SendThread.primeConnection Socket connection established to localhost/127.0.0.1:43688, initiating session
[junit4:junit4]   2> 10578 T1008 oazs.NIOServerCnxn$Factory.run Accepted socket connection from /140.211.11.196:62986
[junit4:junit4]   2> 10578 T1008 oazs.NIOServerCnxn.readConnectRequest Client attempting to establish new session at /140.211.11.196:62986
[junit4:junit4]   2> 10632 T1010 oazs.NIOServerCnxn.finishSessionInit Established session 0x139d5234ead0007 with negotiated timeout 10000 for client /140.211.11.196:62986
[junit4:junit4]   2> 10632 T1082 oaz.ClientCnxn$SendThread.readConnectResult Session establishment complete on server localhost/127.0.0.1:43688, sessionid = 0x139d5234ead0007, negotiated timeout = 10000
[junit4:junit4]   2> 10632 T1083 oascc.ConnectionManager.process Watcher org.apache.solr.common.cloud.ConnectionManager@15cea3eb name:ZooKeeperConnection Watcher:127.0.0.1:43688/solr got event WatchedEvent state:SyncConnected type:None path:null path:null type:None
[junit4:junit4]   2> 10633 T1006 oascc.ConnectionManager.waitForConnected Client is connected to ZooKeeper
[junit4:junit4]   2> 10634 T1006 oascc.ZkStateReader.createClusterStateWatchersAndUpdate Updating cluster state from ZooKeeper... 
[junit4:junit4]   2> 10659 T1040 oascc.ZkStateReader$2.process A cluster state change has occurred - updating...
[junit4:junit4]   2> 10659 T1052 oascc.ZkStateReader$2.process A cluster state change has occurred - updating...
[junit4:junit4]   2> 10659 T1064 oascc.ZkStateReader$2.process A cluster state change has occurred - updating...
[junit4:junit4]   2> 10659 T1078 oascc.ZkStateReader$2.process A cluster state change has occurred - updating...
[junit4:junit4]   2> 10659 T1026 oascc.ZkStateReader$2.process A cluster state change has occurred - updating...
[junit4:junit4]   2> 10662 T1006 oasc.ChaosMonkey.monkeyLog monkey: init - expire sessions:true cause connection loss:true
[junit4:junit4]   2> 10663 T1006 oascsi.HttpClientUtil.createClient Creating new http client, config:
[junit4:junit4]   2> 10674 T1006 oascc.ZkStateReader.updateClusterState Updating cloud state from ZooKeeper... 
[junit4:junit4]   2> ASYNC  NEW_CORE C29 name=collection1 org.apache.solr.core.SolrCore@63935d75 url=http://127.0.0.1:25025/solr/collection1 node=127.0.0.1:25025_solr
[junit4:junit4]   2> 10694 T1018 C29 P25025 oascsi.HttpClientUtil.createClient Creating new http client, config:maxConnections=500&maxConnectionsPerHost=16
[junit4:junit4]   2> 10712 T1018 C29 P25025 oasc.SolrDeletionPolicy.onInit SolrDeletionPolicy.onInit: commits:num=1
[junit4:junit4]   2> 		commit{dir=NRTCachingDirectory(org.apache.lucene.store.NIOFSDirectory@/usr/home/hudson/hudson-slave/workspace/Lucene-Solr-NightlyTests-4.x/solr/build/solr-core/test/J1/org.apache.solr.cloud.BasicDistributedZk2Test-1347900624551/control/data/index lockFactory=org.apache.lucene.store.NativeFSLockFactory@323af348; maxCacheMB=48.0 maxMergeSizeMB=4.0),segFN=segments_1,generation=1,filenames=[segments_1]
[junit4:junit4]   2> 10712 T1018 C29 P25025 oasc.SolrDeletionPolicy.updateCommits newest commit = 1
[junit4:junit4]   2> 10717 T1018 C29 P25025 /update {wt=javabin&version=2} {add=[1 (1413376256511049728)]} 0 35
[junit4:junit4]   2> 10718 T1006 oaz.ZooKeeper.<init> Initiating client connection, connectString=127.0.0.1:43688/solr sessionTimeout=10000 watcher=org.apache.solr.common.cloud.ConnectionManager@4f5c1769
[junit4:junit4]   2> 10719 T1084 oaz.ClientCnxn$SendThread.startConnect Opening socket connection to server /127.0.0.1:43688
[junit4:junit4]   2> 10719 T1006 oascc.ConnectionManager.waitForConnected Waiting for client to connect to ZooKeeper
[junit4:junit4]   2> 10720 T1084 oaz.ClientCnxn$SendThread.primeConnection Socket connection established to localhost/127.0.0.1:43688, initiating session
[junit4:junit4]   2> 10720 T1008 oazs.NIOServerCnxn$Factory.run Accepted socket connection from /140.211.11.196:35958
[junit4:junit4]   2> 10720 T1008 oazs.NIOServerCnxn.readConnectRequest Client attempting to establish new session at /140.211.11.196:35958
[junit4:junit4]   2> 10746 T1010 oazs.NIOServerCnxn.finishSessionInit Established session 0x139d5234ead0008 with negotiated timeout 10000 for client /140.211.11.196:35958
[junit4:junit4]   2> 10746 T1084 oaz.ClientCnxn$SendThread.readConnectResult Session establishment complete on server localhost/127.0.0.1:43688, sessionid = 0x139d5234ead0008, negotiated timeout = 10000
[junit4:junit4]   2> 10746 T1085 oascc.ConnectionManager.process Watcher org.apache.solr.common.cloud.ConnectionManager@4f5c1769 name:ZooKeeperConnection Watcher:127.0.0.1:43688/solr got event WatchedEvent state:SyncConnected type:None path:null path:null type:None
[junit4:junit4]   2> 10746 T1006 oascc.ConnectionManager.waitForConnected Client is connected to ZooKeeper
[junit4:junit4]   2> 10747 T1006 oascc.ZkStateReader.createClusterStateWatchersAndUpdate Updating cluster state from ZooKeeper... 
[junit4:junit4]   2> 10763 T1034 C26 P52839 oasc.SolrDeletionPolicy.onInit SolrDeletionPolicy.onInit: commits:num=1
[junit4:junit4]   2> 		commit{dir=NRTCachingDirectory(org.apache.lucene.store.NIOFSDirectory@/usr/home/hudson/hudson-slave/workspace/Lucene-Solr-NightlyTests-4.x/solr/build/solr-core/test/J1/org.apache.solr.cloud.BasicDistributedZk2Test-1347900624551/jetty1/index lockFactory=org.apache.lucene.store.NativeFSLockFactory@11887eb9; maxCacheMB=48.0 maxMergeSizeMB=4.0),segFN=segments_1,generation=1,filenames=[segments_1]
[junit4:junit4]   2> 10763 T1034 C26 P52839 oasc.SolrDeletionPolicy.updateCommits newest commit = 1
[junit4:junit4]   2>  C25_STATE=coll:collection1 core:collection1 props:{shard=shard1, roles=null, state=recovering, core=collection1, collection=collection1, node_name=127.0.0.1:43223_solr, base_url=http://127.0.0.1:43223/solr}
[junit4:junit4]   2> 10811 T1056 C25 P43223 oasc.SolrDeletionPolicy.onInit SolrDeletionPolicy.onInit: commits:num=1
[junit4:junit4]   2> 		commit{dir=NRTCachingDirectory(org.apache.lucene.store.NIOFSDirectory@/usr/home/hudson/hudson-slave/workspace/Lucene-Solr-NightlyTests-4.x/solr/build/solr-core/test/J1/org.apache.solr.cloud.BasicDistributedZk2Test-1347900624551/jetty3/index lockFactory=org.apache.lucene.store.NativeFSLockFactory@792c68e3; maxCacheMB=48.0 maxMergeSizeMB=4.0),segFN=segments_1,generation=1,filenames=[segments_1]
[junit4:junit4]   2> 10811 T1056 C25 P43223 oasc.SolrDeletionPolicy.updateCommits newest commit = 1
[junit4:junit4]   2> 10814 T1056 C25 P43223 REQ /update {distrib.from=http://127.0.0.1:52839/solr/collection1/&update.distrib=FROMLEADER&wt=javabin&version=2} status=0 QTime=7 
[junit4:junit4]   2> 10815 T1034 C26 P52839 /update {wt=javabin&version=2} {add=[1 (1413376256565575680)]} 0 64
[junit4:junit4]   2> 10815 T1006 oasc.AbstractDistribZkTestBase.waitForRecoveriesToFinish Wait for recoveries to finish - collection: collection1 failOnTimeout:true timeout (sec):3600
[junit4:junit4]   2> 10817 T1006 oascc.ZkStateReader.updateClusterState Updating cloud state from ZooKeeper... 
[junit4:junit4]   2> 11617 T1066 C25 P43223 oasc.RecoveryStrategy.doRecovery Begin buffering updates. core=collection1
[junit4:junit4]   2> 11617 T1066 C25 P43223 oasu.UpdateLog.bufferUpdates Starting to buffer updates. FSUpdateLog{state=ACTIVE, tlog=tlog{file=./org.apache.solr.cloud.BasicDistributedZk2Test-1347900624551/jetty3/tlog/tlog.0000000000000000000 refcount=1}}
[junit4:junit4]   2> 11617 T1066 C25 P43223 oasc.RecoveryStrategy.replicate Attempting to replicate from http://127.0.0.1:52839/solr/collection1/. core=collection1
[junit4:junit4]   2> 11617 T1066 C25 P43223 oascsi.HttpClientUtil.createClient Creating new http client, config:maxConnections=128&maxConnectionsPerHost=32&followRedirects=false
[junit4:junit4]   2> 11634 T1035 C26 P52839 oasu.DirectUpdateHandler2.commit start commit{flags=0,_version_=0,optimize=false,openSearcher=true,waitSearcher=true,expungeDeletes=false,softCommit=false}
[junit4:junit4]   2> 11772 T1035 C26 P52839 oasc.SolrDeletionPolicy.onCommit SolrDeletionPolicy.onCommit: commits:num=2
[junit4:junit4]   2> 		commit{dir=NRTCachingDirectory(org.apache.lucene.store.NIOFSDirectory@/usr/home/hudson/hudson-slave/workspace/Lucene-Solr-NightlyTests-4.x/solr/build/solr-core/test/J1/org.apache.solr.cloud.BasicDistributedZk2Test-1347900624551/jetty1/index lockFactory=org.apache.lucene.store.NativeFSLockFactory@11887eb9; maxCacheMB=48.0 maxMergeSizeMB=4.0),segFN=segments_1,generation=1,filenames=[segments_1]
[junit4:junit4]   2> 		commit{dir=NRTCachingDirectory(org.apache.lucene.store.NIOFSDirectory@/usr/home/hudson/hudson-slave/workspace/Lucene-Solr-NightlyTests-4.x/solr/build/solr-core/test/J1/org.apache.solr.cloud.BasicDistributedZk2Test-1347900624551/jetty1/index lockFactory=org.apache.lucene.store.NativeFSLockFactory@11887eb9; maxCacheMB=48.0 maxMergeSizeMB=4.0),segFN=segments_2,generation=2,filenames=[_0_Asserting_0.tim, _0_Asserting_0.tip, _0_Lucene40_0.prx, _0_MockFixedIntBlock_0.tib, _0_Asserting_0.prx, _0_MockFixedIntBlock_0.pyl, _0_MockFixedIntBlock_0.skp, _0_Lucene40_0.frq, _0_MockFixedIntBlock_0.tii, _0.si, _0_MockRandom_0.tib, _0_Lucene40_0.tim, _0.fnm, _0_MockFixedIntBlock_0.pos, _0_nrm.cfs, _0_MockRandom_0.skp, _0_Lucene40_0.tip, _0_MockFixedIntBlock_0.frq, _0_MockRandom_0.frq, _0_MockRandom_0.sd, _0_Asserting_0.frq, _0_MockRandom_0.doc, _0_MockFixedIntBlock_0.doc, _0_MockRandom_0.pos, _0_nrm.cfe, _0_MockRandom_0.tii, segments_2, _0.fdx, _0_MockRandom_0.pyl, _0.fdt]
[junit4:junit4]   2> 11773 T1035 C26 P52839 oasc.SolrDeletionPolicy.updateCommits newest commit = 2
[junit4:junit4]   2> 11810 T1035 C26 P52839 oass.SolrIndexSearcher.<init> Opening Searcher@12430cdb main
[junit4:junit4]   2> 11811 T1035 C26 P52839 oasu.DirectUpdateHandler2.commit end_commit_flush
[junit4:junit4]   2> 11813 T1041 oasc.SolrCore.registerSearcher [collection1] Registered new searcher Searcher@12430cdb main{StandardDirectoryReader(segments_2:3 _0(4.0.0.2):C1)}
[junit4:junit4]   2> 11813 T1035 C26 P52839 /update {waitSearcher=true&commit=true&commit_end_point=true&wt=javabin&softCommit=false&version=2} {commit=} 0 179
[junit4:junit4]   2> 11819 T1006 oascc.ZkStateReader.updateClusterState Updating cloud state from ZooKeeper... 
[junit4:junit4]   2> 11848 T1066 C25 P43223 oash.ReplicationHandler.inform Commits will be reserved for  10000
[junit4:junit4]   2> 11849 T1066 C25 P43223 oascsi.HttpClientUtil.createClient Creating new http client, config:connTimeout=5000&socketTimeout=20000&allowCompression=false&maxConnections=10000&maxConnectionsPerHost=10000
[junit4:junit4]   2> 11865 T1066 C25 P43223 oash.SnapPuller.<init>  No value set for 'pollInterval'. Timer Task not started.
[junit4:junit4]   2> 11866 T1036 C26 P52839 oash.ReplicationHandler.inform Commits will be reserved for  10000
[junit4:junit4]   2> 11867 T1036 C26 P52839 REQ /replication {command=indexversion&wt=javabin&qt=/replication&version=2} status=0 QTime=1 
[junit4:junit4]   2> 11868 T1066 C25 P43223 oash.SnapPuller.fetchLatestIndex Master's generation: 2
[junit4:junit4]   2> 11868 T1066 C25 P43223 oash.SnapPuller.fetchLatestIndex Slave's generation: 1
[junit4:junit4]   2> 11868 T1066 C25 P43223 oash.SnapPuller.fetchLatestIndex Starting replication process
[junit4:junit4]   2> 11873 T1036 C26 P52839 REQ /replication {command=filelist&generation=2&wt=javabin&qt=/replication&version=2} status=0 QTime=3 
[junit4:junit4]   2> 11874 T1066 C25 P43223 oash.SnapPuller.fetchLatestIndex Number of files in latest index in master: 30
[junit4:junit4]   2> 11880 T1066 C25 P43223 oash.SnapPuller.fetchLatestIndex Starting download to ./org.apache.solr.cloud.BasicDistributedZk2Test-1347900624551/jetty3/index.20120917175036420 fullCopy=true
[junit4:junit4]   2> 11890 T1036 C26 P52839 REQ /replication {file=_0_Asserting_0.tim&command=filecontent&checksum=true&generation=2&qt=/replication&wt=filestream} status=0 QTime=4 
[junit4:junit4]   2> 11903 T1036 C26 P52839 REQ /replication {file=_0_Asserting_0.tip&command=filecontent&checksum=true&generation=2&qt=/replication&wt=filestream} status=0 QTime=0 
[junit4:junit4]   2> 11908 T1036 C26 P52839 REQ /replication {file=_0_MockFixedIntBlock_0.tib&command=filecontent&checksum=true&generation=2&qt=/replication&wt=filestream} status=0 QTime=0 
[junit4:junit4]   2> 11912 T1036 C26 P52839 REQ /replication {file=_0_Lucene40_0.prx&command=filecontent&checksum=true&generation=2&qt=/replication&wt=filestream} status=0 QTime=0 
[junit4:junit4]   2> 11916 T1036 C26 P52839 REQ /replication {file=_0_Asserting_0.prx&command=filecontent&checksum=true&generation=2&qt=/replication&wt=filestream} status=0 QTime=0 
[junit4:junit4]   2> 11920 T1036 C26 P52839 REQ /replication {file=_0_MockFixedIntBlock_0.skp&command=filecontent&checksum=true&generation=2&qt=/replication&wt=filestream} status=0 QTime=0 
[junit4:junit4]   2> 11921 T1066 C25 P43223 oash.SnapPuller$FileFetcher.fetchPackets WARNING No content recieved for file: {name=_0_MockFixedIntBlock_0.skp, lastmodified=1347900636000, size=0}
[junit4:junit4]   2> 11924 T1036 C26 P52839 REQ /replication {file=_0_MockFixedIntBlock_0.pyl&command=filecontent&checksum=true&generation=2&qt=/replication&wt=filestream} status=0 QTime=0 
[junit4:junit4]   2> 11925 T1066 C25 P43223 oash.SnapPuller$FileFetcher.fetchPackets WARNING No content recieved for file: {name=_0_MockFixedIntBlock_0.pyl, lastmodified=1347900636000, size=0}
[junit4:junit4]   2> 11929 T1036 C26 P52839 REQ /replication {file=_0_Lucene40_0.frq&command=filecontent&checksum=true&generation=2&qt=/replication&wt=filestream} status=0 QTime=0 
[junit4:junit4]   2> 11933 T1036 C26 P52839 REQ /replication {file=_0_MockFixedIntBlock_0.tii&command=filecontent&checksum=true&generation=2&qt=/replication&wt=filestream} status=0 QTime=0 
[junit4:junit4]   2> 11937 T1036 C26 P52839 REQ /replication {file=_0.si&command=filecontent&checksum=true&generation=2&qt=/replication&wt=filestream} status=0 QTime=0 
[junit4:junit4]   2> 11941 T1036 C26 P52839 REQ /replication {file=_0_MockRandom_0.tib&command=filecontent&checksum=true&generation=2&qt=/replication&wt=filestream} status=0 QTime=0 
[junit4:junit4]   2> 11945 T1036 C26 P52839 REQ /replication {file=_0_Lucene40_0.tim&command=filecontent&checksum=true&generation=2&qt=/replication&wt=filestream} status=0 QTime=0 
[junit4:junit4]   2> 11949 T1036 C26 P52839 REQ /replication {file=_0.fnm&command=filecontent&checksum=true&generation=2&qt=/replication&wt=filestream} status=0 QTime=0 
[junit4:junit4]   2> 11953 T1036 C26 P52839 REQ /replication {file=_0_MockFixedIntBlock_0.pos&command=filecontent&checksum=true&generation=2&qt=/replication&wt=filestream} status=0 QTime=0 
[junit4:junit4]   2> 11957 T1036 C26 P52839 REQ /replication {file=_0_nrm.cfs&command=filecontent&checksum=true&generation=2&qt=/replication&wt=filestream} status=0 QTime=0 
[junit4:junit4]   2> 11961 T1036 C26 P52839 REQ /replication {file=_0_MockRandom_0.skp&command=filecontent&checksum=true&generation=2&qt=/replication&wt=filestream} status=0 QTime=0 
[junit4:junit4]   2> 11962 T1066 C25 P43223 oash.SnapPuller$FileFetcher.fetchPackets WARNING No content recieved for file: {name=_0_MockRandom_0.skp, lastmodified=1347900636000, size=0}
[junit4:junit4]   2> 11965 T1036 C26 P52839 REQ /replication {file=_0_Lucene40_0.tip&command=filecontent&checksum=true&generation=2&qt=/replication&wt=filestream} status=0 QTime=0 
[junit4:junit4]   2> 11969 T1036 C26 P52839 REQ /replication {file=_0_MockFixedIntBlock_0.frq&command=filecontent&checksum=true&generation=2&qt=/replication&wt=filestream} status=0 QTime=0 
[junit4:junit4]   2> 11973 T1036 C26 P52839 REQ /replication {file=_0_Asserting_0.frq&command=filecontent&checksum=true&generation=2&qt=/replication&wt=filestream} status=0 QTime=0 
[junit4:junit4]   2> 11977 T1036 C26 P52839 REQ /replication {file=_0_MockRandom_0.sd&command=filecontent&checksum=true&generation=2&qt=/replication&wt=filestream} status=0 QTime=0 
[junit4:junit4]   2> 11981 T1036 C26 P52839 REQ /replication {file=_0_MockRandom_0.frq&command=filecontent&checksum=true&generation=2&qt=/replication&wt=filestream} status=0 QTime=0 
[junit4:junit4]   2> 11986 T1036 C26 P52839 REQ /replication {file=_0_MockFixedIntBlock_0.doc&command=filecontent&checksum=true&generation=2&qt=/replication&wt=filestream} status=0 QTime=0 
[junit4:junit4]   2> 11990 T1036 C26 P52839 REQ /replication {file=_0_MockRandom_0.doc&command=filecontent&checksum=true&generation=2&qt=/replication&wt=filestream} status=0 QTime=0 
[junit4:junit4]   2> 11994 T1036 C26 P52839 REQ /replication {file=_0_nrm.cfe&command=filecontent&checksum=true&generation=2&qt=/replication&wt=filestream} status=0 QTime=0 
[junit4:junit4]   2> 11998 T1036 C26 P52839 REQ /replication {file=_0_MockRandom_0.pos&command=filecontent&checksum=true&generation=2&qt=/replication&wt=filestream} status=0 QTime=0 
[junit4:junit4]   2> 12002 T1036 C26 P52839 REQ /replication {file=segments_2&command=filecontent&checksum=true&generation=2&qt=/replication&wt=filestream} status=0 QTime=0 
[junit4:junit4]   2> 12006 T1036 C26 P52839 REQ /replication {file=_0_MockRandom_0.tii&command=filecontent&checksum=true&generation=2&qt=/replication&wt=filestream} status=0 QTime=0 
[junit4:junit4]   2> 12010 T1036 C26 P52839 REQ /replication {file=_0.fdx&command=filecontent&checksum=true&generation=2&qt=/replication&wt=filestream} status=0 QTime=0 
[junit4:junit4]   2> 12014 T1036 C26 P52839 REQ /replication {file=_0_MockRandom_0.pyl&command=filecontent&checksum=true&generation=2&qt=/replication&wt=filestream} status=0 QTime=0 
[junit4:junit4]   2> 12015 T1066 C25 P43223 oash.SnapPuller$FileFetcher.fetchPackets WARNING No content recieved for file: {name=_0_MockRandom_0.pyl, lastmodified=1347900636000, size=0}
[junit4:junit4]   2> 12018 T1036 C26 P52839 REQ /replication {file=_0.fdt&command=filecontent&checksum=true&generation=2&qt=/replication&wt=filestream} status=0 QTime=0 
[junit4:junit4]   2> 12019 T1066 C25 P43223 oash.SnapPuller.fetchLatestIndex Total time taken for download : 0 secs
[junit4:junit4]   2> 12019 T1066 C25 P43223 oash.SnapPuller.modifyIndexProps New index installed. Updating index properties... index=index.20120917175036420
[junit4:junit4]   2> 12025 T1066 C25 P43223 oasu.DefaultSolrCoreState.newIndexWriter Creating new IndexWriter...
[junit4:junit4]   2> 12026 T1066 C25 P43223 oasu.DefaultSolrCoreState.newIndexWriter Waiting until IndexWriter is unused... core=collection1
[junit4:junit4]   2> 12026 T1066 C25 P43223 oasu.DefaultSolrCoreState.newIndexWriter Rollback old IndexWriter... core=collection1
[junit4:junit4]   2> 12030 T1066 C25 P43223 oasc.SolrCore.getNewIndexDir WARNING New index directory detected: old=./org.apache.solr.cloud.BasicDistributedZk2Test-1347900624551/jetty3/index/ new=./org.apache.solr.cloud.BasicDistributedZk2Test-1347900624551/jetty3/index.20120917175036420
[junit4:junit4]   2> 12031 T1066 C25 P43223 oasc.CachingDirectoryFactory.get return new directory for /usr/home/hudson/hudson-slave/workspace/Lucene-Solr-NightlyTests-4.x/solr/build/solr-core/test/J1/./org.apache.solr.cloud.BasicDistributedZk2Test-1347900624551/jetty3/index.20120917175036420 forceNew:true
[junit4:junit4]   2> 12044 T1066 C25 P43223 oasc.SolrDeletionPolicy.onInit SolrDeletionPolicy.onInit: commits:num=1
[junit4:junit4]   2> 		commit{dir=NRTCachingDirectory(org.apache.lucene.store.NIOFSDirectory@/usr/home/hudson/hudson-slave/workspace/Lucene-Solr-NightlyTests-4.x/solr/build/solr-core/test/J1/org.apache.solr.cloud.BasicDistributedZk2Test-1347900624551/jetty3/index.20120917175036420 lockFactory=org.apache.lucene.store.NativeFSLockFactory@41c65839; maxCacheMB=48.0 maxMergeSizeMB=4.0),segFN=segments_2,generation=2,filenames=[_0_Asserting_0.tim, _0_Asserting_0.tip, _0_MockFixedIntBlock_0.tib, _0_Lucene40_0.prx, _0_Asserting_0.prx, _0_MockFixedIntBlock_0.skp, _0_MockFixedIntBlock_0.pyl, _0_Lucene40_0.frq, _0_MockFixedIntBlock_0.tii, _0.si, _0_MockRandom_0.tib, _0_Lucene40_0.tim, _0.fnm, _0_MockFixedIntBlock_0.pos, _0_nrm.cfs, _0_MockRandom_0.skp, _0_Lucene40_0.tip, _0_MockFixedIntBlock_0.frq, _0_MockRandom_0.frq, _0_MockRandom_0.sd, _0_Asserting_0.frq, _0_MockRandom_0.doc, _0_MockFixedIntBlock_0.doc, _0_MockRandom_0.pos, _0_nrm.cfe, _0_MockRandom_0.tii, segments_2, _0.fdx, _0_MockRandom_0.pyl, _0.fdt]
[junit4:junit4]   2> 12044 T1066 C25 P43223 oasc.SolrDeletionPolicy.updateCommits newest commit = 2
[junit4:junit4]   2> 12044 T1066 C25 P43223 oasu.DefaultSolrCoreState.newIndexWriter New IndexWriter is ready to be used.
[junit4:junit4]   2> 12051 T1066 C25 P43223 oass.SolrIndexSearcher.<init> Opening Searcher@38aa3647 main
[junit4:junit4]   2> 12053 T1065 oasc.SolrCore.registerSearcher [collection1] Registered new searcher Searcher@38aa3647 main{StandardDirectoryReader(segments_2:3:nrt _0(4.0.0.2):C1)}
[junit4:junit4]   2> 12054 T1065 oasc.CachingDirectoryFactory.close Closing directory:/usr/home/hudson/hudson-slave/workspace/Lucene-Solr-NightlyTests-4.x/solr/build/solr-core/test/J1/./org.apache.solr.cloud.BasicDistributedZk2Test-1347900624551/jetty3/index
[junit4:junit4]   2> 12054 T1065 oash.SnapPuller$2.onClose removing old index directory ./org.apache.solr.cloud.BasicDistributedZk2Test-1347900624551/jetty3/index
[junit4:junit4]   2> 12056 T1066 C25 P43223 oasu.DirectUpdateHandler2.commit start commit{flags=0,_version_=0,optimize=false,openSearcher=false,waitSearcher=false,expungeDeletes=false,softCommit=false}
[junit4:junit4]   2> 12057 T1066 C25 P43223 oasu.DirectUpdateHandler2.commit end_commit_flush
[junit4:junit4]   2> 12057 T1066 C25 P43223 oasc.RecoveryStrategy.replay Replaying buffered documents. core=collection1
[junit4:junit4]   2> 12057 T1088 C25 P43223 oasu.UpdateLog$LogReplayer.doReplay WARNING Starting log replay tlog{file=./org.apache.solr.cloud.BasicDistributedZk2Test-1347900624551/jetty3/tlog/tlog.0000000000000000000 refcount=2} active=true starting pos=437
[junit4:junit4]   2> 12057 T1088 C25 P43223 oasu.DirectUpdateHandler2.commit start commit{flags=2,_version_=0,optimize=false,openSearcher=true,waitSearcher=true,expungeDeletes=false,softCommit=false}
[junit4:junit4]   2> 12059 T1088 C25 P43223 oass.SolrIndexSearcher.<init> Opening Searcher@1a66421c main
[junit4:junit4]   2> 12059 T1088 C25 P43223 oasu.DirectUpdateHandler2.commit end_commit_flush
[junit4:junit4]   2> 12061 T1065 oasc.SolrCore.registerSearcher [collection1] Registered new searcher Searcher@1a66421c main{StandardDirectoryReader(segments_2:3:nrt _0(4.0.0.2):C1)}
[junit4:junit4]   2> 12061 T1088 C25 P43223 oasu.UpdateLog$LogReplayer.run WARNING Log replay finished. recoveryInfo=RecoveryInfo{adds=0 deletes=0 deleteByQuery=0 errors=0 positionOfStart=437}
[junit4:junit4]   2> 12061 T1066 C25 P43223 oasc.RecoveryStrategy.doRecovery Replication Recovery was successful - registering as Active. core=collection1
[junit4:junit4]   2> 12063 T1066 C25 P43223 oasc.RecoveryStrategy.doRecovery Finished recovery process. core=collection1
[junit4:junit4]   2> 12169 T1027 oascc.ZkStateReader.updateClusterState Updating cloud state from ZooKeeper... 
[junit4:junit4]   2> 12183 T1078 oascc.ZkStateReader$2.process A cluster state change has occurred - updating...
[junit4:junit4]   2> 12183 T1040 oascc.ZkStateReader$2.process A cluster state change has occurred - updating...
[junit4:junit4]   2> 12183 T1026 oascc.ZkStateReader$2.process A cluster state change has occurred - updating...
[junit4:junit4]   2> 12183 T1052 oascc.ZkStateReader$2.process A cluster state change has occurred - updating...
[junit4:junit4]   2> 12183 T1083 oascc.ZkStateReader$2.process A cluster state change has occurred - updating...
[junit4:junit4]   2> 12183 T1085 oascc.ZkStateReader$2.process A cluster state change has occurred - updating...
[junit4:junit4]   2> 12183 T1064 oascc.ZkStateReader$2.process A cluster state change has occurred - updating...
[junit4:junit4]   2> 12821 T1006 oascc.ZkStateReader.updateClusterState Updating cloud state from ZooKeeper... 
[junit4:junit4]   2>  C27_STATE=coll:collection1 core:collection1 props:{shard=shard2, roles=null, state=recovering, core=collection1, collection=collection1, node_name=127.0.0.1:43693_solr, base_url=http://127.0.0.1:43693/solr}
[junit4:junit4]   2> 13574 T1080 C27 P43693 oasc.RecoveryStrategy.doRecovery Begin buffering updates. core=collection1
[junit4:junit4]   2> 13574 T1080 C27 P43693 oasu.UpdateLog.bufferUpdates Starting to buffer updates. FSUpdateLog{state=ACTIVE, tlog=null}
[junit4:junit4]   2> 13574 T1080 C27 P43693 oasc.RecoveryStrategy.replicate Attempting to replicate from http://127.0.0.1:24191/solr/collection1/. core=collection1
[junit4:junit4]   2> 13574 T1080 C27 P43693 oascsi.HttpClientUtil.createClient Creating new http client, config:maxConnections=128&maxConnectionsPerHost=32&followRedirects=false
[junit4:junit4]   2> 13585 T1046 C28 P24191 oasu.DirectUpdateHandler2.commit start commit{flags=0,_version_=0,optimize=false,openSearcher=true,waitSearcher=true,expungeDeletes=false,softCommit=false}
[junit4:junit4]   2> 13592 T1046 C28 P24191 oasc.SolrDeletionPolicy.onInit SolrDeletionPolicy.onInit: commits:num=1
[junit4:junit4]   2> 		commit{dir=NRTCachingDirectory(org.apache.lucene.store.NIOFSDirectory@/usr/home/hudson/hudson-slave/workspace/Lucene-Solr-NightlyTests-4.x/solr/build/solr-core/test/J1/org.apache.solr.cloud.BasicDistributedZk2Test-1347900624551/jetty2/index lockFactory=org.apache.lucene.store.NativeFSLockFactory@4d766b65; maxCacheMB=48.0 maxMergeSizeMB=4.0),segFN=segments_1,generation=1,filenames=[segments_1]
[junit4:junit4]   2> 13592 T1046 C28 P24191 oasc.SolrDeletionPolicy.updateCommits newest commit = 1
[junit4:junit4]   2> 13594 T1046 C28 P24191 oass.SolrIndexSearcher.<init> Opening Searcher@63167bb8 main
[junit4:junit4]   2> 13595 T1046 C28 P24191 oasu.DirectUpdateHandler2.commit end_commit_flush
[junit4:junit4]   2> 13597 T1053 oasc.SolrCore.registerSearcher [collection1] Registered new searcher Searcher@63167bb8 main{StandardDirectoryReader(segments_1:1)}
[junit4:junit4]   2> 13597 T1046 C28 P24191 /update {waitSearcher=true&commit=true&commit_end_point=true&wt=javabin&softCommit=false&version=2} {commit=} 0 12
[junit4:junit4]   2> 13598 T1080 C27 P43693 oash.ReplicationHandler.inform Commits will be reserved for  10000
[junit4:junit4]   2> 13598 T1080 C27 P43693 oash.SnapPuller.<init>  No value set for 'pollInterval'. Timer Task not started.
[junit4:junit4]   2> 13600 T1047 C28 P24191 oash.ReplicationHandler.inform Commits will be reserved for  10000
[junit4:junit4]   2> 13600 T1047 C28 P24191 REQ /replication {command=indexversion&wt=javabin&qt=/replication&version=2} status=0 QTime=1 
[junit4:junit4]   2> 13603 T1080 C27 P43693 oasc.SolrDeletionPolicy.onInit SolrDeletionPolicy.onInit: commits:num=1
[junit4:junit4]   2> 		commit{dir=NRTCachingDirectory(org.apache.lucene.store.NIOFSDirectory@/usr/home/hudson/hudson-slave/workspace/Lucene-Solr-NightlyTests-4.x/solr/build/solr-core/test/J1/org.apache.solr.cloud.BasicDistributedZk2Test-1347900624551/jetty4/index lockFactory=org.apache.lucene.store.NativeFSLockFactory@5aa112de; maxCacheMB=48.0 maxMergeSizeMB=4.0),segFN=segments_1,generation=1,filenames=[segments_1]
[junit4:junit4]   2> 13604 T1080 C27 P43693 oasc.SolrDeletionPolicy.updateCommits newest commit = 1
[junit4:junit4]   2> 13604 T1080 C27 P43693 oasu.DirectUpdateHandler2.commit start commit{flags=0,_version_=0,optimize=false,openSearcher=true,waitSearcher=true,expungeDeletes=false,softCommit=false}
[junit4:junit4]   2> 13607 T1080 C27 P43693 oasc.SolrDeletionPolicy.onCommit SolrDeletionPolicy.onCommit: commits:num=2
[junit4:junit4]   2> 		commit{dir=NRTCachingDirectory(org.apache.lucene.store.NIOFSDirectory@/usr/home/hudson/hudson-slave/workspace/Lucene-Solr-NightlyTests-4.x/solr/build/solr-core/test/J1/org.apache.solr.cloud.BasicDistributedZk2Test-1347900624551/jetty4/index lockFactory=org.apache.lucene.store.NativeFSLockFactory@5aa112de; maxCacheMB=48.0 maxMergeSizeMB=4.0),segFN=segments_1,generation=1,filenames=[segments_1]
[junit4:junit4]   2> 		commit{dir=NRTCachingDirectory(org.apache.lucene.store.NIOFSDirectory@/usr/home/hudson/hudson-slave/workspace/Lucene-Solr-NightlyTests-4.x/solr/build/solr-core/test/J1/org.apache.solr.cloud.BasicDistributedZk2Test-1347900624551/jetty4/index lockFactory=org.apache.lucene.store.NativeFSLockFactory@5aa112de; maxCacheMB=48.0 maxMergeSizeMB=4.0),segFN=segments_2,generation=2,filenames=[segments_2]
[junit4:junit4]   2> 13607 T1080 C27 P43693 oasc.SolrDeletionPolicy.updateCommits newest commit = 2
[junit4:junit4]   2> 13609 T1080 C27 P43693 oass.SolrIndexSearcher.<init> Opening Searcher@4e2ff580 main
[junit4:junit4]   2> 13610 T1080 C27 P43693 oasu.DirectUpdateHandler2.commit end_commit_flush
[junit4:junit4]   2> 13611 T1079 oasc.SolrCore.registerSearcher [collection1] Registered new searcher Searcher@4e2ff580 main{StandardDirectoryReader(segments_2:2)}
[junit4:junit4]   2> 13611 T1080 C27 P43693 oasc.RecoveryStrategy.replay No replay needed. core=collection1
[junit4:junit4]   2> 13611 T1080 C27 P43693 oasc.RecoveryStrategy.doRecovery Replication Recovery was successful - registering as Active. core=collection1
[junit4:junit4]   2> 13619 T1080 C27 P43693 oasc.RecoveryStrategy.doRecovery Finished recovery process. core=collection1
[junit4:junit4]   2> 13693 T1027 oascc.ZkStateReader.updateClusterState Updating cloud state from ZooKeeper... 
[junit4:junit4]   2> 13703 T1040 oascc.ZkStateReader$2.process A cluster state change has occurred - updating...
[junit4:junit4]   2> 13703 T1026 oascc.ZkStateReader$2.process A cluster state change has occurred - updating...
[junit4:junit4]   2> 13703 T1085 oascc.ZkStateReader$2.process A cluster state change has occurred - updating...
[junit4:junit4]   2> 13703 T1064 oascc.ZkStateReader$2.process A cluster state change has occurred - updating...
[junit4:junit4]   2> 13704 T1052 oascc.ZkStateReader$2.process A cluster state change has occurred - updating...
[junit4:junit4]   2> 13703 T1083 oascc.ZkStateReader$2.process A cluster state change has occurred - updating...
[junit4:junit4]   2> 13703 T1078 oascc.ZkStateReader$2.process A cluster state change has occurred - updating...
[junit4:junit4]   2> 13823 T1006 oascc.ZkStateReader.updateClusterState Updating cloud state from ZooKeeper... 
[junit4:junit4]   2> 13826 T1018 C29 P25025 oasu.DirectUpdateHandler2.commit start commit{flags=0,_version_=0,optimize=false,openSearcher=true,waitSearcher=true,expungeDeletes=false,softCommit=false}
[junit4:junit4]   2> 13934 T1018 C29 P25025 oasc.SolrDeletionPolicy.onCommit SolrDeletionPolicy.onCommit: commits:num=2
[junit4:junit4]   2> 		commit{dir=NRTCachingDirectory(org.apache.lucene.store.NIOFSDirectory@/usr/home/hudson/hudson-slave/workspace/Lucene-Solr-NightlyTests-4.x/solr/build/solr-core/test/J1/org.apache.solr.cloud.BasicDistributedZk2Test-1347900624551/control/data/index lockFactory=org.apache.lucene.store.NativeFSLockFactory@323af348; maxCacheMB=48.0 maxMergeSizeMB=4.0),segFN=segments_1,generation=1,filenames=[segments_1]
[junit4:junit4]   2> 		commit{dir=NRTCachingDirectory(org.apache.lucene.store.NIOFSDirectory@/usr/home/hudson/hudson-slave/workspace/Lucene-Solr-NightlyTests-4.x/solr/build/solr-core/test/J1/org.apache.solr.cloud.BasicDistributedZk2Test-1347900624551/control/data/index lockFactory=org.apache.lucene.store.NativeFSLockFactory@323af348; maxCacheMB=48.0 maxMergeSizeMB=4.0),segFN=segments_2,generation=2,filenames=[_0_Asserting_0.tim, _0_Asserting_0.tip, _0_Lucene40_0.prx, _0_MockFixedIntBlock_0.tib, _0_Asserting_0.prx, _0_MockFixedIntBlock_0.pyl, _0_MockFixedIntBlock_0.skp, _0_Lucene40_0.frq, _0_MockFixedIntBlock_0.tii, _0.si, _0_MockRandom_0.tib, _0_Lucene40_0.tim, _0.fnm, _0_MockFixedIntBlock_0.pos, _0_nrm.cfs, _0_MockRandom_0.skp, _0_Lucene40_0.tip, _0_MockFixedIntBlock_0.frq, _0_MockRandom_0.frq, _0_MockRandom_0.sd, _0_Asserting_0.frq, _0_MockRandom_0.doc, _0_MockFixedIntBlock_0.doc, _0_MockRandom_0.pos, _0_nrm.cfe, _0_MockRandom_0.tii, segments_2, _0.fdx, _0_MockRandom_0.pyl, _0.fdt]
[junit4:junit4]   2> 13935 T1018 C29 P25025 oasc.SolrDeletionPolicy.updateCommits newest commit = 2
[junit4:junit4]   2> 13955 T1018 C29 P25025 oass.SolrIndexSearcher.<init> Opening Searcher@115caf78 main
[junit4:junit4]   2> 13956 T1018 C29 P25025 oasu.DirectUpdateHandler2.commit end_commit_flush
[junit4:junit4]   2> 13959 T1029 oasc.SolrCore.registerSearcher [collection1] Registered new searcher Searcher@115caf78 main{StandardDirectoryReader(segments_2:3 _0(4.0.0.2):C1)}
[junit4:junit4]   2> 13960 T1018 C29 P25025 /update {waitSearcher=true&wt=javabin&commit=true&softCommit=false&version=2} {commit=} 0 134
[junit4:junit4]   2> 13962 T1034 C26 P52839 oasu.DirectUpdateHandler2.commit start commit{flags=0,_version_=0,optimize=false,openSearcher=true,waitSearcher=true,expungeDeletes=false,softCommit=false}
[junit4:junit4]   2> 13979 T1034 C26 P52839 oass.SolrIndexSearcher.<init> Opening Searcher@4e42a821 main
[junit4:junit4]   2> 13980 T1034 C26 P52839 oasu.DirectUpdateHandler2.commit end_commit_flush
[junit4:junit4]   2> 13982 T1041 oasc.SolrCore.registerSearcher [collection1] Registered new searcher Searcher@4e42a821 main{StandardDirectoryReader(segments_2:3 _0(4.0.0.2):C1)}
[junit4:junit4]   2> 13983 T1034 C26 P52839 oasu.SolrCmdDistributor.distribCommit Distrib commit to:[StdNode: http://127.0.0.1:43223/solr/collection1/, StdNode: http://127.0.0.1:24191/solr/collection1/, StdNode: http://127.0.0.1:43693/solr/collection1/]
[junit4:junit4]   2>  C25_STATE=coll:collection1 core:collection1 props:{shard=shard1, roles=null, state=active, core=collection1, collection=collection1, node_name=127.0.0.1:43223_solr, base_url=http://127.0.0.1:43223/solr}
[junit4:junit4]   2> 13985 T1056 C25 P43223 oasu.DirectUpdateHandler2.commit start commit{flags=0,_version_=0,optimize=false,openSearcher=true,waitSearcher=true,expungeDeletes=false,softCommit=false}
[junit4:junit4]   2> 13985 T1048 C28 P24191 oasu.DirectUpdateHandler2.commit start commit{flags=0,_version_=0,optimize=false,openSearcher=true,waitSearcher=true,expungeDeletes=false,softCommit=false}
[junit4:junit4]   2> 13988 T1056 C25 P43223 oass.SolrIndexSearcher.<init> Opening Searcher@1eb23fce main
[junit4:junit4]   2> 13989 T1056 C25 P43223 oasu.DirectUpdateHandler2.commit end_commit_flush
[junit4:junit4]   2> 13990 T1065 oasc.SolrCore.registerSearcher [collection1] Registered new searcher Searcher@1eb23fce main{StandardDirectoryReader(segments_2:3:nrt _0(4.0.0.2):C1)}
[junit4:junit4]   2> 13991 T1056 C25 P43223 /update {waitSearcher=true&commit=true&wt=javabin&commit_end_point=true&expungeDeletes=false&softCommit=false&version=2} {commit=} 0 6
[junit4:junit4]   2> 13991 T1048 C28 P24191 oass.SolrIndexSearcher.<init> Opening Searcher@280650d main
[junit4:junit4]   2> 13992 T1048 C28 P24191 oasu.DirectUpdateHandler2.commit end_commit_flush
[junit4:junit4]   2> 13993 T1053 oasc.SolrCore.registerSearcher [collection1] Registered new searcher Searcher@280650d main{StandardDirectoryReader(segments_1:1)}
[junit4:junit4]   2> 13994 T1048 C28 P24191 /update {waitSearcher=true&commit=true&wt=javabin&commit_end_point=true&expungeDeletes=false&softCommit=false&version=2} {commit=} 0 9
[junit4:junit4]   2>  C27_STATE=coll:collection1 core:collection1 props:{shard=shard2, roles=null, state=active, core=collection1, collection=collection1, node_name=127.0.0.1:43693_solr, base_url=http://127.0.0.1:43693/solr}
[junit4:junit4]   2> 13994 T1070 C27 P43693 oasu.DirectUpdateHandler2.commit start commit{flags=0,_version_=0,optimize=false,openSearcher=true,waitSearcher=true,expungeDeletes=false,softCommit=false}
[junit4:junit4]   2> 13998 T1070 C27 P43693 oass.SolrIndexSearcher.<init> Opening Searcher@434575b1 main
[junit4:junit4]   2> 13998 T1070 C27 P43693 oasu.DirectUpdateHandler2.commit end_commit_flush
[junit4:junit4]   2> 14000 T1079 oasc.SolrCore.registerSearcher [collection1] Registered new searcher Searcher@434575b1 main{StandardDirectoryReader(segments_2:2)}
[junit4:junit4]   2> 14000 T1070 C27 P43693 /update {waitSearcher=true&commit=true&wt=javabin&commit_end_point=true&expungeDeletes=false&softCommit=false&version=2} {commit=} 0 6
[junit4:junit4]   2> 14001 T1034 C26 P52839 /update {waitSearcher=true&wt=javabin&commit=true&softCommit=false&version=2} {commit=} 0 39
[junit4:junit4]   2> 14006 T1019 C29 P25025 REQ /select {fl=id,score&shard.url=127.0.0.1:25025/solr/collection1/&NOW=1347900638549&start=0&q=*:*&distrib=false&isShard=true&wt=javabin&fsv=true&rows=10&version=2} hits=1 status=0 QTime=1 
[junit4:junit4]   2> 14009 T1019 C29 P25025 REQ /select {shard.url=127.0.0.1:25025/solr/collection1/&NOW=1347900638549&q=*:*&ids=1&distrib=false&isShard=true&wt=javabin&version=2} status=0 QTime=0 
[junit4:junit4]   2> 14010 T1018 C29 P25025 REQ /select {wt=javabin&q=*:*&version=2} hits=1 status=0 QTime=7 
[junit4:junit4]   2> 14011 T1006 oaz.ZooKeeper.<init> Initiating client connection, connectString=127.0.0.1:43688/solr sessionTimeout=10000 watcher=org.apache.solr.common.cloud.ConnectionManager@3cfff0e9
[junit4:junit4]   2> 14012 T1092 oaz.ClientCnxn$SendThread.startConnect Opening socket connection to server /127.0.0.1:43688
[junit4:junit4]   2> 14012 T1006 oascc.ConnectionManager.waitForConnected Waiting for client to connect to ZooKeeper
[junit4:junit4]   2> 14013 T1092 oaz.ClientCnxn$SendThread.primeConnection Socket connection established to localhost/127.0.0.1:43688, initiating session
[junit4:junit4]   2> 14013 T1008 oazs.NIOServerCnxn$Factory.run Accepted socket connection from /140.211.11.196:16612
[junit4:junit4]   2> 14013 T1008 oazs.NIOServerCnxn.readConnectRequest Client attempting to establish new session at /140.211.11.196:16612
[junit4:junit4]   2> 14015 T1010 oazs.NIOServerCnxn.finishSessionInit Established session 0x139d5234ead0009 with negotiated timeout 10000 for client /140.211.11.196:16612
[junit4:junit4]   2> 14015 T1092 oaz.ClientCnxn$SendThread.readConnectResult Session establishment complete on server localhost/127.0.0.1:43688, sessionid = 0x139d5234ead0009, negotiated timeout = 10000
[junit4:junit4]   2> 14015 T1093 oascc.ConnectionManager.process Watcher org.apache.solr.common.cloud.ConnectionManager@3cfff0e9 name:ZooKeeperConnection Watcher:127.0.0.1:43688/solr got event WatchedEvent state:SyncConnected type:None path:null path:null type:None
[junit4:junit4]   2> 14015 T1006 oascc.ConnectionManager.waitForConnected Client is connected to ZooKeeper
[junit4:junit4]   2> 14016 T1006 oascc.ZkStateReader.createClusterStateWatchersAndUpdate Updating cluster state from ZooKeeper... 
[junit4:junit4]   2> 14018 T1011 oazs.PrepRequestProcessor.pRequest Processed session termination for sessionid: 0x139d5234ead0009
[junit4:junit4]   2> 14019 T1093 oaz.ClientCnxn$EventThread.run EventThread shut down
[junit4:junit4]   2> 14019 T1008 oazs.NIOServerCnxn.closeSock Closed socket connection for client /140.211.11.196:16612 which had sessionid 0x139d5234ead0009
[junit4:junit4]   2> 14019 T1006 oaz.ZooKeeper.close Session: 0x139d5234ead0009 closed
[junit4:junit4]   2> 14021 T1037 C26 P52839 REQ /select {distrib=false&wt=javabin&q=*:*&version=2} hits=1 status=0 QTime=0 
[junit4:junit4]   2> 14024 T1049 C28 P24191 REQ /select {distrib=false&wt=javabin&q=*:*&version=2} hits=0 status=0 QTime=0 
[junit4:junit4]   2> 14029 T1058 C25 P43223 REQ /select {fl=id,score&shard.url=127.0.0.1:52839/solr/collection1/|127.0.0.1:43223/solr/collection1/&NOW=1347900638572&start=0&q=*:*&distrib=false&isShard=true&wt=javabin&fsv=true&rows=10&version=2} hits=1 status=0 QTime=0 
[junit4:junit4]   2> 14029 T1071 C27 P43693 REQ /select {fl=id,score&shard.url=127.0.0.1:24191/solr/collection1/|127.0.0.1:43693/solr/collection1/&NOW=1347900638572&start=0&q=*:*&distrib=false&isShard=true&wt=javabin&fsv=true&rows=10&version=2} hits=0 status=0 QTime=0 
[junit4:junit4]   2> 14032 T1058 C25 P43223 REQ /select {shard.url=127.0.0.1:52839/solr/collection1/|127.0.0.1:43223/solr/collection1/&NOW=1347900638572&q=*:*&ids=1&distrib=false&isShard=true&wt=javabin&version=2} status=0 QTime=0 
[junit4:junit4]   2> 14033 T1057 C25 P43223 REQ /select {wt=javabin&q=*:*&version=2} hits=1 status=0 QTime=7 
[junit4:junit4]   2> 14040 T1018 C29 P25025 /update {wt=javabin&version=2} {add=[2 (1413376260001759232)]} 0 4
[junit4:junit4]   2> 14062 T1070 C27 P43693 REQ /update {update.distrib=FROMLEADER&distrib.from=http://127.0.0.1:24191/solr/collection1/&wt=javabin&version=2} status=0 QTime=4 
[junit4:junit4]   2> 14062 T1048 C28 P24191 REQ /update {distrib.from=http://127.0.0.1:52839/solr/collection1/&update.distrib=TOLEADER&wt=javabin&version=2} status=0 QTime=12 
[junit4:junit4]   2> 14063 T1034 C26 P52839 /update {wt=javabin&version=2} {add=[2]} 0 20
[junit4:junit4]   2> 14067 T1018 C29 P25025 /update {wt=javabin&version=2} {add=[3 (1413376260033216512)]} 0 1
[junit4:junit4]   2> 14075 T1070 C27 P43693 REQ /update {distrib.from=http://127.0.0.1:24191/solr/collection1/&update.distrib=FROMLEADER&wt=javabin&version=2} status=0 QTime=2 
[junit4:junit4]   2> 14075 T1050 C28 P24191 /update {wt=javabin&version=2} {add=[3 (1413376260036362240)]} 0 6
[junit4:junit4]   2> 14079 T1018 C29 P25025 /update {wt=javabin&version=2} {add=[4 (1413376260045799424)]} 0 1
[junit4:junit4]   2> 14091 T1056 C25 P43223 REQ /update {distrib.from=http://127.0.0.1:52839/solr/collection1/&update.distrib=FROMLEADER&wt=javabin&version=2} status=0 QTime=4 
[junit4:junit4]   2> 14091 T1034 C26 P52839 /update {wt=javabin&version=2} {add=[4 (1413376260049993728)]} 0 9
[junit4:junit4]   2> 14095 T1018 C29 P25025 /update {wt=javabin&version=2} {add=[5 (1413376260062576640)]} 0 1
[junit4:junit4]   2> 14103 T1070 C27 P43693 REQ /update {distrib.from=http://127.0.0.1:24191/solr/collection1/&update.distrib=FROMLEADER&wt=javabin&version=2} status=0 QTime=1 
[junit4:junit4]   2> 14104 T1050 C28 P24191 /update {wt=javabin&version=2} {add=[5 (1413376260066770944)]} 0 6
[junit4:junit4]   2> 14110 T1018 C29 P25025 /update {wt=javabin&version=2} {add=[6 (1413376260076208128)]} 0 3
[junit4:junit4]   2> 14194 T1070 C27 P43693 REQ /update {distrib.from=http://127.0.0.1:24191/solr/collection1/&update.distrib=FROMLEADER&wt=javabin&version=2} status=0 QTime=77 
[junit4:junit4]   2> 14195 T1050 C28 P24191 /update {wt=javabin&version=2} {add=[6 (1413376260082499584)]} 0 82
[junit4:junit4]   2> 14200 T1018 C29 P25025 /update {wt=javabin&version=2} {add=[7 (1413376260171628544)]} 0 2
[junit4:junit4]   2> 14208 T1070 C27 P43693 REQ /update {distrib.from=http://127.0.0.1:24191/solr/collection1/&update.distrib=FROMLEADER&wt=javabin&version=2} status=0 QTime=1 
[junit4:junit4]   2> 14209 T1050 C28 P24191 /update {wt=javabin&version=2} {add=[7 (1413376260176871424)]} 0 6
[junit4:junit4]   2> 14213 T1018 C29 P25025 /update {wt=javabin&version=2} {add=[8 (1413376260186308608)]} 0 1
[junit4:junit4]   2> 14225 T1056 C25 P43223 REQ /update {update.distrib=FROMLEADER&distrib.from=http://127.0.0.1:52839/solr/collection1/&wt=javabin&version=2} status=0 QTime=2 
[junit4:junit4]   2> 14225 T1038 C26 P52839 REQ /update {distrib.from=http://127.0.0.1:24191/solr/collection1/&update.distrib=TOLEADER&wt=javabin&version=2} status=0 QTime=7 
[junit4:junit4]   2> 14226 T1050 C28 P24191 /update {wt=javabin&version=2} {add=[8]} 0 10
[junit4:junit4]   2> 14230 T1018 C29 P25025 /update {wt=javabin&version=2} {add=[9 (1413376260204134400)]} 0 1
[junit4:junit4]   2> 14240 T1070 C27 P43693 REQ /update {update.distrib=FROMLEADER&distrib.from=http://127.0.0.1:24191/solr/collection1/&wt=javabin&version=2} status=0 QTime=1 
[junit4:junit4]   2> 14241 T1048 C28 P24191 REQ /update {distrib.from=http://127.0.0.1:52839/solr/collection1/&update.distrib=TOLEADER&wt=javabin&version=2} status=0 QTime=6 
[junit4:junit4]   2> 14242 T1034 C26 P52839 /update {wt=javabin&version=2} {add=[9]} 0 9
[junit4:junit4]   2> 14245 T1018 C29 P25025 /update {wt=javabin&version=2} {add=[10 (1413376260219863040)]} 0 1
[junit4:junit4]   2> 14256 T1056 C25 P43223 REQ /update {update.distrib=FROMLEADER&distrib.from=http://127.0.0.1:52839/solr/collection1/&wt=javabin&version=2} status=0 QTime=2 
[junit4:junit4]   2> 14257 T1038 C26 P52839 REQ /update {distrib.from=http://127.0.0.1:24191/solr/collection1/&update.distrib=TOLEADER&wt=javabin&version=2} status=0 QTime=7 
[junit4:junit4]   2> 14258 T1050 C28 P24191 /update {wt=javabin&version=2} {add=[10]} 0 10
[junit4:junit4]   2> 14285 T1018 C29 P25025 /update {wt=javabin&version=2} {add=[11 (1413376260237688832)]} 0 24
[junit4:junit4]   2> 14298 T1056 C25 P43223 REQ /update {update.distrib=FROMLEADER&distrib.from=http://127.0.0.1:52839/solr/collection1/&wt=javabin&version=2} status=0 QTime=2 
[junit4:junit4]   2> 14298 T1038 C26 P52839 REQ /update {distrib.from=http://127.0.0.1:24191/solr/collection1/&update.distrib=TOLEADER&wt=javabin&version=2} status=0 QTime=7 
[junit4:junit4]   2> 14299 T1050 C28 P24191 /update {wt=javabin&version=2} {add=[11]} 0 11
[junit4:junit4]   2> 14305 T1018 C29 P25025 /update {wt=javabin&version=2} {add=[12 (1413376260280680448)]} 0 3
[junit4:junit4]   2> 14315 T1056 C25 P43223 REQ /update {update.distrib=FROMLEADER&distrib.from=http://127.0.0.1:52839/solr/collection1/&wt=javabin&version=2} status=0 QTime=2 
[junit4:junit4]   2> 14315 T1038 C26 P52839 REQ /update {distrib.from=http://127.0.0.1:24191/solr/collection1/&update.distrib=TOLEADER&wt=javabin&version=2} status=0 QTime=6 
[junit4:junit4]   2> 14316 T1050 C28 P24191 /update {wt=javabin&version=2} {add=[12]} 0 9
[junit4:junit4]   2> 14320 T1018 C29 P25025 /update {wt=javabin&version=2} {add=[13 (1413376260298506240)]} 0 1
[junit4:junit4]   2> 14329 T1056 C25 P43223 REQ /update {distrib.from=http://127.0.0.1:52839/solr/collection1/&update.distrib=FROMLEADER&wt=javabin&version=2} status=0 QTime=2 
[junit4:junit4]   2> 14329 T1034 C26 P52839 /update {wt=javabin&version=2} {add=[13 (1413376260302700544)]} 0 6
[junit4:junit4]   2> 14338 T1018 C29 P25025 /update {wt=javabin&version=2} {add=[14 (1413376260312137728)]} 0 6
[junit4:junit4]   2> 14349 T1056 C25 P43223 REQ /update {update.distrib=FROMLEADER&distrib.from=http://127.0.0.1:52839/solr/collection1/&wt=javabin&version=2} status=0 QTime=1 
[junit4:junit4]   2> 14350 T1038 C26 P52839 REQ /update {distrib.from=http://127.0.0.1:24191/solr/collection1/&update.distrib=TOLEADER&wt=javabin&version=2} status=0 QTime=6 
[junit4:junit4]   2> 14351 T1050 C28 P24191 /update {wt=javabin&version=2} {add=[14]} 0 10
[junit4:junit4]   2> 14354 T1018 C29 P25025 /update {wt=javabin&version=2} {add=[15 (1413376260334157824)]} 0 1
[junit4:junit4]   2> 14362 T1056 C25 P43223 REQ /update {distrib.from=http://127.0.0.1:52839/solr/collection1/&update.distrib=FROMLEADER&wt=javabin&version=2} status=0 QTime=1 
[junit4:junit4]   2> 14363 T1034 C26 P52839 /update {wt=javabin&version=2} {add=[15 (1413376260338352128)]} 0 6
[junit4:junit4]   2> 14366 T1018 C29 P25025 /update {wt=javabin&version=2} {add=[16 (1413376260346740736)]} 0 1
[junit4:junit4]   2> 14376 T1056 C25 P43223 REQ /update {update.distrib=FROMLEADER&distrib.from=http://127.0.0.1:52839/solr/collection1/&wt=javabin&version=2} status=0 QTime=1 
[junit4:junit4]   2> 14377 T1038 C26 P52839 REQ /update {distrib.from=http://127.0.0.1:24191/solr/collection1/&update.distrib=TOLEADER&wt=javabin&version=2} status=0 QTime=6 
[junit4:junit4]   2> 14377 T1050 C28 P24191 /update {wt=javabin&version=2} {add=[16]} 0 8
[junit4:junit4]   2> 14384 T1018 C29 P25025 /update {wt=javabin&version=2} {add=[17 (1413376260363517952)]} 0 4
[junit4:junit4]   2> 14399 T1070 C27 P43693 REQ /update {update.distrib=FROMLEADER&distrib.from=http://127.0.0.1:24191/solr/collection1/&wt=javabin&version=2} status=0 QTime=4 
[junit4:junit4]   2> 14399 T1048 C28 P24191 REQ /update {distrib.from=http://127.0.0.1:52839/solr/collection1/&update.distrib=TOLEADER&wt=javabin&version=2} status=0 QTime=10 
[junit4:junit4]   2> 14400 T1034 C26 P52839 /update {wt=javabin&version=2} {add=[17]} 0 14
[junit4:junit4]   2> 14403 T1018 C29 P25025 /update {wt=javabin&version=2} {add=[100 (1413376260385538048)]} 0 1
[junit4:junit4]   2> 14444 T1056 C25 P43223 REQ /update {update.distrib=FROMLEADER&distrib.from=http://127.0.0.1:52839/solr/collection1/&wt=javabin&version=2} status=0 QTime=16 
[junit4:junit4]   2> 14445 T1038 C26 P52839 REQ /update {distrib.from=http://127.0.0.1:24191/solr/collection1/&update.distrib=TOLEADER&wt=javabin&version=2} status=0 QTime=37 
[junit4:junit4]   2> 14446 T1050 C28 P24191 /update {wt=javabin&version=2} {add=[100]} 0 40
[junit4:junit4]   2> 14449 T1018 C29 P25025 /update {wt=javabin&version=2} {add=[101 (1413376260433772544)]} 0 1
[junit4:junit4]   2> 14461 T1056 C25 P43223 REQ /update {update.distrib=FROMLEADER&distrib.from=http://127.0.0.1:52839/solr/collection1/&wt=javabin&version=2} status=0 QTime=2 
[junit4:junit4]   2> 14462 T1038 C26 P52839 REQ /update {distrib.from=http://127.0.0.1:24191/solr/collection1/&update.distrib=TOLEADER&wt=javabin&version=2} status=0 QTime=8 
[junit4:junit4]   2> 14462 T1050 C28 P24191 /update {wt=javabin&version=2} {add=[101]} 0 10
[junit4:junit4]   2> 14466 T1018 C29 P25025 /update {wt=javabin&version=2} {add=[102 (1413376260451598336)]} 0 1
[junit4:junit4]   2> 14473 T1056 C25 P43223 REQ /update {distrib.from=http://127.0.0.1:52839/solr/collection1/&update.distrib=FROMLEADER&wt=javabin&version=2} status=0 QTime=1 
[junit4:junit4]   2> 14474 T1034 C26 P52839 /update {wt=javabin&version=2} {add=[102 (1413376260455792640)]} 0 5
[junit4:junit4]   2> 14495 T1018 C29 P25025 /update {wt=javabin&version=2} {add=[103 (1413376260463132672)]} 0 19
[junit4:junit4]   2> 14502 T1070 C27 P43693 REQ /update {distrib.from=http://127.0.0.1:24191/solr/collection1/&update.distrib=FROMLEADER&wt=javabin&version=2} status=0 QTime=1 
[junit4:junit4]   2> 14503 T1050 C28 P24191 /update {wt=javabin&version=2} {add=[103 (1413376260486201344)]} 0 5
[junit4:junit4]   2> 14507 T1018 C29 P25025 /update {wt=javabin&version=2} {add=[104 (1413376260493541376)]} 0 2
[junit4:junit4]   2> 14517 T1070 C27 P43693 REQ /update {update.distrib=FROMLEADER&distrib.from=http://127.0.0.1:24191/solr/collection1/&wt=javabin&version=2} status=0 QTime=1 
[junit4:junit4]   2> 14518 T1048 C28 P24191 REQ /update {distrib.from=http://127.0.0.1:52839/solr/collection1/&update.distrib=TOLEADER&wt=javabin&version=2} status=0 QTime=6 
[junit4:junit4]   2> 14518 T1034 C26 P52839 /update {wt=javabin&version=2} {add=[104]} 0 8
[junit4:junit4]   2> 14522 T1018 C29 P25025 /update {wt=javabin&version=2} {add=[105 (1413376260510318592)]} 0 1
[junit4:junit4]   2> 14562 T1070 C27 P43693 REQ /update {update.distrib=FROMLEADER&distrib.from=http://127.0.0.1:24191/solr/collection1/&wt=javabin&version=2} status=0 QTime=17 
[junit4:junit4]   2> 14563 T1048 C28 P24191 REQ /update {distrib.from=http://127.0.0.1:52839/solr/collection1/&update.distrib=TOLEADER&wt=javabin&version=2} status=0 QTime=36 
[junit4:junit4]   2> 14564 T1034 C26 P52839 /update {wt=javabin&version=2} {add=[105]} 0 39
[junit4:junit4]   2> 14567 T1018 C29 P25025 /update {wt=javabin&version=2} {add=[106 (1413376260557504512)]} 0 1
[junit4:junit4]   2> 14577 T1070 C27 P43693 REQ /update {distrib.from=http://127.0.0.1:24191/solr/collection1/&update.distrib=FROMLEADER&wt=javabin&version=2} status=0 QTime=2 
[junit4:junit4]   2> 14578 T1050 C28 P24191 /update {wt=javabin&version=2} {add=[106 (1413376260561698816)]} 0 8
[junit4:junit4]   2> 14581 T1018 C29 P25025 /update {wt=javabin&version=2} {add=[107 (1413376260572184576)]} 0 1
[junit4:junit4]   2> 14588 T1056 C25 P43223 REQ /update {distrib.from=http://127.0.0.1:52839/solr/collection1/&update.distrib=FROMLEADER&wt=javabin&version=2} status=0 QTime=1 
[junit4:junit4]   2> 14589 T1034 C26 P52839 /update {wt=javabin&version=2} {add=[107 (1413376260576378880)]} 0 5
[junit4:junit4]   2> 14592 T1018 C29 P25025 /update {wt=javabin&version=2} {add=[108 (1413376260583718912)]} 0 1
[junit4:junit4]   2> 14599 T1056 C25 P43223 REQ /update {distrib.from=http://127.0.0.1:52839/solr/collection1/&update.distrib=FROMLEADER&wt=javabin&version=2} status=0 QTime=1 
[junit4:junit4]   2> 14600 T1034 C26 P52839 /update {wt=javabin&version=2} {add=[108 (1413376260587913216)]} 0 5
[junit4:junit4]   2> 14603 T1018 C29 P25025 /update {wt=javabin&version=2} {add=[109 (1413376260595253248)]} 0 1
[junit4:junit4]   2> 14613 T1056 C25 P43223 REQ /update {update.distrib=FROMLEADER&distrib.from=http://127.0.0.1:52839/solr/collection1/&wt=javabin&version=2} status=0 QTime=1 
[junit4:junit4]   2> 14614 T1038 C26 P52839 REQ /update {distrib.from=http://127.0.0.1:24191/solr/collection1/&update.distrib=TOLEADER&wt=javabin&version=2} status=0 QTime=6 
[junit4:junit4]   2> 14614 T1050 C28 P24191 /update {wt=javabin&version=2} {add=[109]} 0 8
[junit4:junit4]   2> 14618 T1018 C29 P25025 /update {wt=javabin&version=2} {add=[110 (1413376260610981888)]} 0 1
[junit4:junit4]   2> 14625 T1056 C25 P43223 REQ /update {distrib.from=http://127.0.0.1:52839/solr/collection1/&update.distrib=FROMLEADER&wt=javabin&version=2} status=0 QTime=1 
[junit4:junit4]   2> 14626 T1034 C26 P52839 /update {wt=javabin&version=2} {add=[110 (1413376260615176192)]} 0 5
[junit4:junit4]   2> 14629 T1018 C29 P25025 /update {wt=javabin&version=2} {add=[111 (1413376260622516224)]} 0 1
[junit4:junit4]   2> 14636 T1056 C25 P43223 REQ /update {distrib.from=http://127.0.0.1:52839/solr/collection1/&update.distrib=FROMLEADER&wt=javabin&version=2} status=0 QTime=1 
[junit4:junit4]   2> 14637 T1034 C26 P52839 /update {wt=javabin&version=2} {add=[111 (1413376260626710528)]} 0 5
[junit4:junit4]   2> 14640 T1018 C29 P25025 /update {wt=javabin&version=2} {add=[112 (1413376260634050560)]} 0 1
[junit4:junit4]   2> 14647 T1070 C27 P43693 REQ /update {distrib.from=http://127.0.0.1:24191/solr/collection1/&update.distrib=FROMLEADER&wt=javabin&version=2} status=0 QTime=1 
[junit4:junit4]   2> 14648 T1050 C28 P24191 /update {wt=javabin&version=2} {add=[112 (1413376260638244864)]} 0 5
[junit4:junit4]   2> 14661 T1018 C29 P25025 /update {wt=javabin&version=2} {add=[113 (1413376260645584896)]} 0 11
[junit4:junit4]   2> 14670 T1056 C25 P43223 REQ /update {update.distrib=FROMLEADER&distrib.from=http://127.0.0.1:52839/solr/collection1/&wt=javabin&version=2} status=0 QTime=1 
[junit4:junit4]   2> 14671 T1038 C26 P52839 REQ /update {distrib.from=http://127.0.0.1:24191/solr/collection1/&update.distrib=TOLEADER&wt=javabin&version=2} status=0 QTime=5 
[junit4:junit4]   2> 14672 T1050 C28 P24191 /update {wt=javabin&version=2} {add=[113]} 0 8
[junit4:junit4]   2> 14676 T1018 C29 P25025 /update {wt=javabin&version=2} {add=[114 (1413376260670750720)]} 0 2
[junit4:junit4]   2> 14683 T1056 C25 P43223 REQ /update {distrib.from=http://127.0.0.1:52839/solr/collection1/&update.distrib=FROMLEADER&wt=javabin&version=2} status=0 QTime=1 
[junit4:junit4]   2> 14684 T1034 C26 P52839 /update {wt=javabin&version=2} {add=[114 (1413376260675993600)]} 0 5
[junit4:junit4]   2> 14687 T1018 C29 P25025 /update {wt=javabin&version=2} {add=[115 (1413376260683333632)]} 0 1
[junit4:junit4]   2> 14696 T1070 C27 P43693 REQ /update {update.distrib=FROMLEADER&distrib.from=http://127.0.0.1:24191/solr/collection1/&wt=javabin&version=2} status=0 QTime=1 
[junit4:junit4]   2> 14697 T1048 C28 P24191 REQ /update {distrib.from=http://127.0.0.1:52839/solr/collection1/&update.distrib=TOLEADER&wt=javabin&version=2} status=0 QTime=6 
[junit4:junit4]   2> 14697 T1034 C26 P52839 /update {wt=javabin&version=2} {add=[115]} 0 8
[junit4:junit4]   2> 14701 T1018 C29 P25025 /update {wt=javabin&version=2} {add=[116 (1413376260698013696)]} 0 1
[junit4:junit4]   2> 14708 T1070 C27 P43693 REQ /update {distrib.from=http://127.0.0.1:24191/solr/collection1/&update.distrib=FROMLEADER&wt=javabin&version=2} status=0 QTime=1 
[junit4:junit4]   2> 14708 T1050 C28 P24191 /update {wt=javabin&version=2} {add=[116 (1413376260702208000)]} 0 4
[junit4:junit4]   2> 14712 T1018 C29 P25025 /update {wt=javabin&version=2} {add=[117 (1413376260709548032)]} 0 1
[junit4:junit4]   2> 14719 T1070 C27 P43693 REQ /update {distrib.from=http://127.0.0.1:24191/solr/collection1/&update.distrib=FROMLEADER&wt=javabin&version=2} status=0 QTime=1 
[junit4:junit4]   2> 14720 T1050 C28 P24191 /update {wt=javabin&version=2} {add=[117 (1413376260713742336)]} 0 5
[junit4:junit4]   2> 14723 T1018 C29 P25025 /update {wt=javabin&version=2} {add=[118 (1413376260721082368)]} 0 1
[junit4:junit4]   2> 14760 T1056 C25 P43223 REQ /update {update.distrib=FROMLEADER&distrib.from=http://127.0.0.1:52839/solr/collection1/&wt=javabin&version=2} status=0 QTime=16 
[junit4:junit4]   2> 14761 T1038 C26 P52839 REQ /update {distrib.from=http://127.0.0.1:24191/solr/collection1/&update.distrib=TOLEADER&wt=javabin&version=2} status=0 QTime=33 
[junit4:junit4]   2> 14761 T1050 C28 P24191 /update {wt=javabin&version=2} {add=[118]} 0 35
[junit4:junit4]   2> 14765 T1018 C29 P25025 /update {wt=javabin&version=2} {add=[119 (1413376260765122560)]} 0 1
[junit4:junit4]   2> 14772 T1070 C27 P43693 REQ /update {distrib.from=http://127.0.0.1:24191/solr/collection1/&update.distrib=FROMLEADER&wt=javabin&version=2} status=0 QTime=1 
[junit4:junit4]   2> 14772 T1050 C28 P24191 /update {wt=javabin&version=2} {add=[119 (1413376260769316864)]} 0 4
[junit4:junit4]   2> 14776 T1018 C29 P25025 /update {wt=javabin&version=2} {add=[120 (1413376260776656896)]} 0 1
[junit4:junit4]   2> 14784 T1070 C27 P43693 REQ /update {update.distrib=FROMLEADER&distrib.from=http://127.0.0.1:24191/solr/collection1/&wt=javabin&version=2} status=0 QTime=1 
[junit4:junit4]   2> 14785 T1048 C28 P24191 REQ /update {distrib.from=http://127.0.0.1:52839/solr/collection1/&update.distrib=TOLEADER&wt=javabin&version=2} status=0 QTime=5 
[junit4:junit4]   2> 14785 T1034 C26 P52839 /update {wt=javabin&version=2} {add=[120]} 0 7
[junit4:junit4]   2> 14789 T1018 C29 P25025 /update {wt=javabin&version=2} {add=[121 (1413376260790288384)]} 0 1
[junit4:junit4]   2> 14798 T1070 C27 P43693 REQ /update {update.distrib=FROMLEADER&distrib.from=http://127.0.0.1:24191/solr/collection1/&wt=javabin&version=2} status=0 QTime=1 
[junit4:junit4]   2> 14799 T1048 C28 P24191 REQ /update {distrib.from=http://127.0.0.1:52839/solr/collection1/&update.distrib=TOLEADER&wt=javabin&version=2} status=0 QTime=5 
[junit4:junit4]   2> 14799 T1034 C26 P52839 /update {wt=javabin&version=2} {add=[121]} 0 7
[junit4:junit4]   2> 14803 T1018 C29 P25025 /update {wt=javabin&version=2} {add=[122 (1413376260804968448)]} 0 1
[junit4:junit4]   2> 14812 T1056 C25 P43223 REQ /update {distrib.from=http://127.0.0.1:52839/solr/collection1/&update.distrib=FROMLEADER&wt=javabin&version=2} status=0 QTime=2 
[junit4:junit4]   2> 14813 T1034 C26 P52839 /update {wt=javabin&version=2} {add=[122 (1413376260809162752)]} 0 7
[junit4:junit4]   2> 14826 T1018 C29 P25025 /update {wt=javabin&version=2} {add=[123 (1413376260818599936)]} 0 11
[junit4:junit4]   2> 14832 T1056 C25 P43223 REQ /update {distrib.from=http://127.0.0.1:52839/solr/collection1/&update.distrib=FROMLEADER&wt=javabin&version=2} status=0 QTime=1 
[junit4:junit4]   2> 14833 T1034 C26 P52839 /update {wt=javabin&version=2} {add=[123 (1413376260832231424)]} 0 5
[junit4:junit4]   2> 14836 T1018 C29 P25025 /update {wt=javabin&version=2} {add=[124 (1413376260839571456)]} 0 1
[junit4:junit4]   2> 14843 T1056 C25 P43223 REQ /update {distrib.from=http://127.0.0.1:52839/solr/collection1/&update.distrib=FROMLEADER&wt=javabin&version=2} status=0 QTime=1 
[junit4:junit4]   2> 14844 T1034 C26 P52839 /update {wt=javabin&version=2} {add=[124 (1413376260843765760)]} 0 5
[junit4:junit4]   2> 14847 T1018 C29 P25025 /update {wt=javabin&version=2} {add=[125 (1413376260851105792)]} 0 1
[junit4:junit4]   2> 14854 T1056 C25 P43223 REQ /update {distrib.from=http://127.0.0.1:52839/solr/collection1/&update.distrib=FROMLEADER&wt=javabin&version=2} status=0 QTime=1 
[junit4:junit4]   2> 14855 T1034 C26 P52839 /update {wt=javabin&version=2} {add=[125 (1413376260855300096)]} 0 5
[junit4:junit4]   2> 14858 T1018 C29 P25025 /update {wt=javabin&version=2} {add=[126 (1413376260862640128)]} 0 1
[junit4:junit4]   2> 14866 T1070 C27 P43693 REQ /update {update.distrib=FROMLEADER&distrib.from=http://127.0.0.1:24191/solr/collection1/&wt=javabin&version=2} status=0 QTime=1 
[junit4:junit4]   2> 14867 T1048 C28 P24191 REQ /update {distrib.from=http://127.0.0.1:52839/solr/collection1/&update.distrib=TOLEADER&wt=javabin&version=2} status=0 QTime=5 
[junit4:junit4]   2> 14867 T1034 C26 P52839 /update {wt=javabin&version=2} {add=[126]} 0 7
[junit4:junit4]   2> 14871 T1018 C29 P25025 /update {wt=javabin&version=2} {add=[127 (1413376260876271616)]} 0 1
[junit4:junit4]   2> 14909 T1070 C27 P43693 REQ /update {distrib.from=http://127.0.0.1:24191/solr/collection1/&update.distrib=FROMLEADER&wt=javabin&version=2} status=0 QTime=19 
[junit4:junit4]   2> 14910 T1050 C28 P24191 /update {wt=javabin&version=2} {add=[127 (1413376260879417344)]} 0 37
[junit4:junit4]   2> 14913 T1018 C29 P25025 /update {wt=javabin&version=2} {add=[128 (1413376260920311808)]} 0 1
[junit4:junit4]   2> 14924 T1070 C27 P43693 REQ /update {update.distrib=FROMLEADER&distrib.from=http://127.0.0.1:24191/solr/collection1/&wt=javabin&version=2} status=0 QTime=2 
[junit4:junit4]   2> 14925 T1048 C28 P24191 REQ /update {distrib.from=http://127.0.0.1:52839/solr/collection1/&update.distrib=TOLEADER&wt=javabin&version=2} status=0 QTime=7 
[junit4:junit4]   2> 14925 T1034 C26 P52839 /update {wt=javabin&version=2} {add=[128]} 0 9
[junit4:junit4]   2> 14929 T1018 C29 P25025 /update {wt=javabin&version=2} {add=[129 (1413376260937089024)]} 0 1
[junit4:junit4]   2> 14937 T1056 C25 P43223 REQ /update {update.distrib=FROMLEADER&distrib.from=http://127.0.0.1:52839/solr/collection1/&wt=javabin&version=2} status=0 QTime=1 
[junit4:junit4]   2> 14938 T1038 C26 P52839 REQ /update {distrib.from=http://127.0.0.1:24191/solr/collection1/&update.distrib=TOLEADER&wt=javabin&version=2} status=0 QTime=5 
[junit4:junit4]   2> 14938 T1050 C28 P24191 /update {wt=javabin&version=2} {add=[129]} 0 7
[junit4:junit4]   2> 14942 T1018 C29 P25025 /update {wt=javabin&version=2} {add=[130 (1413376260950720512)]} 0 1
[junit4:junit4]   2> 14954 T1070 C27 P43693 REQ /update {distrib.from=http://127.0.0.1:24191/solr/collection1/&update.distrib=FROMLEADER&wt=javabin&version=2} status=0 QTime=1 
[junit4:junit4]   2> 14955 T1050 C28 P24191 /update {wt=javabin&version=2} {add=[130 (1413376260953866240)]} 0 11
[junit4:junit4]   2> 14958 T1018 C29 P25025 /update {wt=javabin&version=2} {add=[131 (1413376260967497728)]} 0 1
[junit4:junit4]   2> 14966 T1070 C27 P43693 REQ /update {update.distrib=FROMLEADER&distrib.from=http://127.0.0.1:24191/solr/collection1/&wt=javabin&version=2} status=0 QTime=1 
[junit4:junit4]   2> 14967 T1048 C28 P24191 REQ /update {distrib.from=http://127.0.0.1:52839/solr/collection1/&update.distrib=TOLEADER&wt=javabin&version=2} status=0 QTime=5 
[junit4:junit4]   2> 14967 T1034 C26 P52839 /update {wt=javabin&version=2} {add=[131]} 0 7
[junit4:junit4]   2> 14971 T1018 C29 P25025 /update {wt=javabin&version=2} {add=[132 (1413376260981129216)]} 0 1
[junit4:junit4]   2> 14977 T1056 C25 P43223 REQ /update {distrib.from=http://127.0.0.1:52839/solr/collection1/&update.distrib=FROMLEADER&wt=javabin&version=2} status=0 QTime=1 
[junit4:junit4]   2> 14978 T1034 C26 P52839 /update {wt=javabin&version=2} {add=[132 (1413376260984274944)]} 0 5
[junit4:junit4]   2> 14990 T1018 C29 P25025 /update {wt=javabin&version=2} {add=[133 (1413376260991614976)]} 0 10
[junit4:junit4]   2> 14999 T1056 C25 P43223 REQ /update {update.distrib=FROMLEADER&distrib.from=http://127.0.0.1:52839/solr/collection1/&wt=javabin&version=2} status=0 QTime=1 
[junit4:junit4]   2> 15000 T1038 C26 P52839 REQ /update {distrib.from=http://127.0.0.1:24191/solr/collection1/&update.distrib=TOLEADER&wt=javabin&version=2} status=0 QTime=5 
[junit4:junit4]   2> 15000 T1050 C28 P24191 /update {wt=javabin&version=2} {add=[133]} 0 7
[junit4:junit4]   2> 15005 T1018 C29 P25025 /update {wt=javabin&version=2} {add=[134 (1413376261015732224)]} 0 2
[junit4:junit4]   2> 15012 T1070 C27 P43693 REQ /update {distrib.from=http://127.0.0.1:24191/solr/collection1/&update.distrib=FROMLEADER&wt=javabin&version=2} status=0 QTime=1 
[junit4:junit4]   2> 15013 T1050 C28 P24191 /update {wt=javabin&version=2} {add=[134 (1413376261020975104)]} 0 5
[junit4:junit4]   2> 15016 T1018 C29 P25025 /update {wt=javabin&version=2} {add=[135 (1413376261028315136)]} 0 1
[junit4:junit4]   2> 15022 T1056 C25 P43223 REQ /update {distrib.from=http://127.0.0.1:52839/solr/collection1/&update.distrib=FROMLEADER&wt=javabin&version=2} status=0 QTime=1 
[junit4:junit4]   2> 15023 T1034 C26 P52839 /update {wt=javabin&version=2} {add=[135 (1413376261031460864)]} 0 5
[junit4:junit4]   2> 15026 T1018 C29 P25025 /update {wt=javabin&version=2} {add=[136 (1413376261038800896)]} 0 1
[junit4:junit4]   2> 15035 T1070 C27 P43693 REQ /update {update.distrib=FROMLEADER&distrib.from=http://127.0.0.1:24191/solr/collection1/&wt=javabin&version=2} status=0 QTime=1 
[junit4:junit4]   2> 15035 T1048 C28 P24191 REQ /update {distrib.from=http://127.0.0.1:52839/solr/collection1/&update.distrib=TOLEADER&wt=javabin&version=2} status=0 QTime=4 
[junit4:junit4]   2> 15035 T1034 C26 P52839 /update {wt=javabin&version=2} {add=[136]} 0 6
[junit4:junit4]   2> 15039 T1018 C29 P25025 /update {wt=javabin&version=2} {add=[137 (1413376261052432384)]} 0 1
[junit4:junit4]   2> 15048 T1070 C27 P43693 REQ /update {update.distrib=FROMLEADER&distrib.from=http://127.0.0.1:24191/solr/collection1/&wt=javabin&version=2} status=0 QTime=1 
[junit4:junit4]   2> 15049 T1048 C28 P24191 REQ /update {distrib.from=http://127.0.0.1:52839/solr/collection1/&update.distrib=TOLEADER&wt=javabin&version=2} status=0 QTime=5 
[junit4:junit4]   2> 15049 T1034 C26 P52839 /update {wt=javabin&version=2} {add=[137]} 0 7
[junit4:junit4]   2> 15053 T1018 C29 P25025 /update {wt=javabin&version=2} {add=[138 (1413376261067112448)]} 0 1
[junit4:junit4]   2> 15060 T1056 C25 P43223 REQ /update {distrib.from=http://127.0.0.1:52839/solr/collection1/&update.distrib=FROMLEADER&wt=javabin&version=2} status=0 QTime=1 
[junit4:junit4]   2> 15061 T1034 C26 P52839 /update {wt=javabin&version=2} {add=[138 (1413376261071306752)]} 0 5
[junit4:junit4]   2> 15064 T1018 C29 P25025 /update {wt=javabin&version=2} {add=[139 (1413376261078646784)]} 0 1
[junit4:junit4]   2> 15073 T1070 C27 P43693 REQ /update {update.distrib=FROMLEADER&distrib.from=http://127.0.0.1:24191/solr/collection1/&wt=javabin&version=2} status=0 QTime=1 
[junit4:junit4]   2> 15074 T1048 C28 P24191 REQ /update {distrib.from=http://127.0.0.1:52839/solr/collection1/&update.distrib=TOLEADER&wt=javabin&version=2} status=0 QTime=5 
[junit4:junit4]   2> 15074 T1034 C26 P52839 /update {wt=javabin&version=2} {add=[139]} 0 7
[junit4:junit4]   2> 15078 T1018 C29 P25025 /update {wt=javabin&version=2} {add=[140 (1413376261093326848)]} 0 1
[junit4:junit4]   2> 15087 T1070 C27 P43693 REQ /update {update.distrib=FROMLEADER&distrib.from=http://127.0.0.1:24191/solr/collection1/&wt=javabin&version=2} status=0 QTime=1 
[junit4:junit4]   2> 15088 T1048 C28 P24191 REQ /update {distrib.from=http://127.0.0.1:52839/solr/collection1/&update.distrib=TOLEADER&wt=javabin&version=2} status=0 QTime=5 
[junit4:junit4]   2> 15088 T1034 C26 P52839 /update {wt=javabin&version=2} {add=[140]} 0 7
[junit4:junit4]   2> 15092 T1018 C29 P25025 /update {wt=javabin&version=2} {add=[141 (1413376261108006912)]} 0 1
[junit4:junit4]   2> 15101 T1070 C27 P43693 REQ /update {update.distrib=FROMLEADER&distrib.from=http://127.0.0.1:24191/solr/collection1/&wt=javabin&version=2} status=0 QTime=1 
[junit4:junit4]   2> 15102 T1048 C28 P24191 REQ /update {distrib.from=http://127.0.0.1:52839/solr/collection1/&update.distrib=TOLEADER&wt=javabin&version=2} status=0 QTime=5 
[junit4:junit4]   2> 15102 T1034 C26 P52839 /update {wt=javabin&version=2} {add=[141]} 0 7
[junit4:junit4]   2> 15106 T1018 C29 P25025 /update {wt=javabin&version=2} {add=[142 (1413376261122686976)]} 0 1
[junit4:junit4]   2> 15136 T1070 C27 P43693 REQ /update {update.distrib=FROMLEADER&distrib.from=http://127.0.0.1:24191/solr/collection1/&wt=javabin&version=2} status=0 QTime=9 
[junit4:junit4]   2> 15137 T1048 C28 P24191 REQ /update {distrib.from=http://127.0.0.1:52839/solr/collection1/&update.distrib=TOLEADER&wt=javabin&version=2} status=0 QTime=26 
[junit4:junit4]   2> 15137 T1034 C26 P52839 /update {wt=javabin&version=2} {add=[142]} 0 28
[junit4:junit4]   2> 15150 T1018 C29 P25025 /update {wt=javabin&version=2} {add=[143 (1413376261159387136)]} 0 10
[junit4:junit4]   2> 15160 T1070 C27 P43693 REQ /update {update.distrib=FROMLEADER&distrib.from=http://127.0.0.1:24191/solr/collection1/&wt=javabin&version=2} status=0 QTime=2 
[junit4:junit4]   2> 15160 T1048 C28 P24191 REQ /update {distrib.from=http://127.0.0.1:52839/solr/collection1/&update.distrib=TOLEADER&wt=javabin&version=2} status=0 QTime=6 
[junit4:junit4]   2> 15161 T1034 C26 P52839 /update {wt=javabin&version=2} {add=[143]} 0 9
[junit4:junit4]   2> 15164 T1018 C29 P25025 /update {wt=javabin&version=2} {add=[144 (1413376261183504384)]} 0 1
[junit4:junit4]   2> 15173 T1070 C27 P43693 REQ /update {update.distrib=FROMLEADER&distrib.from=http://127.0.0.1:24191/solr/collection1/&wt=javabin&version=2} status=0 QTime=1 
[junit4:junit4]   2> 15173 T1048 C28 P24191 REQ /update {distrib.from=http://127.0.0.1:52839/solr/collection1/&update.distrib=TOLEADER&wt=javabin&version=2} status=0 QTime=4 
[junit4:junit4]   2> 15173 T1034 C26 P52839 /update {wt=javabin&version=2} {add=[144]} 0 6
[junit4:junit4]   2> 15177 T1018 C29 P25025 /update {wt=javabin&version=2} {add=[145 (1413376261197135872)]} 0 1
[junit4:junit4]   2> 15183 T1070 C27 P43693 REQ /update {distrib.from=http://127.0.0.1:24191/solr/collection1/&update.distrib=FROMLEADER&wt=javabin&version=2} status=0 QTime=1 
[junit4:junit4]   2> 15183 T1050 C28 P24191 /update {wt=javabin&version=2} {add=[145 (1413376261200281600)]} 0 4
[junit4:junit4]   2> 15187 T1018 C29 P25025 /update {wt=javabin&version=2} {add=[146 (1413376261207621632)]} 0 1
[junit4:junit4]   2> 15222 T1056 C25 P43223 REQ /update {update.distrib=FROMLEADER&distrib.from=http://127.0.0.1:52839/solr/collection1/&wt=javabin&version=2} status=0 QTime=14 
[junit4:junit4] 

[...truncated too long message...]

ic/Madeira -Dtests.file.encoding=US-ASCII
[junit4:junit4] FAILURE  167s J0 | SyncSliceTest.testDistribSearch <<<
[junit4:junit4]    > Throwable #1: java.lang.AssertionError: There are still nodes recoverying
[junit4:junit4]    > 	at __randomizedtesting.SeedInfo.seed([5638A91D867C79B6:D7DE2705F123198A]:0)
[junit4:junit4]    > 	at org.junit.Assert.fail(Assert.java:93)
[junit4:junit4]    > 	at org.apache.solr.cloud.AbstractDistribZkTestBase.waitForRecoveriesToFinish(AbstractDistribZkTestBase.java:154)
[junit4:junit4]    > 	at org.apache.solr.cloud.AbstractFullDistribZkTestBase.waitForRecoveriesToFinish(AbstractFullDistribZkTestBase.java:560)
[junit4:junit4]    > 	at org.apache.solr.cloud.AbstractFullDistribZkTestBase.waitForThingsToLevelOut(AbstractFullDistribZkTestBase.java:1135)
[junit4:junit4]    > 	at org.apache.solr.cloud.SyncSliceTest.doTest(SyncSliceTest.java:162)
[junit4:junit4]    > 	at org.apache.solr.BaseDistributedSearchTestCase.testDistribSearch(BaseDistributedSearchTestCase.java:695)
[junit4:junit4]    > 	at sun.reflect.NativeMethodAccessorImpl.invoke0(Native Method)
[junit4:junit4]    > 	at sun.reflect.NativeMethodAccessorImpl.invoke(NativeMethodAccessorImpl.java:57)
[junit4:junit4]    > 	at sun.reflect.DelegatingMethodAccessorImpl.invoke(DelegatingMethodAccessorImpl.java:43)
[junit4:junit4]    > 	at java.lang.reflect.Method.invoke(Method.java:616)
[junit4:junit4]    > 	at com.carrotsearch.randomizedtesting.RandomizedRunner.invoke(RandomizedRunner.java:1559)
[junit4:junit4]    > 	at com.carrotsearch.randomizedtesting.RandomizedRunner.access$600(RandomizedRunner.java:79)
[junit4:junit4]    > 	at com.carrotsearch.randomizedtesting.RandomizedRunner$6.evaluate(RandomizedRunner.java:737)
[junit4:junit4]    > 	at com.carrotsearch.randomizedtesting.RandomizedRunner$7.evaluate(RandomizedRunner.java:773)
[junit4:junit4]    > 	at com.carrotsearch.randomizedtesting.RandomizedRunner$8.evaluate(RandomizedRunner.java:787)
[junit4:junit4]    > 	at com.carrotsearch.randomizedtesting.rules.SystemPropertiesRestoreRule$1.evaluate(SystemPropertiesRestoreRule.java:53)
[junit4:junit4]    > 	at org.apache.lucene.util.TestRuleSetupTeardownChained$1.evaluate(TestRuleSetupTeardownChained.java:50)
[junit4:junit4]    > 	at org.apache.lucene.util.TestRuleFieldCacheSanity$1.evaluate(TestRuleFieldCacheSanity.java:51)
[junit4:junit4]    > 	at org.apache.lucene.util.AbstractBeforeAfterRule$1.evaluate(AbstractBeforeAfterRule.java:45)
[junit4:junit4]    > 	at com.carrotsearch.randomizedtesting.rules.SystemPropertiesInvariantRule$1.evaluate(SystemPropertiesInvariantRule.java:55)
[junit4:junit4]    > 	at org.apache.lucene.util.TestRuleThreadAndTestName$1.evaluate(TestRuleThreadAndTestName.java:48)
[junit4:junit4]    > 	at org.apache.lucene.util.TestRuleIgnoreAfterMaxFailures$1.evaluate(TestRuleIgnoreAfterMaxFailures.java:70)
[junit4:junit4]    > 	at org.apache.lucene.util.TestRuleMarkFailure$1.evaluate(TestRuleMarkFailure.java:48)
[junit4:junit4]    > 	at com.carrotsearch.randomizedtesting.rules.StatementAdapter.evaluate(StatementAdapter.java:36)
[junit4:junit4]    > 	at com.carrotsearch.randomizedtesting.ThreadLeakControl$StatementRunner.run(ThreadLeakControl.java:358)
[junit4:junit4]    > 	at com.carrotsearch.randomizedtesting.ThreadLeakControl.forkTimeoutingTask(ThreadLeakControl.java:782)
[junit4:junit4]    > 	at com.carrotsearch.randomizedtesting.ThreadLeakControl$3.evaluate(ThreadLeakControl.java:442)
[junit4:junit4]    > 	at com.carrotsearch.randomizedtesting.RandomizedRunner.runSingleTest(RandomizedRunner.java:746)
[junit4:junit4]    > 	at com.carrotsearch.randomizedtesting.RandomizedRunner$3.evaluate(RandomizedRunner.java:648)
[junit4:junit4]    > 	at com.carrotsearch.randomizedtesting.RandomizedRunner$4.evaluate(RandomizedRunner.java:682)
[junit4:junit4]    > 	at com.carrotsearch.randomizedtesting.RandomizedRunner$5.evaluate(RandomizedRunner.java:693)
[junit4:junit4]    > 	at com.carrotsearch.randomizedtesting.rules.StatementAdapter.evaluate(StatementAdapter.java:36)
[junit4:junit4]    > 	at com.carrotsearch.randomizedtesting.rules.SystemPropertiesRestoreRule$1.evaluate(SystemPropertiesRestoreRule.java:53)
[junit4:junit4]    > 	at org.apache.lucene.util.AbstractBeforeAfterRule$1.evaluate(AbstractBeforeAfterRule.java:45)
[junit4:junit4]    > 	at org.apache.lucene.util.TestRuleStoreClassName$1.evaluate(TestRuleStoreClassName.java:42)
[junit4:junit4]    > 	at com.carrotsearch.randomizedtesting.rules.SystemPropertiesInvariantRule$1.evaluate(SystemPropertiesInvariantRule.java:55)
[junit4:junit4]    > 	at com.carrotsearch.randomizedtesting.rules.NoShadowingOrOverridesOnMethodsRule$1.evaluate(NoShadowingOrOverridesOnMethodsRule.java:39)
[junit4:junit4]    > 	at com.carrotsearch.randomizedtesting.rules.NoShadowingOrOverridesOnMethodsRule$1.evaluate(NoShadowingOrOverridesOnMethodsRule.java:39)
[junit4:junit4]    > 	at com.carrotsearch.randomizedtesting.rules.StatementAdapter.evaluate(StatementAdapter.java:36)
[junit4:junit4]    > 	at org.apache.lucene.util.TestRuleAssertionsRequired$1.evaluate(TestRuleAssertionsRequired.java:43)
[junit4:junit4]    > 	at org.apache.lucene.util.TestRuleMarkFailure$1.evaluate(TestRuleMarkFailure.java:48)
[junit4:junit4]    > 	at org.apache.lucene.util.TestRuleIgnoreAfterMaxFailures$1.evaluate(TestRuleIgnoreAfterMaxFailures.java:70)
[junit4:junit4]    > 	at org.apache.lucene.util.TestRuleIgnoreTestSuites$1.evaluate(TestRuleIgnoreTestSuites.java:55)
[junit4:junit4]    > 	at com.carrotsearch.randomizedtesting.rules.StatementAdapter.evaluate(StatementAdapter.java:36)
[junit4:junit4]    > 	at com.carrotsearch.randomizedtesting.ThreadLeakControl$StatementRunner.run(ThreadLeakControl.java:358)
[junit4:junit4]    > 	at java.lang.Thread.run(Thread.java:679)
[junit4:junit4]   2> 166861 T3224 oas.SolrTestCaseJ4.deleteCore ###deleteCore
[junit4:junit4]   2> NOTE: test params are: codec=Asserting, sim=DefaultSimilarity, locale=it_CH, timezone=Atlantic/Madeira
[junit4:junit4]   2> NOTE: FreeBSD 9.0-RELEASE amd64/Sun Microsystems Inc. 1.6.0_32 (64-bit)/cpus=16,threads=1,free=171123328,total=312672256
[junit4:junit4]   2> NOTE: All tests run in this JVM: [AlternateDirectoryTest, TestWordDelimiterFilterFactory, SpellPossibilityIteratorTest, TestSolrJ, SystemInfoHandlerTest, TestLuceneMatchVersion, DateFieldTest, UpdateRequestProcessorFactoryTest, TestCollationField, HighlighterConfigTest, TestIBSimilarityFactory, TestCoreContainer, TestPerFieldSimilarity, NotRequiredUniqueKeyTest, TestFastLRUCache, DateMathParserTest, TestStressVersions, CurrencyFieldTest, TestQuerySenderNoQuery, SuggesterFSTTest, SuggesterWFSTTest, DirectUpdateHandlerOptimizeTest, AutoCommitTest, TestStressReorder, SpatialFilterTest, TestLFUCache, TestFiltering, DistributedSpellCheckComponentTest, RequestHandlersTest, TestSuggestSpellingConverter, TestConfig, ZkControllerTest, NumericFieldsTest, TestJoin, FileBasedSpellCheckerTest, CSVRequestHandlerTest, TestRangeQuery, MoreLikeThisHandlerTest, SampleTest, TestBinaryResponseWriter, BinaryUpdateRequestHandlerTest, SpellCheckCollatorTest, SolrCmdDistributorTest, CoreAdminHandlerTest, TestFaceting, SOLR749Test, CoreContainerCoreInitFailuresTest, LoggingHandlerTest, ResourceLoaderTest, TestSearchPerf, SolrCoreCheckLockOnStartupTest, TestGroupingSearch, CacheHeaderTest, BasicDistributedZkTest, LeaderElectionIntegrationTest, LeaderElectionTest, TestRealTimeGet, TestDistributedGrouping, TestExtendedDismaxParser, SoftAutoCommitTest, WordBreakSolrSpellCheckerTest, TestHashPartitioner, DistributedTermsComponentTest, TestRecovery, IndexBasedSpellCheckerTest, DirectUpdateHandlerTest, TestMultiCoreConfBootstrap, SimpleFacetsTest, LukeRequestHandlerTest, PeerSyncTest, QueryElevationComponentTest, SortByFunctionTest, SignatureUpdateProcessorFactoryTest, TestJmxIntegration, HighlighterTest, TestIndexSearcher, TestFunctionQuery, TestTrie, SolrRequestParserTest, DirectSolrConnectionTest, TestCSVLoader, PolyFieldTest, DocumentBuilderTest, MBeansHandlerTest, TestPseudoReturnFields, DisMaxRequestHandlerTest, IndexSchemaTest, TermsComponentTest, DistanceFunctionTest, SolrInfoMBeanTest, MinimalSchemaTest, TestQueryTypes, TestPHPSerializedResponseWriter, XmlUpdateRequestHandlerTest, FieldAnalysisRequestHandlerTest, JsonLoaderTest, TestSurroundQueryParser, TestSolrQueryParser, FastVectorHighlighterTest, JSONWriterTest, ReturnFieldsTest, CopyFieldTest, UniqFieldsUpdateProcessorFactoryTest, TestPropInject, FieldMutatingUpdateProcessorTest, TestBinaryField, TestSolrDeletionPolicy2, DefaultValueUpdateProcessorTest, TestXIncludeConfig, TestQuerySenderListener, MultiTermTest, TestBM25SimilarityFactory, TestPhraseSuggestions, TestLMJelinekMercerSimilarityFactory, TestDefaultSimilarityFactory, FileUtilsTest, SpellingQueryConverterTest, UUIDFieldTest, RAMDirectoryFactoryTest, TestUtils, PreAnalyzedFieldTest, ZkNodePropsTest, CircularListTest, AnalysisAfterCoreReloadTest, SyncSliceTest]
[junit4:junit4] Completed on J0 in 166.89s, 1 test, 1 failure <<< FAILURES!

[...truncated 5 lines...]
BUILD FAILED
/usr/home/hudson/hudson-slave/workspace/Lucene-Solr-NightlyTests-4.x/build.xml:32: The following error occurred while executing this line:
/usr/home/hudson/hudson-slave/workspace/Lucene-Solr-NightlyTests-4.x/solr/build.xml:146: The following error occurred while executing this line:
/usr/home/hudson/hudson-slave/workspace/Lucene-Solr-NightlyTests-4.x/lucene/module-build.xml:63: The following error occurred while executing this line:
/usr/home/hudson/hudson-slave/workspace/Lucene-Solr-NightlyTests-4.x/lucene/common-build.xml:1133: The following error occurred while executing this line:
/usr/home/hudson/hudson-slave/workspace/Lucene-Solr-NightlyTests-4.x/lucene/common-build.xml:810: There were test failures: 230 suites, 951 tests, 2 failures, 7 ignored (2 assumptions)

Total time: 100 minutes 31 seconds
Build step 'Invoke Ant' marked build as failure
Recording test results
Email was triggered for: Failure
Sending email for trigger: Failure



Mime
View raw message