lucene-dev mailing list archives

Site index · List index
Message view « Date » · « Thread »
Top « Date » · « Thread »
From Apache Jenkins Server <jenk...@builds.apache.org>
Subject [JENKINS] Lucene-Solr-Tests-4.x-Java6 - Build # 657 - Still Failing
Date Mon, 17 Sep 2012 05:48:18 GMT
Build: https://builds.apache.org/job/Lucene-Solr-Tests-4.x-Java6/657/

1 tests failed.
REGRESSION:  org.apache.solr.cloud.SyncSliceTest.testDistribSearch

Error Message:
There are still nodes recoverying

Stack Trace:
java.lang.AssertionError: There are still nodes recoverying
	at __randomizedtesting.SeedInfo.seed([E10027658B081383:60E6A97DFC5773BF]:0)
	at org.junit.Assert.fail(Assert.java:93)
	at org.apache.solr.cloud.AbstractDistribZkTestBase.waitForRecoveriesToFinish(AbstractDistribZkTestBase.java:154)
	at org.apache.solr.cloud.AbstractFullDistribZkTestBase.waitForRecoveriesToFinish(AbstractFullDistribZkTestBase.java:560)
	at org.apache.solr.cloud.AbstractFullDistribZkTestBase.waitForThingsToLevelOut(AbstractFullDistribZkTestBase.java:1135)
	at org.apache.solr.cloud.SyncSliceTest.doTest(SyncSliceTest.java:162)
	at org.apache.solr.BaseDistributedSearchTestCase.testDistribSearch(BaseDistributedSearchTestCase.java:695)
	at sun.reflect.NativeMethodAccessorImpl.invoke0(Native Method)
	at sun.reflect.NativeMethodAccessorImpl.invoke(NativeMethodAccessorImpl.java:57)
	at sun.reflect.DelegatingMethodAccessorImpl.invoke(DelegatingMethodAccessorImpl.java:43)
	at java.lang.reflect.Method.invoke(Method.java:616)
	at com.carrotsearch.randomizedtesting.RandomizedRunner.invoke(RandomizedRunner.java:1559)
	at com.carrotsearch.randomizedtesting.RandomizedRunner.access$600(RandomizedRunner.java:79)
	at com.carrotsearch.randomizedtesting.RandomizedRunner$6.evaluate(RandomizedRunner.java:737)
	at com.carrotsearch.randomizedtesting.RandomizedRunner$7.evaluate(RandomizedRunner.java:773)
	at com.carrotsearch.randomizedtesting.RandomizedRunner$8.evaluate(RandomizedRunner.java:787)
	at com.carrotsearch.randomizedtesting.rules.SystemPropertiesRestoreRule$1.evaluate(SystemPropertiesRestoreRule.java:53)
	at org.apache.lucene.util.TestRuleSetupTeardownChained$1.evaluate(TestRuleSetupTeardownChained.java:50)
	at org.apache.lucene.util.TestRuleFieldCacheSanity$1.evaluate(TestRuleFieldCacheSanity.java:51)
	at org.apache.lucene.util.AbstractBeforeAfterRule$1.evaluate(AbstractBeforeAfterRule.java:45)
	at com.carrotsearch.randomizedtesting.rules.SystemPropertiesInvariantRule$1.evaluate(SystemPropertiesInvariantRule.java:55)
	at org.apache.lucene.util.TestRuleThreadAndTestName$1.evaluate(TestRuleThreadAndTestName.java:48)
	at org.apache.lucene.util.TestRuleIgnoreAfterMaxFailures$1.evaluate(TestRuleIgnoreAfterMaxFailures.java:70)
	at org.apache.lucene.util.TestRuleMarkFailure$1.evaluate(TestRuleMarkFailure.java:48)
	at com.carrotsearch.randomizedtesting.rules.StatementAdapter.evaluate(StatementAdapter.java:36)
	at com.carrotsearch.randomizedtesting.ThreadLeakControl$StatementRunner.run(ThreadLeakControl.java:358)
	at com.carrotsearch.randomizedtesting.ThreadLeakControl.forkTimeoutingTask(ThreadLeakControl.java:782)
	at com.carrotsearch.randomizedtesting.ThreadLeakControl$3.evaluate(ThreadLeakControl.java:442)
	at com.carrotsearch.randomizedtesting.RandomizedRunner.runSingleTest(RandomizedRunner.java:746)
	at com.carrotsearch.randomizedtesting.RandomizedRunner$3.evaluate(RandomizedRunner.java:648)
	at com.carrotsearch.randomizedtesting.RandomizedRunner$4.evaluate(RandomizedRunner.java:682)
	at com.carrotsearch.randomizedtesting.RandomizedRunner$5.evaluate(RandomizedRunner.java:693)
	at com.carrotsearch.randomizedtesting.rules.StatementAdapter.evaluate(StatementAdapter.java:36)
	at com.carrotsearch.randomizedtesting.rules.SystemPropertiesRestoreRule$1.evaluate(SystemPropertiesRestoreRule.java:53)
	at org.apache.lucene.util.AbstractBeforeAfterRule$1.evaluate(AbstractBeforeAfterRule.java:45)
	at org.apache.lucene.util.TestRuleStoreClassName$1.evaluate(TestRuleStoreClassName.java:42)
	at com.carrotsearch.randomizedtesting.rules.SystemPropertiesInvariantRule$1.evaluate(SystemPropertiesInvariantRule.java:55)
	at com.carrotsearch.randomizedtesting.rules.NoShadowingOrOverridesOnMethodsRule$1.evaluate(NoShadowingOrOverridesOnMethodsRule.java:39)
	at com.carrotsearch.randomizedtesting.rules.NoShadowingOrOverridesOnMethodsRule$1.evaluate(NoShadowingOrOverridesOnMethodsRule.java:39)
	at com.carrotsearch.randomizedtesting.rules.StatementAdapter.evaluate(StatementAdapter.java:36)
	at org.apache.lucene.util.TestRuleAssertionsRequired$1.evaluate(TestRuleAssertionsRequired.java:43)
	at org.apache.lucene.util.TestRuleMarkFailure$1.evaluate(TestRuleMarkFailure.java:48)
	at org.apache.lucene.util.TestRuleIgnoreAfterMaxFailures$1.evaluate(TestRuleIgnoreAfterMaxFailures.java:70)
	at org.apache.lucene.util.TestRuleIgnoreTestSuites$1.evaluate(TestRuleIgnoreTestSuites.java:55)
	at com.carrotsearch.randomizedtesting.rules.StatementAdapter.evaluate(StatementAdapter.java:36)
	at com.carrotsearch.randomizedtesting.ThreadLeakControl$StatementRunner.run(ThreadLeakControl.java:358)
	at java.lang.Thread.run(Thread.java:679)




Build Log:
[...truncated 7149 lines...]
[junit4:junit4] Suite: org.apache.solr.cloud.SyncSliceTest
[junit4:junit4]   2> 3 T1105 oas.SolrTestCaseJ4.setUp ###Starting testDistribSearch
[junit4:junit4]   2> Creating dataDir: /usr/home/hudson/hudson-slave/workspace/Lucene-Solr-Tests-4.x-Java6/solr/build/solr-core/test/J1/./solrtest-SyncSliceTest-1347860388954
[junit4:junit4]   2> 4 T1105 oasc.ZkTestServer.run STARTING ZK TEST SERVER
[junit4:junit4]   2> 8 T1106 oazs.ZooKeeperServer.setTickTime tickTime set to 1000
[junit4:junit4]   2> 8 T1106 oazs.NIOServerCnxn$Factory.<init> binding to port 0.0.0.0/0.0.0.0:0
[junit4:junit4]   2> 9 T1106 oazsp.FileTxnSnapLog.save Snapshotting: 0
[junit4:junit4]   2> 106 T1105 oasc.ZkTestServer.run start zk server on port:14524
[junit4:junit4]   2> 106 T1105 oaz.ZooKeeper.<init> Initiating client connection, connectString=127.0.0.1:14524 sessionTimeout=10000 watcher=org.apache.solr.common.cloud.ConnectionManager@7603c500
[junit4:junit4]   2> 107 T1111 oaz.ClientCnxn$SendThread.startConnect Opening socket connection to server /127.0.0.1:14524
[junit4:junit4]   2> 107 T1105 oascc.ConnectionManager.waitForConnected Waiting for client to connect to ZooKeeper
[junit4:junit4]   2> 107 T1111 oaz.ClientCnxn$SendThread.primeConnection Socket connection established to localhost/127.0.0.1:14524, initiating session
[junit4:junit4]   2> 108 T1107 oazs.NIOServerCnxn$Factory.run Accepted socket connection from /140.211.11.196:14526
[junit4:junit4]   2> 108 T1107 oazs.NIOServerCnxn.readConnectRequest Client attempting to establish new session at /140.211.11.196:14526
[junit4:junit4]   2> 108 T1109 oazsp.FileTxnLog.append Creating new log file: log.1
[junit4:junit4]   2> 111 T1109 oazs.NIOServerCnxn.finishSessionInit Established session 0x139d2bd5c600000 with negotiated timeout 10000 for client /140.211.11.196:14526
[junit4:junit4]   2> 111 T1111 oaz.ClientCnxn$SendThread.readConnectResult Session establishment complete on server localhost/127.0.0.1:14524, sessionid = 0x139d2bd5c600000, negotiated timeout = 10000
[junit4:junit4]   2> 111 T1112 oascc.ConnectionManager.process Watcher org.apache.solr.common.cloud.ConnectionManager@7603c500 name:ZooKeeperConnection Watcher:127.0.0.1:14524 got event WatchedEvent state:SyncConnected type:None path:null path:null type:None
[junit4:junit4]   2> 111 T1105 oascc.ConnectionManager.waitForConnected Client is connected to ZooKeeper
[junit4:junit4]   2> 111 T1105 oascc.SolrZkClient.makePath makePath: /solr
[junit4:junit4]   2> 119 T1110 oazs.PrepRequestProcessor.pRequest Processed session termination for sessionid: 0x139d2bd5c600000
[junit4:junit4]   2> 120 T1112 oaz.ClientCnxn$EventThread.run EventThread shut down
[junit4:junit4]   2> 120 T1105 oaz.ZooKeeper.close Session: 0x139d2bd5c600000 closed
[junit4:junit4]   2> 121 T1107 oazs.NIOServerCnxn.closeSock Closed socket connection for client /140.211.11.196:14526 which had sessionid 0x139d2bd5c600000
[junit4:junit4]   2> 121 T1105 oaz.ZooKeeper.<init> Initiating client connection, connectString=127.0.0.1:14524/solr sessionTimeout=10000 watcher=org.apache.solr.common.cloud.ConnectionManager@382da869
[junit4:junit4]   2> 122 T1113 oaz.ClientCnxn$SendThread.startConnect Opening socket connection to server /127.0.0.1:14524
[junit4:junit4]   2> 122 T1105 oascc.ConnectionManager.waitForConnected Waiting for client to connect to ZooKeeper
[junit4:junit4]   2> 123 T1113 oaz.ClientCnxn$SendThread.primeConnection Socket connection established to localhost/127.0.0.1:14524, initiating session
[junit4:junit4]   2> 123 T1107 oazs.NIOServerCnxn$Factory.run Accepted socket connection from /140.211.11.196:14527
[junit4:junit4]   2> 123 T1107 oazs.NIOServerCnxn.readConnectRequest Client attempting to establish new session at /140.211.11.196:14527
[junit4:junit4]   2> 125 T1109 oazs.NIOServerCnxn.finishSessionInit Established session 0x139d2bd5c600001 with negotiated timeout 10000 for client /140.211.11.196:14527
[junit4:junit4]   2> 125 T1113 oaz.ClientCnxn$SendThread.readConnectResult Session establishment complete on server localhost/127.0.0.1:14524, sessionid = 0x139d2bd5c600001, negotiated timeout = 10000
[junit4:junit4]   2> 125 T1114 oascc.ConnectionManager.process Watcher org.apache.solr.common.cloud.ConnectionManager@382da869 name:ZooKeeperConnection Watcher:127.0.0.1:14524/solr got event WatchedEvent state:SyncConnected type:None path:null path:null type:None
[junit4:junit4]   2> 125 T1105 oascc.ConnectionManager.waitForConnected Client is connected to ZooKeeper
[junit4:junit4]   2> 126 T1105 oascc.SolrZkClient.makePath makePath: /collections/collection1
[junit4:junit4]   2> 133 T1105 oascc.SolrZkClient.makePath makePath: /collections/collection1/shards
[junit4:junit4]   2> 134 T1105 oascc.SolrZkClient.makePath makePath: /collections/control_collection
[junit4:junit4]   2> 144 T1105 oascc.SolrZkClient.makePath makePath: /collections/control_collection/shards
[junit4:junit4]   2> 161 T1105 oasc.AbstractZkTestCase.putConfig put /usr/home/hudson/hudson-slave/workspace/Lucene-Solr-Tests-4.x-Java6/solr/build/solr-core/test-files/solr/collection1/conf/solrconfig.xml to /configs/conf1/solrconfig.xml
[junit4:junit4]   2> 162 T1105 oascc.SolrZkClient.makePath makePath: /configs/conf1/solrconfig.xml
[junit4:junit4]   2> 185 T1105 oasc.AbstractZkTestCase.putConfig put /usr/home/hudson/hudson-slave/workspace/Lucene-Solr-Tests-4.x-Java6/solr/build/solr-core/test-files/solr/collection1/conf/schema.xml to /configs/conf1/schema.xml
[junit4:junit4]   2> 186 T1105 oascc.SolrZkClient.makePath makePath: /configs/conf1/schema.xml
[junit4:junit4]   2> 296 T1105 oasc.AbstractZkTestCase.putConfig put /usr/home/hudson/hudson-slave/workspace/Lucene-Solr-Tests-4.x-Java6/solr/build/solr-core/test-files/solr/collection1/conf/solrconfig.xml to /configs/conf1/solrconfig.xml
[junit4:junit4]   2> 297 T1105 oascc.SolrZkClient.makePath makePath: /configs/conf1/solrconfig.xml
[junit4:junit4]   2> 308 T1105 oasc.AbstractZkTestCase.putConfig put /usr/home/hudson/hudson-slave/workspace/Lucene-Solr-Tests-4.x-Java6/solr/build/solr-core/test-files/solr/collection1/conf/stopwords.txt to /configs/conf1/stopwords.txt
[junit4:junit4]   2> 309 T1105 oascc.SolrZkClient.makePath makePath: /configs/conf1/stopwords.txt
[junit4:junit4]   2> 318 T1105 oasc.AbstractZkTestCase.putConfig put /usr/home/hudson/hudson-slave/workspace/Lucene-Solr-Tests-4.x-Java6/solr/build/solr-core/test-files/solr/collection1/conf/protwords.txt to /configs/conf1/protwords.txt
[junit4:junit4]   2> 319 T1105 oascc.SolrZkClient.makePath makePath: /configs/conf1/protwords.txt
[junit4:junit4]   2> 326 T1105 oasc.AbstractZkTestCase.putConfig put /usr/home/hudson/hudson-slave/workspace/Lucene-Solr-Tests-4.x-Java6/solr/build/solr-core/test-files/solr/collection1/conf/currency.xml to /configs/conf1/currency.xml
[junit4:junit4]   2> 326 T1105 oascc.SolrZkClient.makePath makePath: /configs/conf1/currency.xml
[junit4:junit4]   2> 333 T1105 oasc.AbstractZkTestCase.putConfig put /usr/home/hudson/hudson-slave/workspace/Lucene-Solr-Tests-4.x-Java6/solr/build/solr-core/test-files/solr/collection1/conf/open-exchange-rates.json to /configs/conf1/open-exchange-rates.json
[junit4:junit4]   2> 334 T1105 oascc.SolrZkClient.makePath makePath: /configs/conf1/open-exchange-rates.json
[junit4:junit4]   2> 345 T1105 oasc.AbstractZkTestCase.putConfig put /usr/home/hudson/hudson-slave/workspace/Lucene-Solr-Tests-4.x-Java6/solr/build/solr-core/test-files/solr/collection1/conf/mapping-ISOLatin1Accent.txt to /configs/conf1/mapping-ISOLatin1Accent.txt
[junit4:junit4]   2> 345 T1105 oascc.SolrZkClient.makePath makePath: /configs/conf1/mapping-ISOLatin1Accent.txt
[junit4:junit4]   2> 352 T1105 oasc.AbstractZkTestCase.putConfig put /usr/home/hudson/hudson-slave/workspace/Lucene-Solr-Tests-4.x-Java6/solr/build/solr-core/test-files/solr/collection1/conf/old_synonyms.txt to /configs/conf1/old_synonyms.txt
[junit4:junit4]   2> 353 T1105 oascc.SolrZkClient.makePath makePath: /configs/conf1/old_synonyms.txt
[junit4:junit4]   2> 355 T1105 oasc.AbstractZkTestCase.putConfig put /usr/home/hudson/hudson-slave/workspace/Lucene-Solr-Tests-4.x-Java6/solr/build/solr-core/test-files/solr/collection1/conf/synonyms.txt to /configs/conf1/synonyms.txt
[junit4:junit4]   2> 356 T1105 oascc.SolrZkClient.makePath makePath: /configs/conf1/synonyms.txt
[junit4:junit4]   2> 357 T1110 oazs.PrepRequestProcessor.pRequest Processed session termination for sessionid: 0x139d2bd5c600001
[junit4:junit4]   2> 366 T1114 oaz.ClientCnxn$EventThread.run EventThread shut down
[junit4:junit4]   2> 367 T1107 oazs.NIOServerCnxn.closeSock Closed socket connection for client /140.211.11.196:14527 which had sessionid 0x139d2bd5c600001
[junit4:junit4]   2> 366 T1105 oaz.ZooKeeper.close Session: 0x139d2bd5c600001 closed
[junit4:junit4]   2> 369 T1105 oejs.Server.doStart jetty-8.1.2.v20120308
[junit4:junit4]   2> 373 T1105 oejs.AbstractConnector.doStart Started SocketConnector@0.0.0.0:14528
[junit4:junit4]   2> 374 T1105 oasc.SolrResourceLoader.locateSolrHome JNDI not configured for solr (NoInitialContextEx)
[junit4:junit4]   2> 375 T1105 oasc.SolrResourceLoader.locateSolrHome using system property solr.solr.home: /usr/home/hudson/hudson-slave/workspace/Lucene-Solr-Tests-4.x-Java6/solr/build/solr-core/test-files/solr
[junit4:junit4]   2> 375 T1105 oasc.SolrResourceLoader.<init> new SolrResourceLoader for deduced Solr Home: '/usr/home/hudson/hudson-slave/workspace/Lucene-Solr-Tests-4.x-Java6/solr/build/solr-core/test-files/solr/'
[junit4:junit4]   2> 411 T1105 oass.SolrDispatchFilter.init SolrDispatchFilter.init()
[junit4:junit4]   2> 412 T1105 oasc.SolrResourceLoader.locateSolrHome JNDI not configured for solr (NoInitialContextEx)
[junit4:junit4]   2> 413 T1105 oasc.SolrResourceLoader.locateSolrHome using system property solr.solr.home: /usr/home/hudson/hudson-slave/workspace/Lucene-Solr-Tests-4.x-Java6/solr/build/solr-core/test-files/solr
[junit4:junit4]   2> 413 T1105 oasc.CoreContainer$Initializer.initialize looking for solr.xml: /usr/home/hudson/hudson-slave/workspace/Lucene-Solr-Tests-4.x-Java6/solr/build/solr-core/test-files/solr/solr.xml
[junit4:junit4]   2> 413 T1105 oasc.CoreContainer.<init> New CoreContainer 720145348
[junit4:junit4]   2> 414 T1105 oasc.CoreContainer.load Loading CoreContainer using Solr Home: '/usr/home/hudson/hudson-slave/workspace/Lucene-Solr-Tests-4.x-Java6/solr/build/solr-core/test-files/solr/'
[junit4:junit4]   2> 414 T1105 oasc.SolrResourceLoader.<init> new SolrResourceLoader for directory: '/usr/home/hudson/hudson-slave/workspace/Lucene-Solr-Tests-4.x-Java6/solr/build/solr-core/test-files/solr/'
[junit4:junit4]   2> 442 T1105 oasc.CoreContainer.load Registering Log Listener
[junit4:junit4]   2> 458 T1105 oasc.CoreContainer.initZooKeeper Zookeeper client=127.0.0.1:14524/solr
[junit4:junit4]   2> 459 T1105 oaz.ZooKeeper.<init> Initiating client connection, connectString=127.0.0.1:14524/solr sessionTimeout=5000 watcher=org.apache.solr.common.cloud.ConnectionManager@1bd7643a
[junit4:junit4]   2> 460 T1124 oaz.ClientCnxn$SendThread.startConnect Opening socket connection to server /127.0.0.1:14524
[junit4:junit4]   2> 460 T1105 oascc.ConnectionManager.waitForConnected Waiting for client to connect to ZooKeeper
[junit4:junit4]   2> 461 T1124 oaz.ClientCnxn$SendThread.primeConnection Socket connection established to localhost/127.0.0.1:14524, initiating session
[junit4:junit4]   2> 461 T1107 oazs.NIOServerCnxn$Factory.run Accepted socket connection from /140.211.11.196:14529
[junit4:junit4]   2> 462 T1107 oazs.NIOServerCnxn.readConnectRequest Client attempting to establish new session at /140.211.11.196:14529
[junit4:junit4]   2> 464 T1109 oazs.NIOServerCnxn.finishSessionInit Established session 0x139d2bd5c600002 with negotiated timeout 5000 for client /140.211.11.196:14529
[junit4:junit4]   2> 464 T1124 oaz.ClientCnxn$SendThread.readConnectResult Session establishment complete on server localhost/127.0.0.1:14524, sessionid = 0x139d2bd5c600002, negotiated timeout = 5000
[junit4:junit4]   2> 464 T1125 oascc.ConnectionManager.process Watcher org.apache.solr.common.cloud.ConnectionManager@1bd7643a name:ZooKeeperConnection Watcher:127.0.0.1:14524/solr got event WatchedEvent state:SyncConnected type:None path:null path:null type:None
[junit4:junit4]   2> 464 T1105 oascc.ConnectionManager.waitForConnected Client is connected to ZooKeeper
[junit4:junit4]   2> 471 T1110 oazs.PrepRequestProcessor.pRequest Got user-level KeeperException when processing sessionid:0x139d2bd5c600002 type:create cxid:0x2 zxid:0xfffffffffffffffe txntype:unknown reqpath:n/a Error Path:/solr/overseer Error:KeeperErrorCode = NodeExists for /solr/overseer
[junit4:junit4]   2> 472 T1105 oascc.SolrZkClient.makePath makePath: /live_nodes
[junit4:junit4]   2> 479 T1105 oasc.ZkController.createEphemeralLiveNode Register node as live in ZooKeeper:/live_nodes/127.0.0.1:14528_solr
[junit4:junit4]   2> 480 T1110 oazs.PrepRequestProcessor.pRequest Got user-level KeeperException when processing sessionid:0x139d2bd5c600002 type:delete cxid:0x7 zxid:0xfffffffffffffffe txntype:unknown reqpath:n/a Error Path:/solr/live_nodes/127.0.0.1:14528_solr Error:KeeperErrorCode = NoNode for /solr/live_nodes/127.0.0.1:14528_solr
[junit4:junit4]   2> 490 T1105 oascc.SolrZkClient.makePath makePath: /live_nodes/127.0.0.1:14528_solr
[junit4:junit4]   2> 501 T1105 oashc.HttpShardHandlerFactory.getParameter Setting socketTimeout to: 0
[junit4:junit4]   2> 502 T1105 oashc.HttpShardHandlerFactory.getParameter Setting urlScheme to: http://
[junit4:junit4]   2> 502 T1105 oashc.HttpShardHandlerFactory.getParameter Setting connTimeout to: 0
[junit4:junit4]   2> 502 T1105 oashc.HttpShardHandlerFactory.getParameter Setting maxConnectionsPerHost to: 20
[junit4:junit4]   2> 503 T1105 oashc.HttpShardHandlerFactory.getParameter Setting corePoolSize to: 0
[junit4:junit4]   2> 503 T1105 oashc.HttpShardHandlerFactory.getParameter Setting maximumPoolSize to: 2147483647
[junit4:junit4]   2> 503 T1105 oashc.HttpShardHandlerFactory.getParameter Setting maxThreadIdleTime to: 5
[junit4:junit4]   2> 504 T1105 oashc.HttpShardHandlerFactory.getParameter Setting sizeOfQueue to: -1
[junit4:junit4]   2> 504 T1105 oashc.HttpShardHandlerFactory.getParameter Setting fairnessPolicy to: false
[junit4:junit4]   2> 504 T1105 oascsi.HttpClientUtil.createClient Creating new http client, config:maxConnectionsPerHost=20&maxConnections=10000&socketTimeout=0&connTimeout=0&retry=false
[junit4:junit4]   2> 515 T1105 oascc.SolrZkClient.makePath makePath: /overseer_elect/election
[junit4:junit4]   2> 535 T1110 oazs.PrepRequestProcessor.pRequest Got user-level KeeperException when processing sessionid:0x139d2bd5c600002 type:delete cxid:0x15 zxid:0xfffffffffffffffe txntype:unknown reqpath:n/a Error Path:/solr/overseer_elect/leader Error:KeeperErrorCode = NoNode for /solr/overseer_elect/leader
[junit4:junit4]   2> 543 T1105 oascc.SolrZkClient.makePath makePath: /overseer_elect/leader
[junit4:junit4]   2> 556 T1105 oasc.Overseer.start Overseer (id=88333378450882562-127.0.0.1:14528_solr-n_0000000000) starting
[junit4:junit4]   2> 557 T1110 oazs.PrepRequestProcessor.pRequest Got user-level KeeperException when processing sessionid:0x139d2bd5c600002 type:create cxid:0x1a zxid:0xfffffffffffffffe txntype:unknown reqpath:n/a Error Path:/solr/overseer Error:KeeperErrorCode = NodeExists for /solr/overseer
[junit4:junit4]   2> 558 T1110 oazs.PrepRequestProcessor.pRequest Got user-level KeeperException when processing sessionid:0x139d2bd5c600002 type:create cxid:0x1b zxid:0xfffffffffffffffe txntype:unknown reqpath:n/a Error Path:/solr/overseer Error:KeeperErrorCode = NodeExists for /solr/overseer
[junit4:junit4]   2> 559 T1110 oazs.PrepRequestProcessor.pRequest Got user-level KeeperException when processing sessionid:0x139d2bd5c600002 type:create cxid:0x1c zxid:0xfffffffffffffffe txntype:unknown reqpath:n/a Error Path:/solr/overseer Error:KeeperErrorCode = NodeExists for /solr/overseer
[junit4:junit4]   2> 560 T1110 oazs.PrepRequestProcessor.pRequest Got user-level KeeperException when processing sessionid:0x139d2bd5c600002 type:create cxid:0x1d zxid:0xfffffffffffffffe txntype:unknown reqpath:n/a Error Path:/solr/overseer Error:KeeperErrorCode = NodeExists for /solr/overseer
[junit4:junit4]   2> 564 T1127 oasc.OverseerCollectionProcessor.run Process current queue of collection creations
[junit4:junit4]   2> 564 T1105 oascc.SolrZkClient.makePath makePath: /clusterstate.json
[junit4:junit4]   2> 566 T1105 oascc.ZkStateReader.createClusterStateWatchersAndUpdate Updating cluster state from ZooKeeper... 
[junit4:junit4]   2> 572 T1126 oasc.Overseer$ClusterStateUpdater.run Starting to work on the main queue
[junit4:junit4]   2> 573 T1105 oasc.CoreContainer.create Creating SolrCore 'collection1' using instanceDir: /usr/home/hudson/hudson-slave/workspace/Lucene-Solr-Tests-4.x-Java6/solr/build/solr-core/test-files/solr/collection1
[junit4:junit4]   2> 574 T1105 oasc.ZkController.createCollectionZkNode Check for collection zkNode:control_collection
[junit4:junit4]   2> 574 T1105 oasc.ZkController.createCollectionZkNode Collection zkNode exists
[junit4:junit4]   2> 575 T1105 oasc.ZkController.readConfigName Load collection config from:/collections/control_collection
[junit4:junit4]   2> 576 T1105 oasc.SolrResourceLoader.<init> new SolrResourceLoader for directory: '/usr/home/hudson/hudson-slave/workspace/Lucene-Solr-Tests-4.x-Java6/solr/build/solr-core/test-files/solr/collection1/'
[junit4:junit4]   2> 577 T1105 oasc.SolrResourceLoader.replaceClassLoader Adding 'file:/usr/home/hudson/hudson-slave/workspace/Lucene-Solr-Tests-4.x-Java6/solr/build/solr-core/test-files/solr/collection1/lib/README' to classloader
[junit4:junit4]   2> 577 T1105 oasc.SolrResourceLoader.replaceClassLoader Adding 'file:/usr/home/hudson/hudson-slave/workspace/Lucene-Solr-Tests-4.x-Java6/solr/build/solr-core/test-files/solr/collection1/lib/classes/' to classloader
[junit4:junit4]   2> 613 T1105 oasc.SolrConfig.<init> Using Lucene MatchVersion: LUCENE_40
[junit4:junit4]   2> 666 T1105 oasc.SolrConfig.<init> Loaded SolrConfig: solrconfig.xml
[junit4:junit4]   2> 767 T1105 oass.IndexSchema.readSchema Reading Solr Schema
[junit4:junit4]   2> 773 T1105 oass.IndexSchema.readSchema Schema name=test
[junit4:junit4]   2> 1307 T1105 oass.OpenExchangeRatesOrgProvider.init Initialized with rates=open-exchange-rates.json, refreshInterval=1440.
[junit4:junit4]   2> 1314 T1105 oass.IndexSchema.readSchema default search field in schema is text
[junit4:junit4]   2> 1317 T1105 oass.IndexSchema.readSchema unique key field: id
[junit4:junit4]   2> 1326 T1105 oass.FileExchangeRateProvider.reload Reloading exchange rates from file currency.xml
[junit4:junit4]   2> 1329 T1105 oass.FileExchangeRateProvider.reload Reloading exchange rates from file currency.xml
[junit4:junit4]   2> 1332 T1105 oass.OpenExchangeRatesOrgProvider.reload Reloading exchange rates from open-exchange-rates.json
[junit4:junit4]   2> 1333 T1105 oass.OpenExchangeRatesOrgProvider.reload Reloading exchange rates from open-exchange-rates.json
[junit4:junit4]   2> 1334 T1105 oasc.SolrCore.<init> [collection1] Opening new SolrCore at /usr/home/hudson/hudson-slave/workspace/Lucene-Solr-Tests-4.x-Java6/solr/build/solr-core/test-files/solr/collection1/, dataDir=./org.apache.solr.cloud.SyncSliceTest-1347860388954/control/data/
[junit4:junit4]   2> 1334 T1105 oasc.JmxMonitoredMap.<init> JMX monitoring is enabled. Adding Solr mbeans to JMX Server: com.sun.jmx.mbeanserver.JmxMBeanServer@786c1a82
[junit4:junit4]   2> 1357 T1105 oasc.SolrCore.getNewIndexDir WARNING New index directory detected: old=null new=./org.apache.solr.cloud.SyncSliceTest-1347860388954/control/data/index/
[junit4:junit4]   2> 1358 T1105 oasc.SolrCore.initIndex WARNING [collection1] Solr index directory './org.apache.solr.cloud.SyncSliceTest-1347860388954/control/data/index' doesn't exist. Creating new index...
[junit4:junit4]   2> 1359 T1105 oasc.CachingDirectoryFactory.get return new directory for /usr/home/hudson/hudson-slave/workspace/Lucene-Solr-Tests-4.x-Java6/solr/build/solr-core/test/J1/./org.apache.solr.cloud.SyncSliceTest-1347860388954/control/data/index forceNew:false
[junit4:junit4]   2> 1408 T1105 oasc.SolrDeletionPolicy.onCommit SolrDeletionPolicy.onCommit: commits:num=1
[junit4:junit4]   2> 		commit{dir=/usr/home/hudson/hudson-slave/workspace/Lucene-Solr-Tests-4.x-Java6/solr/build/solr-core/test/J1/org.apache.solr.cloud.SyncSliceTest-1347860388954/control/data/index,segFN=segments_1,generation=1,filenames=[segments_1]
[junit4:junit4]   2> 1409 T1105 oasc.SolrDeletionPolicy.updateCommits newest commit = 1
[junit4:junit4]   2> 1410 T1105 oasc.SolrCore.initWriters created xml: solr.XMLResponseWriter
[junit4:junit4]   2> 1412 T1105 oasup.UpdateRequestProcessorChain.init inserting DistributedUpdateProcessorFactory into updateRequestProcessorChain "dedupe"
[junit4:junit4]   2> 1413 T1105 oasup.UpdateRequestProcessorChain.init inserting DistributedUpdateProcessorFactory into updateRequestProcessorChain "dedupe-allfields"
[junit4:junit4]   2> 1413 T1105 oasup.UpdateRequestProcessorChain.init inserting DistributedUpdateProcessorFactory into updateRequestProcessorChain "stored_sig"
[junit4:junit4]   2> 1414 T1105 oasup.UpdateRequestProcessorChain.init inserting DistributedUpdateProcessorFactory into updateRequestProcessorChain "uniq-fields"
[junit4:junit4]   2> 1414 T1105 oasup.UpdateRequestProcessorChain.init inserting DistributedUpdateProcessorFactory into updateRequestProcessorChain "distrib-dup-test-chain-implicit"
[junit4:junit4]   2> 1415 T1105 oasc.RequestHandlers.initHandlersFromConfig adding lazy requestHandler: solr.ReplicationHandler
[junit4:junit4]   2> 1415 T1105 oasc.RequestHandlers.initHandlersFromConfig created /replication: solr.ReplicationHandler
[junit4:junit4]   2> 1416 T1105 oasc.RequestHandlers.initHandlersFromConfig created standard: solr.StandardRequestHandler
[junit4:junit4]   2> 1417 T1105 oasc.RequestHandlers.initHandlersFromConfig created /get: solr.RealTimeGetHandler
[junit4:junit4]   2> 1417 T1105 oasc.RequestHandlers.initHandlersFromConfig created dismax: solr.SearchHandler
[junit4:junit4]   2> 1418 T1105 oasc.RequestHandlers.initHandlersFromConfig created mock: org.apache.solr.core.MockQuerySenderListenerReqHandler
[junit4:junit4]   2> 1419 T1105 oasc.RequestHandlers.initHandlersFromConfig created /admin/: org.apache.solr.handler.admin.AdminHandlers
[junit4:junit4]   2> 1419 T1105 oasc.RequestHandlers.initHandlersFromConfig created defaults: solr.StandardRequestHandler
[junit4:junit4]   2> 1420 T1105 oasc.RequestHandlers.initHandlersFromConfig adding lazy requestHandler: solr.StandardRequestHandler
[junit4:junit4]   2> 1420 T1105 oasc.RequestHandlers.initHandlersFromConfig created lazy: solr.StandardRequestHandler
[junit4:junit4]   2> 1421 T1105 oasc.RequestHandlers.initHandlersFromConfig created /update: solr.UpdateRequestHandler
[junit4:junit4]   2> 1421 T1105 oasc.RequestHandlers.initHandlersFromConfig created /terms: org.apache.solr.handler.component.SearchHandler
[junit4:junit4]   2> 1422 T1105 oasc.RequestHandlers.initHandlersFromConfig created spellCheckCompRH: org.apache.solr.handler.component.SearchHandler
[junit4:junit4]   2> 1423 T1105 oasc.RequestHandlers.initHandlersFromConfig created spellCheckCompRH_Direct: org.apache.solr.handler.component.SearchHandler
[junit4:junit4]   2> 1423 T1105 oasc.RequestHandlers.initHandlersFromConfig created spellCheckWithWordbreak: org.apache.solr.handler.component.SearchHandler
[junit4:junit4]   2> 1424 T1105 oasc.RequestHandlers.initHandlersFromConfig created spellCheckWithWordbreak_Direct: org.apache.solr.handler.component.SearchHandler
[junit4:junit4]   2> 1424 T1105 oasc.RequestHandlers.initHandlersFromConfig created spellCheckCompRH1: org.apache.solr.handler.component.SearchHandler
[junit4:junit4]   2> 1425 T1105 oasc.RequestHandlers.initHandlersFromConfig created tvrh: org.apache.solr.handler.component.SearchHandler
[junit4:junit4]   2> 1426 T1105 oasc.RequestHandlers.initHandlersFromConfig created /mlt: solr.MoreLikeThisHandler
[junit4:junit4]   2> 1426 T1105 oasc.RequestHandlers.initHandlersFromConfig created /debug/dump: solr.DumpRequestHandler
[junit4:junit4]   2> 1430 T1105 oashl.XMLLoader.init xsltCacheLifetimeSeconds=60
[junit4:junit4]   2> 1434 T1105 oasc.SolrCore.initDeprecatedSupport WARNING solrconfig.xml uses deprecated <admin/gettableFiles>, Please update your config to use the ShowFileRequestHandler.
[junit4:junit4]   2> 1435 T1105 oasc.SolrCore.initDeprecatedSupport WARNING adding ShowFileRequestHandler with hidden files: [SCHEMA.XML, OLD_SYNONYMS.TXT, STOPWORDS.TXT, PROTWORDS.TXT, OPEN-EXCHANGE-RATES.JSON, SYNONYMS.TXT, CURRENCY.XML, MAPPING-ISOLATIN1ACCENT.TXT]
[junit4:junit4]   2> 1438 T1105 oass.SolrIndexSearcher.<init> Opening Searcher@62d4dcb5 main
[junit4:junit4]   2> 1439 T1105 oasu.CommitTracker.<init> Hard AutoCommit: disabled
[junit4:junit4]   2> 1439 T1105 oasu.CommitTracker.<init> Soft AutoCommit: disabled
[junit4:junit4]   2> 1440 T1105 oashc.SpellCheckComponent.inform Initializing spell checkers
[junit4:junit4]   2> 1490 T1105 oass.DirectSolrSpellChecker.init init: {name=direct,classname=DirectSolrSpellChecker,field=lowerfilt,minQueryLength=3}
[junit4:junit4]   2> 1561 T1128 oasc.SolrCore.registerSearcher [collection1] Registered new searcher Searcher@62d4dcb5 main{StandardDirectoryReader(segments_1:1)}
[junit4:junit4]   2> 1567 T1110 oazs.PrepRequestProcessor.pRequest Got user-level KeeperException when processing sessionid:0x139d2bd5c600002 type:create cxid:0x53 zxid:0xfffffffffffffffe txntype:unknown reqpath:n/a Error Path:/solr/overseer/queue Error:KeeperErrorCode = NoNode for /solr/overseer/queue
[junit4:junit4]   2> 1581 T1105 oasc.CoreContainer.register registering core: collection1
[junit4:junit4]   2> 1582 T1126 oascc.ZkStateReader.updateClusterState Updating cloud state from ZooKeeper... 
[junit4:junit4]   2> 1582 T1105 oasc.ZkController.register Register shard - core:collection1 address:http://127.0.0.1:14528/solr shardId:control_shard
[junit4:junit4]   2> 1582 T1110 oazs.PrepRequestProcessor.pRequest Got user-level KeeperException when processing sessionid:0x139d2bd5c600002 type:create cxid:0x5c zxid:0xfffffffffffffffe txntype:unknown reqpath:n/a Error Path:/solr/overseer/queue-work Error:KeeperErrorCode = NoNode for /solr/overseer/queue-work
[junit4:junit4]   2> 1582 T1105 oascc.SolrZkClient.makePath makePath: /collections/control_collection/leader_elect/control_shard/election
[junit4:junit4]   2> 1587 T1125 oascc.ZkStateReader$2.process A cluster state change has occurred - updating...
[junit4:junit4]   2> 1588 T1110 oazs.PrepRequestProcessor.pRequest Got user-level KeeperException when processing sessionid:0x139d2bd5c600002 type:delete cxid:0x73 zxid:0xfffffffffffffffe txntype:unknown reqpath:n/a Error Path:/solr/collections/control_collection/leaders Error:KeeperErrorCode = NoNode for /solr/collections/control_collection/leaders
[junit4:junit4]   2> 1589 T1105 oasc.ShardLeaderElectionContext.runLeaderProcess Running the leader process.
[junit4:junit4]   2> 1589 T1110 oazs.PrepRequestProcessor.pRequest Got user-level KeeperException when processing sessionid:0x139d2bd5c600002 type:create cxid:0x75 zxid:0xfffffffffffffffe txntype:unknown reqpath:n/a Error Path:/solr/overseer Error:KeeperErrorCode = NodeExists for /solr/overseer
[junit4:junit4]   2> 1600 T1105 oasc.ShardLeaderElectionContext.waitForReplicasToComeUp Enough replicas found to continue.
[junit4:junit4]   2> 1600 T1105 oasc.ShardLeaderElectionContext.runLeaderProcess I may be the new leader - try and sync
[junit4:junit4]   2> 1601 T1105 oasc.SyncStrategy.sync Sync replicas to http://127.0.0.1:14528/solr/collection1/
[junit4:junit4]   2> 1601 T1105 oasc.SyncStrategy.syncReplicas Sync Success - now sync replicas to me
[junit4:junit4]   2> 1601 T1105 oasc.SyncStrategy.syncToMe http://127.0.0.1:14528/solr/collection1/ has no replicas
[junit4:junit4]   2> 1602 T1105 oasc.ShardLeaderElectionContext.runLeaderProcess I am the new leader: http://127.0.0.1:14528/solr/collection1/
[junit4:junit4]   2> 1602 T1105 oascc.SolrZkClient.makePath makePath: /collections/control_collection/leaders/control_shard
[junit4:junit4]   2> 1605 T1110 oazs.PrepRequestProcessor.pRequest Got user-level KeeperException when processing sessionid:0x139d2bd5c600002 type:create cxid:0x7f zxid:0xfffffffffffffffe txntype:unknown reqpath:n/a Error Path:/solr/overseer Error:KeeperErrorCode = NodeExists for /solr/overseer
[junit4:junit4]   2> 2090 T1126 oascc.ZkStateReader.updateClusterState Updating cloud state from ZooKeeper... 
[junit4:junit4]   2> 2104 T1125 oascc.ZkStateReader$2.process A cluster state change has occurred - updating...
[junit4:junit4]   2> 2125 T1105 oasc.ZkController.register We are http://127.0.0.1:14528/solr/collection1/ and leader is http://127.0.0.1:14528/solr/collection1/
[junit4:junit4]   2> 2125 T1105 oasc.ZkController.register No LogReplay needed for core=collection1 baseURL=http://127.0.0.1:14528/solr
[junit4:junit4]   2> 2126 T1105 oasc.ZkController.checkRecovery I am the leader, no recovery necessary
[junit4:junit4]   2> 2127 T1105 oascc.ZkStateReader.updateClusterState Updating cloud state from ZooKeeper... 
[junit4:junit4]   2> 2128 T1105 oass.SolrDispatchFilter.init user.dir=/usr/home/hudson/hudson-slave/workspace/Lucene-Solr-Tests-4.x-Java6/solr/build/solr-core/test/J1
[junit4:junit4]   2> 2129 T1105 oass.SolrDispatchFilter.init SolrDispatchFilter.init() done
[junit4:junit4]   2> 2129 T1105 oascsi.HttpClientUtil.createClient Creating new http client, config:maxConnections=128&maxConnectionsPerHost=32&followRedirects=false
[junit4:junit4]   2> 2303 T1105 oejs.Server.doStart jetty-8.1.2.v20120308
[junit4:junit4]   2> 2305 T1105 oejs.AbstractConnector.doStart Started SocketConnector@0.0.0.0:14531
[junit4:junit4]   2> 2305 T1105 oasc.SolrResourceLoader.locateSolrHome JNDI not configured for solr (NoInitialContextEx)
[junit4:junit4]   2> 2305 T1105 oasc.SolrResourceLoader.locateSolrHome using system property solr.solr.home: /usr/home/hudson/hudson-slave/workspace/Lucene-Solr-Tests-4.x-Java6/solr/build/solr-core/test/J1/./solrtest-jetty1-1347860391096
[junit4:junit4]   2> 2306 T1105 oasc.SolrResourceLoader.<init> new SolrResourceLoader for deduced Solr Home: '/usr/home/hudson/hudson-slave/workspace/Lucene-Solr-Tests-4.x-Java6/solr/build/solr-core/test/J1/./solrtest-jetty1-1347860391096/'
[junit4:junit4]   2> 2334 T1105 oass.SolrDispatchFilter.init SolrDispatchFilter.init()
[junit4:junit4]   2> 2334 T1105 oasc.SolrResourceLoader.locateSolrHome JNDI not configured for solr (NoInitialContextEx)
[junit4:junit4]   2> 2335 T1105 oasc.SolrResourceLoader.locateSolrHome using system property solr.solr.home: /usr/home/hudson/hudson-slave/workspace/Lucene-Solr-Tests-4.x-Java6/solr/build/solr-core/test/J1/./solrtest-jetty1-1347860391096
[junit4:junit4]   2> 2335 T1105 oasc.CoreContainer$Initializer.initialize looking for solr.xml: /usr/home/hudson/hudson-slave/workspace/Lucene-Solr-Tests-4.x-Java6/solr/build/solr-core/test/J1/./solrtest-jetty1-1347860391096/solr.xml
[junit4:junit4]   2> 2335 T1105 oasc.CoreContainer.<init> New CoreContainer 1490782441
[junit4:junit4]   2> 2336 T1105 oasc.CoreContainer.load Loading CoreContainer using Solr Home: '/usr/home/hudson/hudson-slave/workspace/Lucene-Solr-Tests-4.x-Java6/solr/build/solr-core/test/J1/./solrtest-jetty1-1347860391096/'
[junit4:junit4]   2> 2336 T1105 oasc.SolrResourceLoader.<init> new SolrResourceLoader for directory: '/usr/home/hudson/hudson-slave/workspace/Lucene-Solr-Tests-4.x-Java6/solr/build/solr-core/test/J1/./solrtest-jetty1-1347860391096/'
[junit4:junit4]   2> 2354 T1105 oasc.CoreContainer.load Registering Log Listener
[junit4:junit4]   2> 2365 T1105 oasc.CoreContainer.initZooKeeper Zookeeper client=127.0.0.1:14524/solr
[junit4:junit4]   2> 2366 T1105 oaz.ZooKeeper.<init> Initiating client connection, connectString=127.0.0.1:14524/solr sessionTimeout=5000 watcher=org.apache.solr.common.cloud.ConnectionManager@7226d669
[junit4:junit4]   2> 2367 T1138 oaz.ClientCnxn$SendThread.startConnect Opening socket connection to server /127.0.0.1:14524
[junit4:junit4]   2> 2367 T1105 oascc.ConnectionManager.waitForConnected Waiting for client to connect to ZooKeeper
[junit4:junit4]   2> 2368 T1138 oaz.ClientCnxn$SendThread.primeConnection Socket connection established to localhost/127.0.0.1:14524, initiating session
[junit4:junit4]   2> 2368 T1107 oazs.NIOServerCnxn$Factory.run Accepted socket connection from /140.211.11.196:14532
[junit4:junit4]   2> 2368 T1107 oazs.NIOServerCnxn.readConnectRequest Client attempting to establish new session at /140.211.11.196:14532
[junit4:junit4]   2> 2370 T1109 oazs.NIOServerCnxn.finishSessionInit Established session 0x139d2bd5c600003 with negotiated timeout 5000 for client /140.211.11.196:14532
[junit4:junit4]   2> 2371 T1138 oaz.ClientCnxn$SendThread.readConnectResult Session establishment complete on server localhost/127.0.0.1:14524, sessionid = 0x139d2bd5c600003, negotiated timeout = 5000
[junit4:junit4]   2> 2371 T1139 oascc.ConnectionManager.process Watcher org.apache.solr.common.cloud.ConnectionManager@7226d669 name:ZooKeeperConnection Watcher:127.0.0.1:14524/solr got event WatchedEvent state:SyncConnected type:None path:null path:null type:None
[junit4:junit4]   2> 2371 T1105 oascc.ConnectionManager.waitForConnected Client is connected to ZooKeeper
[junit4:junit4]   2> 2371 T1110 oazs.PrepRequestProcessor.pRequest Got user-level KeeperException when processing sessionid:0x139d2bd5c600003 type:create cxid:0x1 zxid:0xfffffffffffffffe txntype:unknown reqpath:n/a Error Path:/solr/overseer Error:KeeperErrorCode = NodeExists for /solr/overseer
[junit4:junit4]   2> 2381 T1110 oazs.PrepRequestProcessor.pRequest Got user-level KeeperException when processing sessionid:0x139d2bd5c600003 type:create cxid:0x2 zxid:0xfffffffffffffffe txntype:unknown reqpath:n/a Error Path:/solr/overseer Error:KeeperErrorCode = NodeExists for /solr/overseer
[junit4:junit4]   2> 2389 T1105 oasc.ZkController.createEphemeralLiveNode Register node as live in ZooKeeper:/live_nodes/127.0.0.1:14531_solr
[junit4:junit4]   2> 2389 T1110 oazs.PrepRequestProcessor.pRequest Got user-level KeeperException when processing sessionid:0x139d2bd5c600003 type:delete cxid:0x4 zxid:0xfffffffffffffffe txntype:unknown reqpath:n/a Error Path:/solr/live_nodes/127.0.0.1:14531_solr Error:KeeperErrorCode = NoNode for /solr/live_nodes/127.0.0.1:14531_solr
[junit4:junit4]   2> 2396 T1105 oascc.SolrZkClient.makePath makePath: /live_nodes/127.0.0.1:14531_solr
[junit4:junit4]   2> 2408 T1125 oascc.ZkStateReader$3.process Updating live nodes
[junit4:junit4]   2> 2408 T1105 oashc.HttpShardHandlerFactory.getParameter Setting socketTimeout to: 0
[junit4:junit4]   2> 2409 T1105 oashc.HttpShardHandlerFactory.getParameter Setting urlScheme to: http://
[junit4:junit4]   2> 2409 T1105 oashc.HttpShardHandlerFactory.getParameter Setting connTimeout to: 0
[junit4:junit4]   2> 2409 T1105 oashc.HttpShardHandlerFactory.getParameter Setting maxConnectionsPerHost to: 20
[junit4:junit4]   2> 2409 T1105 oashc.HttpShardHandlerFactory.getParameter Setting corePoolSize to: 0
[junit4:junit4]   2> 2410 T1105 oashc.HttpShardHandlerFactory.getParameter Setting maximumPoolSize to: 2147483647
[junit4:junit4]   2> 2410 T1105 oashc.HttpShardHandlerFactory.getParameter Setting maxThreadIdleTime to: 5
[junit4:junit4]   2> 2410 T1105 oashc.HttpShardHandlerFactory.getParameter Setting sizeOfQueue to: -1
[junit4:junit4]   2> 2410 T1105 oashc.HttpShardHandlerFactory.getParameter Setting fairnessPolicy to: false
[junit4:junit4]   2> 2411 T1105 oascsi.HttpClientUtil.createClient Creating new http client, config:maxConnectionsPerHost=20&maxConnections=10000&socketTimeout=0&connTimeout=0&retry=false
[junit4:junit4]   2> 2428 T1105 oascc.ZkStateReader.createClusterStateWatchersAndUpdate Updating cluster state from ZooKeeper... 
[junit4:junit4]   2> 2433 T1105 oasc.CoreContainer.create Creating SolrCore 'collection1' using instanceDir: /usr/home/hudson/hudson-slave/workspace/Lucene-Solr-Tests-4.x-Java6/solr/build/solr-core/test/J1/./solrtest-jetty1-1347860391096/collection1
[junit4:junit4]   2> 2433 T1105 oasc.ZkController.createCollectionZkNode Check for collection zkNode:collection1
[junit4:junit4]   2> 2433 T1105 oasc.ZkController.createCollectionZkNode Collection zkNode exists
[junit4:junit4]   2> 2434 T1105 oasc.ZkController.readConfigName Load collection config from:/collections/collection1
[junit4:junit4]   2> 2435 T1105 oasc.SolrResourceLoader.<init> new SolrResourceLoader for directory: '/usr/home/hudson/hudson-slave/workspace/Lucene-Solr-Tests-4.x-Java6/solr/build/solr-core/test/J1/./solrtest-jetty1-1347860391096/collection1/'
[junit4:junit4]   2> 2435 T1105 oasc.SolrResourceLoader.replaceClassLoader Adding 'file:/usr/home/hudson/hudson-slave/workspace/Lucene-Solr-Tests-4.x-Java6/solr/build/solr-core/test/J1/solrtest-jetty1-1347860391096/collection1/lib/README' to classloader
[junit4:junit4]   2> 2436 T1105 oasc.SolrResourceLoader.replaceClassLoader Adding 'file:/usr/home/hudson/hudson-slave/workspace/Lucene-Solr-Tests-4.x-Java6/solr/build/solr-core/test/J1/solrtest-jetty1-1347860391096/collection1/lib/classes/' to classloader
[junit4:junit4]   2> 2470 T1105 oasc.SolrConfig.<init> Using Lucene MatchVersion: LUCENE_40
[junit4:junit4]   2> 2524 T1105 oasc.SolrConfig.<init> Loaded SolrConfig: solrconfig.xml
[junit4:junit4]   2> 2625 T1105 oass.IndexSchema.readSchema Reading Solr Schema
[junit4:junit4]   2> 2630 T1126 oascc.ZkStateReader.updateClusterState Updating cloud state from ZooKeeper... 
[junit4:junit4]   2> 2630 T1105 oass.IndexSchema.readSchema Schema name=test
[junit4:junit4]   2> 2666 T1139 oascc.ZkStateReader$2.process A cluster state change has occurred - updating...
[junit4:junit4]   2> 2666 T1125 oascc.ZkStateReader$2.process A cluster state change has occurred - updating...
[junit4:junit4]   2> 3139 T1105 oass.OpenExchangeRatesOrgProvider.init Initialized with rates=open-exchange-rates.json, refreshInterval=1440.
[junit4:junit4]   2> 3147 T1105 oass.IndexSchema.readSchema default search field in schema is text
[junit4:junit4]   2> 3150 T1105 oass.IndexSchema.readSchema unique key field: id
[junit4:junit4]   2> 3159 T1105 oass.FileExchangeRateProvider.reload Reloading exchange rates from file currency.xml
[junit4:junit4]   2> 3164 T1105 oass.FileExchangeRateProvider.reload Reloading exchange rates from file currency.xml
[junit4:junit4]   2> 3170 T1105 oass.OpenExchangeRatesOrgProvider.reload Reloading exchange rates from open-exchange-rates.json
[junit4:junit4]   2> 3171 T1105 oass.OpenExchangeRatesOrgProvider.reload Reloading exchange rates from open-exchange-rates.json
[junit4:junit4]   2> 3172 T1105 oasc.SolrCore.<init> [collection1] Opening new SolrCore at /usr/home/hudson/hudson-slave/workspace/Lucene-Solr-Tests-4.x-Java6/solr/build/solr-core/test/J1/./solrtest-jetty1-1347860391096/collection1/, dataDir=./org.apache.solr.cloud.SyncSliceTest-1347860388954/jetty1/
[junit4:junit4]   2> 3172 T1105 oasc.JmxMonitoredMap.<init> JMX monitoring is enabled. Adding Solr mbeans to JMX Server: com.sun.jmx.mbeanserver.JmxMBeanServer@786c1a82
[junit4:junit4]   2> 3173 T1105 oasc.SolrCore.getNewIndexDir WARNING New index directory detected: old=null new=./org.apache.solr.cloud.SyncSliceTest-1347860388954/jetty1/index/
[junit4:junit4]   2> 3174 T1105 oasc.SolrCore.initIndex WARNING [collection1] Solr index directory './org.apache.solr.cloud.SyncSliceTest-1347860388954/jetty1/index' doesn't exist. Creating new index...
[junit4:junit4]   2> 3175 T1105 oasc.CachingDirectoryFactory.get return new directory for /usr/home/hudson/hudson-slave/workspace/Lucene-Solr-Tests-4.x-Java6/solr/build/solr-core/test/J1/./org.apache.solr.cloud.SyncSliceTest-1347860388954/jetty1/index forceNew:false
[junit4:junit4]   2> 3191 T1105 oasc.SolrDeletionPolicy.onCommit SolrDeletionPolicy.onCommit: commits:num=1
[junit4:junit4]   2> 		commit{dir=/usr/home/hudson/hudson-slave/workspace/Lucene-Solr-Tests-4.x-Java6/solr/build/solr-core/test/J1/org.apache.solr.cloud.SyncSliceTest-1347860388954/jetty1/index,segFN=segments_1,generation=1,filenames=[segments_1]
[junit4:junit4]   2> 3191 T1105 oasc.SolrDeletionPolicy.updateCommits newest commit = 1
[junit4:junit4]   2> 3192 T1105 oasc.SolrCore.initWriters created xml: solr.XMLResponseWriter
[junit4:junit4]   2> 3194 T1105 oasup.UpdateRequestProcessorChain.init inserting DistributedUpdateProcessorFactory into updateRequestProcessorChain "dedupe"
[junit4:junit4]   2> 3194 T1105 oasup.UpdateRequestProcessorChain.init inserting DistributedUpdateProcessorFactory into updateRequestProcessorChain "dedupe-allfields"
[junit4:junit4]   2> 3195 T1105 oasup.UpdateRequestProcessorChain.init inserting DistributedUpdateProcessorFactory into updateRequestProcessorChain "stored_sig"
[junit4:junit4]   2> 3195 T1105 oasup.UpdateRequestProcessorChain.init inserting DistributedUpdateProcessorFactory into updateRequestProcessorChain "uniq-fields"
[junit4:junit4]   2> 3196 T1105 oasup.UpdateRequestProcessorChain.init inserting DistributedUpdateProcessorFactory into updateRequestProcessorChain "distrib-dup-test-chain-implicit"
[junit4:junit4]   2> 3196 T1105 oasc.RequestHandlers.initHandlersFromConfig adding lazy requestHandler: solr.ReplicationHandler
[junit4:junit4]   2> 3197 T1105 oasc.RequestHandlers.initHandlersFromConfig created /replication: solr.ReplicationHandler
[junit4:junit4]   2> 3197 T1105 oasc.RequestHandlers.initHandlersFromConfig created standard: solr.StandardRequestHandler
[junit4:junit4]   2> 3198 T1105 oasc.RequestHandlers.initHandlersFromConfig created /get: solr.RealTimeGetHandler
[junit4:junit4]   2> 3198 T1105 oasc.RequestHandlers.initHandlersFromConfig created dismax: solr.SearchHandler
[junit4:junit4]   2> 3199 T1105 oasc.RequestHandlers.initHandlersFromConfig created mock: org.apache.solr.core.MockQuerySenderListenerReqHandler
[junit4:junit4]   2> 3199 T1105 oasc.RequestHandlers.initHandlersFromConfig created /admin/: org.apache.solr.handler.admin.AdminHandlers
[junit4:junit4]   2> 3199 T1105 oasc.RequestHandlers.initHandlersFromConfig created defaults: solr.StandardRequestHandler
[junit4:junit4]   2> 3200 T1105 oasc.RequestHandlers.initHandlersFromConfig adding lazy requestHandler: solr.StandardRequestHandler
[junit4:junit4]   2> 3200 T1105 oasc.RequestHandlers.initHandlersFromConfig created lazy: solr.StandardRequestHandler
[junit4:junit4]   2> 3201 T1105 oasc.RequestHandlers.initHandlersFromConfig created /update: solr.UpdateRequestHandler
[junit4:junit4]   2> 3201 T1105 oasc.RequestHandlers.initHandlersFromConfig created /terms: org.apache.solr.handler.component.SearchHandler
[junit4:junit4]   2> 3202 T1105 oasc.RequestHandlers.initHandlersFromConfig created spellCheckCompRH: org.apache.solr.handler.component.SearchHandler
[junit4:junit4]   2> 3202 T1105 oasc.RequestHandlers.initHandlersFromConfig created spellCheckCompRH_Direct: org.apache.solr.handler.component.SearchHandler
[junit4:junit4]   2> 3203 T1105 oasc.RequestHandlers.initHandlersFromConfig created spellCheckWithWordbreak: org.apache.solr.handler.component.SearchHandler
[junit4:junit4]   2> 3203 T1105 oasc.RequestHandlers.initHandlersFromConfig created spellCheckWithWordbreak_Direct: org.apache.solr.handler.component.SearchHandler
[junit4:junit4]   2> 3204 T1105 oasc.RequestHandlers.initHandlersFromConfig created spellCheckCompRH1: org.apache.solr.handler.component.SearchHandler
[junit4:junit4]   2> 3204 T1105 oasc.RequestHandlers.initHandlersFromConfig created tvrh: org.apache.solr.handler.component.SearchHandler
[junit4:junit4]   2> 3204 T1105 oasc.RequestHandlers.initHandlersFromConfig created /mlt: solr.MoreLikeThisHandler
[junit4:junit4]   2> 3205 T1105 oasc.RequestHandlers.initHandlersFromConfig created /debug/dump: solr.DumpRequestHandler
[junit4:junit4]   2> 3208 T1105 oashl.XMLLoader.init xsltCacheLifetimeSeconds=60
[junit4:junit4]   2> 3212 T1105 oasc.SolrCore.initDeprecatedSupport WARNING solrconfig.xml uses deprecated <admin/gettableFiles>, Please update your config to use the ShowFileRequestHandler.
[junit4:junit4]   2> 3213 T1105 oasc.SolrCore.initDeprecatedSupport WARNING adding ShowFileRequestHandler with hidden files: [SCHEMA.XML, OLD_SYNONYMS.TXT, STOPWORDS.TXT, PROTWORDS.TXT, OPEN-EXCHANGE-RATES.JSON, SYNONYMS.TXT, CURRENCY.XML, MAPPING-ISOLATIN1ACCENT.TXT]
[junit4:junit4]   2> 3217 T1105 oass.SolrIndexSearcher.<init> Opening Searcher@5676ba57 main
[junit4:junit4]   2> 3219 T1105 oasu.CommitTracker.<init> Hard AutoCommit: disabled
[junit4:junit4]   2> 3219 T1105 oasu.CommitTracker.<init> Soft AutoCommit: disabled
[junit4:junit4]   2> 3219 T1105 oashc.SpellCheckComponent.inform Initializing spell checkers
[junit4:junit4]   2> 3231 T1105 oass.DirectSolrSpellChecker.init init: {name=direct,classname=DirectSolrSpellChecker,field=lowerfilt,minQueryLength=3}
[junit4:junit4]   2> 3350 T1140 oasc.SolrCore.registerSearcher [collection1] Registered new searcher Searcher@5676ba57 main{StandardDirectoryReader(segments_1:1)}
[junit4:junit4]   2> 3676 T1126 oascc.ZkStateReader.updateClusterState Updating cloud state from ZooKeeper... 
[junit4:junit4]   2> 3690 T1139 oascc.ZkStateReader$2.process A cluster state change has occurred - updating...
[junit4:junit4]   2> 3690 T1125 oascc.ZkStateReader$2.process A cluster state change has occurred - updating...
[junit4:junit4]   2> 3856 T1105 oasc.CoreContainer.register registering core: collection1
[junit4:junit4]   2> 3856 T1105 oasc.ZkController.register Register shard - core:collection1 address:http://127.0.0.1:14531/solr shardId:shard1
[junit4:junit4]   2> 3857 T1105 oascc.SolrZkClient.makePath makePath: /collections/collection1/leader_elect/shard1/election
[junit4:junit4]   2> 3885 T1110 oazs.PrepRequestProcessor.pRequest Got user-level KeeperException when processing sessionid:0x139d2bd5c600003 type:delete cxid:0x43 zxid:0xfffffffffffffffe txntype:unknown reqpath:n/a Error Path:/solr/collections/collection1/leaders Error:KeeperErrorCode = NoNode for /solr/collections/collection1/leaders
[junit4:junit4]   2> 3893 T1105 oasc.ShardLeaderElectionContext.runLeaderProcess Running the leader process.
[junit4:junit4]   2> 3894 T1110 oazs.PrepRequestProcessor.pRequest Got user-level KeeperException when processing sessionid:0x139d2bd5c600003 type:create cxid:0x44 zxid:0xfffffffffffffffe txntype:unknown reqpath:n/a Error Path:/solr/overseer Error:KeeperErrorCode = NodeExists for /solr/overseer
[junit4:junit4]   2> 3910 T1105 oasc.ShardLeaderElectionContext.waitForReplicasToComeUp Enough replicas found to continue.
[junit4:junit4]   2> 3910 T1105 oasc.ShardLeaderElectionContext.runLeaderProcess I may be the new leader - try and sync
[junit4:junit4]   2> 3910 T1105 oasc.SyncStrategy.sync Sync replicas to http://127.0.0.1:14531/solr/collection1/
[junit4:junit4]   2> 3911 T1105 oasc.SyncStrategy.syncReplicas Sync Success - now sync replicas to me
[junit4:junit4]   2> 3911 T1105 oasc.SyncStrategy.syncToMe http://127.0.0.1:14531/solr/collection1/ has no replicas
[junit4:junit4]   2> 3911 T1105 oasc.ShardLeaderElectionContext.runLeaderProcess I am the new leader: http://127.0.0.1:14531/solr/collection1/
[junit4:junit4]   2> 3912 T1105 oascc.SolrZkClient.makePath makePath: /collections/collection1/leaders/shard1
[junit4:junit4]   2> 3934 T1110 oazs.PrepRequestProcessor.pRequest Got user-level KeeperException when processing sessionid:0x139d2bd5c600003 type:create cxid:0x4e zxid:0xfffffffffffffffe txntype:unknown reqpath:n/a Error Path:/solr/overseer Error:KeeperErrorCode = NodeExists for /solr/overseer
[junit4:junit4]   2> 4206 T1126 oascc.ZkStateReader.updateClusterState Updating cloud state from ZooKeeper... 
[junit4:junit4]   2> 4240 T1139 oascc.ZkStateReader$2.process A cluster state change has occurred - updating...
[junit4:junit4]   2> 4240 T1125 oascc.ZkStateReader$2.process A cluster state change has occurred - updating...
[junit4:junit4]   2> 4292 T1105 oasc.ZkController.register We are http://127.0.0.1:14531/solr/collection1/ and leader is http://127.0.0.1:14531/solr/collection1/
[junit4:junit4]   2> 4292 T1105 oasc.ZkController.register No LogReplay needed for core=collection1 baseURL=http://127.0.0.1:14531/solr
[junit4:junit4]   2> 4293 T1105 oasc.ZkController.checkRecovery I am the leader, no recovery necessary
[junit4:junit4]   2> 4296 T1105 oascc.ZkStateReader.updateClusterState Updating cloud state from ZooKeeper... 
[junit4:junit4]   2> 4296 T1105 oass.SolrDispatchFilter.init user.dir=/usr/home/hudson/hudson-slave/workspace/Lucene-Solr-Tests-4.x-Java6/solr/build/solr-core/test/J1
[junit4:junit4]   2> 4297 T1105 oass.SolrDispatchFilter.init SolrDispatchFilter.init() done
[junit4:junit4]   2> 4297 T1105 oascsi.HttpClientUtil.createClient Creating new http client, config:maxConnections=128&maxConnectionsPerHost=32&followRedirects=false
[junit4:junit4]   2> 4525 T1105 oejs.Server.doStart jetty-8.1.2.v20120308
[junit4:junit4]   2> 4528 T1105 oejs.AbstractConnector.doStart Started SocketConnector@0.0.0.0:14535
[junit4:junit4]   2> 4529 T1105 oasc.SolrResourceLoader.locateSolrHome JNDI not configured for solr (NoInitialContextEx)
[junit4:junit4]   2> 4529 T1105 oasc.SolrResourceLoader.locateSolrHome using system property solr.solr.home: /usr/home/hudson/hudson-slave/workspace/Lucene-Solr-Tests-4.x-Java6/solr/build/solr-core/test/J1/./solrtest-jetty2-1347860393262
[junit4:junit4]   2> 4530 T1105 oasc.SolrResourceLoader.<init> new SolrResourceLoader for deduced Solr Home: '/usr/home/hudson/hudson-slave/workspace/Lucene-Solr-Tests-4.x-Java6/solr/build/solr-core/test/J1/./solrtest-jetty2-1347860393262/'
[junit4:junit4]   2> 4568 T1105 oass.SolrDispatchFilter.init SolrDispatchFilter.init()
[junit4:junit4]   2> 4569 T1105 oasc.SolrResourceLoader.locateSolrHome JNDI not configured for solr (NoInitialContextEx)
[junit4:junit4]   2> 4569 T1105 oasc.SolrResourceLoader.locateSolrHome using system property solr.solr.home: /usr/home/hudson/hudson-slave/workspace/Lucene-Solr-Tests-4.x-Java6/solr/build/solr-core/test/J1/./solrtest-jetty2-1347860393262
[junit4:junit4]   2> 4570 T1105 oasc.CoreContainer$Initializer.initialize looking for solr.xml: /usr/home/hudson/hudson-slave/workspace/Lucene-Solr-Tests-4.x-Java6/solr/build/solr-core/test/J1/./solrtest-jetty2-1347860393262/solr.xml
[junit4:junit4]   2> 4570 T1105 oasc.CoreContainer.<init> New CoreContainer 833486058
[junit4:junit4]   2> 4571 T1105 oasc.CoreContainer.load Loading CoreContainer using Solr Home: '/usr/home/hudson/hudson-slave/workspace/Lucene-Solr-Tests-4.x-Java6/solr/build/solr-core/test/J1/./solrtest-jetty2-1347860393262/'
[junit4:junit4]   2> 4571 T1105 oasc.SolrResourceLoader.<init> new SolrResourceLoader for directory: '/usr/home/hudson/hudson-slave/workspace/Lucene-Solr-Tests-4.x-Java6/solr/build/solr-core/test/J1/./solrtest-jetty2-1347860393262/'
[junit4:junit4]   2> 4601 T1105 oasc.CoreContainer.load Registering Log Listener
[junit4:junit4]   2> 4623 T1105 oasc.CoreContainer.initZooKeeper Zookeeper client=127.0.0.1:14524/solr
[junit4:junit4]   2> 4624 T1105 oaz.ZooKeeper.<init> Initiating client connection, connectString=127.0.0.1:14524/solr sessionTimeout=5000 watcher=org.apache.solr.common.cloud.ConnectionManager@429302e2
[junit4:junit4]   2> 4625 T1150 oaz.ClientCnxn$SendThread.startConnect Opening socket connection to server /127.0.0.1:14524
[junit4:junit4]   2> 4625 T1105 oascc.ConnectionManager.waitForConnected Waiting for client to connect to ZooKeeper
[junit4:junit4]   2> 4626 T1150 oaz.ClientCnxn$SendThread.primeConnection Socket connection established to localhost/127.0.0.1:14524, initiating session
[junit4:junit4]   2> 4627 T1107 oazs.NIOServerCnxn$Factory.run Accepted socket connection from /140.211.11.196:14536
[junit4:junit4]   2> 4627 T1107 oazs.NIOServerCnxn.readConnectRequest Client attempting to establish new session at /140.211.11.196:14536
[junit4:junit4]   2> 4631 T1109 oazs.NIOServerCnxn.finishSessionInit Established session 0x139d2bd5c600004 with negotiated timeout 5000 for client /140.211.11.196:14536
[junit4:junit4]   2> 4631 T1150 oaz.ClientCnxn$SendThread.readConnectResult Session establishment complete on server localhost/127.0.0.1:14524, sessionid = 0x139d2bd5c600004, negotiated timeout = 5000
[junit4:junit4]   2> 4631 T1151 oascc.ConnectionManager.process Watcher org.apache.solr.common.cloud.ConnectionManager@429302e2 name:ZooKeeperConnection Watcher:127.0.0.1:14524/solr got event WatchedEvent state:SyncConnected type:None path:null path:null type:None
[junit4:junit4]   2> 4632 T1105 oascc.ConnectionManager.waitForConnected Client is connected to ZooKeeper
[junit4:junit4]   2> 4632 T1110 oazs.PrepRequestProcessor.pRequest Got user-level KeeperException when processing sessionid:0x139d2bd5c600004 type:create cxid:0x1 zxid:0xfffffffffffffffe txntype:unknown reqpath:n/a Error Path:/solr/overseer Error:KeeperErrorCode = NodeExists for /solr/overseer
[junit4:junit4]   2> 4641 T1110 oazs.PrepRequestProcessor.pRequest Got user-level KeeperException when processing sessionid:0x139d2bd5c600004 type:create cxid:0x2 zxid:0xfffffffffffffffe txntype:unknown reqpath:n/a Error Path:/solr/overseer Error:KeeperErrorCode = NodeExists for /solr/overseer
[junit4:junit4]   2> 4642 T1105 oasc.ZkController.createEphemeralLiveNode Register node as live in ZooKeeper:/live_nodes/127.0.0.1:14535_solr
[junit4:junit4]   2> 4643 T1110 oazs.PrepRequestProcessor.pRequest Got user-level KeeperException when processing sessionid:0x139d2bd5c600004 type:delete cxid:0x4 zxid:0xfffffffffffffffe txntype:unknown reqpath:n/a Error Path:/solr/live_nodes/127.0.0.1:14535_solr Error:KeeperErrorCode = NoNode for /solr/live_nodes/127.0.0.1:14535_solr
[junit4:junit4]   2> 4643 T1105 oascc.SolrZkClient.makePath makePath: /live_nodes/127.0.0.1:14535_solr
[junit4:junit4]   2> 4645 T1139 oascc.ZkStateReader$3.process Updating live nodes
[junit4:junit4]   2> 4645 T1125 oascc.ZkStateReader$3.process Updating live nodes
[junit4:junit4]   2> 4646 T1105 oashc.HttpShardHandlerFactory.getParameter Setting socketTimeout to: 0
[junit4:junit4]   2> 4646 T1105 oashc.HttpShardHandlerFactory.getParameter Setting urlScheme to: http://
[junit4:junit4]   2> 4646 T1105 oashc.HttpShardHandlerFactory.getParameter Setting connTimeout to: 0
[junit4:junit4]   2> 4647 T1105 oashc.HttpShardHandlerFactory.getParameter Setting maxConnectionsPerHost to: 20
[junit4:junit4]   2> 4647 T1105 oashc.HttpShardHandlerFactory.getParameter Setting corePoolSize to: 0
[junit4:junit4]   2> 4648 T1105 oashc.HttpShardHandlerFactory.getParameter Setting maximumPoolSize to: 2147483647
[junit4:junit4]   2> 4648 T1105 oashc.HttpShardHandlerFactory.getParameter Setting maxThreadIdleTime to: 5
[junit4:junit4]   2> 4649 T1105 oashc.HttpShardHandlerFactory.getParameter Setting sizeOfQueue to: -1
[junit4:junit4]   2> 4649 T1105 oashc.HttpShardHandlerFactory.getParameter Setting fairnessPolicy to: false
[junit4:junit4]   2> 4650 T1105 oascsi.HttpClientUtil.createClient Creating new http client, config:maxConnectionsPerHost=20&maxConnections=10000&socketTimeout=0&connTimeout=0&retry=false
[junit4:junit4]   2> 4667 T1105 oascc.ZkStateReader.createClusterStateWatchersAndUpdate Updating cluster state from ZooKeeper... 
[junit4:junit4]   2> 4674 T1105 oasc.CoreContainer.create Creating SolrCore 'collection1' using instanceDir: /usr/home/hudson/hudson-slave/workspace/Lucene-Solr-Tests-4.x-Java6/solr/build/solr-core/test/J1/./solrtest-jetty2-1347860393262/collection1
[junit4:junit4]   2> 4674 T1105 oasc.ZkController.createCollectionZkNode Check for collection zkNode:collection1
[junit4:junit4]   2> 4675 T1105 oasc.ZkController.createCollectionZkNode Collection zkNode exists
[junit4:junit4]   2> 4675 T1105 oasc.ZkController.readConfigName Load collection config from:/collections/collection1
[junit4:junit4]   2> 4679 T1105 oasc.SolrResourceLoader.<init> new SolrResourceLoader for directory: '/usr/home/hudson/hudson-slave/workspace/Lucene-Solr-Tests-4.x-Java6/solr/build/solr-core/test/J1/./solrtest-jetty2-1347860393262/collection1/'
[junit4:junit4]   2> 4680 T1105 oasc.SolrResourceLoader.replaceClassLoader Adding 'file:/usr/home/hudson/hudson-slave/workspace/Lucene-Solr-Tests-4.x-Java6/solr/build/solr-core/test/J1/solrtest-jetty2-1347860393262/collection1/lib/classes/' to classloader
[junit4:junit4]   2> 4681 T1105 oasc.SolrResourceLoader.replaceClassLoader Adding 'file:/usr/home/hudson/hudson-slave/workspace/Lucene-Solr-Tests-4.x-Java6/solr/build/solr-core/test/J1/solrtest-jetty2-1347860393262/collection1/lib/README' to classloader
[junit4:junit4]   2> 4735 T1105 oasc.SolrConfig.<init> Using Lucene MatchVersion: LUCENE_40
[junit4:junit4]   2> 4754 T1126 oascc.ZkStateReader.updateClusterState Updating cloud state from ZooKeeper... 
[junit4:junit4]   2> 4777 T1151 oascc.ZkStateReader$2.process A cluster state change has occurred - updating...
[junit4:junit4]   2> 4777 T1139 oascc.ZkStateReader$2.process A cluster state change has occurred - updating...
[junit4:junit4]   2> 4777 T1125 oascc.ZkStateReader$2.process A cluster state change has occurred - updating...
[junit4:junit4]   2> 4805 T1105 oasc.SolrConfig.<init> Loaded SolrConfig: solrconfig.xml
[junit4:junit4]   2> 4906 T1105 oass.IndexSchema.readSchema Reading Solr Schema
[junit4:junit4]   2> 4914 T1105 oass.IndexSchema.readSchema Schema name=test
[junit4:junit4]   2> 5555 T1105 oass.OpenExchangeRatesOrgProvider.init Initialized with rates=open-exchange-rates.json, refreshInterval=1440.
[junit4:junit4]   2> 5568 T1105 oass.IndexSchema.readSchema default search field in schema is text
[junit4:junit4]   2> 5573 T1105 oass.IndexSchema.readSchema unique key field: id
[junit4:junit4]   2> 5585 T1105 oass.FileExchangeRateProvider.reload Reloading exchange rates from file currency.xml
[junit4:junit4]   2> 5590 T1105 oass.FileExchangeRateProvider.reload Reloading exchange rates from file currency.xml
[junit4:junit4]   2> 5595 T1105 oass.OpenExchangeRatesOrgProvider.reload Reloading exchange rates from open-exchange-rates.json
[junit4:junit4]   2> 5596 T1105 oass.OpenExchangeRatesOrgProvider.reload Reloading exchange rates from open-exchange-rates.json
[junit4:junit4]   2> 5599 T1105 oasc.SolrCore.<init> [collection1] Opening new SolrCore at /usr/home/hudson/hudson-slave/workspace/Lucene-Solr-Tests-4.x-Java6/solr/build/solr-core/test/J1/./solrtest-jetty2-1347860393262/collection1/, dataDir=./org.apache.solr.cloud.SyncSliceTest-1347860388954/jetty2/
[junit4:junit4]   2> 5599 T1105 oasc.JmxMonitoredMap.<init> JMX monitoring is enabled. Adding Solr mbeans to JMX Server: com.sun.jmx.mbeanserver.JmxMBeanServer@786c1a82
[junit4:junit4]   2> 5601 T1105 oasc.SolrCore.getNewIndexDir WARNING New index directory detected: old=null new=./org.apache.solr.cloud.SyncSliceTest-1347860388954/jetty2/index/
[junit4:junit4]   2> 5602 T1105 oasc.SolrCore.initIndex WARNING [collection1] Solr index directory './org.apache.solr.cloud.SyncSliceTest-1347860388954/jetty2/index' doesn't exist. Creating new index...
[junit4:junit4]   2> 5603 T1105 oasc.CachingDirectoryFactory.get return new directory for /usr/home/hudson/hudson-slave/workspace/Lucene-Solr-Tests-4.x-Java6/solr/build/solr-core/test/J1/./org.apache.solr.cloud.SyncSliceTest-1347860388954/jetty2/index forceNew:false
[junit4:junit4]   2> 5619 T1105 oasc.SolrDeletionPolicy.onCommit SolrDeletionPolicy.onCommit: commits:num=1
[junit4:junit4]   2> 		commit{dir=/usr/home/hudson/hudson-slave/workspace/Lucene-Solr-Tests-4.x-Java6/solr/build/solr-core/test/J1/org.apache.solr.cloud.SyncSliceTest-1347860388954/jetty2/index,segFN=segments_1,generation=1,filenames=[segments_1]
[junit4:junit4]   2> 5619 T1105 oasc.SolrDeletionPolicy.updateCommits newest commit = 1
[junit4:junit4]   2> 5620 T1105 oasc.SolrCore.initWriters created xml: solr.XMLResponseWriter
[junit4:junit4]   2> 5622 T1105 oasup.UpdateRequestProcessorChain.init inserting DistributedUpdateProcessorFactory into updateRequestProcessorChain "dedupe"
[junit4:junit4]   2> 5623 T1105 oasup.UpdateRequestProcessorChain.init inserting DistributedUpdateProcessorFactory into updateRequestProcessorChain "dedupe-allfields"
[junit4:junit4]   2> 5624 T1105 oasup.UpdateRequestProcessorChain.init inserting DistributedUpdateProcessorFactory into updateRequestProcessorChain "stored_sig"
[junit4:junit4]   2> 5624 T1105 oasup.UpdateRequestProcessorChain.init inserting DistributedUpdateProcessorFactory into updateRequestProcessorChain "uniq-fields"
[junit4:junit4]   2> 5625 T1105 oasup.UpdateRequestProcessorChain.init inserting DistributedUpdateProcessorFactory into updateRequestProcessorChain "distrib-dup-test-chain-implicit"
[junit4:junit4]   2> 5625 T1105 oasc.RequestHandlers.initHandlersFromConfig adding lazy requestHandler: solr.ReplicationHandler
[junit4:junit4]   2> 5626 T1105 oasc.RequestHandlers.initHandlersFromConfig created /replication: solr.ReplicationHandler
[junit4:junit4]   2> 5627 T1105 oasc.RequestHandlers.initHandlersFromConfig created standard: solr.StandardRequestHandler
[junit4:junit4]   2> 5627 T1105 oasc.RequestHandlers.initHandlersFromConfig created /get: solr.RealTimeGetHandler
[junit4:junit4]   2> 5628 T1105 oasc.RequestHandlers.initHandlersFromConfig created dismax: solr.SearchHandler
[junit4:junit4]   2> 5629 T1105 oasc.RequestHandlers.initHandlersFromConfig created mock: org.apache.solr.core.MockQuerySenderListenerReqHandler
[junit4:junit4]   2> 5629 T1105 oasc.RequestHandlers.initHandlersFromConfig created /admin/: org.apache.solr.handler.admin.AdminHandlers
[junit4:junit4]   2> 5630 T1105 oasc.RequestHandlers.initHandlersFromConfig created defaults: solr.StandardRequestHandler
[junit4:junit4]   2> 5631 T1105 oasc.RequestHandlers.initHandlersFromConfig adding lazy requestHandler: solr.StandardRequestHandler
[junit4:junit4]   2> 5631 T1105 oasc.RequestHandlers.initHandlersFromConfig created lazy: solr.StandardRequestHandler
[junit4:junit4]   2> 5632 T1105 oasc.RequestHandlers.initHandlersFromConfig created /update: solr.UpdateRequestHandler
[junit4:junit4]   2> 5633 T1105 oasc.RequestHandlers.initHandlersFromConfig created /terms: org.apache.solr.handler.component.SearchHandler
[junit4:junit4]   2> 5633 T1105 oasc.RequestHandlers.initHandlersFromConfig created spellCheckCompRH: org.apache.solr.handler.component.SearchHandler
[junit4:junit4]   2> 5634 T1105 oasc.RequestHandlers.initHandlersFromConfig created spellCheckCompRH_Direct: org.apache.solr.handler.component.SearchHandler
[junit4:junit4]   2> 5635 T1105 oasc.RequestHandlers.initHandlersFromConfig created spellCheckWithWordbreak: org.apache.solr.handler.component.SearchHandler
[junit4:junit4]   2> 5635 T1105 oasc.RequestHandlers.initHandlersFromConfig created spellCheckWithWordbreak_Direct: org.apache.solr.handler.component.SearchHandler
[junit4:junit4]   2> 5636 T1105 oasc.RequestHandlers.initHandlersFromConfig created spellCheckCompRH1: org.apache.solr.handler.component.SearchHandler
[junit4:junit4]   2> 5637 T1105 oasc.RequestHandlers.initHandlersFromConfig created tvrh: org.apache.solr.handler.component.SearchHandler
[junit4:junit4]   2> 5637 T1105 oasc.RequestHandlers.initHandlersFromConfig created /mlt: solr.MoreLikeThisHandler
[junit4:junit4]   2> 5638 T1105 oasc.RequestHandlers.initHandlersFromConfig created /debug/dump: solr.DumpRequestHandler
[junit4:junit4]   2> 5644 T1105 oashl.XMLLoader.init xsltCacheLifetimeSeconds=60
[junit4:junit4]   2> 5654 T1105 oasc.SolrCore.initDeprecatedSupport WARNING solrconfig.xml uses deprecated <admin/gettableFiles>, Please update your config to use the ShowFileRequestHandler.
[junit4:junit4]   2> 5655 T1105 oasc.SolrCore.initDeprecatedSupport WARNING adding ShowFileRequestHandler with hidden files: [SCHEMA.XML, OLD_SYNONYMS.TXT, STOPWORDS.TXT, PROTWORDS.TXT, OPEN-EXCHANGE-RATES.JSON, SYNONYMS.TXT, CURRENCY.XML, MAPPING-ISOLATIN1ACCENT.TXT]
[junit4:junit4]   2> 5660 T1105 oass.SolrIndexSearcher.<init> Opening Searcher@3055191 main
[junit4:junit4]   2> 5661 T1105 oasu.CommitTracker.<init> Hard AutoCommit: disabled
[junit4:junit4]   2> 5661 T1105 oasu.CommitTracker.<init> Soft AutoCommit: disabled
[junit4:junit4]   2> 5662 T1105 oashc.SpellCheckComponent.inform Initializing spell checkers
[junit4:junit4]   2> 5678 T1105 oass.DirectSolrSpellChecker.init init: {name=direct,classname=DirectSolrSpellChecker,field=lowerfilt,minQueryLength=3}
[junit4:junit4]   2> 5772 T1152 oasc.SolrCore.registerSearcher [collection1] Registered new searcher Searcher@3055191 main{StandardDirectoryReader(segments_1:1)}
[junit4:junit4]   2> 5786 T1126 oascc.ZkStateReader.updateClusterState Updating cloud state from ZooKeeper... 
[junit4:junit4]   2> 5798 T1151 oascc.ZkStateReader$2.process A cluster state change has occurred - updating...
[junit4:junit4]   2> 5798 T1139 oascc.ZkStateReader$2.process A cluster state change has occurred - updating...
[junit4:junit4]   2> 5798 T1125 oascc.ZkStateReader$2.process A cluster state change has occurred - updating...
[junit4:junit4]   2> 6280 T1105 oasc.CoreContainer.register registering core: collection1
[junit4:junit4]   2> 6280 T1105 oasc.ZkController.register Register shard - core:collection1 address:http://127.0.0.1:14535/solr shardId:shard1
[junit4:junit4]   2> 6293 T1105 oasc.ZkController.register We are http://127.0.0.1:14535/solr/collection1/ and leader is http://127.0.0.1:14531/solr/collection1/
[junit4:junit4]   2> 6293 T1105 oasc.ZkController.register No LogReplay needed for core=collection1 baseURL=http://127.0.0.1:14535/solr
[junit4:junit4]   2> 6294 T1105 oasc.ZkController.checkRecovery Core needs to recover:collection1
[junit4:junit4]   2> 6294 T1105 oasu.DefaultSolrCoreState.doRecovery Running recovery - first canceling any ongoing recovery
[junit4:junit4]   2> ASYNC  NEW_CORE C77 name=collection1 org.apache.solr.core.SolrCore@532ba0c2 url=http://127.0.0.1:14535/solr/collection1 node=127.0.0.1:14535_solr
[junit4:junit4]   2> 6302 T1153 C77 P14535 oasc.RecoveryStrategy.run Starting recovery process.  core=collection1 recoveringAfterStartup=true
[junit4:junit4]   2> 6302 T1105 oascc.ZkStateReader.updateClusterState Updating cloud state from ZooKeeper... 
[junit4:junit4]   2> 6303 T1153 C77 P14535 oasc.RecoveryStrategy.doRecovery ###### startupVersions=[]
[junit4:junit4]   2> 6303 T1105 oass.SolrDispatchFilter.init user.dir=/usr/home/hudson/hudson-slave/workspace/Lucene-Solr-Tests-4.x-Java6/solr/build/solr-core/test/J1
[junit4:junit4]   2> 6303 T1105 oass.SolrDispatchFilter.init SolrDispatchFilter.init() done
[junit4:junit4]   2> 6304 T1105 oascsi.HttpClientUtil.createClient Creating new http client, config:maxConnections=128&maxConnectionsPerHost=32&followRedirects=false
[junit4:junit4]   2> 6327 T1153 C77 P14535 oasc.RecoveryStrategy.doRecovery Attempting to PeerSync from http://127.0.0.1:14531/solr/collection1/ core=collection1 - recoveringAfterStartup=true
[junit4:junit4]   2> 6328 T1153 C77 P14535 oasu.PeerSync.sync PeerSync: core=collection1 url=http://127.0.0.1:14535/solr START replicas=[http://127.0.0.1:14531/solr/collection1/] nUpdates=100
[junit4:junit4]   2> 6328 T1126 oascc.ZkStateReader.updateClusterState Updating cloud state from ZooKeeper... 
[junit4:junit4]   2> 6328 T1153 C77 P14535 oasu.PeerSync.sync WARNING no frame of reference to tell of we've missed updates
[junit4:junit4]   2> 6330 T1153 C77 P14535 oasc.RecoveryStrategy.doRecovery PeerSync Recovery was not successful - trying replication. core=collection1
[junit4:junit4]   2> 6330 T1153 C77 P14535 oasc.RecoveryStrategy.doRecovery Starting Replication Recovery. core=collection1
[junit4:junit4]   2> 6331 T1153 C77 P14535 oascsi.HttpClientUtil.createClient Creating new http client, config:maxConnections=128&maxConnectionsPerHost=32&followRedirects=false
[junit4:junit4]   2> ASYNC  NEW_CORE C78 name=collection1 org.apache.solr.core.SolrCore@647e1a0a url=http://127.0.0.1:14531/solr/collection1 node=127.0.0.1:14531_solr
[junit4:junit4]   2> 6340 T1131 C78 P14531 REQ /get {distrib=false&qt=/get&wt=javabin&version=2&getVersions=100} status=0 QTime=0 
[junit4:junit4]   2> 6454 T1151 oascc.ZkStateReader$2.process A cluster state change has occurred - updating...
[junit4:junit4]   2> 6454 T1139 oascc.ZkStateReader$2.process A cluster state change has occurred - updating...
[junit4:junit4]   2> 6454 T1125 oascc.ZkStateReader$2.process A cluster state change has occurred - updating...
[junit4:junit4]   2> 6485 T1105 oejs.Server.doStart jetty-8.1.2.v20120308
[junit4:junit4]   2> 6488 T1105 oejs.AbstractConnector.doStart Started SocketConnector@0.0.0.0:14540
[junit4:junit4]   2> 6489 T1105 oasc.SolrResourceLoader.locateSolrHome JNDI not configured for solr (NoInitialContextEx)
[junit4:junit4]   2> 6490 T1105 oasc.SolrResourceLoader.locateSolrHome using system property solr.solr.home: /usr/home/hudson/hudson-slave/workspace/Lucene-Solr-Tests-4.x-Java6/solr/build/solr-core/test/J1/./solrtest-jetty3-1347860395268
[junit4:junit4]   2> 6490 T1105 oasc.SolrResourceLoader.<init> new SolrResourceLoader for deduced Solr Home: '/usr/home/hudson/hudson-slave/workspace/Lucene-Solr-Tests-4.x-Java6/solr/build/solr-core/test/J1/./solrtest-jetty3-1347860395268/'
[junit4:junit4]   2> 6525 T1105 oass.SolrDispatchFilter.init SolrDispatchFilter.init()
[junit4:junit4]   2> 6526 T1105 oasc.SolrResourceLoader.locateSolrHome JNDI not configured for solr (NoInitialContextEx)
[junit4:junit4]   2> 6526 T1105 oasc.SolrResourceLoader.locateSolrHome using system property solr.solr.home: /usr/home/hudson/hudson-slave/workspace/Lucene-Solr-Tests-4.x-Java6/solr/build/solr-core/test/J1/./solrtest-jetty3-1347860395268
[junit4:junit4]   2> 6527 T1105 oasc.CoreContainer$Initializer.initialize looking for solr.xml: /usr/home/hudson/hudson-slave/workspace/Lucene-Solr-Tests-4.x-Java6/solr/build/solr-core/test/J1/./solrtest-jetty3-1347860395268/solr.xml
[junit4:junit4]   2> 6527 T1105 oasc.CoreContainer.<init> New CoreContainer 1081971092
[junit4:junit4]   2> 6528 T1105 oasc.CoreContainer.load Loading CoreContainer using Solr Home: '/usr/home/hudson/hudson-slave/workspace/Lucene-Solr-Tests-4.x-Java6/solr/build/solr-core/test/J1/./solrtest-jetty3-1347860395268/'
[junit4:junit4]   2> 6528 T1105 oasc.SolrResourceLoader.<init> new SolrResourceLoader for directory: '/usr/home/hudson/hudson-slave/workspace/Lucene-Solr-Tests-4.x-Java6/solr/build/solr-core/test/J1/./solrtest-jetty3-1347860395268/'
[junit4:junit4]   2> 6556 T1105 oasc.CoreContainer.load Registering Log Listener
[junit4:junit4]   2> 6574 T1105 oasc.CoreContainer.initZooKeeper Zookeeper client=127.0.0.1:14524/solr
[junit4:junit4]   2> 6574 T1105 oaz.ZooKeeper.<init> Initiating client connection, connectString=127.0.0.1:14524/solr sessionTimeout=5000 watcher=org.apache.solr.common.cloud.ConnectionManager@23653628
[junit4:junit4]   2> 6575 T1164 oaz.ClientCnxn$SendThread.startConnect Opening socket connection to server /127.0.0.1:14524
[junit4:junit4]   2> 6575 T1105 oascc.ConnectionManager.waitForConnected Waiting for client to connect to ZooKeeper
[junit4:junit4]   2> 6577 T1164 oaz.ClientCnxn$SendThread.primeConnection Socket connection established to localhost/127.0.0.1:14524, initiating session
[junit4:junit4]   2> 6577 T1107 oazs.NIOServerCnxn$Factory.run Accepted socket connection from /140.211.11.196:14541
[junit4:junit4]   2> 6577 T1107 oazs.NIOServerCnxn.readConnectRequest Client attempting to establish new session at /140.211.11.196:14541
[junit4:junit4]   2> 6586 T1109 oazs.NIOServerCnxn.finishSessionInit Established session 0x139d2bd5c600005 with negotiated timeout 5000 for client /140.211.11.196:14541
[junit4:junit4]   2> 6586 T1164 oaz.ClientCnxn$SendThread.readConnectResult Session establishment complete on server localhost/127.0.0.1:14524, sessionid = 0x139d2bd5c600005, negotiated timeout = 5000
[junit4:junit4]   2> 6586 T1165 oascc.ConnectionManager.process Watcher org.apache.solr.common.cloud.ConnectionManager@23653628 name:ZooKeeperConnection Watcher:127.0.0.1:14524/solr got event WatchedEvent state:SyncConnected type:None path:null path:null type:None
[junit4:junit4]   2> 6586 T1105 oascc.ConnectionManager.waitForConnected Client is connected to ZooKeeper
[junit4:junit4]   2> 6587 T1110 oazs.PrepRequestProcessor.pRequest Got user-level KeeperException when processing sessionid:0x139d2bd5c600005 type:create cxid:0x1 zxid:0xfffffffffffffffe txntype:unknown reqpath:n/a Error Path:/solr/overseer Error:KeeperErrorCode = NodeExists for /solr/overseer
[junit4:junit4]   2> 6593 T1110 oazs.PrepRequestProcessor.pRequest Got user-level KeeperException when processing sessionid:0x139d2bd5c600005 type:create cxid:0x2 zxid:0xfffffffffffffffe txntype:unknown reqpath:n/a Error Path:/solr/overseer Error:KeeperErrorCode = NodeExists for /solr/overseer
[junit4:junit4]   2> 6601 T1105 oasc.ZkController.createEphemeralLiveNode Register node as live in ZooKeeper:/live_nodes/127.0.0.1:14540_solr
[junit4:junit4]   2> 6601 T1110 oazs.PrepRequestProcessor.pRequest Got user-level KeeperException when processing sessionid:0x139d2bd5c600005 type:delete cxid:0x4 zxid:0xfffffffffffffffe txntype:unknown reqpath:n/a Error Path:/solr/live_nodes/127.0.0.1:14540_solr Error:KeeperErrorCode = NoNode for /solr/live_nodes/127.0.0.1:14540_solr
[junit4:junit4]   2> 6608 T1105 oascc.SolrZkClient.makePath makePath: /live_nodes/127.0.0.1:14540_solr
[junit4:junit4]   2> 6619 T1139 oascc.ZkStateReader$3.process Updating live nodes
[junit4:junit4]   2> 6619 T1151 oascc.ZkStateReader$3.process Updating live nodes
[junit4:junit4]   2> 6619 T1125 oascc.ZkStateReader$3.process Updating live nodes
[junit4:junit4]   2> 6620 T1105 oashc.HttpShardHandlerFactory.getParameter Setting socketTimeout to: 0
[junit4:junit4]   2> 6620 T1105 oashc.HttpShardHandlerFactory.getParameter Setting urlScheme to: http://
[junit4:junit4]   2> 6621 T1105 oashc.HttpShardHandlerFactory.getParameter Setting connTimeout to: 0
[junit4:junit4]   2> 6621 T1105 oashc.HttpShardHandlerFactory.getParameter Setting maxConnectionsPerHost to: 20
[junit4:junit4]   2> 6622 T1105 oashc.HttpShardHandlerFactory.getParameter Setting corePoolSize to: 0
[junit4:junit4]   2> 6622 T1105 oashc.HttpShardHandlerFactory.getParameter Setting maximumPoolSize to: 2147483647
[junit4:junit4]   2> 6622 T1105 oashc.HttpShardHandlerFactory.getParameter Setting maxThreadIdleTime to: 5
[junit4:junit4]   2> 6623 T1105 oashc.HttpShardHandlerFactory.getParameter Setting sizeOfQueue to: -1
[junit4:junit4]   2> 6623 T1105 oashc.HttpShardHandlerFactory.getParameter Setting fairnessPolicy to: false
[junit4:junit4]   2> 6624 T1105 oascsi.HttpClientUtil.createClient Creating new http client, config:maxConnectionsPerHost=20&maxConnections=10000&socketTimeout=0&connTimeout=0&retry=false
[junit4:junit4]   2> 6648 T1105 oascc.ZkStateReader.createClusterStateWatchersAndUpdate Updating cluster state from ZooKeeper... 
[junit4:junit4]   2> 6654 T1105 oasc.CoreContainer.create Creating SolrCore 'collection1' using instanceDir: /usr/home/hudson/hudson-slave/workspace/Lucene-Solr-Tests-4.x-Java6/solr/build/solr-core/test/J1/./solrtest-jetty3-1347860395268/collection1
[junit4:junit4]   2> 6655 T1105 oasc.ZkController.createCollectionZkNode Check for collection zkNode:collection1
[junit4:junit4]   2> 6656 T1105 oasc.ZkController.createCollectionZkNode Collection zkNode exists
[junit4:junit4]   2> 6656 T1105 oasc.ZkController.readConfigName Load collection config from:/collections/collection1
[junit4:junit4]   2> 6657 T1105 oasc.SolrResourceLoader.<init> new SolrResourceLoader for directory: '/usr/home/hudson/hudson-slave/workspace/Lucene-Solr-Tests-4.x-Java6/solr/build/solr-core/test/J1/./solrtest-jetty3-1347860395268/collection1/'
[junit4:junit4]   2> 6659 T1105 oasc.SolrResourceLoader.replaceClassLoader Adding 'file:/usr/home/hudson/hudson-slave/workspace/Lucene-Solr-Tests-4.x-Java6/solr/build/solr-core/test/J1/solrtest-jetty3-1347860395268/collection1/lib/README' to classloader
[junit4:junit4]   2> 6660 T1105 oasc.SolrResourceLoader.replaceClassLoader Adding 'file:/usr/home/hudson/hudson-slave/workspace/Lucene-Solr-Tests-4.x-Java6/solr/build/solr-core/test/J1/solrtest-jetty3-1347860395268/collection1/lib/classes/' to classloader
[junit4:junit4]   2> 6713 T1105 oasc.SolrConfig.<init> Using Lucene MatchVersion: LUCENE_40
[junit4:junit4]   2> 6792 T1105 oasc.SolrConfig.<init> Loaded SolrConfig: solrconfig.xml
[junit4:junit4]   2> 6893 T1105 oass.IndexSchema.readSchema Reading Solr Schema
[junit4:junit4]   2> 6901 T1105 oass.IndexSchema.readSchema Schema name=test
[junit4:junit4]   2> 7460 T1105 oass.OpenExchangeRatesOrgProvider.init Initialized with rates=open-exchange-rates.json, refreshInterval=1440.
[junit4:junit4]   2> 7467 T1105 oass.IndexSchema.readSchema default search field in schema is text
[junit4:junit4]   2> 7470 T1105 oass.IndexSchema.readSchema unique key field: id
[junit4:junit4]   2> 7478 T1105 oass.FileExchangeRateProvider.reload Reloading exchange rates from file currency.xml
[junit4:junit4]   2> 7482 T1105 oass.FileExchangeRateProvider.reload Reloading exchange rates from file currency.xml
[junit4:junit4]   2> 7485 T1105 oass.OpenExchangeRatesOrgProvider.reload Reloading exchange rates from open-exchange-rates.json
[junit4:junit4]   2> 7486 T1105 oass.OpenExchangeRatesOrgProvider.reload Reloading exchange rates from open-exchange-rates.json
[junit4:junit4]   2> 7487 T1105 oasc.SolrCore.<init> [collection1] Opening new SolrCore at /usr/home/hudson/hudson-slave/workspace/Lucene-Solr-Tests-4.x-Java6/solr/build/solr-core/test/J1/./solrtest-jetty3-1347860395268/collection1/, dataDir=./org.apache.solr.cloud.SyncSliceTest-1347860388954/jetty3/
[junit4:junit4]   2> 7488 T1105 oasc.JmxMonitoredMap.<init> JMX monitoring is enabled. Adding Solr mbeans to JMX Server: com.sun.jmx.mbeanserver.JmxMBeanServer@786c1a82
[junit4:junit4]   2> 7489 T1105 oasc.SolrCore.getNewIndexDir WARNING New index directory detected: old=null new=./org.apache.solr.cloud.SyncSliceTest-1347860388954/jetty3/index/
[junit4:junit4]   2> 7489 T1105 oasc.SolrCore.initIndex WARNING [collection1] Solr index directory './org.apache.solr.cloud.SyncSliceTest-1347860388954/jetty3/index' doesn't exist. Creating new index...
[junit4:junit4]   2> 7490 T1105 oasc.CachingDirectoryFactory.get return new directory for /usr/home/hudson/hudson-slave/workspace/Lucene-Solr-Tests-4.x-Java6/solr/build/solr-core/test/J1/./org.apache.solr.cloud.SyncSliceTest-1347860388954/jetty3/index forceNew:false
[junit4:junit4]   2> 7510 T1105 oasc.SolrDeletionPolicy.onCommit SolrDeletionPolicy.onCommit: commits:num=1
[junit4:junit4]   2> 		commit{dir=/usr/home/hudson/hudson-slave/workspace/Lucene-Solr-Tests-4.x-Java6/solr/build/solr-core/test/J1/org.apache.solr.cloud.SyncSliceTest-1347860388954/jetty3/index,segFN=segments_1,generation=1,filenames=[segments_1]
[junit4:junit4]   2> 7510 T1105 oasc.SolrDeletionPolicy.updateCommits newest commit = 1
[junit4:junit4]   2> 7511 T1105 oasc.SolrCore.initWriters created xml: solr.XMLResponseWriter
[junit4:junit4]   2> 7512 T1105 oasup.UpdateRequestProcessorChain.init inserting DistributedUpdateProcessorFactory into updateRequestProcessorChain "dedupe"
[junit4:junit4]   2> 7513 T1105 oasup.UpdateRequestProcessorChain.init inserting DistributedUpdateProcessorFactory into updateRequestProcessorChain "dedupe-allfields"
[junit4:junit4]   2> 7513 T1105 oasup.UpdateRequestProcessorChain.init inserting DistributedUpdateProcessorFactory into updateRequestProcessorChain "stored_sig"
[junit4:junit4]   2> 7514 T1105 oasup.UpdateRequestProcessorChain.init inserting DistributedUpdateProcessorFactory into updateRequestProcessorChain "uniq-fields"
[junit4:junit4]   2> 7514 T1105 oasup.UpdateRequestProcessorChain.init inserting DistributedUpdateProcessorFactory into updateRequestProcessorChain "distrib-dup-test-chain-implicit"
[junit4:junit4]   2> 7514 T1105 oasc.RequestHandlers.initHandlersFromConfig adding lazy requestHandler: solr.ReplicationHandler
[junit4:junit4]   2> 7515 T1105 oasc.RequestHandlers.initHandlersFromConfig created /replication: solr.ReplicationHandler
[junit4:junit4]   2> 7515 T1105 oasc.RequestHandlers.initHandlersFromConfig created standard: solr.StandardRequestHandler
[junit4:junit4]   2> 7516 T1105 oasc.RequestHandlers.initHandlersFromConfig created /get: solr.RealTimeGetHandler
[junit4:junit4]   2> 7516 T1105 oasc.RequestHandlers.initHandlersFromConfig created dismax: solr.SearchHandler
[junit4:junit4]   2> 7517 T1105 oasc.RequestHandlers.initHandlersFromConfig created mock: org.apache.solr.core.MockQuerySenderListenerReqHandler
[junit4:junit4]   2> 7517 T1105 oasc.RequestHandlers.initHandlersFromConfig created /admin/: org.apache.solr.handler.admin.AdminHandlers
[junit4:junit4]   2> 7518 T1105 oasc.RequestHandlers.initHandlersFromConfig created defaults: solr.StandardRequestHandler
[junit4:junit4]   2> 7518 T1105 oasc.RequestHandlers.initHandlersFromConfig adding lazy requestHandler: solr.StandardRequestHandler
[junit4:junit4]   2> 7518 T1105 oasc.RequestHandlers.initHandlersFromConfig created lazy: solr.StandardRequestHandler
[junit4:junit4]   2> 7519 T1105 oasc.RequestHandlers.initHandlersFromConfig created /update: solr.UpdateRequestHandler
[junit4:junit4]   2> 7519 T1105 oasc.RequestHandlers.initHandlersFromConfig created /terms: org.apache.solr.handler.component.SearchHandler
[junit4:junit4]   2> 7520 T1105 oasc.RequestHandlers.initHandlersFromConfig created spellCheckCompRH: org.apache.solr.handler.component.SearchHandler
[junit4:junit4]   2> 7520 T1105 oasc.RequestHandlers.initHandlersFromConfig created spellCheckCompRH_Direct: org.apache.solr.handler.component.SearchHandler
[junit4:junit4]   2> 7521 T1105 oasc.RequestHandlers.initHandlersFromConfig created spellCheckWithWordbreak: org.apache.solr.handler.component.SearchHandler
[junit4:junit4]   2> 7521 T1105 oasc.RequestHandlers.initHandlersFromConfig created spellCheckWithWordbreak_Direct: org.apache.solr.handler.component.SearchHandler
[junit4:junit4]   2> 7522 T1105 oasc.RequestHandlers.initHandlersFromConfig created spellCheckCompRH1: org.apache.solr.handler.component.SearchHandler
[junit4:junit4]   2> 7522 T1105 oasc.RequestHandlers.initHandlersFromConfig created tvrh: org.apache.solr.handler.component.SearchHandler
[junit4:junit4]   2> 7523 T1105 oasc.RequestHandlers.initHandlersFromConfig created /mlt: solr.MoreLikeThisHandler
[junit4:junit4]   2> 7523 T1105 oasc.RequestHandlers.initHandlersFromConfig created /debug/dump: solr.DumpRequestHandler
[junit4:junit4]   2> 7525 T1105 oashl.XMLLoader.init xsltCacheLifetimeSeconds=60
[junit4:junit4]   2> 7529 T1105 oasc.SolrCore.initDeprecatedSupport WARNING solrconfig.xml uses deprecated <admin/gettableFiles>, Please update your config to use the ShowFileRequestHandler.
[junit4:junit4]   2> 7530 T1105 oasc.SolrCore.initDeprecatedSupport WARNING adding ShowFileRequestHandler with hidden files: [SCHEMA.XML, OLD_SYNONYMS.TXT, STOPWORDS.TXT, PROTWORDS.TXT, OPEN-EXCHANGE-RATES.JSON, SYNONYMS.TXT, CURRENCY.XML, MAPPING-ISOLATIN1ACCENT.TXT]
[junit4:junit4]   2> 7532 T1105 oass.SolrIndexSearcher.<init> Opening Searcher@59323b6c main
[junit4:junit4]   2> 7533 T1105 oasu.CommitTracker.<init> Hard AutoCommit: disabled
[junit4:junit4]   2> 7534 T1105 oasu.CommitTracker.<init> Soft AutoCommit: disabled
[junit4:junit4]   2> 7534 T1105 oashc.SpellCheckComponent.inform Initializing spell checkers
[junit4:junit4]   2> 7547 T1105 oass.DirectSolrSpellChecker.init init: {name=direct,classname=DirectSolrSpellChecker,field=lowerfilt,minQueryLength=3}
[junit4:junit4]   2> 7650 T1166 oasc.SolrCore.registerSearcher [collection1] Registered new searcher Searcher@59323b6c main{StandardDirectoryReader(segments_1:1)}
[junit4:junit4]   2> 7996 T1126 oascc.ZkStateReader.updateClusterState Updating cloud state from ZooKeeper... 
[junit4:junit4]   2> 8008 T1165 oascc.ZkStateReader$2.process A cluster state change has occurred - updating...
[junit4:junit4]   2> 8008 T1125 oascc.ZkStateReader$2.process A cluster state change has occurred - updating...
[junit4:junit4]   2> 8008 T1151 oascc.ZkStateReader$2.process A cluster state change has occurred - updating...
[junit4:junit4]   2> 8008 T1139 oascc.ZkStateReader$2.process A cluster state change has occurred - updating...
[junit4:junit4]   2> 8157 T1105 oasc.CoreContainer.register registering core: collection1
[junit4:junit4]   2> 8157 T1105 oasc.ZkController.register Register shard - core:collection1 address:http://127.0.0.1:14540/solr shardId:shard1
[junit4:junit4]   2> 8163 T1105 oasc.ZkController.register We are http://127.0.0.1:14540/solr/collection1/ and leader is http://127.0.0.1:14531/solr/collection1/
[junit4:junit4]   2> 8163 T1105 oasc.ZkController.register No LogReplay needed for core=collection1 baseURL=http://127.0.0.1:14540/solr
[junit4:junit4]   2> 8163 T1105 oasc.ZkController.checkRecovery Core needs to recover:collection1
[junit4:junit4]   2> 8163 T1105 oasu.DefaultSolrCoreState.doRecovery Running recovery - first canceling any ongoing recovery
[junit4:junit4]   2> ASYNC  NEW_CORE C79 name=collection1 org.apache.solr.core.SolrCore@520991f4 url=http://127.0.0.1:14540/solr/collection1 node=127.0.0.1:14540_solr
[junit4:junit4]   2> 8165 T1167 C79 P14540 oasc.RecoveryStrategy.run Starting recovery process.  core=collection1 recoveringAfterStartup=true
[junit4:junit4]   2> 8165 T1105 oascc.ZkStateReader.updateClusterState Updating cloud state from ZooKeeper... 
[junit4:junit4]   2> 8165 T1167 C79 P14540 oasc.RecoveryStrategy.doRecovery ###### startupVersions=[]
[junit4:junit4]   2> 8166 T1105 oass.SolrDispatchFilter.init user.dir=/usr/home/hudson/hudson-slave/workspace/Lucene-Solr-Tests-4.x-Java6/solr/build/solr-core/test/J1
[junit4:junit4]   2> 8166 T1105 oass.SolrDispatchFilter.init SolrDispatchFilter.init() done
[junit4:junit4]   2> 8166 T1105 oascsi.HttpClientUtil.createClient Creating new http client, config:maxConnections=128&maxConnectionsPerHost=32&followRedirects=false
[junit4:junit4]   2> 8169 T1167 C79 P14540 oasc.RecoveryStrategy.doRecovery Attempting to PeerSync from http://127.0.0.1:14531/solr/collection1/ core=collection1 - recoveringAfterStartup=true
[junit4:junit4]   2> 8170 T1167 C79 P14540 oasu.PeerSync.sync PeerSync: core=collection1 url=http://127.0.0.1:14540/solr START replicas=[http://127.0.0.1:14531/solr/collection1/] nUpdates=100
[junit4:junit4]   2> 8170 T1167 C79 P14540 oasu.PeerSync.sync WARNING no frame of reference to tell of we've missed updates
[junit4:junit4]   2> 8170 T1167 C79 P14540 oasc.RecoveryStrategy.doRecovery PeerSync Recovery was not successful - trying replication. core=collection1
[junit4:junit4]   2> 8171 T1167 C79 P14540 oasc.RecoveryStrategy.doRecovery Starting Replication Recovery. core=collection1
[junit4:junit4]   2> 8171 T1167 C79 P14540 oascsi.HttpClientUtil.createClient Creating new http client, config:maxConnections=128&maxConnectionsPerHost=32&followRedirects=false
[junit4:junit4]   2> 8173 T1131 C78 P14531 REQ /get {distrib=false&qt=/get&wt=javabin&version=2&getVersions=100} status=0 QTime=0 
[junit4:junit4]   2> 8308 T1105 oejs.Server.doStart jetty-8.1.2.v20120308
[junit4:junit4]   2> 8310 T1105 oejs.AbstractConnector.doStart Started SocketConnector@0.0.0.0:14561
[junit4:junit4]   2> 8311 T1105 oasc.SolrResourceLoader.locateSolrHome JNDI not configured for solr (NoInitialContextEx)
[junit4:junit4]   2> 8311 T1105 oasc.SolrResourceLoader.locateSolrHome using system property solr.solr.home: /usr/home/hudson/hudson-slave/workspace/Lucene-Solr-Tests-4.x-Java6/solr/build/solr-core/test/J1/./solrtest-jetty4-1347860397126
[junit4:junit4]   2> 8311 T1105 oasc.SolrResourceLoader.<init> new SolrResourceLoader for deduced Solr Home: '/usr/home/hudson/hudson-slave/workspace/Lucene-Solr-Tests-4.x-Java6/solr/build/solr-core/test/J1/./solrtest-jetty4-1347860397126/'
[junit4:junit4]   2> 8340 T1105 oass.SolrDispatchFilter.init SolrDispatchFilter.init()
[junit4:junit4]   2> 8340 T1105 oasc.SolrResourceLoader.locateSolrHome JNDI not configured for solr (NoInitialContextEx)
[junit4:junit4]   2> 8340 T1105 oasc.SolrResourceLoader.locateSolrHome using system property solr.solr.home: /usr/home/hudson/hudson-slave/workspace/Lucene-Solr-Tests-4.x-Java6/solr/build/solr-core/test/J1/./solrtest-jetty4-1347860397126
[junit4:junit4]   2> 8341 T1105 oasc.CoreContainer$Initializer.initialize looking for solr.xml: /usr/home/hudson/hudson-slave/workspace/Lucene-Solr-Tests-4.x-Java6/solr/build/solr-core/test/J1/./solrtest-jetty4-1347860397126/solr.xml
[junit4:junit4]   2> 8341 T1105 oasc.CoreContainer.<init> New CoreContainer 786634838
[junit4:junit4]   2> 8341 T1105 oasc.CoreContainer.load Loading CoreContainer using Solr Home: '/usr/home/hudson/hudson-slave/workspace/Lucene-Solr-Tests-4.x-Java6/solr/build/solr-core/test/J1/./solrtest-jetty4-1347860397126/'
[junit4:junit4]   2> 8342 T1105 oasc.SolrResourceLoader.<init> new SolrResourceLoader for directory: '/usr/home/hudson/hudson-slave/workspace/Lucene-Solr-Tests-4.x-Java6/solr/build/solr-core/test/J1/./solrtest-jetty4-1347860397126/'
[junit4:junit4]   2> 8364 T1105 oasc.CoreContainer.load Registering Log Listener
[junit4:junit4]   2> 8375 T1105 oasc.CoreContainer.initZooKeeper Zookeeper client=127.0.0.1:14524/solr
[junit4:junit4]   2> 8375 T1105 oaz.ZooKeeper.<init> Initiating client connection, connectString=127.0.0.1:14524/solr sessionTimeout=5000 watcher=org.apache.solr.common.cloud.ConnectionManager@555c4144
[junit4:junit4]   2> 8376 T1178 oaz.ClientCnxn$SendThread.startConnect Opening socket connection to server /127.0.0.1:14524
[junit4:junit4]   2> 8376 T1105 oascc.ConnectionManager.waitForConnected Waiting for client to connect to ZooKeeper
[junit4:junit4]   2> 8378 T1178 oaz.ClientCnxn$SendThread.primeConnection Socket connection established to localhost/127.0.0.1:14524, initiating session
[junit4:junit4]   2> 8378 T1107 oazs.NIOServerCnxn$Factory.run Accepted socket connection from /140.211.11.196:14562
[junit4:junit4]   2> 8378 T1107 oazs.NIOServerCnxn.readConnectRequest Client attempting to establish new session at /140.211.11.196:14562
[junit4:junit4]   2> 8389 T1109 oazs.NIOServerCnxn.finishSessionInit Established session 0x139d2bd5c600006 with negotiated timeout 5000 for client /140.211.11.196:14562
[junit4:junit4]   2> 8389 T1178 oaz.ClientCnxn$SendThread.readConnectResult Session establishment complete on server localhost/127.0.0.1:14524, sessionid = 0x139d2bd5c600006, negotiated timeout = 5000
[junit4:junit4]   2> 8390 T1179 oascc.ConnectionManager.process Watcher org.apache.solr.common.cloud.ConnectionManager@555c4144 name:ZooKeeperConnection Watcher:127.0.0.1:14524/solr got event WatchedEvent state:SyncConnected type:None path:null path:null type:None
[junit4:junit4]   2> 8390 T1105 oascc.ConnectionManager.waitForConnected Client is connected to ZooKeeper
[junit4:junit4]   2> 8391 T1110 oazs.PrepRequestProcessor.pRequest Got user-level KeeperException when processing sessionid:0x139d2bd5c600006 type:create cxid:0x1 zxid:0xfffffffffffffffe txntype:unknown reqpath:n/a Error Path:/solr/overseer Error:KeeperErrorCode = NodeExists for /solr/overseer
[junit4:junit4]   2> 8400 T1110 oazs.PrepRequestProcessor.pRequest Got user-level KeeperException when processing sessionid:0x139d2bd5c600006 type:create cxid:0x2 zxid:0xfffffffffffffffe txntype:unknown reqpath:n/a Error Path:/solr/overseer Error:KeeperErrorCode = NodeExists for /solr/overseer
[junit4:junit4]   2> 8409 T1105 oasc.ZkController.createEphemeralLiveNode Register node as live in ZooKeeper:/live_nodes/127.0.0.1:14561_solr
[junit4:junit4]   2> 8410 T1110 oazs.PrepRequestProcessor.pRequest Got user-level KeeperException when processing sessionid:0x139d2bd5c600006 type:delete cxid:0x4 zxid:0xfffffffffffffffe txntype:unknown reqpath:n/a Error Path:/solr/live_nodes/127.0.0.1:14561_solr Error:KeeperErrorCode = NoNode for /solr/live_nodes/127.0.0.1:14561_solr
[junit4:junit4]   2> 8417 T1105 oascc.SolrZkClient.makePath makePath: /live_nodes/127.0.0.1:14561_solr
[junit4:junit4]   2> 8425 T1165 oascc.ZkStateReader$3.process Updating live nodes
[junit4:junit4]   2> 8425 T1139 oascc.ZkStateReader$3.process Updating live nodes
[junit4:junit4]   2> 8425 T1125 oascc.ZkStateReader$3.process Updating live nodes
[junit4:junit4]   2> 8425 T1151 oascc.ZkStateReader$3.process Updating live nodes
[junit4:junit4]   2> 8426 T1105 oashc.HttpShardHandlerFactory.getParameter Setting socketTimeout to: 0
[junit4:junit4]   2> 8426 T1105 oashc.HttpShardHandlerFactory.getParameter Setting urlScheme to: http://
[junit4:junit4]   2> 8426 T1105 oashc.HttpShardHandlerFactory.getParameter Setting connTimeout to: 0
[junit4:junit4]   2> 8427 T1105 oashc.HttpShardHandlerFactory.getParameter Setting maxConnectionsPerHost to: 20
[junit4:junit4]   2> 8427 T1105 oashc.HttpShardHandlerFactory.getParameter Setting corePoolSize to: 0
[junit4:junit4]   2> 8427 T1105 oashc.HttpShardHandlerFactory.getParameter Setting maximumPoolSize to: 2147483647
[junit4:junit4]   2> 8428 T1105 oashc.HttpShardHandlerFactory.getParameter Setting maxThreadIdleTime to: 5
[junit4:junit4]   2> 8428 T1105 oashc.HttpShardHandlerFactory.getParameter Setting sizeOfQueue to: -1
[junit4:junit4]   2> 8428 T1105 oashc.HttpShardHandlerFactory.getParameter Setting fairnessPolicy to: false
[junit4:junit4]   2> 8428 T1105 oascsi.HttpClientUtil.createClient Creating new http client, config:maxConnectionsPerHost=20&maxConnections=10000&socketTimeout=0&connTimeout=0&retry=false
[junit4:junit4]   2> 8446 T1105 oascc.ZkStateReader.createClusterStateWatchersAndUpdate Updating cluster state from ZooKeeper... 
[junit4:junit4]   2> 8452 T1105 oasc.CoreContainer.create Creating SolrCore 'collection1' using instanceDir: /usr/home/hudson/hudson-slave/workspace/Lucene-Solr-Tests-4.x-Java6/solr/build/solr-core/test/J1/./solrtest-jetty4-1347860397126/collection1
[junit4:junit4]   2> 8452 T1105 oasc.ZkController.createCollectionZkNode Check for collection zkNode:collection1
[junit4:junit4]   2> 8453 T1105 oasc.ZkController.createCollectionZkNode Collection zkNode exists
[junit4:junit4]   2> 8453 T1105 oasc.ZkController.readConfigName Load collection config from:/collections/collection1
[junit4:junit4]   2> 8455 T1105 oasc.SolrResourceLoader.<init> new SolrResourceLoader for directory: '/usr/home/hudson/hudson-slave/workspace/Lucene-Solr-Tests-4.x-Java6/solr/build/solr-core/test/J1/./solrtest-jetty4-1347860397126/collection1/'
[junit4:junit4]   2> 8456 T1105 oasc.SolrResourceLoader.replaceClassLoader Adding 'file:/usr/home/hudson/hudson-slave/workspace/Lucene-Solr-Tests-4.x-Java6/solr/build/solr-core/test/J1/solrtest-jetty4-1347860397126/collection1/lib/classes/' to classloader
[junit4:junit4]   2> 8457 T1105 oasc.SolrResourceLoader.replaceClassLoader Adding 'file:/usr/home/hudson/hudson-slave/workspace/Lucene-Solr-Tests-4.x-Java6/solr/build/solr-core/test/J1/solrtest-jetty4-1347860397126/collection1/lib/README' to classloader
[junit4:junit4]   2> 8509 T1105 oasc.SolrConfig.<init> Using Lucene MatchVersion: LUCENE_40
[junit4:junit4]   2> 8521 T1126 oascc.ZkStateReader.updateClusterState Updating cloud state from ZooKeeper... 
[junit4:junit4]   2> 8545 T1165 oascc.ZkStateReader$2.process A cluster state change has occurred - updating...
[junit4:junit4]   2> 8545 T1151 oascc.ZkStateReader$2.process A cluster state change has occurred - updating...
[junit4:junit4]   2> 8545 T1139 oascc.ZkStateReader$2.process A cluster state change has occurred - updating...
[junit4:junit4]   2> 8545 T1179 oascc.ZkStateReader$2.process A cluster state change has occurred - updating...
[junit4:junit4]   2> 8545 T1125 oascc.ZkStateReader$2.process A cluster state change has occurred - updating...
[junit4:junit4]   2> 8589 T1105 oasc.SolrConfig.<init> Loaded SolrConfig: solrconfig.xml
[junit4:junit4]   2> 8690 T1105 oass.IndexSchema.readSchema Reading Solr Schema
[junit4:junit4]   2> 8698 T1105 oass.IndexSchema.readSchema Schema name=test
[junit4:junit4]   2>  C77_STATE=coll:collection1 core:collection1 props:{shard=shard1, roles=null, state=recovering, core=collection1, collection=collection1, node_name=127.0.0.1:14535_solr, base_url=http://127.0.0.1:14535/solr}
[junit4:junit4]   2> 9363 T1153 C77 P14535 oasc.RecoveryStrategy.doRecovery Begin buffering updates. core=collection1
[junit4:junit4]   2> 9363 T1153 C77 P14535 oasu.UpdateLog.bufferUpdates Starting to buffer updates. FSUpdateLog{state=ACTIVE, tlog=null}
[junit4:junit4]   2> 9363 T1153 C77 P14535 oasc.RecoveryStrategy.replicate Attempting to replicate from http://127.0.0.1:14531/solr/collection1/. core=collection1
[junit4:junit4]   2> 9364 T1153 C77 P14535 oascsi.HttpClientUtil.createClient Creating new http client, config:maxConnections=128&maxConnectionsPerHost=32&followRedirects=false
[junit4:junit4]   2> 9377 T1134 C78 P14531 oasu.DirectUpdateHandler2.commit start commit{flags=0,_version_=0,optimize=false,openSearcher=true,waitSearcher=true,expungeDeletes=false,softCommit=false}
[junit4:junit4]   2> 9382 T1134 C78 P14531 oasc.SolrDeletionPolicy.onInit SolrDeletionPolicy.onInit: commits:num=1
[junit4:junit4]   2> 		commit{dir=/usr/home/hudson/hudson-slave/workspace/Lucene-Solr-Tests-4.x-Java6/solr/build/solr-core/test/J1/org.apache.solr.cloud.SyncSliceTest-1347860388954/jetty1/index,segFN=segments_1,generation=1,filenames=[segments_1]
[junit4:junit4]   2> 9382 T1134 C78 P14531 oasc.SolrDeletionPolicy.updateCommits newest commit = 1
[junit4:junit4]   2> 9383 T1134 C78 P14531 oass.SolrIndexSearcher.<init> Opening Searcher@2b5e33df main
[junit4:junit4]   2> 9384 T1134 C78 P14531 oasu.DirectUpdateHandler2.commit end_commit_flush
[junit4:junit4]   2> 9386 T1140 oasc.SolrCore.registerSearcher [collection1] Registered new searcher Searcher@2b5e33df main{StandardDirectoryReader(segments_1:1)}
[junit4:junit4]   2> 9386 T1134 C78 P14531 /update {waitSearcher=true&commit=true&commit_end_point=true&wt=javabin&softCommit=false&version=2} {commit=} 0 9
[junit4:junit4]   2> 9387 T1153 C77 P14535 oash.ReplicationHandler.inform Commits will be reserved for  10000
[junit4:junit4]   2> 9388 T1153 C77 P14535 oascsi.HttpClientUtil.createClient Creating new http client, config:connTimeout=5000&socketTimeout=20000&allowCompression=false&maxConnections=10000&maxConnectionsPerHost=10000
[junit4:junit4]   2> 9405 T1153 C77 P14535 oash.SnapPuller.<init>  No value set for 'pollInterval'. Timer Task not started.
[junit4:junit4]   2> 9407 T1135 C78 P14531 oash.ReplicationHandler.inform Commits will be reserved for  10000
[junit4:junit4]   2> 9408 T1135 C78 P14531 REQ /replication {command=indexversion&wt=javabin&qt=/replication&version=2} status=0 QTime=1 
[junit4:junit4]   2> 9411 T1153 C77 P14535 oasc.SolrDeletionPolicy.onInit SolrDeletionPolicy.onInit: commits:num=1
[junit4:junit4]   2> 		commit{dir=/usr/home/hudson/hudson-slave/workspace/Lucene-Solr-Tests-4.x-Java6/solr/build/solr-core/test/J1/org.apache.solr.cloud.SyncSliceTest-1347860388954/jetty2/index,segFN=segments_1,generation=1,filenames=[segments_1]
[junit4:junit4]   2> 9412 T1153 C77 P14535 oasc.SolrDeletionPolicy.updateCommits newest commit = 1
[junit4:junit4]   2> 9412 T1153 C77 P14535 oasu.DirectUpdateHandler2.commit start commit{flags=0,_version_=0,optimize=false,openSearcher=true,waitSearcher=true,expungeDeletes=false,softCommit=false}
[junit4:junit4]   2> 9426 T1153 C77 P14535 oasc.SolrDeletionPolicy.onCommit SolrDeletionPolicy.onCommit: commits:num=2
[junit4:junit4]   2> 		commit{dir=/usr/home/hudson/hudson-slave/workspace/Lucene-Solr-Tests-4.x-Java6/solr/build/solr-core/test/J1/org.apache.solr.cloud.SyncSliceTest-1347860388954/jetty2/index,segFN=segments_1,generation=1,filenames=[segments_1]
[junit4:junit4]   2> 		commit{dir=/usr/home/hudson/hudson-slave/workspace/Lucene-Solr-Tests-4.x-Java6/solr/build/solr-core/test/J1/org.apache.solr.cloud.SyncSliceTest-1347860388954/jetty2/index,segFN=segments_2,generation=2,filenames=[segments_2]
[junit4:junit4]   2> 9426 T1153 C77 P14535 oasc.SolrDeletionPolicy.updateCommits newest commit = 2
[junit4:junit4]   2> 9429 T1153 C77 P14535 oass.SolrIndexSearcher.<init> Opening Searcher@52489b7e main
[junit4:junit4]   2> 9429 T1153 C77 P14535 oasu.DirectUpdateHandler2.commit end_commit_flush
[junit4:junit4]   2> 9431 T1152 oasc.SolrCore.registerSearcher [collection1] Registered new searcher Searcher@52489b7e main{StandardDirectoryReader(segments_2:2)}
[junit4:junit4]   2> 9432 T1153 C77 P14535 oasc.RecoveryStrategy.replay No replay needed. core=collection1
[junit4:junit4]   2> 9432 T1153 C77 P14535 oasc.RecoveryStrategy.doRecovery Replication Recovery was successful - registering as Active. core=collection1
[junit4:junit4]   2> 9437 T1153 C77 P14535 oasc.RecoveryStrategy.doRecovery Finished recovery process. core=collection1
[junit4:junit4]   2> 9556 T1126 oascc.ZkStateReader.updateClusterState Updating cloud state from ZooKeeper... 
[junit4:junit4]   2> 9573 T1179 oascc.ZkStateReader$2.process A cluster state change has occurred - updating...
[junit4:junit4]   2> 9573 T1165 oascc.ZkStateReader$2.process A cluster state change has occurred - updating...
[junit4:junit4]   2> 9573 T1125 oascc.ZkStateReader$2.process A cluster state change has occurred - updating...
[junit4:junit4]   2> 9573 T1139 oascc.ZkStateReader$2.process A cluster state change has occurred - updating...
[junit4:junit4]   2> 9573 T1151 oascc.ZkStateReader$2.process A cluster state change has occurred - updating...
[junit4:junit4]   2> 9652 T1105 oass.OpenExchangeRatesOrgProvider.init Initialized with rates=open-exchange-rates.json, refreshInterval=1440.
[junit4:junit4]   2> 9664 T1105 oass.IndexSchema.readSchema default search field in schema is text
[junit4:junit4]   2> 9668 T1105 oass.IndexSchema.readSchema unique key field: id
[junit4:junit4]   2> 9680 T1105 oass.FileExchangeRateProvider.reload Reloading exchange rates from file currency.xml
[junit4:junit4]   2> 9691 T1105 oass.FileExchangeRateProvider.reload Reloading exchange rates from file currency.xml
[junit4:junit4]   2> 9696 T1105 oass.OpenExchangeRatesOrgProvider.reload Reloading exchange rates from open-exchange-rates.json
[junit4:junit4]   2> 9697 T1105 oass.OpenExchangeRatesOrgProvider.reload Reloading exchange rates from open-exchange-rates.json
[junit4:junit4]   2> 9698 T1105 oasc.SolrCore.<init> [collection1] Opening new SolrCore at /usr/home/hudson/hudson-slave/workspace/Lucene-Solr-Tests-4.x-Java6/solr/build/solr-core/test/J1/./solrtest-jetty4-1347860397126/collection1/, dataDir=./org.apache.solr.cloud.SyncSliceTest-1347860388954/jetty4/
[junit4:junit4]   2> 9698 T1105 oasc.JmxMonitoredMap.<init> JMX monitoring is enabled. Adding Solr mbeans to JMX Server: com.sun.jmx.mbeanserver.JmxMBeanServer@786c1a82
[junit4:junit4]   2> 9700 T1105 oasc.SolrCore.getNewIndexDir WARNING New index directory detected: old=null new=./org.apache.solr.cloud.SyncSliceTest-1347860388954/jetty4/index/
[junit4:junit4]   2> 9700 T1105 oasc.SolrCore.initIndex WARNING [collection1] Solr index directory './org.apache.solr.cloud.SyncSliceTest-1347860388954/jetty4/index' doesn't exist. Creating new index...
[junit4:junit4]   2> 9701 T1105 oasc.CachingDirectoryFactory.get return new directory for /usr/home/hudson/hudson-slave/workspace/Lucene-Solr-Tests-4.x-Java6/solr/build/solr-core/test/J1/./org.apache.solr.cloud.SyncSliceTest-1347860388954/jetty4/index forceNew:false
[junit4:junit4]   2> 9717 T1105 oasc.SolrDeletionPolicy.onCommit SolrDeletionPolicy.onCommit: commits:num=1
[junit4:junit4]   2> 		commit{dir=/usr/home/hudson/hudson-slave/workspace/Lucene-Solr-Tests-4.x-Java6/solr/build/solr-core/test/J1/org.apache.solr.cloud.SyncSliceTest-1347860388954/jetty4/index,segFN=segments_1,generation=1,filenames=[segments_1]
[junit4:junit4]   2> 9718 T1105 oasc.SolrDeletionPolicy.updateCommits newest commit = 1
[junit4:junit4]   2> 9719 T1105 oasc.SolrCore.initWriters created xml: solr.XMLResponseWriter
[junit4:junit4]   2> 9721 T1105 oasup.UpdateRequestProcessorChain.init inserting DistributedUpdateProcessorFactory into updateRequestProcessorChain "dedupe"
[junit4:junit4]   2> 9722 T1105 oasup.UpdateRequestProcessorChain.init inserting DistributedUpdateProcessorFactory into updateRequestProcessorChain "dedupe-allfields"
[junit4:junit4]   2> 9722 T1105 oasup.UpdateRequestProcessorChain.init inserting DistributedUpdateProcessorFactory into updateRequestProcessorChain "stored_sig"
[junit4:junit4]   2> 9723 T1105 oasup.UpdateRequestProcessorChain.init inserting DistributedUpdateProcessorFactory into updateRequestProcessorChain "uniq-fields"
[junit4:junit4]   2> 9723 T1105 oasup.UpdateRequestProcessorChain.init inserting DistributedUpdateProcessorFactory into updateRequestProcessorChain "distrib-dup-test-chain-implicit"
[junit4:junit4]   2> 9724 T1105 oasc.RequestHandlers.initHandlersFromConfig adding lazy requestHandler: solr.ReplicationHandler
[junit4:junit4]   2> 9724 T1105 oasc.RequestHandlers.initHandlersFromConfig created /replication: solr.ReplicationHandler
[junit4:junit4]   2> 9725 T1105 oasc.RequestHandlers.initHandlersFromConfig created standard: solr.StandardRequestHandler
[junit4:junit4]   2> 9726 T1105 oasc.RequestHandlers.initHandlersFromConfig created /get: solr.RealTimeGetHandler
[junit4:junit4]   2> 9727 T1105 oasc.RequestHandlers.initHandlersFromConfig created dismax: solr.SearchHandler
[junit4:junit4]   2> 9727 T1105 oasc.RequestHandlers.initHandlersFromConfig created mock: org.apache.solr.core.MockQuerySenderListenerReqHandler
[junit4:junit4]   2> 9728 T1105 oasc.RequestHandlers.initHandlersFromConfig created /admin/: org.apache.solr.handler.admin.AdminHandlers
[junit4:junit4]   2> 9729 T1105 oasc.RequestHandlers.initHandlersFromConfig created defaults: solr.StandardRequestHandler
[junit4:junit4]   2> 9729 T1105 oasc.RequestHandlers.initHandlersFromConfig adding lazy requestHandler: solr.StandardRequestHandler
[junit4:junit4]   2> 9730 T1105 oasc.RequestHandlers.initHandlersFromConfig created lazy: solr.StandardRequestHandler
[junit4:junit4]   2> 9731 T1105 oasc.RequestHandlers.initHandlersFromConfig created /update: solr.UpdateRequestHandler
[junit4:junit4]   2> 9731 T1105 oasc.RequestHandlers.initHandlersFromConfig created /terms: org.apache.solr.handler.component.SearchHandler
[junit4:junit4]   2> 9732 T1105 oasc.RequestHandlers.initHandlersFromConfig created spellCheckCompRH: org.apache.solr.handler.component.SearchHandler
[junit4:junit4]   2> 9733 T1105 oasc.RequestHandlers.initHandlersFromConfig created spellCheckCompRH_Direct: org.apache.solr.handler.component.SearchHandler
[junit4:junit4]   2> 9733 T1105 oasc.RequestHandlers.initHandlersFromConfig created spellCheckWithWordbreak: org.apache.solr.handler.component.SearchHandler
[junit4:junit4]   2> 9734 T1105 oasc.RequestHandlers.initHandlersFromConfig created spellCheckWithWordbreak_Direct: org.apache.solr.handler.component.SearchHandler
[junit4:junit4]   2> 9735 T1105 oasc.RequestHandlers.initHandlersFromConfig created spellCheckCompRH1: org.apache.solr.handler.component.SearchHandler
[junit4:junit4]   2> 9736 T1105 oasc.RequestHandlers.initHandlersFromConfig created tvrh: org.apache.solr.handler.component.SearchHandler
[junit4:junit4]   2> 9736 T1105 oasc.RequestHandlers.initHandlersFromConfig created /mlt: solr.MoreLikeThisHandler
[junit4:junit4]   2> 9737 T1105 oasc.RequestHandlers.initHandlersFromConfig created /debug/dump: solr.DumpRequestHandler
[junit4:junit4]   2> 9741 T1105 oashl.XMLLoader.init xsltCacheLifetimeSeconds=60
[junit4:junit4]   2> 9746 T1105 oasc.SolrCore.initDeprecatedSupport WARNING solrconfig.xml uses deprecated <admin/gettableFiles>, Please update your config to use the ShowFileRequestHandler.
[junit4:junit4]   2> 9747 T1105 oasc.SolrCore.initDeprecatedSupport WARNING adding ShowFileRequestHandler with hidden files: [SCHEMA.XML, OLD_SYNONYMS.TXT, STOPWORDS.TXT, PROTWORDS.TXT, OPEN-EXCHANGE-RATES.JSON, SYNONYMS.TXT, CURRENCY.XML, MAPPING-ISOLATIN1ACCENT.TXT]
[junit4:junit4]   2> 9751 T1105 oass.SolrIndexSearcher.<init> Opening Searcher@6d8ad46a main
[junit4:junit4]   2> 9752 T1105 oasu.CommitTracker.<init> Hard AutoCommit: disabled
[junit4:junit4]   2> 9753 T1105 oasu.CommitTracker.<init> Soft AutoCommit: disabled
[junit4:junit4]   2> 9754 T1105 oashc.SpellCheckComponent.inform Initializing spell checkers
[junit4:junit4]   2> 9770 T1105 oass.DirectSolrSpellChecker.init init: {name=direct,classname=DirectSolrSpellChecker,field=lowerfilt,minQueryLength=3}
[junit4:junit4]   2> 9864 T1180 oasc.SolrCore.registerSearcher [collection1] Registered new searcher Searcher@6d8ad46a main{StandardDirectoryReader(segments_1:1)}
[junit4:junit4]   2> 10083 T1126 oascc.ZkStateReader.updateClusterState Updating cloud state from ZooKeeper... 
[junit4:junit4]   2> 10093 T1179 oascc.ZkStateReader$2.process A cluster state change has occurred - updating...
[junit4:junit4]   2> 10093 T1125 oascc.ZkStateReader$2.process A cluster state change has occurred - updating...
[junit4:junit4]   2> 10093 T1139 oascc.ZkStateReader$2.process A cluster state change has occurred - updating...
[junit4:junit4]   2> 10093 T1151 oascc.ZkStateReader$2.process A cluster state change has occurred - updating...
[junit4:junit4]   2> 10093 T1165 oascc.ZkStateReader$2.process A cluster state change has occurred - updating...
[junit4:junit4]   2> 10378 T1105 oasc.CoreContainer.register registering core: collection1
[junit4:junit4]   2> 10378 T1105 oasc.ZkController.register Register shard - core:collection1 address:http://127.0.0.1:14561/solr shardId:shard1
[junit4:junit4]   2> 10381 T1105 oasc.ZkController.register We are http://127.0.0.1:14561/solr/collection1/ and leader is http://127.0.0.1:14531/solr/collection1/
[junit4:junit4]   2> 10382 T1105 oasc.ZkController.register No LogReplay needed for core=collection1 baseURL=http://127.0.0.1:14561/solr
[junit4:junit4]   2> 10382 T1105 oasc.ZkController.checkRecovery Core needs to recover:collection1
[junit4:junit4]   2> 10383 T1105 oasu.DefaultSolrCoreState.doRecovery Running recovery - first canceling any ongoing recovery
[junit4:junit4]   2> ASYNC  NEW_CORE C80 name=collection1 org.apache.solr.core.SolrCore@906b39f url=http://127.0.0.1:14561/solr/collection1 node=127.0.0.1:14561_solr
[junit4:junit4]   2> 10384 T1181 C80 P14561 oasc.RecoveryStrategy.run Starting recovery process.  core=collection1 recoveringAfterStartup=true
[junit4:junit4]   2> 10385 T1181 C80 P14561 oasc.RecoveryStrategy.doRecovery ###### startupVersions=[]
[junit4:junit4]   2> 10384 T1105 oascc.ZkStateReader.updateClusterState Updating cloud state from ZooKeeper... 
[junit4:junit4]   2> 10391 T1181 C80 P14561 oasc.RecoveryStrategy.doRecovery Attempting to PeerSync from http://127.0.0.1:14531/solr/collection1/ core=collection1 - recoveringAfterStartup=true
[junit4:junit4]   2> 10391 T1181 C80 P14561 oasu.PeerSync.sync PeerSync: core=collection1 url=http://127.0.0.1:14561/solr START replicas=[http://127.0.0.1:14531/solr/collection1/] nUpdates=100
[junit4:junit4]   2> 10391 T1105 oass.SolrDispatchFilter.init user.dir=/usr/home/hudson/hudson-slave/workspace/Lucene-Solr-Tests-4.x-Java6/solr/build/solr-core/test/J1
[junit4:junit4]   2> 10392 T1181 C80 P14561 oasu.PeerSync.sync WARNING no frame of reference to tell of we've missed updates
[junit4:junit4]   2> 10391 T1105 oass.SolrDispatchFilter.init SolrDispatchFilter.init() done
[junit4:junit4]   2> 10392 T1181 C80 P14561 oasc.RecoveryStrategy.doRecovery PeerSync Recovery was not successful - trying replication. core=collection1
[junit4:junit4]   2> 10392 T1105 oascsi.HttpClientUtil.createClient Creating new http client, config:maxConnections=128&maxConnectionsPerHost=32&followRedirects=false
[junit4:junit4]   2> 10392 T1181 C80 P14561 oasc.RecoveryStrategy.doRecovery Starting Replication Recovery. core=collection1
[junit4:junit4]   2> 10393 T1181 C80 P14561 oascsi.HttpClientUtil.createClient Creating new http client, config:maxConnections=128&maxConnectionsPerHost=32&followRedirects=false
[junit4:junit4]   2> 10394 T1131 C78 P14531 REQ /get {distrib=false&qt=/get&wt=javabin&version=2&getVersions=100} status=0 QTime=0 
[junit4:junit4]   2> 10414 T1105 oaz.ZooKeeper.<init> Initiating client connection, connectString=127.0.0.1:14524/solr sessionTimeout=10000 watcher=org.apache.solr.common.cloud.ConnectionManager@79e70822
[junit4:junit4]   2> 10415 T1183 oaz.ClientCnxn$SendThread.startConnect Opening socket connection to server /127.0.0.1:14524
[junit4:junit4]   2> 10415 T1105 oascc.ConnectionManager.waitForConnected Waiting for client to connect to ZooKeeper
[junit4:junit4]   2> 10416 T1183 oaz.ClientCnxn$SendThread.primeConnection Socket connection established to localhost/127.0.0.1:14524, initiating session
[junit4:junit4]   2> 10416 T1107 oazs.NIOServerCnxn$Factory.run Accepted socket connection from /140.211.11.196:14568
[junit4:junit4]   2> 10416 T1107 oazs.NIOServerCnxn.readConnectRequest Client attempting to establish new session at /140.211.11.196:14568
[junit4:junit4]   2> 10421 T1109 oazs.NIOServerCnxn.finishSessionInit Established session 0x139d2bd5c600007 with negotiated timeout 10000 for client /140.211.11.196:14568
[junit4:junit4]   2> 10421 T1183 oaz.ClientCnxn$SendThread.readConnectResult Session establishment complete on server localhost/127.0.0.1:14524, sessionid = 0x139d2bd5c600007, negotiated timeout = 10000
[junit4:junit4]   2> 10421 T1184 oascc.ConnectionManager.process Watcher org.apache.solr.common.cloud.ConnectionManager@79e70822 name:ZooKeeperConnection Watcher:127.0.0.1:14524/solr got event WatchedEvent state:SyncConnected type:None path:null path:null type:None
[junit4:junit4]   2> 10421 T1105 oascc.ConnectionManager.waitForConnected Client is connected to ZooKeeper
[junit4:junit4]   2> 10422 T1105 oascc.ZkStateReader.createClusterStateWatchersAndUpdate Updating cluster state from ZooKeeper... 
[junit4:junit4]   2> 10423 T1105 oasc.ChaosMonkey.monkeyLog monkey: init - expire sessions:true cause connection loss:true
[junit4:junit4]   2> 10424 T1105 oascsi.HttpClientUtil.createClient Creating new http client, config:
[junit4:junit4]   2> 10432 T1105 oascc.ZkStateReader.updateClusterState Updating cloud state from ZooKeeper... 
[junit4:junit4]   2> 10433 T1105 oasc.AbstractFullDistribZkTestBase.waitForThingsToLevelOut Wait for recoveries to finish - wait 15 for each attempt
[junit4:junit4]   2> 10433 T1105 oasc.AbstractDistribZkTestBase.waitForRecoveriesToFinish Wait for recoveries to finish - collection: collection1 failOnTimeout:true timeout (sec):15
[junit4:junit4]   2> 10434 T1105 oascc.ZkStateReader.updateClusterState Updating cloud state from ZooKeeper... 
[junit4:junit4]   2> 10603 T1126 oascc.ZkStateReader.updateClusterState Updating cloud state from ZooKeeper... 
[junit4:junit4]   2> 10607 T1179 oascc.ZkStateReader$2.process A cluster state change has occurred - updating...
[junit4:junit4]   2> 10607 T1139 oascc.ZkStateReader$2.process A cluster state change has occurred - updating...
[junit4:junit4]   2> 10607 T1184 oascc.ZkStateReader$2.process A cluster state change has occurred - updating...
[junit4:junit4]   2> 10607 T1151 oascc.ZkStateReader$2.process A cluster state change has occurred - updating...
[junit4:junit4]   2> 10607 T1125 oascc.ZkStateReader$2.process A cluster state change has occurred - updating...
[junit4:junit4]   2> 10607 T1165 oascc.ZkStateReader$2.process A cluster state change has occurred - updating...
[junit4:junit4]   2>  C79_STATE=coll:collection1 core:collection1 props:{shard=shard1, roles=null, state=recovering, core=collection1, collection=collection1, node_name=127.0.0.1:14540_solr, base_url=http://127.0.0.1:14540/solr}
[junit4:junit4]   2> 11337 T1167 C79 P14540 oasc.RecoveryStrategy.doRecovery Begin buffering updates. core=collection1
[junit4:junit4]   2> 11337 T1167 C79 P14540 oasu.UpdateLog.bufferUpdates Starting to buffer updates. FSUpdateLog{state=ACTIVE, tlog=null}
[junit4:junit4]   2> 11338 T1167 C79 P14540 oasc.RecoveryStrategy.replicate Attempting to replicate from http://127.0.0.1:14531/solr/collection1/. core=collection1
[junit4:junit4]   2> 11338 T1167 C79 P14540 oascsi.HttpClientUtil.createClient Creating new http client, config:maxConnections=128&maxConnectionsPerHost=32&followRedirects=false
[junit4:junit4]   2> 11350 T1137 C78 P14531 oasu.DirectUpdateHandler2.commit start commit{flags=0,_version_=0,optimize=false,openSearcher=true,waitSearcher=true,expungeDeletes=false,softCommit=false}
[junit4:junit4]   2> 11355 T1137 C78 P14531 oass.SolrIndexSearcher.<init> Opening Searcher@2f529074 main
[junit4:junit4]   2> 11356 T1137 C78 P14531 oasu.DirectUpdateHandler2.commit end_commit_flush
[junit4:junit4]   2> 11357 T1140 oasc.SolrCore.registerSearcher [collection1] Registered new searcher Searcher@2f529074 main{StandardDirectoryReader(segments_1:1)}
[junit4:junit4]   2> 11358 T1137 C78 P14531 /update {waitSearcher=true&commit=true&commit_end_point=true&wt=javabin&softCommit=false&version=2} {commit=} 0 8
[junit4:junit4]   2> 11359 T1167 C79 P14540 oash.ReplicationHandler.inform Commits will be reserved for  10000
[junit4:junit4]   2> 11359 T1167 C79 P14540 oash.SnapPuller.<init>  No value set for 'pollInterval'. Timer Task not started.
[junit4:junit4]   2> 11362 T1135 C78 P14531 REQ /replication {command=indexversion&wt=javabin&qt=/replication&version=2} status=0 QTime=0 
[junit4:junit4]   2> 11367 T1167 C79 P14540 oasc.SolrDeletionPolicy.onInit SolrDeletionPolicy.onInit: commits:num=1
[junit4:junit4]   2> 		commit{dir=/usr/home/hudson/hudson-slave/workspace/Lucene-Solr-Tests-4.x-Java6/solr/build/solr-core/test/J1/org.apache.solr.cloud.SyncSliceTest-1347860388954/jetty3/index,segFN=segments_1,generation=1,filenames=[segments_1]
[junit4:junit4]   2> 11367 T1167 C79 P14540 oasc.SolrDeletionPolicy.updateCommits newest commit = 1
[junit4:junit4]   2> 11368 T1167 C79 P14540 oasu.DirectUpdateHandler2.commit start commit{flags=0,_version_=0,optimize=false,openSearcher=true,waitSearcher=true,expungeDeletes=false,softCommit=false}
[junit4:junit4]   2> 11435 T1105 oascc.ZkStateReader.updateClusterState Updating cloud state from ZooKeeper... 
[junit4:junit4]   2> 11449 T1167 C79 P14540 oasc.SolrDeletionPolicy.onCommit SolrDeletionPolicy.onCommit: commits:num=2
[junit4:junit4]   2> 		commit{dir=/usr/home/hudson/hudson-slave/workspace/Lucene-Solr-Tests-4.x-Java6/solr/build/solr-core/test/J1/org.apache.solr.cloud.SyncSliceTest-1347860388954/jetty3/index,segFN=segments_1,generation=1,filenames=[segments_1]
[junit4:junit4]   2> 		commit{dir=/usr/home/hudson/hudson-slave/workspace/Lucene-Solr-Tests-4.x-Java6/solr/build/solr-core/test/J1/org.apache.solr.cloud.SyncSliceTest-1347860388954/jetty3/index,segFN=segments_2,generation=2,filenames=[segments_2]
[junit4:junit4]   2> 11449 T1167 C79 P14540 oasc.SolrDeletionPolicy.updateCommits newest commit = 2
[junit4:junit4]   2> 11452 T1167 C79 P14540 oass.SolrIndexSearcher.<init> Opening Searcher@909a74a main
[junit4:junit4]   2> 11452 T1167 C79 P14540 oasu.DirectUpdateHandler2.commit end_commit_flush
[junit4:junit4]   2> 11454 T1166 oasc.SolrCore.registerSearcher [collection1] Registered new searcher Searcher@909a74a main{StandardDirectoryReader(segments_2:2)}
[junit4:junit4]   2> 11455 T1167 C79 P14540 oasc.RecoveryStrategy.replay No replay needed. core=collection1
[junit4:junit4]   2> 11455 T1167 C79 P14540 oasc.RecoveryStrategy.doRecovery Replication Recovery was successful - registering as Active. core=collection1
[junit4:junit4]   2> 11480 T1167 C79 P14540 oasc.RecoveryStrategy.doRecovery Finished recovery process. core=collection1
[junit4:junit4]   2> 11612 T1126 oascc.ZkStateReader.updateClusterState Updating cloud state from ZooKeeper... 
[junit4:junit4]   2> 11630 T1151 oascc.ZkStateReader$2.process A cluster state change has occurred - updating...
[junit4:junit4]   2> 11630 T1184 oascc.ZkStateReader$2.process A cluster state change has occurred - updating...
[junit4:junit4]   2> 11630 T1139 oascc.ZkStateReader$2.process A cluster state change has occurred - updating...
[junit4:junit4]   2> 11630 T1125 oascc.ZkStateReader$2.process A cluster state change has occurred - updating...
[junit4:junit4]   2> 11630 T1179 oascc.ZkStateReader$2.process A cluster state change has occurred - updating...
[junit4:junit4]   2> 11630 T1165 oascc.ZkStateReader$2.process A cluster state change has occurred - updating...
[junit4:junit4]   2> 12437 T1105 oascc.ZkStateReader.updateClusterState Updating cloud state from ZooKeeper... 
[junit4:junit4]   2>  C80_STATE=coll:collection1 core:collection1 props:{shard=shard1, roles=null, state=recovering, core=collection1, collection=collection1, node_name=127.0.0.1:14561_solr, base_url=http://127.0.0.1:14561/solr}
[junit4:junit4]   2> 13414 T1181 C80 P14561 oasc.RecoveryStrategy.doRecovery Begin buffering updates. core=collection1
[junit4:junit4]   2> 13414 T1181 C80 P14561 oasu.UpdateLog.bufferUpdates Starting to buffer updates. FSUpdateLog{state=ACTIVE, tlog=null}
[junit4:junit4]   2> 13414 T1181 C80 P14561 oasc.RecoveryStrategy.replicate Attempting to replicate from http://127.0.0.1:14531/solr/collection1/. core=collection1
[junit4:junit4]   2> 13414 T1181 C80 P14561 oascsi.HttpClientUtil.createClient Creating new http client, config:maxConnections=128&maxConnectionsPerHost=32&followRedirects=false
[junit4:junit4]   2> 13432 T1132 C78 P14531 oasu.DirectUpdateHandler2.commit start commit{flags=0,_version_=0,optimize=false,openSearcher=true,waitSearcher=true,expungeDeletes=false,softCommit=false}
[junit4:junit4]   2> 13435 T1132 C78 P14531 oass.SolrIndexSearcher.<init> Opening Searcher@26e28e69 main
[junit4:junit4]   2> 13436 T1132 C78 P14531 oasu.DirectUpdateHandler2.commit end_commit_flush
[junit4:junit4]   2> 13438 T1140 oasc.SolrCore.registerSearcher [collection1] Registered new searcher Searcher@26e28e69 main{StandardDirectoryReader(segments_1:1)}
[junit4:junit4]   2> 13438 T1132 C78 P14531 /update {waitSearcher=true&commit=true&commit_end_point=true&wt=javabin&softCommit=false&version=2} {commit=} 0 6
[junit4:junit4]   2> 13439 T1181 C80 P14561 oash.ReplicationHandler.inform Commits will be reserved for  10000
[junit4:junit4]   2> 13439 T1105 oascc.ZkStateReader.updateClusterState Updating cloud state from ZooKeeper... 
[junit4:junit4]   2> 13440 T1181 C80 P14561 oash.SnapPuller.<init>  No value set for 'pollInterval'. Timer Task not started.
[junit4:junit4]   2> 13442 T1135 C78 P14531 REQ /replication {command=indexversion&wt=javabin&qt=/replication&version=2} status=0 QTime=0 
[junit4:junit4]   2> 13447 T1181 C80 P14561 oasc.SolrDeletionPolicy.onInit SolrDeletionPolicy.onInit: commits:num=1
[junit4:junit4]   2> 		commit{dir=/usr/home/hudson/hudson-slave/workspace/Lucene-Solr-Tests-4.x-Java6/solr/build/solr-core/test/J1/org.apache.solr.cloud.SyncSliceTest-1347860388954/jetty4/index,segFN=segments_1,generation=1,filenames=[segments_1]
[junit4:junit4]   2> 13447 T1181 C80 P14561 oasc.SolrDeletionPolicy.updateCommits newest commit = 1
[junit4:junit4]   2> 13448 T1181 C80 P14561 oasu.DirectUpdateHandler2.commit start commit{flags=0,_version_=0,optimize=false,openSearcher=true,waitSearcher=true,expungeDeletes=false,softCommit=false}
[junit4:junit4]   2> 13460 T1181 C80 P14561 oasc.SolrDeletionPolicy.onCommit SolrDeletionPolicy.onCommit: commits:num=2
[junit4:junit4]   2> 		commit{dir=/usr/home/hudson/hudson-slave/workspace/Lucene-Solr-Tests-4.x-Java6/solr/build/solr-core/test/J1/org.apache.solr.cloud.SyncSliceTest-1347860388954/jetty4/index,segFN=segments_1,generation=1,filenames=[segments_1]
[junit4:junit4]   2> 		commit{dir=/usr/home/hudson/hudson-slave/workspace/Lucene-Solr-Tests-4.x-Java6/solr/build/solr-core/test/J1/org.apache.solr.cloud.SyncSliceTest-1347860388954/jetty4/index,segFN=segments_2,generation=2,filenames=[segments_2]
[junit4:junit4]   2> 13461 T1181 C80 P14561 oasc.SolrDeletionPolicy.updateCommits newest commit = 2
[junit4:junit4]   2> 13464 T1181 C80 P14561 oass.SolrIndexSearcher.<init> Opening Searcher@501dc938 main
[junit4:junit4]   2> 13464 T1181 C80 P14561 oasu.DirectUpdateHandler2.commit end_commit_flush
[junit4:junit4]   2> 13467 T1180 oasc.SolrCore.registerSearcher [collection1] Registered new searcher Searcher@501dc938 main{StandardDirectoryReader(segments_2:2)}
[junit4:junit4]   2> 13468 T1181 C80 P14561 oasc.RecoveryStrategy.replay No replay needed. core=collection1
[junit4:junit4]   2> 13468 T1181 C80 P14561 oasc.RecoveryStrategy.doRecovery Replication Recovery was successful - registering as Active. core=collection1
[junit4:junit4]   2> 13472 T1181 C80 P14561 oasc.RecoveryStrategy.doRecovery Finished recovery process. core=collection1
[junit4:junit4]   2> 13638 T1126 oascc.ZkStateReader.updateClusterState Updating cloud state from ZooKeeper... 
[junit4:junit4]   2> 13657 T1184 oascc.ZkStateReader$2.process A cluster state change has occurred - updating...
[junit4:junit4]   2> 13657 T1139 oascc.ZkStateReader$2.process A cluster state change has occurred - updating...
[junit4:junit4]   2> 13657 T1151 oascc.ZkStateReader$2.process A cluster state change has occurred - updating...
[junit4:junit4]   2> 13657 T1165 oascc.ZkStateReader$2.process A cluster state change has occurred - updating...
[junit4:junit4]   2> 13657 T1125 oascc.ZkStateReader$2.process A cluster state change has occurred - updating...
[junit4:junit4]   2> 13657 T1179 oascc.ZkStateReader$2.process A cluster state change has occurred - updating...
[junit4:junit4]   2> 14441 T1105 oascc.ZkStateReader.updateClusterState Updating cloud state from ZooKeeper... 
[junit4:junit4]   2> ASYNC  NEW_CORE C81 name=collection1 org.apache.solr.core.SolrCore@7e35ab86 url=http://127.0.0.1:14528/solr/collection1 node=127.0.0.1:14528_solr
[junit4:junit4]   2> 14452 T1117 C81 P14528 oasu.DirectUpdateHandler2.commit start commit{flags=0,_version_=0,optimize=false,openSearcher=true,waitSearcher=true,expungeDeletes=false,softCommit=false}
[junit4:junit4]   2> 14457 T1117 C81 P14528 oasc.SolrDeletionPolicy.onInit SolrDeletionPolicy.onInit: commits:num=1
[junit4:junit4]   2> 		commit{dir=/usr/home/hudson/hudson-slave/workspace/Lucene-Solr-Tests-4.x-Java6/solr/build/solr-core/test/J1/org.apache.solr.cloud.SyncSliceTest-1347860388954/control/data/index,segFN=segments_1,generation=1,filenames=[segments_1]
[junit4:junit4]   2> 14458 T1117 C81 P14528 oasc.SolrDeletionPolicy.updateCommits newest commit = 1
[junit4:junit4]   2> 14459 T1117 C81 P14528 oass.SolrIndexSearcher.<init> Opening Searcher@76512afa main
[junit4:junit4]   2> 14459 T1117 C81 P14528 oasu.DirectUpdateHandler2.commit end_commit_flush
[junit4:junit4]   2> 14462 T1128 oasc.SolrCore.registerSearcher [collection1] Registered new searcher Searcher@76512afa main{StandardDirectoryReader(segments_1:1)}
[junit4:junit4]   2> 14463 T1117 C81 P14528 /update {waitSearcher=true&wt=javabin&commit=true&softCommit=false&version=2} {commit=} 0 11
[junit4:junit4]   2> 14464 T1105 oaz.ZooKeeper.<init> Initiating client connection, connectString=127.0.0.1:14524/solr sessionTimeout=10000 watcher=org.apache.solr.common.cloud.ConnectionManager@62b244e8
[junit4:junit4]   2> 14465 T1185 oaz.ClientCnxn$SendThread.startConnect Opening socket connection to server /127.0.0.1:14524
[junit4:junit4]   2> 14465 T1105 oascc.ConnectionManager.waitForConnected Waiting for client to connect to ZooKeeper
[junit4:junit4]   2> 14466 T1185 oaz.ClientCnxn$SendThread.primeConnection Socket connection established to localhost/127.0.0.1:14524, initiating session
[junit4:junit4]   2> 14466 T1107 oazs.NIOServerCnxn$Factory.run Accepted socket connection from /140.211.11.196:14572
[junit4:junit4]   2> 14466 T1107 oazs.NIOServerCnxn.readConnectRequest Client attempting to establish new session at /140.211.11.196:14572
[junit4:junit4]   2> 14467 T1109 oazs.NIOServerCnxn.finishSessionInit Established session 0x139d2bd5c600008 with negotiated timeout 10000 for client /140.211.11.196:14572
[junit4:junit4]   2> 14468 T1185 oaz.ClientCnxn$SendThread.readConnectResult Session establishment complete on server localhost/127.0.0.1:14524, sessionid = 0x139d2bd5c600008, negotiated timeout = 10000
[junit4:junit4]   2> 14468 T1186 oascc.ConnectionManager.process Watcher org.apache.solr.common.cloud.ConnectionManager@62b244e8 name:ZooKeeperConnection Watcher:127.0.0.1:14524/solr got event WatchedEvent state:SyncConnected type:None path:null path:null type:None
[junit4:junit4]   2> 14468 T1105 oascc.ConnectionManager.waitForConnected Client is connected to ZooKeeper
[junit4:junit4]   2> 14469 T1105 oascc.ZkStateReader.createClusterStateWatchersAndUpdate Updating cluster state from ZooKeeper... 
[junit4:junit4]   2> 14472 T1133 C78 P14531 oasu.DirectUpdateHandler2.commit start commit{flags=0,_version_=0,optimize=false,openSearcher=true,waitSearcher=true,expungeDeletes=false,softCommit=false}
[junit4:junit4]   2> 14475 T1133 C78 P14531 oass.SolrIndexSearcher.<init> Opening Searcher@77d514e3 main
[junit4:junit4]   2> 14475 T1133 C78 P14531 oasu.DirectUpdateHandler2.commit end_commit_flush
[junit4:junit4]   2> 14477 T1140 oasc.SolrCore.registerSearcher [collection1] Registered new searcher Searcher@77d514e3 main{StandardDirectoryReader(segments_1:1)}
[junit4:junit4]   2> 14497 T1133 C78 P14531 oasu.SolrCmdDistributor.distribCommit Distrib commit to:[StdNode: http://127.0.0.1:14535/solr/collection1/, StdNode: http://127.0.0.1:14540/solr/collection1/, StdNode: http://127.0.0.1:14561/solr/collection1/]
[junit4:junit4]   2>  C79_STATE=coll:collection1 core:collection1 props:{shard=shard1, roles=null, state=active, core=collection1, collection=collection1, node_name=127.0.0.1:14540_solr, base_url=http://127.0.0.1:14540/solr}
[junit4:junit4]   2> 14526 T1157 C79 P14540 oasu.DirectUpdateHandler2.commit start commit{flags=0,_version_=0,optimize=false,openSearcher=true,waitSearcher=true,expungeDeletes=false,softCommit=false}
[junit4:junit4]   2>  C80_STATE=coll:collection1 core:collection1 props:{shard=shard1, roles=null, state=active, core=collection1, collection=collection1, node_name=127.0.0.1:14561_solr, base_url=http://127.0.0.1:14561/solr}
[junit4:junit4]   2> 14526 T1171 C80 P14561 oasu.DirectUpdateHandler2.commit start commit{flags=0,_version_=0,optimize=false,openSearcher=true,waitSearcher=true,expungeDeletes=false,softCommit=false}
[junit4:junit4]   2> 14529 T1171 C80 P14561 oass.SolrIndexSearcher.<init> Opening Searcher@74d917f5 main
[junit4:junit4]   2> 14530 T1171 C80 P14561 oasu.DirectUpdateHandler2.commit end_commit_flush
[junit4:junit4]   2> 14531 T1157 C79 P14540 oass.SolrIndexSearcher.<init> Opening Searcher@15f9c366 main
[junit4:junit4]   2>  C77_STATE=coll:collection1 core:collection1 props:{shard=shard1, roles=null, state=active, core=collection1, collection=collection1, node_name=127.0.0.1:14535_solr, base_url=http://127.0.0.1:14535/solr}
[junit4:junit4]   2> 14531 T1143 C77 P14535 oasu.DirectUpdateHandler2.commit start commit{flags=0,_version_=0,optimize=false,openSearcher=true,waitSearcher=true,expungeDeletes=false,softCommit=false}
[junit4:junit4]   2> 14531 T1157 C79 P14540 oasu.DirectUpdateHandler2.commit end_commit_flush
[junit4:junit4]   2> 14531 T1180 oasc.SolrCore.registerSearcher [collection1] Registered new searcher Searcher@74d917f5 main{StandardDirectoryReader(segments_2:2)}
[junit4:junit4]   2> 14533 T1171 C80 P14561 /update {waitSearcher=true&commit=true&wt=javabin&commit_end_point=true&expungeDeletes=false&softCommit=false&version=2} {commit=} 0 7
[junit4:junit4]   2> 14534 T1166 oasc.SolrCore.registerSearcher [collection1] Registered new searcher Searcher@15f9c366 main{StandardDirectoryReader(segments_2:2)}
[junit4:junit4]   2> 14534 T1157 C79 P14540 /update {waitSearcher=true&commit=true&wt=javabin&commit_end_point=true&expungeDeletes=false&softCommit=false&version=2} {commit=} 0 8
[junit4:junit4]   2> 14537 T1143 C77 P14535 oass.SolrIndexSearcher.<init> Opening Searcher@38c62eaa main
[junit4:junit4]   2> 14537 T1143 C77 P14535 oasu.DirectUpdateHandler2.commit end_commit_flush
[junit4:junit4]   2> 14539 T1152 oasc.SolrCore.registerSearcher [collection1] Registered new searcher Searcher@38c62eaa main{StandardDirectoryReader(segments_2:2)}
[junit4:junit4]   2> 14539 T1143 C77 P14535 /update {waitSearcher=true&commit=true&wt=javabin&commit_end_point=true&expungeDeletes=false&softCommit=false&version=2} {commit=} 0 8
[junit4:junit4]   2> 14540 T1133 C78 P14531 /update {waitSearcher=true&wt=javabin&commit=true&softCommit=false&version=2} {commit=} 0 68
[junit4:junit4]   2> 14541 T1105 oascc.ZkStateReader.updateClusterState Updating cloud state from ZooKeeper... 
[junit4:junit4]   2> 14544 T1134 C78 P14531 REQ /select {distrib=false&wt=javabin&q=*:*&version=2} hits=0 status=0 QTime=0 
[junit4:junit4]   2> 14546 T1144 C77 P14535 REQ /select {distrib=false&wt=javabin&q=*:*&version=2} hits=0 status=0 QTime=0 
[junit4:junit4]   2> 14549 T1158 C79 P14540 REQ /select {distrib=false&wt=javabin&q=*:*&version=2} hits=0 status=0 QTime=1 
[junit4:junit4]   2> 14551 T1172 C80 P14561 REQ /select {distrib=false&wt=javabin&q=*:*&version=2} hits=0 status=0 QTime=0 
[junit4:junit4]   2> 16557 T1117 C81 P14528 oass.SolrIndexSearcher.<init> Opening Searcher@6ca2652 realtime
[junit4:junit4]   2> 16558 T1117 C81 P14528 /update {wt=javabin&version=2} {deleteByQuery=*:* (-1413334072563859456)} 0 3
[junit4:junit4]   2> 16561 T1133 C78 P14531 oass.SolrIndexSearcher.<init> Opening Searcher@5a6d4914 realtime
[junit4:junit4]   2> 16572 T1143 C77 P14535 oass.SolrIndexSearcher.<init> Opening Searcher@52ad106f realtime
[junit4:junit4]   2> 16573 T1171 C80 P14561 oass.SolrIndexSearcher.<init> Opening Searcher@798ef17c realtime
[junit4:junit4]   2> 16573 T1157 C79 P14540 oass.SolrIndexSearcher.<init> Opening Searcher@424f9ff6 realtime
[junit4:junit4]   2> 16573 T1143 C77 P14535 REQ /update {update.distrib=FROMLEADER&_version_=-1413334072568053760&update.from=http://127.0.0.1:14531/solr/collection1/&wt=javabin&version=2} status=0 QTime=2 
[junit4:junit4]   2> 16573 T1171 C80 P14561 REQ /update {update.distrib=FROMLEADER&_version_=-1413334072568053760&update.from=http://127.0.0.1:14531/solr/collection1/&wt=javabin&version=2} status=0 QTime=2 
[junit4:junit4]   2> 16573 T1157 C79 P14540 REQ /update {update.distrib=FROMLEADER&_version_=-1413334072568053760&update.from=http://127.0.0.1:14531/solr/collection1/&wt=javabin&version=2} status=0 QTime=2 
[junit4:junit4]   2> 16574 T1133 C78 P14531 /update {wt=javabin&version=2} {deleteByQuery=*:* (-1413334072568053760)} 0 14
[junit4:junit4]   2> 16580 T1117 C81 P14528 /update {wt=javabin&version=2} {add=[0 (1413334072585879552)]} 0 3
[junit4:junit4]   2> 16603 T1171 C80 P14561 REQ /update {distrib.from=http://127.0.0.1:14531/solr/collection1/&update.distrib=FROMLEADER&wt=javabin&version=2} status=0 QTime=4 
[junit4:junit4]   2> 16603 T1143 C77 P14535 REQ /update {distrib.from=http://127.0.0.1:14531/solr/collection1/&update.distrib=FROMLEADER&wt=javabin&version=2} status=0 QTime=3 
[junit4:junit4]   2> 16604 T1157 C79 P14540 REQ /update {distrib.from=http://127.0.0.1:14531/solr/collection1/&update.distrib=FROMLEADER&wt=javabin&version=2} status=0 QTime=4 
[junit4:junit4]   2> 16605 T1133 C78 P14531 /update {wt=javabin&version=2} {add=[0 (1413334072592171008)]} 0 22
[junit4:junit4]   2> 16609 T1117 C81 P14528 /update {wt=javabin&version=2} {add=[1 (1413334072618385408)]} 0 1
[junit4:junit4]   2> 16616 T1143 C77 P14535 REQ /update {distrib.from=http://127.0.0.1:14531/solr/collection1/&update.distrib=FROMLEADER&wt=javabin&version=2} status=0 QTime=1 
[junit4:junit4]   2> 16616 T1171 C80 P14561 REQ /update {distrib.from=http://127.0.0.1:14531/solr/collection1/&update.distrib=FROMLEADER&wt=javabin&version=2} status=0 QTime=1 
[junit4:junit4]   2> 16617 T1157 C79 P14540 REQ /update {distrib.from=http://127.0.0.1:14531/solr/collection1/&update.distrib=FROMLEADER&wt=javabin&version=2} status=0 QTime=2 
[junit4:junit4]   2> 16618 T1133 C78 P14531 /update {wt=javabin&version=2} {add=[1 (1413334072622579712)]} 0 6
[junit4:junit4]   2> 16621 T1117 C81 P14528 /update {wt=javabin&version=2} {add=[2 (1413334072630968320)]} 0 1
[junit4:junit4]   2> 16628 T1171 C80 P14561 REQ /update {distrib.from=http://127.0.0.1:14531/solr/collection1/&update.distrib=FROMLEADER&test.distrib.skip.servers=http://127.0.0.1:14535/solr/collection1/&wt=javabin&version=2} status=0 QTime=1 
[junit4:junit4]   2> 16630 T1157 C79 P14540 REQ /update {distrib.from=http://127.0.0.1:14531/solr/collection1/&update.distrib=FROMLEADER&test.distrib.skip.servers=http://127.0.0.1:14535/solr/collection1/&wt=javabin&version=2} status=0 QTime=2 
[junit4:junit4]   2> 16631 T1133 C78 P14531 /update {test.distrib.skip.servers=http://127.0.0.1:14535/solr/collection1/&wt=javabin&version=2} {add=[2 (1413334072635162624)]} 0 7
[junit4:junit4]   2> 16634 T1117 C81 P14528 /update {wt=javabin&version=2} {add=[3 (1413334072644599808)]} 0 1
[junit4:junit4]   2> 16642 T1171 C80 P14561 REQ /update {distrib.from=http://127.0.0.1:14531/solr/collection1/&update.distrib=FROMLEADER&test.distrib.skip.servers=http://127.0.0.1:14535/solr/collection1/&test.distrib.skip.servers=http://127.0.0.1:14540/solr/collection1/&wt=javabin&version=2} status=0 QTime=1 
[junit4:junit4]   2> 16643 T1133 C78 P14531 /update {test.distrib.skip.servers=http://127.0.0.1:14535/solr/collection1/&test.distrib.skip.servers=http://127.0.0.1:14540/solr/collection1/&wt=javabin&version=2} {add=[3 (1413334072648794112)]} 0 6
[junit4:junit4]   2> 16646 T1117 C81 P14528 oasu.DirectUpdateHandler2.commit start commit{flags=0,_version_=0,optimize=false,openSearcher=true,waitSearcher=true,expungeDeletes=false,softCommit=false}
[junit4:junit4]   2> 16849 T1117 C81 P14528 oasc.SolrDeletionPolicy.onCommit SolrDeletionPolicy.onCommit: commits:num=2
[junit4:junit4]   2> 		commit{dir=/usr/home/hudson/hudson-slave/workspace/Lucene-Solr-Tests-4.x-Java6/solr/build/solr-core/test/J1/org.apache.solr.cloud.SyncSliceTest-1347860388954/control/data/index,segFN=segments_1,generation=1,filenames=[segments_1]
[junit4:junit4]   2> 		commit{dir=/usr/home/hudson/hudson-slave/workspace/Lucene-Solr-Tests-4.x-Java6/solr/build/solr-core/test/J1/org.apache.solr.cloud.SyncSliceTest-1347860388954/control/data/index,segFN=segments_2,generation=2,filenames=[_0_MockVariableIntBlock_0.doc, _0_TestBloomFilteredLucene40Postings_0.prx, _0_MockVariableIntBlock_0.skp, _0_MockFixedIntBlock_0.tib, _0_MockVariableIntBlock_0.pyl, _0_MockFixedIntBlock_0.skp, _0_MockFixedIntBlock_0.pyl, _0_MockVariableIntBlock_0.tib, _0_MockFixedIntBlock_0.tii, _0_MockVariableIntBlock_0.pos, _0_TestBloomFilteredLucene40Postings_0.frq, _0.si, _0_MockVariableIntBlock_0.tii, _0_MockRandom_0.tib, _0_TestBloomFilteredLucene40Postings_0.tim, _0_TestBloomFilteredLucene40Postings_0.blm, _0_TestBloomFilteredLucene40Postings_0.tip, _0.fnm, _0_MockFixedIntBlock_0.pos, _0_nrm.cfs, _0_MockRandom_0.skp, _0_MockFixedIntBlock_0.frq, _0_MockRandom_0.frq, _0_MockRandom_0.sd, _0_MockRandom_0.tiv, _0_MockRandom_0.doc, _0_MockFixedIntBlock_0.doc, _0_MockVariableIntBlock_0.frq, _0_MockRandom_0.pos, _0_nrm.cfe, segments_2, _0.fdx, _0_MockRandom_0.pyl, _0.fdt]
[junit4:junit4]   2> 16849 T1117 C81 P14528 oasc.SolrDeletionPolicy.updateCommits newest commit = 2
[junit4:junit4]   2> 16875 T1117 C81 P14528 oass.SolrIndexSearcher.<init> Opening Searcher@4cdbf3ff main
[junit4:junit4]   2> 16876 T1117 C81 P14528 oasu.DirectUpdateHandler2.commit end_commit_flush
[junit4:junit4]   2> 16879 T1128 oasc.SolrCore.registerSearcher [collection1] Registered new searcher Searcher@4cdbf3ff main{StandardDirectoryReader(segments_2:3:nrt _0(4.0.0.2):C4)}
[junit4:junit4]   2> 16880 T1117 C81 P14528 /update {waitSearcher=true&wt=javabin&commit=true&softCommit=false&version=2} {commit=} 0 234
[junit4:junit4]   2> 16882 T1133 C78 P14531 oasu.DirectUpdateHandler2.commit start commit{flags=0,_version_=0,optimize=false,openSearcher=true,waitSearcher=true,expungeDeletes=false,softCommit=false}
[junit4:junit4]   2> 17003 T1133 C78 P14531 oasc.SolrDeletionPolicy.onCommit SolrDeletionPolicy.onCommit: commits:num=2
[junit4:junit4]   2> 		commit{dir=/usr/home/hudson/hudson-slave/workspace/Lucene-Solr-Tests-4.x-Java6/solr/build/solr-core/test/J1/org.apache.solr.cloud.SyncSliceTest-1347860388954/jetty1/index,segFN=segments_1,generation=1,filenames=[segments_1]
[junit4:junit4]   2> 		commit{dir=/usr/home/hudson/hudson-slave/workspace/Lucene-Solr-Tests-4.x-Java6/solr/build/solr-core/test/J1/org.apache.solr.cloud.SyncSliceTest-1347860388954/jetty1/index,segFN=segments_2,generation=2,filenames=[_0_MockVariableIntBlock_0.doc, _0_TestBloomFilteredLucene40Postings_0.prx, _0_MockVariableIntBlock_0.skp, _0_MockFixedIntBlock_0.tib, _0_MockVariableIntBlock_0.pyl, _0_MockFixedIntBlock_0.skp, _0_MockFixedIntBlock_0.pyl, _0_MockVariableIntBlock_0.tib, _0_MockFixedIntBlock_0.tii, _0_MockVariableIntBlock_0.pos, _0_TestBloomFilteredLucene40Postings_0.frq, _0.si, _0_MockVariableIntBlock_0.tii, _0_MockRandom_0.tib, _0_TestBloomFilteredLucene40Postings_0.tim, _0_TestBloomFilteredLucene40Postings_0.blm, _0_TestBloomFilteredLucene40Postings_0.tip, _0.fnm, _0_MockFixedIntBlock_0.pos, _0_nrm.cfs, _0_MockRandom_0.skp, _0_MockFixedIntBlock_0.frq, _0_MockRandom_0.frq, _0_MockRandom_0.sd, _0_MockRandom_0.tiv, _0_MockRandom_0.doc, _0_MockFixedIntBlock_0.doc, _0_MockVariableIntBlock_0.frq, _0_MockRandom_0.pos, _0_nrm.cfe, segments_2, _0.fdx, _0_MockRandom_0.pyl, _0.fdt]
[junit4:junit4]   2> 17004 T1133 C78 P14531 oasc.SolrDeletionPolicy.updateCommits newest commit = 2
[junit4:junit4]   2> 17020 T1133 C78 P14531 oass.SolrIndexSearcher.<init> Opening Searcher@53bc93fe main
[junit4:junit4]   2> 17021 T1133 C78 P14531 oasu.DirectUpdateHandler2.commit end_commit_flush
[junit4:junit4]   2> 17022 T1140 oasc.SolrCore.registerSearcher [collection1] Registered new searcher Searcher@53bc93fe main{StandardDirectoryReader(segments_2:3:nrt _0(4.0.0.2):C4)}
[junit4:junit4]   2> 17023 T1133 C78 P14531 oasu.SolrCmdDistributor.distribCommit Distrib commit to:[StdNode: http://127.0.0.1:14535/solr/collection1/, StdNode: http://127.0.0.1:14540/solr/collection1/, StdNode: http://127.0.0.1:14561/solr/collection1/]
[junit4:junit4]   2> 17025 T1143 C77 P14535 oasu.DirectUpdateHandler2.commit start commit{flags=0,_version_=0,optimize=false,openSearcher=true,waitSearcher=true,expungeDeletes=false,softCommit=false}
[junit4:junit4]   2> 17025 T1171 C80 P14561 oasu.DirectUpdateHandler2.commit start commit{flags=0,_version_=0,optimize=false,openSearcher=true,waitSearcher=true,expungeDeletes=false,softCommit=false}
[junit4:junit4]   2> 17025 T1157 C79 P14540 oasu.DirectUpdateHandler2.commit start commit{flags=0,_version_=0,optimize=false,openSearcher=true,waitSearcher=true,expungeDeletes=false,softCommit=false}
[junit4:junit4]   2> 17133 T1171 C80 P14561 oasc.SolrDeletionPolicy.onCommit SolrDeletionPolicy.onCommit: commits:num=2
[junit4:junit4]   2> 		commit{dir=/usr/home/hudson/hudson-slave/workspace/Lucene-Solr-Tests-4.x-Java6/solr/build/solr-core/test/J1/org.apache.solr.cloud.SyncSliceTest-1347860388954/jetty4/index,segFN=segments_2,generation=2,filenames=[segments_2]
[junit4:junit4]   2> 		commit{dir=/usr/home/hudson/hudson-slave/workspace/Lucene-Solr-Tests-4.x-Java6/solr/build/solr-core/test/J1/org.apache.solr.cloud.SyncSliceTest-1347860388954/jetty4/index,segFN=segments_3,generation=3,filenames=[_0_MockVariableIntBlock_0.doc, _0_MockRandom_0.prx, _0_TestBloomFilteredLucene40Postings_0.prx, _0_MockVariableIntBlock_0.skp, _0_MockFixedIntBlock_0.tib, _0_MockVariableIntBlock_0.pyl, _0_MockFixedIntBlock_0.pyl, _0_MockFixedIntBlock_0.skp, _0_MockVariableIntBlock_0.tib, _0_MockFixedIntBlock_0.tii, _0_MockVariableIntBlock_0.pos, _0_TestBloomFilteredLucene40Postings_0.frq, _0.si, _0_MockVariableIntBlock_0.tii, _0_TestBloomFilteredLucene40Postings_0.tim, _0_TestBloomFilteredLucene40Postings_0.blm, _0_TestBloomFilteredLucene40Postings_0.tip, _0.fnm, _0_MockFixedIntBlock_0.pos, _0_nrm.cfs, _0_MockFixedIntBlock_0.frq, _0_MockRandom_0.tip, _0_MockRandom_0.frq, _0_MockRandom_0.sd, _0_MockFixedIntBlock_0.doc, _0_MockVariableIntBlock_0.frq, _0_nrm.cfe, _0.fdx, _0_MockRandom_0.tim, _0.fdt, segments_3]
[junit4:junit4]   2> 17133 T1171 C80 P14561 oasc.SolrDeletionPolicy.updateCommits newest commit = 3
[junit4:junit4]   2> 17139 T1157 C79 P14540 oasc.SolrDeletionPolicy.onCommit SolrDeletionPolicy.onCommit: commits:num=2
[junit4:junit4]   2> 		commit{dir=/usr/home/hudson/hudson-slave/workspace/Lucene-Solr-Tests-4.x-Java6/solr/build/solr-core/test/J1/org.apache.solr.cloud.SyncSliceTest-1347860388954/jetty3/index,segFN=segments_2,generation=2,filenames=[segments_2]
[junit4:junit4]   2> 		commit{dir=/usr/home/hudson/hudson-slave/workspace/Lucene-Solr-Tests-4.x-Java6/solr/build/solr-core/test/J1/org.apache.solr.cloud.SyncSliceTest-1347860388954/jetty3/index,segFN=segments_3,generation=3,filenames=[_0_MockVariableIntBlock_0.doc, _0_TestBloomFilteredLucene40Postings_0.prx, _0_MockVariableIntBlock_0.skp, _0_MockFixedIntBlock_0.tib, _0_MockVariableIntBlock_0.pyl, _0_MockFixedIntBlock_0.skp, _0_MockFixedIntBlock_0.pyl, _0_MockVariableIntBlock_0.tib, _0_MockFixedIntBlock_0.tii, _0_MockVariableIntBlock_0.pos, _0_TestBloomFilteredLucene40Postings_0.frq, _0.si, _0_MockVariableIntBlock_0.tii, _0_MockRandom_0.tib, _0_TestBloomFilteredLucene40Postings_0.tim, _0_TestBloomFilteredLucene40Postings_0.blm, _0_TestBloomFilteredLucene40Postings_0.tip, _0.fnm, _0_MockFixedIntBlock_0.pos, _0_nrm.cfs, _0_MockRandom_0.skp, _0_MockFixedIntBlock_0.frq, _0_MockRandom_0.frq, _0_MockRandom_0.sd, _0_MockRandom_0.tiv, _0_MockRandom_0.doc, _0_MockFixedIntBlock_0.doc, _0_MockVariableIntBlock_0.frq, _0_MockRandom_0.pos, _0_nrm.cfe, _0.fdx, _0_MockRandom_0.pyl, _0.fdt, segments_3]
[junit4:junit4]   2> 17139 T1143 C77 P14535 oasc.SolrDeletionPolicy.onCommit SolrDeletionPolicy.onCommit: commits:num=2
[junit4:junit4]   2> 		commit{dir=/usr/home/hudson/hudson-slave/workspace/Lucene-Solr-Tests-4.x-Java6/solr/build/solr-core/test/J1/org.apache.solr.cloud.SyncSliceTest-1347860388954/jetty2/index,segFN=segments_2,generation=2,filenames=[segments_2]
[junit4:junit4]   2> 		commit{dir=/usr/home/hudson/hudson-slave/workspace/Lucene-Solr-Tests-4.x-Java6/solr/build/solr-core/test/J1/org.apache.solr.cloud.SyncSliceTest-1347860388954/jetty2/index,segFN=segments_3,generation=3,filenames=[_0_MockVariableIntBlock_0.doc, _0_TestBloomFilteredLucene40Postings_0.prx, _0_MockVariableIntBlock_0.skp, _0_MockFixedIntBlock_0.tib, _0_MockVariableIntBlock_0.pyl, _0_MockFixedIntBlock_0.skp, _0_MockFixedIntBlock_0.pyl, _0_MockVariableIntBlock_0.tib, _0_MockFixedIntBlock_0.tii, _0_MockVariableIntBlock_0.pos, _0_TestBloomFilteredLucene40Postings_0.frq, _0.si, _0_MockVariableIntBlock_0.tii, _0_MockRandom_0.tib, _0_TestBloomFilteredLucene40Postings_0.tim, _0_TestBloomFilteredLucene40Postings_0.blm, _0_TestBloomFilteredLucene40Postings_0.tip, _0.fnm, _0_MockFixedIntBlock_0.pos, _0_nrm.cfs, _0_MockRandom_0.skp, _0_MockFixedIntBlock_0.frq, _0_MockRandom_0.frq, _0_MockRandom_0.sd, _0_MockRandom_0.tiv, _0_MockRandom_0.doc, _0_MockFixedIntBlock_0.doc, _0_MockVariableIntBlock_0.frq, _0_MockRandom_0.pos, _0_nrm.cfe, _0.fdx, _0_MockRandom_0.pyl, _0.fdt, segments_3]
[junit4:junit4]   2> 17141 T1143 C77 P14535 oasc.SolrDeletionPolicy.updateCommits newest commit = 3
[junit4:junit4]   2> 17141 T1157 C79 P14540 oasc.SolrDeletionPolicy.updateCommits newest commit = 3
[junit4:junit4]   2> 17146 T1171 C80 P14561 oass.SolrIndexSearcher.<init> Opening Searcher@7f85cdec main
[junit4:junit4]   2> 17146 T1171 C80 P14561 oasu.DirectUpdateHandler2.commit end_commit_flush
[junit4:junit4]   2> 17149 T1180 oasc.SolrCore.registerSearcher [collection1] Registered new searcher Searcher@7f85cdec main{StandardDirectoryReader(segments_3:4:nrt _0(4.0.0.2):C4)}
[junit4:junit4]   2> 17150 T1171 C80 P14561 /update {waitSearcher=true&commit=true&wt=javabin&commit_end_point=true&expungeDeletes=false&softCommit=false&version=2} {commit=} 0 125
[junit4:junit4]   2> 17159 T1143 C77 P14535 oass.SolrIndexSearcher.<init> Opening Searcher@1aed9010 main
[junit4:junit4]   2> 17159 T1143 C77 P14535 oasu.DirectUpdateHandler2.commit end_commit_flush
[junit4:junit4]   2> 17160 T1152 oasc.SolrCore.registerSearcher [collection1] Registered new searcher Searcher@1aed9010 main{StandardDirectoryReader(segments_3:4:nrt _0(4.0.0.2):C2)}
[junit4:junit4]   2> 17161 T1143 C77 P14535 /update {waitSearcher=true&commit=true&wt=javabin&commit_end_point=true&expungeDeletes=false&softCommit=false&version=2} {commit=} 0 136
[junit4:junit4]   2> 17165 T1157 C79 P14540 oass.SolrIndexSearcher.<init> Opening Searcher@15641e64 main
[junit4:junit4]   2> 17166 T1157 C79 P14540 oasu.DirectUpdateHandler2.commit end_commit_flush
[junit4:junit4]   2> 17168 T1166 oasc.SolrCore.registerSearcher [collection1] Registered new searcher Searcher@15641e64 main{StandardDirectoryReader(segments_3:4:nrt _0(4.0.0.2):C3)}
[junit4:junit4]   2> 17168 T1157 C79 P14540 /update {waitSearcher=true&commit=true&wt=javabin&commit_end_point=true&expungeDeletes=false&softCommit=false&version=2} {commit=} 0 143
[junit4:junit4]   2> 17169 T1133 C78 P14531 /update {waitSearcher=true&wt=javabin&commit=true&softCommit=false&version=2} {commit=} 0 287
[junit4:junit4]   2> 17170 T1105 oasc.AbstractDistribZkTestBase.waitForRecoveriesToFinish Wait for recoveries to finish - collection: collection1 failOnTimeout:true timeout (sec):1800
[junit4:junit4]   2> 17170 T1105 oascc.ZkStateReader.updateClusterState Updating cloud state from ZooKeeper... 
[junit4:junit4]   2> check const of shard1
[junit4:junit4]   2> client0
[junit4:junit4]   2> PROPS:shard=shard1
[junit4:junit4]   2> roles=null
[junit4:junit4]   2> leader=true
[junit4:junit4]   2> state=active
[junit4:junit4]   2> core=collection1
[junit4:junit4]   2> collection=collection1
[junit4:junit4]   2> node_name=127.0.0.1:14531_solr
[junit4:junit4]   2> base_url=http://127.0.0.1:14531/solr
[junit4:junit4]   2> 
[junit4:junit4]   2> 17173 T1134 C78 P14531 REQ /select {distrib=false&wt=javabin&q=*:*&version=2} hits=4 status=0 QTime=0 
[junit4:junit4]   2>  live:true
[junit4:junit4]   2>  num:4
[junit4:junit4]   2> 
[junit4:junit4]   2> client1
[junit4:junit4]   2> PROPS:shard=shard1
[junit4:junit4]   2> roles=null
[junit4:junit4]   2> state=active
[junit4:junit4]   2> core=collection1
[junit4:junit4]   2> collection=collection1
[junit4:junit4]   2> node_name=127.0.0.1:14535_solr
[junit4:junit4]   2> base_url=http://127.0.0.1:14535/solr
[junit4:junit4]   2> 
[junit4:junit4]   2> 17177 T1144 C77 P14535 REQ /select {distrib=false&wt=javabin&q=*:*&version=2} hits=2 status=0 QTime=0 
[junit4:junit4]   2>  live:true
[junit4:junit4]   2>  num:2
[junit4:junit4]   2> 
[junit4:junit4]   2> ######shard1 is not consistent.  Got 4 from http://127.0.0.1:14531/solr/collection1lastClient and got 2 from http://127.0.0.1:14535/solr/collection1
[junit4:junit4]   2> 17187 T1134 C78 P14531 REQ /select {fl=id,_version_&sort=id+asc&q=*:*&distrib=false&wt=javabin&rows=1000&version=2} hits=4 status=0 QTime=6 
[junit4:junit4]   2> 17191 T1144 C77 P14535 REQ /select {fl=id,_version_&sort=id+asc&q=*:*&distrib=false&wt=javabin&rows=1000&version=2} hits=2 status=0 QTime=1 
[junit4:junit4]   2> ######http://127.0.0.1:14531/solr/collection1: {numFound=4,start=0,docs=[SolrDocument{id=0, _version_=1413334072592171008}, SolrDocument{id=1, _version_=1413334072622579712}, SolrDocument{id=2, _version_=1413334072635162624}, SolrDocument{id=3, _version_=1413334072648794112}]}
[junit4:junit4]   2> ######http://127.0.0.1:14535/solr/collection1: {numFound=2,start=0,docs=[SolrDocument{id=0, _version_=1413334072592171008}, SolrDocument{id=1, _version_=1413334072622579712}]}
[junit4:junit4]   2> ###### sizes=4,2
[junit4:junit4]   2> ###### Only in http://127.0.0.1:14531/solr/collection1: [{id=2, _version_=1413334072635162624}, {id=3, _version_=1413334072648794112}]
[junit4:junit4]   2> client2
[junit4:junit4]   2> PROPS:shard=shard1
[junit4:junit4]   2> roles=null
[junit4:junit4]   2> state=active
[junit4:junit4]   2> core=collection1
[junit4:junit4]   2> collection=collection1
[junit4:junit4]   2> node_name=127.0.0.1:14540_solr
[junit4:junit4]   2> base_url=http://127.0.0.1:14540/solr
[junit4:junit4]   2> 
[junit4:junit4]   2> 17194 T1158 C79 P14540 REQ /select {distrib=false&wt=javabin&q=*:*&version=2} hits=3 status=0 QTime=0 
[junit4:junit4]   2>  live:true
[junit4:junit4]   2>  num:3
[junit4:junit4]   2> 
[junit4:junit4]   2> client3
[junit4:junit4]   2> PROPS:shard=shard1
[junit4:junit4]   2> roles=null
[junit4:junit4]   2> state=active
[junit4:junit4]   2> core=collection1
[junit4:junit4]   2> collection=collection1
[junit4:junit4]   2> node_name=127.0.0.1:14561_solr
[junit4:junit4]   2> base_url=http://127.0.0.1:14561/solr
[junit4:junit4]   2> 
[junit4:junit4]   2> 17197 T1172 C80 P14561 REQ /select {distrib=false&wt=javabin&q=*:*&version=2} hits=4 status=0 QTime=0 
[junit4:junit4]   2>  live:true
[junit4:junit4]   2>  num:4
[junit4:junit4]   2> 
[junit4:junit4]   2> 17201 T1105 oascsi.HttpClientUtil.createClient Creating new http client, config:maxConnections=128&maxConnectionsPerHost=32&followRedirects=false
[junit4:junit4]   2> 17216 T1159 oasha.CollectionsHandler.handleSyncShardAction Syncing shard : action=SYNCSHARD&collection=collection1&shard=shard1&wt=javabin&version=2
[junit4:junit4]   2> 17217 T1159 oascsi.HttpClientUtil.createClient Creating new http client, config:maxConnections=128&maxConnectionsPerHost=32&followRedirects=false
[junit4:junit4]   2> 17227 T1137 oasha.CoreAdminHandler.handleRequestSyncAction I have been requested to sync up my shard
[junit4:junit4]   2> 17228 T1137 oasc.SyncStrategy.sync Sync replicas to http://127.0.0.1:14531/solr/collection1/
[junit4:junit4]   2> 17228 T1137 oasu.PeerSync.sync PeerSync: core=collection1 url=http://127.0.0.1:14531/solr START replicas=[http://127.0.0.1:14535/solr/collection1/, http://127.0.0.1:14540/solr/collection1/, http://127.0.0.1:14561/solr/collection1/] nUpdates=100
[junit4:junit4]   2> 17231 T1160 C79 P14540 REQ /get {distrib=false&qt=/get&wt=javabin&version=2&getVersions=100} status=0 QTime=1 
[junit4:junit4]   2> 17231 T1145 C77 P14535 REQ /get {distrib=false&qt=/get&wt=javabin&version=2&getVersions=100} status=0 QTime=0 
[junit4:junit4]   2> 17231 T1173 C80 P14561 REQ /get {distrib=false&qt=/get&wt=javabin&version=2&getVersions=100} status=0 QTime=0 
[junit4:junit4]   2> 17232 T1137 oasu.PeerSync.handleVersions PeerSync: core=collection1 url=http://127.0.0.1:14531/solr  Received 5 versions from 127.0.0.1:14561/solr/collection1/
[junit4:junit4]   2> 17232 T1137 oasu.PeerSync.handleVersions PeerSync: core=collection1 url=http://127.0.0.1:14531/solr  Our versions are newer. ourLowThreshold=1413334072568053760 otherHigh=1413334072635162624
[junit4:junit4]   2> 17232 T1137 oasu.PeerSync.handleVersions PeerSync: core=collection1 url=http://127.0.0.1:14531/solr  Received 3 versions from 127.0.0.1:14535/solr/collection1/
[junit4:junit4]   2> 17233 T1137 oasu.PeerSync.handleVersions PeerSync: core=collection1 url=http://127.0.0.1:14531/solr  Our versions are newer. ourLowThreshold=1413334072568053760 otherHigh=1413334072622579712
[junit4:junit4]   2> 17233 T1137 oasu.PeerSync.handleVersions PeerSync: core=collection1 url=http://127.0.0.1:14531/solr  Received 4 versions from 127.0.0.1:14540/solr/collection1/
[junit4:junit4]   2> 17233 T1137 oasu.PeerSync.handleVersions PeerSync: core=collection1 url=http://127.0.0.1:14531/solr  Our versions are newer. ourLowThreshold=1413334072568053760 otherHigh=1413334072635162624
[junit4:junit4]   2> 17234 T1137 oasu.PeerSync.sync PeerSync: core=collection1 url=http://127.0.0.1:14531/solr DONE. sync succeeded
[junit4:junit4]   2> 17234 T1137 oasc.SyncStrategy.syncReplicas Sync Success - now sync replicas to me
[junit4:junit4]   2> 17234 T1137 oasc.SyncStrategy.syncToMe http://127.0.0.1:14531/solr/collection1/: try and ask http://127.0.0.1:14535/solr/collection1/ to sync
[junit4:junit4]   2> 17235 T1137 oasc.SyncStrategy.syncToMe http://127.0.0.1:14531/solr/collection1/: try and ask http://127.0.0.1:14540/solr/collection1/ to sync
[junit4:junit4]   2> 17235 T1137 oasc.SyncStrategy.syncToMe http://127.0.0.1:14531/solr/collection1/: try and ask http://127.0.0.1:14561/solr/collection1/ to sync
[junit4:junit4]   2> 17237 T1146 C77 P14535 oasu.PeerSync.sync PeerSync: core=collection1 url=http://127.0.0.1:14535/solr START replicas=[http://127.0.0.1:14531/solr/collection1/] nUpdates=100
[junit4:junit4]   2> 17238 T1161 C79 P14540 oasu.PeerSync.sync PeerSync: core=collection1 url=http://127.0.0.1:14540/solr START replicas=[http://127.0.0.1:14531/solr/collection1/] nUpdates=100
[junit4:junit4]   2> 17238 T1174 C80 P14561 oasu.PeerSync.sync PeerSync: core=collection1 url=http://127.0.0.1:14561/solr START replicas=[http://127.0.0.1:14531/solr/collection1/] nUpdates=100
[junit4:junit4]   2> 17240 T1136 C78 P14531 REQ /get {distrib=false&qt=/get&wt=javabin&version=2&getVersions=100} status=0 QTime=0 
[junit4:junit4]   2> 17240 T1132 C78 P14531 REQ /get {distrib=false&qt=/get&wt=javabin&version=2&getVersions=100} status=0 QTime=0 
[junit4:junit4]   2> 17241 T1131 C78 P14531 REQ /get {distrib=false&qt=/get&wt=javabin&version=2&getVersions=100} status=0 QTime=1 
[junit4:junit4]   2> 17241 T1174 C80 P14561 oasu.PeerSync.handleVersions PeerSync: core=collection1 url=http://127.0.0.1:14561/solr  Received 5 versions from 127.0.0.1:14531/solr/collection1/
[junit4:junit4]   2> 17241 T1161 C79 P14540 oasu.PeerSync.handleVersions PeerSync: core=collection1 url=http://127.0.0.1:14540/solr  Received 5 versions from 127.0.0.1:14531/solr/collection1/
[junit4:junit4]   2> 17241 T1146 C77 P14535 oasu.PeerSync.handleVersions PeerSync: core=collection1 url=http://127.0.0.1:14535/solr  Received 5 versions from 127.0.0.1:14531/solr/collection1/
[junit4:junit4]   2> 17241 T1174 C80 P14561 oasu.PeerSync.handleVersions PeerSync: core=collection1 url=http://127.0.0.1:14561/solr  Our versions are newer. ourLowThreshold=1413334072568053760 otherHigh=1413334072635162624
[junit4:junit4]   2> 17241 T1161 C79 P14540 oasu.PeerSync.requestUpdates PeerSync: core=collection1 url=http://127.0.0.1:14540/solr Requesting updates from 127.0.0.1:14531/solr/collection1/n=1 versions=[1413334072648794112]
[junit4:junit4]   2> 17241 T1146 C77 P14535 oasu.PeerSync.requestUpdates PeerSync: core=collection1 url=http://127.0.0.1:14535/solr Requesting updates from 127.0.0.1:14531/solr/collection1/n=2 versions=[1413334072648794112, 1413334072635162624]
[junit4:junit4]   2> 17242 T1174 C80 P14561 oasu.PeerSync.sync PeerSync: core=collection1 url=http://127.0.0.1:14561/solr DONE. sync succeeded
[junit4:junit4]   2> 17242 T1174 C80 P14561 REQ /get {sync=http://127.0.0.1:14531/solr/collection1/&getVersions=100&distrib=false&qt=/get&wt=javabin&version=2} status=0 QTime=4 
[junit4:junit4]   2> 17243 T1137 oasc.SyncStrategy.syncToMe http://127.0.0.1:14531/solr/collection1/:  sync completed with http://127.0.0.1:14561/solr/collection1/
[junit4:junit4]   2> 17244 T1132 C78 P14531 REQ /get {distrib=false&getUpdates=1413334072648794112&qt=/get&wt=javabin&version=2} status=0 QTime=0 
[junit4:junit4]   2> 17245 T1131 C78 P14531 REQ /get {distrib=false&getUpdates=1413334072648794112,1413334072635162624&qt=/get&wt=javabin&version=2} status=0 QTime=1 
[junit4:junit4]   2> 17252 T1146 C77 P14535 oasu.PeerSync.sync PeerSync: core=collection1 url=http://127.0.0.1:14535/solr DONE. sync succeeded
[junit4:junit4]   2> 17252 T1161 C79 P14540 oasu.PeerSync.sync PeerSync: core=collection1 url=http://127.0.0.1:14540/solr DONE. sync succeeded
[junit4:junit4]   2> 17252 T1146 C77 P14535 REQ /get {sync=http://127.0.0.1:14531/solr/collection1/&getVersions=100&distrib=false&qt=/get&wt=javabin&version=2} status=0 QTime=15 
[junit4:junit4]   2> 17252 T1161 C79 P14540 REQ /get {sync=http://127.0.0.1:14531/solr/collection1/&getVersions=100&distrib=false&qt=/get&wt=javabin&version=2} status=0 QTime=15 
[junit4:junit4]   2> 17253 T1137 oasc.SyncStrategy.syncToMe http://127.0.0.1:14531/solr/collection1/:  sync completed with http://127.0.0.1:14535/solr/collection1/
[junit4:junit4]   2> 17253 T1137 oasc.SyncStrategy.syncToMe http://127.0.0.1:14531/solr/collection1/:  sync completed with http://127.0.0.1:14540/solr/collection1/
[junit4:junit4]   2> 17254 T1105 oasc.AbstractFullDistribZkTestBase.waitForThingsToLevelOut Wait for recoveries to finish - wait 15 for each attempt
[junit4:junit4]   2> 17254 T1105 oasc.AbstractDistribZkTestBase.waitForRecoveriesToFinish Wait for recoveries to finish - collection: collection1 failOnTimeout:true timeout (sec):15
[junit4:junit4]   2> 17255 T1105 oascc.ZkStateReader.updateClusterState Updating cloud state from ZooKeeper... 
[junit4:junit4]   2> 17258 T1117 C81 P14528 oasu.DirectUpdateHandler2.commit start commit{flags=0,_version_=0,optimize=false,openSearcher=true,waitSearcher=true,expungeDeletes=false,softCommit=false}
[junit4:junit4]   2> 17259 T1117 C81 P14528 oass.SolrIndexSearcher.<init> Opening Searcher@6151b68a main
[junit4:junit4]   2> 17259 T1117 C81 P14528 oasu.DirectUpdateHandler2.commit end_commit_flush
[junit4:junit4]   2> 17261 T1128 oasc.SolrCore.registerSearcher [collection1] Registered new searcher Searcher@6151b68a main{StandardDirectoryReader(segments_2:3:nrt _0(4.0.0.2):C4)}
[junit4:junit4]   2> 17261 T1117 C81 P14528 /update {waitSearcher=true&wt=javabin&commit=true&softCommit=false&version=2} {commit=} 0 3
[junit4:junit4]   2> 17264 T1133 C78 P14531 oasu.DirectUpdateHandler2.commit start commit{flags=0,_version_=0,optimize=false,openSearcher=true,waitSearcher=true,expungeDeletes=false,softCommit=false}
[junit4:junit4]   2> 17265 T1133 C78 P14531 oass.SolrIndexSearcher.<init> Opening Searcher@65713428 main
[junit4:junit4]   2> 17265 T1133 C78 P14531 oasu.DirectUpdateHandler2.commit end_commit_flush
[junit4:junit4]   2> 17267 T1140 oasc.SolrCore.registerSearcher [collection1] Registered new searcher Searcher@65713428 main{StandardDirectoryReader(segments_2:3:nrt _0(4.0.0.2):C4)}
[junit4:junit4]   2> 17267 T1133 C78 P14531 oasu.SolrCmdDistributor.distribCommit Distrib commit to:[StdNode: http://127.0.0.1:14535/solr/collection1/, StdNode: http://127.0.0.1:14540/solr/collection1/, StdNode: http://127.0.0.1:14561/solr/collection1/]
[junit4:junit4]   2> 17270 T1171 C80 P14561 oasu.DirectUpdateHandler2.commit start commit{flags=0,_version_=0,optimize=false,openSearcher=true,waitSearcher=true,expungeDeletes=false,softCommit=false}
[junit4:junit4]   2> 17270 T1143 C77 P14535 oasu.DirectUpdateHandler2.commit start commit{flags=0,_version_=0,optimize=false,openSearcher=true,waitSearcher=true,expungeDeletes=false,softCommit=false}
[junit4:junit4]   2> 17270 T1157 C79 P14540 oasu.DirectUpdateHandler2.commit start commit{flags=0,_version_=0,optimize=false,openSearcher=true,waitSearcher=true,expungeDeletes=false,softCommit=false}
[junit4:junit4]   2> 17271 T1171 C80 P14561 oass.SolrIndexSearcher.<init> Opening Searcher@23ce6f88 main
[junit4:junit4]   2> 17271 T1171 C80 P14561 oasu.DirectUpdateHandler2.commit end_commit_flush
[junit4:junit4]   2> 17273 T1180 oasc.SolrCore.registerSearcher [collection1] Registered new searcher Searcher@23ce6f88 main{StandardDirectoryReader(segments_3:4:nrt _0(4.0.0.2):C4)}
[junit4:junit4]   2> 17273 T1171 C80 P14561 /update {waitSearcher=true&commit=true&wt=javabin&commit_end_point=true&expungeDeletes=false&softCommit=false&version=2} {commit=} 0 3
[junit4:junit4]   2> 17607 T1143 C77 P14535 oasc.SolrDeletionPolicy.onCommit SolrDeletionPolicy.onCommit: commits:num=2
[junit4:junit4]   2> 		commit{dir=/usr/home/hudson/hudson-slave/workspace/Lucene-Solr-Tests-4.x-Java6/solr/build/solr-core/test/J1/org.apache.solr.cloud.SyncSliceTest-1347860388954/jetty2/index,segFN=segments_3,generation=3,filenames=[_0_MockVariableIntBlock_0.doc, _0_TestBloomFilteredLucene40Postings_0.prx, _0_MockVariableIntBlock_0.skp, _0_MockFixedIntBlock_0.tib, _0_MockVariableIntBlock_0.pyl, _0_MockFixedIntBlock_0.skp, _0_MockFixedIntBlock_0.pyl, _0_MockVariableIntBlock_0.tib, _0_MockFixedIntBlock_0.tii, _0_MockVariableIntBlock_0.pos, _0_TestBloomFilteredLucene40Postings_0.frq, _0.si, _0_MockVariableIntBlock_0.tii, _0_MockRandom_0.tib, _0_TestBloomFilteredLucene40Postings_0.tim, _0_TestBloomFilteredLucene40Postings_0.blm, _0_TestBloomFilteredLucene40Postings_0.tip, _0.fnm, _0_MockFixedIntBlock_0.pos, _0_nrm.cfs, _0_MockRandom_0.skp, _0_MockFixedIntBlock_0.frq, _0_MockRandom_0.frq, _0_MockRandom_0.sd, _0_MockRandom_0.tiv, _0_MockRandom_0.doc, _0_MockFixedIntBlock_0.doc, _0_MockVariableIntBlock_0.frq, _0_MockRandom_0.pos, _0_nrm.cfe, _0.fdx, _0_MockRandom_0.pyl, _0.fdt, segments_3]
[junit4:junit4]   2> 		commit{dir=/usr/home/hudson/hudson-slave/workspace/Lucene-Solr-Tests-4.x-Java6/solr/build/solr-core/test/J1/org.apache.solr.cloud.SyncSliceTest-1347860388954/jetty2/index,segFN=segments_4,generation=4,filenames=[_1_MockFixedIntBlock_0.pyl, _0_MockVariableIntBlock_0.skp, _0_MockFixedIntBlock_0.tib, _1.fnm, _0_MockFixedIntBlock_0.tii, _0_TestBloomFilteredLucene40Postings_0.frq, _0_TestBloomFilteredLucene40Postings_0.tim, _0_TestBloomFilteredLucene40Postings_0.tip, _0_TestBloomFilteredLucene40Postings_0.blm, _0.fnm, _1_MockFixedIntBlock_0.frq, _1_MockVariableIntBlock_0.tii, _1_MockRandom_0.tip, _1_MockRandom_0.sd, _1_MockRandom_0.tim, _0_MockFixedIntBlock_0.pos, _1_TestBloomFilteredLucene40Postings_0.frq, _0_MockRandom_0.skp, _1_MockVariableIntBlock_0.tib, _1.fdx, _0_MockRandom_0.frq, _1_MockFixedIntBlock_0.skp, _1.fdt, _0_MockRandom_0.doc, _0_MockRandom_0.pos, _0_MockVariableIntBlock_0.frq, _1_MockFixedIntBlock_0.pos, _1_MockRandom_0.frq, _1_MockVariableIntBlock_0.skp, _0_MockVariableIntBlock_0.doc, _1_MockFixedIntBlock_0.doc, _0_TestBloomFilteredLucene40Postings_0.prx, _1_TestBloomFilteredLucene40Postings_0.blm, _1_MockVariableIntBlock_0.pyl, _0_MockVariableIntBlock_0.pyl, _1_TestBloomFilteredLucene40Postings_0.tip, _0_MockFixedIntBlock_0.pyl, _0_MockFixedIntBlock_0.skp, _0_MockVariableIntBlock_0.tib, _1_MockVariableIntBlock_0.doc, _0_MockVariableIntBlock_0.pos, _0.si, _1_TestBloomFilteredLucene40Postings_0.tim, _0_MockVariableIntBlock_0.tii, _0_MockRandom_0.tib, _1_nrm.cfs, _1_MockFixedIntBlock_0.tii, _1_TestBloomFilteredLucene40Postings_0.prx, _1_MockVariableIntBlock_0.pos, _0_nrm.cfs, _1_nrm.cfe, _0_MockFixedIntBlock_0.frq, _1_MockVariableIntBlock_0.frq, _1_MockRandom_0.prx, _0_MockRandom_0.sd, _0_MockRandom_0.tiv, _0_MockFixedIntBlock_0.doc, _1.si, _0_nrm.cfe, _1_MockFixedIntBlock_0.tib, _0.fdx, _0_MockRandom_0.pyl, _0.fdt, segments_4]
[junit4:junit4]   2> 17607 T1143 C77 P14535 oasc.SolrDeletionPolicy.updateCommits newest commit = 4
[junit4:junit4]   2> 17608 T1157 C79 P14540 oasc.SolrDeletionPolicy.onCommit SolrDeletionPolicy.onCommit: commits:num=2
[junit4:junit4]   2> 		commit{dir=/usr/home/hudson/hudson-slave/workspace/Lucene-Solr-Tests-4.x-Java6/solr/build/solr-core/test/J1/org.apache.solr.cloud.SyncSliceTest-1347860388954/jetty3/index,segFN=segments_3,generation=3,filenames=[_0_MockVariableIntBlock_0.doc, _0_TestBloomFilteredLucene40Postings_0.prx, _0_MockVariableIntBlock_0.skp, _0_MockFixedIntBlock_0.tib, _0_MockVariableIntBlock_0.pyl, _0_MockFixedIntBlock_0.skp, _0_MockFixedIntBlock_0.pyl, _0_MockVariableIntBlock_0.tib, _0_MockFixedIntBlock_0.tii, _0_MockVariableIntBlock_0.pos, _0_TestBloomFilteredLucene40Postings_0.frq, _0.si, _0_MockVariableIntBlock_0.tii, _0_MockRandom_0.tib, _0_TestBloomFilteredLucene40Postings_0.tim, _0_TestBloomFilteredLucene40Postings_0.blm, _0_TestBloomFilteredLucene40Postings_0.tip, _0.fnm, _0_MockFixedIntBlock_0.pos, _0_nrm.cfs, _0_MockRandom_0.skp, _0_MockFixedIntBlock_0.frq, _0_MockRandom_0.frq, _0_MockRandom_0.sd, _0_MockRandom_0.tiv, _0_MockRandom_0.doc, _0_MockFixedIntBlock_0.doc, _0_MockVariableIntBlock_0.frq, _0_MockRandom_0.pos, _0_nrm.cfe, _0.fdx, _0_MockRandom_0.pyl, _0.fdt, segments_3]
[junit4:junit4]   2> 		commit{dir=/usr/home/hudson/hudson-slave/workspace/Lucene-Solr-Tests-4.x-Java6/solr/build/solr-core/test/J1/org.apache.solr.cloud.SyncSliceTest-1347860388954/jetty3/index,segFN=segments_4,generation=4,filenames=[_1_MockFixedIntBlock_0.pyl, _0_MockVariableIntBlock_0.skp, _0_MockFixedIntBlock_0.tib, _1.fnm, _0_MockFixedIntBlock_0.tii, _0_TestBloomFilteredLucene40Postings_0.frq, _0_TestBloomFilteredLucene40Postings_0.tim, _0_TestBloomFilteredLucene40Postings_0.tip, _0_TestBloomFilteredLucene40Postings_0.blm, _0.fnm, _1_MockFixedIntBlock_0.frq, _1_MockVariableIntBlock_0.tii, _1_MockRandom_0.tip, _1_MockRandom_0.sd, _1_MockRandom_0.tim, _0_MockFixedIntBlock_0.pos, _1_TestBloomFilteredLucene40Postings_0.frq, _0_MockRandom_0.skp, _1_MockVariableIntBlock_0.tib, _1.fdx, _0_MockRandom_0.frq, _1_MockFixedIntBlock_0.skp, _1.fdt, _0_MockRandom_0.doc, _0_MockRandom_0.pos, _0_MockVariableIntBlock_0.frq, _1_MockFixedIntBlock_0.pos, _1_MockRandom_0.frq, _1_MockVariableIntBlock_0.skp, _0_MockVariableIntBlock_0.doc, _1_MockFixedIntBlock_0.doc, _0_TestBloomFilteredLucene40Postings_0.prx, _1_TestBloomFilteredLucene40Postings_0.blm, _1_MockVariableIntBlock_0.pyl, _0_MockVariableIntBlock_0.pyl, _1_TestBloomFilteredLucene40Postings_0.tip, _0_MockFixedIntBlock_0.pyl, _0_MockFixedIntBlock_0.skp, _0_MockVariableIntBlock_0.tib, _1_MockVariableIntBlock_0.doc, _0_MockVariableIntBlock_0.pos, _0.si, _1_TestBloomFilteredLucene40Postings_0.tim, _0_MockVariableIntBlock_0.tii, _0_MockRandom_0.tib, _1_nrm.cfs, _1_MockFixedIntBlock_0.tii, _1_TestBloomFilteredLucene40Postings_0.prx, _1_MockVariableIntBlock_0.pos, _0_nrm.cfs, _1_nrm.cfe, _0_MockFixedIntBlock_0.frq, _1_MockVariableIntBlock_0.frq, _1_MockRandom_0.prx, _0_MockRandom_0.sd, _0_MockRandom_0.tiv, _0_MockFixedIntBlock_0.doc, _1.si, _0_nrm.cfe, _1_MockFixedIntBlock_0.tib, _0.fdx, _0_MockRandom_0.pyl, _0.fdt, segments_4]
[junit4:junit4]   2> 17609 T1157 C79 P14540 oasc.SolrDeletionPolicy.updateCommits newest commit = 4
[junit4:junit4]   2> 17623 T1143 C77 P14535 oass.SolrIndexSearcher.<init> Opening Searcher@7384ef21 main
[junit4:junit4]   2> 17623 T1157 C79 P14540 oass.SolrIndexSearcher.<init> Opening Searcher@75600762 main
[junit4:junit4]   2> 17624 T1143 C77 P14535 oasu.DirectUpdateHandler2.commit end_commit_flush
[junit4:junit4]   2> 17624 T1157 C79 P14540 oasu.DirectUpdateHandler2.commit end_commit_flush
[junit4:junit4]   2> 17625 T1152 oasc.JmxMonitoredMap.put WARNING Failed to register info bean: searcher javax.management.InstanceNotFoundException: solr/collection1:type=searcher,id=org.apache.solr.search.SolrIndexSearcher
[junit4:junit4]   2> 	at com.sun.jmx.interceptor.DefaultMBeanServerInterceptor.getMBean(DefaultMBeanServerInterceptor.java:1118)
[junit4:junit4]   2> 	at com.sun.jmx.interceptor.DefaultMBeanServerInterceptor.exclusiveUnregisterMBean(DefaultMBeanServerInterceptor.java:433)
[junit4:junit4]   2> 	at com.sun.jmx.interceptor.DefaultMBeanServerInterceptor.unregisterMBean(DefaultMBeanServerInterceptor.java:421)
[junit4:junit4]   2> 	at com.sun.jmx.mbeanserver.JmxMBeanServer.unregisterMBean(JmxMBeanServer.java:540)
[junit4:junit4]   2> 	at org.apache.solr.core.JmxMonitoredMap.put(JmxMonitoredMap.java:138)
[junit4:junit4]   2> 	at org.apache.solr.core.JmxMonitoredMap.put(JmxMonitoredMap.java:51)
[junit4:junit4]   2> 	at org.apache.solr.search.SolrIndexSearcher.register(SolrIndexSearcher.java:242)
[junit4:junit4]   2> 	at org.apache.solr.core.SolrCore.registerSearcher(SolrCore.java:1642)
[junit4:junit4]   2> 	at org.apache.solr.core.SolrCore.access$000(SolrCore.java:121)
[junit4:junit4]   2> 	at org.apache.solr.core.SolrCore$7.call(SolrCore.java:1519)
[junit4:junit4]   2> 	at java.util.concurrent.FutureTask$Sync.innerRun(FutureTask.java:334)
[junit4:junit4]   2> 	at java.util.concurrent.FutureTask.run(FutureTask.java:166)
[junit4:junit4]   2> 	at java.util.concurrent.ThreadPoolExecutor.runWorker(ThreadPoolExecutor.java:1110)
[junit4:junit4]   2> 	at java.util.concurrent.ThreadPoolExecutor$Worker.run(ThreadPoolExecutor.java:603)
[junit4:junit4]   2> 	at java.lang.Thread.run(Thread.java:679)
[junit4:junit4]   2> 
[junit4:junit4]   2> 17627 T1166 oasc.JmxMonitoredMap.put WARNING Failed to register info bean: queryResultCache javax.management.InstanceAlreadyExistsException: solr/collection1:type=queryResultCache,id=org.apache.solr.search.LRUCache
[junit4:junit4]   2> 	at com.sun.jmx.mbeanserver.Repository.addMBean(Repository.java:467)
[junit4:junit4]   2> 	at com.sun.jmx.interceptor.DefaultMBeanServerInterceptor.internal_addObject(DefaultMBeanServerInterceptor.java:1520)
[junit4:junit4]   2> 	at com.sun.jmx.interceptor.DefaultMBeanServerInterceptor.registerDynamicMBean(DefaultMBeanServerInterceptor.java:986)
[junit4:junit4]   2> 	at com.sun.jmx.interceptor.DefaultMBeanServerInterceptor.registerObject(DefaultMBeanServerInterceptor.java:938)
[junit4:junit4]   2> 	at com.sun.jmx.interceptor.DefaultMBeanServerInterceptor.registerMBean(DefaultMBeanServerInterceptor.java:330)
[junit4:junit4]   2> 	at com.sun.jmx.mbeanserver.JmxMBeanServer.registerMBean(JmxMBeanServer.java:516)
[junit4:junit4]   2> 	at org.apache.solr.core.JmxMonitoredMap.put(JmxMonitoredMap.java:140)
[junit4:junit4]   2> 	at org.apache.solr.core.JmxMonitoredMap.put(JmxMonitoredMap.java:51)
[junit4:junit4]   2> 	at org.apache.solr.search.SolrIndexSearcher.register(SolrIndexSearcher.java:246)
[junit4:junit4]   2> 	at org.apache.solr.core.SolrCore.registerSearcher(SolrCore.java:1642)
[junit4:junit4]   2> 	at org.apache.solr.core.SolrCore.access$000(SolrCore.java:121)
[junit4:junit4]   2> 	at org.apache.solr.core.SolrCore$7.call(SolrCore.java:1519)
[junit4:junit4]   2> 	at java.util.concurrent.FutureTask$Sync.innerRun(FutureTask.java:334)
[junit4:junit4]   2> 	at java.util.concurrent.FutureTask.run(FutureTask.java:166)
[junit4:junit4]   2> 	at java.util.concurrent.ThreadPoolExecutor.runWorker(ThreadPoolExecutor.java:1110)
[junit4:junit4]   2> 	at java.util.concurrent.ThreadPoolExecutor$Worker.run(ThreadPoolExecutor.java:603)
[junit4:junit4]   2> 	at java.lang.Thread.run(Thread.java:679)
[junit4:junit4]   2> 
[junit4:junit4]   2> 17627 T1152 oasc.SolrCore.registerSearcher [collection1] Registered new searcher Searcher@7384ef21 main{StandardDirectoryReader(segments_4:6:nrt _0(4.0.0.2):C2 _1(4.0.0.2):C2)}
[junit4:junit4]   2> 17628 T1166 oasc.SolrCore.registerSearcher [collection1] Registered new searcher Searcher@75600762 main{StandardDirectoryReader(segments_4:6:nrt _0(4.0.0.2):C3 _1(4.0.0.2):C1)}
[junit4:junit4]   2> 17628 T1143 C77 P14535 /update {waitSearcher=true&commit=true&wt=javabin&commit_end_point=true&expungeDeletes=false&softCommit=false&version=2} {commit=} 0 358
[junit4:junit4]   2> 17629 T1157 C79 P14540 /update {waitSearcher=true&commit=true&wt=javabin&commit_end_point=true&expungeDeletes=false&softCommit=false&version=2} {commit=} 0 359
[junit4:junit4]   2> 17629 T1133 C78 P14531 /update {waitSearcher=true&wt=javabin&commit=true&softCommit=false&version=2} {commit=} 0 365
[junit4:junit4]   2> 17630 T1105 oascc.ZkStateReader.updateClusterState Updating cloud state from ZooKeeper... 
[junit4:junit4]   2> 17633 T1134 C78 P14531 REQ /select {distrib=false&wt=javabin&q=*:*&version=2} hits=4 status=0 QTime=0 
[junit4:junit4]   2> 17636 T1144 C77 P14535 REQ /select {distrib=false&wt=javabin&q=*:*&version=2} hits=4 status=0 QTime=0 
[junit4:junit4]   2> 17639 T1158 C79 P14540 REQ /select {distrib=false&wt=javabin&q=*:*&version=2} hits=4 status=0 QTime=0 
[junit4:junit4]   2> 17642 T1172 C80 P14561 REQ /select {distrib=false&wt=javabin&q=*:*&version=2} hits=4 status=0 QTime=0 
[junit4:junit4]   2> 19650 T1118 C81 P14528 REQ /select {fl=id,score&shard.url=127.0.0.1:14528/solr/collection1/&NOW=1347860408597&start=0&q=*:*&distrib=false&isShard=true&wt=javabin&fsv=true&rows=10&version=2} hits=4 status=0 QTime=0 
[junit4:junit4]   2> 19653 T1118 C81 P14528 REQ /select {shard.url=127.0.0.1:14528/solr/collection1/&NOW=1347860408597&q=*:*&ids=3,2,1,0&distrib=false&isShard=true&wt=javabin&version=2} status=0 QTime=0 
[junit4:junit4]   2> 19654 T1117 C81 P14528 REQ /select {wt=javabin&q=*:*&version=2} hits=4 status=0 QTime=7 
[junit4:junit4]   2> Control Docs:4
[junit4:junit4]   2> 19654 T1105 oascc.ZkStateReader.updateClusterState Updating cloud state from ZooKeeper... 
[junit4:junit4]   2> check const of shard1
[junit4:junit4]   2> client0
[junit4:junit4]   2> PROPS:shard=shard1
[junit4:junit4]   2> roles=null
[junit4:junit4]   2> leader=true
[junit4:junit4]   2> state=active
[junit4:junit4]   2> core=collection1
[junit4:junit4]   2> collection=collection1
[junit4:junit4]   2> node_name=127.0.0.1:14531_solr
[junit4:junit4]   2> base_url=http://127.0.0.1:14531/solr
[junit4:junit4]   2> 
[junit4:junit4]   2> 19657 T1134 C78 P14531 REQ /select {distrib=false&wt=javabin&q=*:*&version=2} hits=4 status=0 QTime=0 
[junit4:junit4]   2>  live:true
[junit4:junit4]   2>  num:4
[junit4:junit4]   2> 
[junit4:junit4]   2> client1
[junit4:junit4]   2> PROPS:shard=shard1
[junit4:junit4]   2> roles=null
[junit4:junit4]   2> state=active
[junit4:junit4]   2> core=collection1
[junit4:junit4]   2> collection=collection1
[junit4:junit4]   2> node_name=127.0.0.1:14535_solr
[junit4:junit4]   2> base_url=http://127.0.0.1:14535/solr
[junit4:junit4]   2> 
[junit4:junit4]   2> 19660 T1144 C77 P14535 REQ /select {distrib=false&wt=javabin&q=*:*&version=2} hits=4 status=0 QTime=0 
[junit4:junit4]   2>  live:true
[junit4:junit4]   2>  num:4
[junit4:junit4]   2> 
[junit4:junit4]   2> client2
[junit4:junit4]   2> PROPS:shard=shard1
[junit4:junit4]   2> roles=null
[junit4:junit4]   2> state=active
[junit4:junit4]   2> core=collection1
[junit4:junit4]   2> collection=collection1
[junit4:junit4]   2> node_name=127.0.0.1:14540_solr
[junit4:junit4]   2> base_url=http://127.0.0.1:14540/solr
[junit4:junit4]   2> 
[junit4:junit4]   2> 19662 T1158 C79 P14540 REQ /select {distrib=false&wt=javabin&q=*:*&version=2} hits=4 status=0 QTime=0 
[junit4:junit4]   2>  live:true
[junit4:junit4]   2>  num:4
[junit4:junit4]   2> 
[junit4:junit4]   2> client3
[junit4:junit4]   2> PROPS:shard=shard1
[junit4:junit4]   2> roles=null
[junit4:junit4]   2> state=active
[junit4:junit4]   2> core=collection1
[junit4:junit4]   2> collection=collection1
[junit4:junit4]   2> node_name=127.0.0.1:14561_solr
[junit4:junit4]   2> base_url=http://127.0.0.1:14561/solr
[junit4:junit4]   2> 
[junit4:junit4]   2> 19664 T1172 C80 P14561 REQ /select {distrib=false&wt=javabin&q=*:*&version=2} hits=4 status=0 QTime=0 
[junit4:junit4]   2>  live:true
[junit4:junit4]   2>  num:4
[junit4:junit4]   2> 
[junit4:junit4]   2> 19668 T1201 C78 P14531 REQ /select {fl=id,score&shard.url=127.0.0.1:14531/solr/collection1/|127.0.0.1:14535/solr/collection1/|127.0.0.1:14540/solr/collection1/|127.0.0.1:14561/solr/collection1/&NOW=1347860408616&start=0&q=*:*&distrib=false&isShard=true&wt=javabin&fsv=true&rows=10&version=2} hits=4 status=0 QTime=0 
[junit4:junit4]   2> 19671 T1201 C78 P14531 REQ /select {shard.url=127.0.0.1:14531/solr/collection1/|127.0.0.1:14535/solr/collection1/|127.0.0.1:14540/solr/collection1/|127.0.0.1:14561/solr/collection1/&NOW=1347860408616&q=*:*&ids=3,2,1,0&distrib=false&isShard=true&wt=javabin&version=2} status=0 QTime=0 
[junit4:junit4]   2> 19672 T1162 C79 P14540 REQ /select {wt=javabin&q=*:*&version=2} hits=4 status=0 QTime=6 
[junit4:junit4]   2> 19677 T1117 C81 P14528 /update {wt=javabin&version=2} {add=[4 (1413334075833319424)]} 0 3
[junit4:junit4]   2> 19685 T1171 C80 P14561 REQ /update {distrib.from=http://127.0.0.1:14531/solr/collection1/&update.distrib=FROMLEADER&test.distrib.skip.servers=http://127.0.0.1:14540/solr/collection1/&wt=javabin&version=2} status=0 QTime=2 
[junit4:junit4]   2> 19687 T1143 C77 P14535 REQ /update {distrib.from=http://127.0.0.1:14531/solr/collection1/&update.distrib=FROMLEADER&test.distrib.skip.servers=http://127.0.0.1:14540/solr/collection1/&wt=javabin&version=2} status=0 QTime=4 
[junit4:junit4]   2> 19687 T1133 C78 P14531 /update {test.distrib.skip.servers=http://127.0.0.1:14540/solr/collection1/&wt=javabin&version=2} {add=[4 (1413334075838562304)]} 0 8
[junit4:junit4]   2> 19688 T1105 oasc.ChaosMonkey.monkeyLog monkey: kill shard! 14531
[junit4:junit4]   2> 19690 T1105 oasc.CoreContainer.shutdown Shutting down CoreContainer instance=1490782441
[junit4:junit4]   2> 19691 T1105 oasc.SolrCore.close [collection1]  CLOSING SolrCore org.apache.solr.core.SolrCore@647e1a0a
[junit4:junit4]   2> 19705 T1105 oasc.SolrCore.closeSearcher [collection1] Closing main searcher on request.
[junit4:junit4]   2> 19705 T1105 oasu.DirectUpdateHandler2.close closing DirectUpdateHandler2{commits=6,autocommits=0,soft autocommits=0,optimizes=0,rollbacks=0,expungeDeletes=0,docsPending=1,adds=1,deletesById=0,deletesByQuery=0,errors=0,cumulative_adds=5,cumulative_deletesById=0,cumulative_deletesByQuery=1,cumulative_errors=0}
[junit4:junit4]   2> 19706 T1105 oasu.DefaultSolrCoreState.decref SolrCoreState ref count has reached 0 - closing IndexWriter
[junit4:junit4]   2> 19908 T1105 C78 P14531 oasc.SolrDeletionPolicy.onCommit SolrDeletionPolicy.onCommit: commits:num=3
[junit4:junit4]   2> 		commit{dir=/usr/home/hudson/hudson-slave/workspace/Lucene-Solr-Tests-4.x-Java6/solr/build/solr-core/test/J1/org.apache.solr.cloud.SyncSliceTest-1347860388954/jetty1/index,segFN=segments_1,generation=1,filenames=[segments_1]
[junit4:junit4]   2> 		commit{dir=/usr/home/hudson/hudson-slave/workspace/Lucene-Solr-Tests-4.x-Java6/solr/build/solr-core/test/J1/org.apache.solr.cloud.SyncSliceTest-1347860388954/jetty1/index,segFN=segments_2,generation=2,filenames=[_0_MockVariableIntBlock_0.doc, _0_TestBloomFilteredLucene40Postings_0.prx, _0_MockVariableIntBlock_0.skp, _0_MockFixedIntBlock_0.tib, _0_MockVariableIntBlock_0.pyl, _0_MockFixedIntBlock_0.skp, _0_MockFixedIntBlock_0.pyl, _0_MockVariableIntBlock_0.tib, _0_MockFixedIntBlock_0.tii, _0_MockVariableIntBlock_0.pos, _0_TestBloomFilteredLucene40Postings_0.frq, _0.si, _0_MockVariableIntBlock_0.tii, _0_MockRandom_0.tib, _0_TestBloomFilteredLucene40Postings_0.tim, _0_TestBloomFilteredLucene40Postings_0.blm, _0_TestBloomFilteredLucene40Postings_0.tip, _0.fnm, _0_MockFixedIntBlock_0.pos, _0_nrm.cfs, _0_MockRandom_0.skp, _0_MockFixedIntBlock_0.frq, _0_MockRandom_0.frq, _0_MockRandom_0.sd, _0_MockRandom_0.tiv, _0_MockRandom_0.doc, _0_MockFixedIntBlock_0.doc, _0_MockVariableIntBlock_0.frq, _0_MockRandom_0.pos, _0_nrm.cfe, segments_2, _0.fdx, _0_MockRandom_0.pyl, _0.fdt]
[junit4:junit4]   2> 		commit{dir=/usr/home/hudson/hudson-slave/workspace/Lucene-Solr-Tests-4.x-Java6/solr/build/solr-core/test/J1/org.apache.solr.cloud.SyncSliceTest-1347860388954/jetty1/index,segFN=segments_3,generation=3,filenames=[_1_MockFixedIntBlock_0.pyl, _0_MockVariableIntBlock_0.skp, _0_MockFixedIntBlock_0.tib, _1.fnm, _1_MockRandom_0.pos, _0_MockFixedIntBlock_0.tii, _0_TestBloomFilteredLucene40Postings_0.frq, _0_TestBloomFilteredLucene40Postings_0.tim, _0_TestBloomFilteredLucene40Postings_0.tip, _0_TestBloomFilteredLucene40Postings_0.blm, _0.fnm, _1_MockFixedIntBlock_0.frq, _1_MockVariableIntBlock_0.tii, _1_MockRandom_0.sd, _0_MockFixedIntBlock_0.pos, _1_TestBloomFilteredLucene40Postings_0.frq, _1_MockRandom_0.tii, _0_MockRandom_0.skp, _1_MockVariableIntBlock_0.tib, _1.fdx, _0_MockRandom_0.frq, _1_MockFixedIntBlock_0.skp, _1_MockRandom_0.tib, _1.fdt, _0_MockRandom_0.doc, _0_MockRandom_0.pos, _0_MockVariableIntBlock_0.frq, _1_MockRandom_0.doc, _1_MockFixedIntBlock_0.pos, _1_MockRandom_0.frq, _1_MockVariableIntBlock_0.skp, _0_MockVariableIntBlock_0.doc, _1_MockFixedIntBlock_0.doc, _0_TestBloomFilteredLucene40Postings_0.prx, _1_TestBloomFilteredLucene40Postings_0.blm, _1_MockVariableIntBlock_0.pyl, _0_MockVariableIntBlock_0.pyl, _1_TestBloomFilteredLucene40Postings_0.tip, _0_MockFixedIntBlock_0.pyl, _0_MockFixedIntBlock_0.skp, _0_MockVariableIntBlock_0.tib, _1_MockVariableIntBlock_0.doc, _0_MockVariableIntBlock_0.pos, _0.si, _1_TestBloomFilteredLucene40Postings_0.tim, _0_MockVariableIntBlock_0.tii, _0_MockRandom_0.tib, _1_nrm.cfs, _1_MockFixedIntBlock_0.tii, _1_TestBloomFilteredLucene40Postings_0.prx, _1_MockVariableIntBlock_0.pos, _1_MockRandom_0.skp, _0_nrm.cfs, _1_nrm.cfe, _0_MockFixedIntBlock_0.frq, _1_MockVariableIntBlock_0.frq, _0_MockRandom_0.sd, _1_MockRandom_0.pyl, _0_MockRandom_0.tiv, _0_MockFixedIntBlock_0.doc, _1.si, _0_nrm.cfe, _1_MockFixedIntBlock_0.tib, _0.fdx, _0_MockRandom_0.pyl, segments_3, _0.fdt]
[junit4:junit4]   2> 19909 T1105 C78 P14531 oasc.SolrDeletionPolicy.updateCommits newest commit = 3
[junit4:junit4]   2> 19912 T1105 oasu.DefaultSolrCoreState.decref Closing SolrCoreState - canceling any ongoing recovery
[junit4:junit4]   2> 19913 T1110 oazs.PrepRequestProcessor.pRequest Processed session termination for sessionid: 0x139d2bd5c600003
[junit4:junit4]   2> 19914 T1184 oascc.ZkStateReader$3.process Updating live nodes
[junit4:junit4]   2> 19914 T1165 oascc.ZkStateReader$3.process Updating live nodes
[junit4:junit4]   2> 19914 T1139 oascc.ZkState

[...truncated too long message...]

=0,expungeDeletes=0,docsPending=0,adds=0,deletesById=0,deletesByQuery=0,errors=0,cumulative_adds=5,cumulative_deletesById=0,cumulative_deletesByQuery=1,cumulative_errors=0}
[junit4:junit4]   2> 140051 T1105 oasu.DefaultSolrCoreState.decref SolrCoreState ref count has reached 0 - closing IndexWriter
[junit4:junit4]   2> 140054 T1105 oasu.DefaultSolrCoreState.decref Closing SolrCoreState - canceling any ongoing recovery
[junit4:junit4]   2> 141926 T1178 oaz.ClientCnxn$SendThread.startConnect Opening socket connection to server localhost/127.0.0.1:14524
[junit4:junit4]   2> 145054 T1179 oaz.ClientCnxn$EventThread.run EventThread shut down
[junit4:junit4]   2> 145054 T1105 oaz.ZooKeeper.close Session: 0x139d2bd5c600006 closed
[junit4:junit4]   2> 145056 T1105 oejsh.ContextHandler.doStop stopped o.e.j.s.ServletContextHandler{/solr,null}
[junit4:junit4]   2> 145328 T1105 oas.SolrTestCaseJ4.tearDown ###Ending testDistribSearch
[junit4:junit4]   2> NOTE: reproduce with: ant test  -Dtestcase=SyncSliceTest -Dtests.method=testDistribSearch -Dtests.seed=E10027658B081383 -Dtests.multiplier=3 -Dtests.slow=true -Dtests.locale=es_PA -Dtests.timezone=US/Hawaii -Dtests.file.encoding=ISO8859-1
[junit4:junit4] FAILURE  145s J1 | SyncSliceTest.testDistribSearch <<<
[junit4:junit4]    > Throwable #1: java.lang.AssertionError: There are still nodes recoverying
[junit4:junit4]    > 	at __randomizedtesting.SeedInfo.seed([E10027658B081383:60E6A97DFC5773BF]:0)
[junit4:junit4]    > 	at org.junit.Assert.fail(Assert.java:93)
[junit4:junit4]    > 	at org.apache.solr.cloud.AbstractDistribZkTestBase.waitForRecoveriesToFinish(AbstractDistribZkTestBase.java:154)
[junit4:junit4]    > 	at org.apache.solr.cloud.AbstractFullDistribZkTestBase.waitForRecoveriesToFinish(AbstractFullDistribZkTestBase.java:560)
[junit4:junit4]    > 	at org.apache.solr.cloud.AbstractFullDistribZkTestBase.waitForThingsToLevelOut(AbstractFullDistribZkTestBase.java:1135)
[junit4:junit4]    > 	at org.apache.solr.cloud.SyncSliceTest.doTest(SyncSliceTest.java:162)
[junit4:junit4]    > 	at org.apache.solr.BaseDistributedSearchTestCase.testDistribSearch(BaseDistributedSearchTestCase.java:695)
[junit4:junit4]    > 	at sun.reflect.NativeMethodAccessorImpl.invoke0(Native Method)
[junit4:junit4]    > 	at sun.reflect.NativeMethodAccessorImpl.invoke(NativeMethodAccessorImpl.java:57)
[junit4:junit4]    > 	at sun.reflect.DelegatingMethodAccessorImpl.invoke(DelegatingMethodAccessorImpl.java:43)
[junit4:junit4]    > 	at java.lang.reflect.Method.invoke(Method.java:616)
[junit4:junit4]    > 	at com.carrotsearch.randomizedtesting.RandomizedRunner.invoke(RandomizedRunner.java:1559)
[junit4:junit4]    > 	at com.carrotsearch.randomizedtesting.RandomizedRunner.access$600(RandomizedRunner.java:79)
[junit4:junit4]    > 	at com.carrotsearch.randomizedtesting.RandomizedRunner$6.evaluate(RandomizedRunner.java:737)
[junit4:junit4]    > 	at com.carrotsearch.randomizedtesting.RandomizedRunner$7.evaluate(RandomizedRunner.java:773)
[junit4:junit4]    > 	at com.carrotsearch.randomizedtesting.RandomizedRunner$8.evaluate(RandomizedRunner.java:787)
[junit4:junit4]    > 	at com.carrotsearch.randomizedtesting.rules.SystemPropertiesRestoreRule$1.evaluate(SystemPropertiesRestoreRule.java:53)
[junit4:junit4]    > 	at org.apache.lucene.util.TestRuleSetupTeardownChained$1.evaluate(TestRuleSetupTeardownChained.java:50)
[junit4:junit4]    > 	at org.apache.lucene.util.TestRuleFieldCacheSanity$1.evaluate(TestRuleFieldCacheSanity.java:51)
[junit4:junit4]    > 	at org.apache.lucene.util.AbstractBeforeAfterRule$1.evaluate(AbstractBeforeAfterRule.java:45)
[junit4:junit4]    > 	at com.carrotsearch.randomizedtesting.rules.SystemPropertiesInvariantRule$1.evaluate(SystemPropertiesInvariantRule.java:55)
[junit4:junit4]    > 	at org.apache.lucene.util.TestRuleThreadAndTestName$1.evaluate(TestRuleThreadAndTestName.java:48)
[junit4:junit4]    > 	at org.apache.lucene.util.TestRuleIgnoreAfterMaxFailures$1.evaluate(TestRuleIgnoreAfterMaxFailures.java:70)
[junit4:junit4]    > 	at org.apache.lucene.util.TestRuleMarkFailure$1.evaluate(TestRuleMarkFailure.java:48)
[junit4:junit4]    > 	at com.carrotsearch.randomizedtesting.rules.StatementAdapter.evaluate(StatementAdapter.java:36)
[junit4:junit4]    > 	at com.carrotsearch.randomizedtesting.ThreadLeakControl$StatementRunner.run(ThreadLeakControl.java:358)
[junit4:junit4]    > 	at com.carrotsearch.randomizedtesting.ThreadLeakControl.forkTimeoutingTask(ThreadLeakControl.java:782)
[junit4:junit4]    > 	at com.carrotsearch.randomizedtesting.ThreadLeakControl$3.evaluate(ThreadLeakControl.java:442)
[junit4:junit4]    > 	at com.carrotsearch.randomizedtesting.RandomizedRunner.runSingleTest(RandomizedRunner.java:746)
[junit4:junit4]    > 	at com.carrotsearch.randomizedtesting.RandomizedRunner$3.evaluate(RandomizedRunner.java:648)
[junit4:junit4]    > 	at com.carrotsearch.randomizedtesting.RandomizedRunner$4.evaluate(RandomizedRunner.java:682)
[junit4:junit4]    > 	at com.carrotsearch.randomizedtesting.RandomizedRunner$5.evaluate(RandomizedRunner.java:693)
[junit4:junit4]    > 	at com.carrotsearch.randomizedtesting.rules.StatementAdapter.evaluate(StatementAdapter.java:36)
[junit4:junit4]    > 	at com.carrotsearch.randomizedtesting.rules.SystemPropertiesRestoreRule$1.evaluate(SystemPropertiesRestoreRule.java:53)
[junit4:junit4]    > 	at org.apache.lucene.util.AbstractBeforeAfterRule$1.evaluate(AbstractBeforeAfterRule.java:45)
[junit4:junit4]    > 	at org.apache.lucene.util.TestRuleStoreClassName$1.evaluate(TestRuleStoreClassName.java:42)
[junit4:junit4]    > 	at com.carrotsearch.randomizedtesting.rules.SystemPropertiesInvariantRule$1.evaluate(SystemPropertiesInvariantRule.java:55)
[junit4:junit4]    > 	at com.carrotsearch.randomizedtesting.rules.NoShadowingOrOverridesOnMethodsRule$1.evaluate(NoShadowingOrOverridesOnMethodsRule.java:39)
[junit4:junit4]    > 	at com.carrotsearch.randomizedtesting.rules.NoShadowingOrOverridesOnMethodsRule$1.evaluate(NoShadowingOrOverridesOnMethodsRule.java:39)
[junit4:junit4]    > 	at com.carrotsearch.randomizedtesting.rules.StatementAdapter.evaluate(StatementAdapter.java:36)
[junit4:junit4]    > 	at org.apache.lucene.util.TestRuleAssertionsRequired$1.evaluate(TestRuleAssertionsRequired.java:43)
[junit4:junit4]    > 	at org.apache.lucene.util.TestRuleMarkFailure$1.evaluate(TestRuleMarkFailure.java:48)
[junit4:junit4]    > 	at org.apache.lucene.util.TestRuleIgnoreAfterMaxFailures$1.evaluate(TestRuleIgnoreAfterMaxFailures.java:70)
[junit4:junit4]    > 	at org.apache.lucene.util.TestRuleIgnoreTestSuites$1.evaluate(TestRuleIgnoreTestSuites.java:55)
[junit4:junit4]    > 	at com.carrotsearch.randomizedtesting.rules.StatementAdapter.evaluate(StatementAdapter.java:36)
[junit4:junit4]    > 	at com.carrotsearch.randomizedtesting.ThreadLeakControl$StatementRunner.run(ThreadLeakControl.java:358)
[junit4:junit4]    > 	at java.lang.Thread.run(Thread.java:679)
[junit4:junit4]   2> 145469 T1105 oas.SolrTestCaseJ4.deleteCore ###deleteCore
[junit4:junit4]   2> NOTE: test params are: codec=Lucene40: {range_facet_l=MockFixedIntBlock(blockSize=122), text=MockVariableIntBlock(baseBlockSize=30), _version_=PostingsFormat(name=MockRandom), rnd_b=PostingsFormat(name=TestBloomFilteredLucene40Postings), intDefault=PostingsFormat(name=MockRandom), id=PostingsFormat(name=TestBloomFilteredLucene40Postings), timestamp=MockFixedIntBlock(blockSize=122), a_t=MockFixedIntBlock(blockSize=122), range_facet_sl=PostingsFormat(name=TestBloomFilteredLucene40Postings), range_facet_si=MockFixedIntBlock(blockSize=122), other_tl1=PostingsFormat(name=MockRandom), multiDefault=MockFixedIntBlock(blockSize=122), a_si=PostingsFormat(name=MockRandom)}, sim=DefaultSimilarity, locale=es_PA, timezone=US/Hawaii
[junit4:junit4]   2> NOTE: FreeBSD 9.0-RELEASE amd64/Sun Microsystems Inc. 1.6.0_32 (64-bit)/cpus=16,threads=1,free=63856440,total=171245568
[junit4:junit4]   2> NOTE: All tests run in this JVM: [BasicZkTest, SoftAutoCommitTest, TestDistributedSearch, DistributedQueryElevationComponentTest, ShowFileRequestHandlerTest, FileUtilsTest, PolyFieldTest, TestCodecSupport, PeerSyncTest, LegacyHTMLStripCharFilterTest, SuggesterTSTTest, RAMDirectoryFactoryTest, XsltUpdateRequestHandlerTest, TestSolrXMLSerializer, TestMultiCoreConfBootstrap, TestStressLucene, TestSort, TestSolrDeletionPolicy2, QueryParsingTest, TestDocSet, QueryEqualityTest, TestReload, TestRTGBase, TestMergePolicyConfig, TestCharFilters, ZkNodePropsTest, TimeZoneUtilsTest, DocumentAnalysisRequestHandlerTest, TestPropInject, PrimitiveFieldTypeTest, TermVectorComponentDistributedTest, TestCSVLoader, TestSolrDeletionPolicy1, RequiredFieldsTest, TestDocumentBuilder, DisMaxRequestHandlerTest, DebugComponentTest, TestHashPartitioner, TestSolrCoreProperties, TestArbitraryIndexDir, TestQueryUtils, TermVectorComponentTest, TestReversedWildcardFilterFactory, TestBM25SimilarityFactory, OverseerTest, TestLRUCache, SyncSliceTest]
[junit4:junit4] Completed on J1 in 145.49s, 1 test, 1 failure <<< FAILURES!

[...truncated 390 lines...]
BUILD FAILED
/usr/home/hudson/hudson-slave/workspace/Lucene-Solr-Tests-4.x-Java6/build.xml:32: The following error occurred while executing this line:
/usr/home/hudson/hudson-slave/workspace/Lucene-Solr-Tests-4.x-Java6/solr/build.xml:146: The following error occurred while executing this line:
/usr/home/hudson/hudson-slave/workspace/Lucene-Solr-Tests-4.x-Java6/lucene/module-build.xml:63: The following error occurred while executing this line:
/usr/home/hudson/hudson-slave/workspace/Lucene-Solr-Tests-4.x-Java6/lucene/common-build.xml:1133: The following error occurred while executing this line:
/usr/home/hudson/hudson-slave/workspace/Lucene-Solr-Tests-4.x-Java6/lucene/common-build.xml:810: There were test failures: 230 suites, 951 tests, 1 failure, 8 ignored (3 assumptions)

Total time: 30 minutes 35 seconds
Build step 'Invoke Ant' marked build as failure
Recording test results
Email was triggered for: Failure
Sending email for trigger: Failure



Mime
View raw message