lucene-dev mailing list archives

Site index · List index
Message view « Date » · « Thread »
Top « Date » · « Thread »
From Policeman Jenkins Server <jenk...@sd-datasolutions.de>
Subject [JENKINS] Lucene-Solr-trunk-Windows (64bit/jdk1.7.0_07) - Build # 644 - Failure!
Date Thu, 06 Sep 2012 14:15:00 GMT
Build: http://jenkins.sd-datasolutions.de/job/Lucene-Solr-trunk-Windows/644/
Java: 64bit/jdk1.7.0_07 -XX:+UseConcMarkSweepGC

1 tests failed.
REGRESSION:  org.apache.solr.spelling.suggest.SuggesterFSTTest.testReload

Error Message:
Exception during query

Stack Trace:
java.lang.RuntimeException: Exception during query
	at __randomizedtesting.SeedInfo.seed([A4B9BCD5B474F45C:6349C4D67E370C4E]:0)
	at org.apache.solr.SolrTestCaseJ4.assertQ(SolrTestCaseJ4.java:493)
	at org.apache.solr.SolrTestCaseJ4.assertQ(SolrTestCaseJ4.java:460)
	at org.apache.solr.spelling.suggest.SuggesterTest.testReload(SuggesterTest.java:91)
	at sun.reflect.NativeMethodAccessorImpl.invoke0(Native Method)
	at sun.reflect.NativeMethodAccessorImpl.invoke(NativeMethodAccessorImpl.java:57)
	at sun.reflect.DelegatingMethodAccessorImpl.invoke(DelegatingMethodAccessorImpl.java:43)
	at java.lang.reflect.Method.invoke(Method.java:601)
	at com.carrotsearch.randomizedtesting.RandomizedRunner.invoke(RandomizedRunner.java:1559)
	at com.carrotsearch.randomizedtesting.RandomizedRunner.access$600(RandomizedRunner.java:79)
	at com.carrotsearch.randomizedtesting.RandomizedRunner$6.evaluate(RandomizedRunner.java:737)
	at com.carrotsearch.randomizedtesting.RandomizedRunner$7.evaluate(RandomizedRunner.java:773)
	at com.carrotsearch.randomizedtesting.RandomizedRunner$8.evaluate(RandomizedRunner.java:787)
	at com.carrotsearch.randomizedtesting.rules.SystemPropertiesRestoreRule$1.evaluate(SystemPropertiesRestoreRule.java:53)
	at org.apache.lucene.util.TestRuleSetupTeardownChained$1.evaluate(TestRuleSetupTeardownChained.java:50)
	at org.apache.lucene.util.TestRuleFieldCacheSanity$1.evaluate(TestRuleFieldCacheSanity.java:51)
	at org.apache.lucene.util.AbstractBeforeAfterRule$1.evaluate(AbstractBeforeAfterRule.java:45)
	at com.carrotsearch.randomizedtesting.rules.SystemPropertiesInvariantRule$1.evaluate(SystemPropertiesInvariantRule.java:55)
	at org.apache.lucene.util.TestRuleThreadAndTestName$1.evaluate(TestRuleThreadAndTestName.java:48)
	at org.apache.lucene.util.TestRuleIgnoreAfterMaxFailures$1.evaluate(TestRuleIgnoreAfterMaxFailures.java:70)
	at org.apache.lucene.util.TestRuleMarkFailure$1.evaluate(TestRuleMarkFailure.java:48)
	at com.carrotsearch.randomizedtesting.rules.StatementAdapter.evaluate(StatementAdapter.java:36)
	at com.carrotsearch.randomizedtesting.ThreadLeakControl$StatementRunner.run(ThreadLeakControl.java:358)
	at com.carrotsearch.randomizedtesting.ThreadLeakControl.forkTimeoutingTask(ThreadLeakControl.java:782)
	at com.carrotsearch.randomizedtesting.ThreadLeakControl$3.evaluate(ThreadLeakControl.java:442)
	at com.carrotsearch.randomizedtesting.RandomizedRunner.runSingleTest(RandomizedRunner.java:746)
	at com.carrotsearch.randomizedtesting.RandomizedRunner$3.evaluate(RandomizedRunner.java:648)
	at com.carrotsearch.randomizedtesting.RandomizedRunner$4.evaluate(RandomizedRunner.java:682)
	at com.carrotsearch.randomizedtesting.RandomizedRunner$5.evaluate(RandomizedRunner.java:693)
	at com.carrotsearch.randomizedtesting.rules.StatementAdapter.evaluate(StatementAdapter.java:36)
	at com.carrotsearch.randomizedtesting.rules.SystemPropertiesRestoreRule$1.evaluate(SystemPropertiesRestoreRule.java:53)
	at org.apache.lucene.util.AbstractBeforeAfterRule$1.evaluate(AbstractBeforeAfterRule.java:45)
	at org.apache.lucene.util.TestRuleStoreClassName$1.evaluate(TestRuleStoreClassName.java:42)
	at com.carrotsearch.randomizedtesting.rules.SystemPropertiesInvariantRule$1.evaluate(SystemPropertiesInvariantRule.java:55)
	at com.carrotsearch.randomizedtesting.rules.NoShadowingOrOverridesOnMethodsRule$1.evaluate(NoShadowingOrOverridesOnMethodsRule.java:39)
	at com.carrotsearch.randomizedtesting.rules.NoShadowingOrOverridesOnMethodsRule$1.evaluate(NoShadowingOrOverridesOnMethodsRule.java:39)
	at org.apache.lucene.util.TestRuleAssertionsRequired$1.evaluate(TestRuleAssertionsRequired.java:40)
	at org.apache.lucene.util.TestRuleMarkFailure$1.evaluate(TestRuleMarkFailure.java:48)
	at org.apache.lucene.util.TestRuleIgnoreAfterMaxFailures$1.evaluate(TestRuleIgnoreAfterMaxFailures.java:70)
	at org.apache.lucene.util.TestRuleIgnoreTestSuites$1.evaluate(TestRuleIgnoreTestSuites.java:55)
	at com.carrotsearch.randomizedtesting.rules.StatementAdapter.evaluate(StatementAdapter.java:36)
	at com.carrotsearch.randomizedtesting.ThreadLeakControl$StatementRunner.run(ThreadLeakControl.java:358)
	at java.lang.Thread.run(Thread.java:722)
Caused by: java.lang.NullPointerException
	at org.apache.lucene.search.suggest.fst.FSTCompletionLookup.lookup(FSTCompletionLookup.java:237)
	at org.apache.solr.spelling.suggest.Suggester.getSuggestions(Suggester.java:190)
	at org.apache.solr.handler.component.SpellCheckComponent.process(SpellCheckComponent.java:172)
	at org.apache.solr.handler.component.SearchHandler.handleRequestBody(SearchHandler.java:206)
	at org.apache.solr.handler.RequestHandlerBase.handleRequest(RequestHandlerBase.java:129)
	at org.apache.solr.core.SolrCore.execute(SolrCore.java:1693)
	at org.apache.solr.util.TestHarness.query(TestHarness.java:351)
	at org.apache.solr.util.TestHarness.query(TestHarness.java:333)
	at org.apache.solr.SolrTestCaseJ4.assertQ(SolrTestCaseJ4.java:467)
	... 41 more




Build Log:
[...truncated 7991 lines...]
[junit4:junit4] Suite: org.apache.solr.spelling.suggest.SuggesterFSTTest
[junit4:junit4]   2> 3 T3046 oas.SolrTestCaseJ4.initCore ####initCore
[junit4:junit4]   2> Creating dataDir: C:\Jenkins\workspace\Lucene-Solr-trunk-Windows\solr\build\solr-core\test\J0\.\solrtest-SuggesterFSTTest-1346940643176
[junit4:junit4]   2> 5 T3046 oasc.SolrResourceLoader.<init> new SolrResourceLoader for directory: 'C:\Jenkins\workspace\Lucene-Solr-trunk-Windows\solr\build\solr-core\test-files\solr\collection1\'
[junit4:junit4]   2> 9 T3046 oasc.SolrResourceLoader.replaceClassLoader Adding 'file:/C:/Jenkins/workspace/Lucene-Solr-trunk-Windows/solr/build/solr-core/test-files/solr/collection1/lib/classes/' to classloader
[junit4:junit4]   2> 10 T3046 oasc.SolrResourceLoader.replaceClassLoader Adding 'file:/C:/Jenkins/workspace/Lucene-Solr-trunk-Windows/solr/build/solr-core/test-files/solr/collection1/lib/README' to classloader
[junit4:junit4]   2> 72 T3046 oasc.SolrConfig.<init> Using Lucene MatchVersion: LUCENE_50
[junit4:junit4]   2> 157 T3046 oasc.SolrConfig.<init> Loaded SolrConfig: solrconfig-spellchecker.xml
[junit4:junit4]   2> 157 T3046 oass.IndexSchema.readSchema Reading Solr Schema
[junit4:junit4]   2> 162 T3046 oass.IndexSchema.readSchema Schema name=Solr SpellCheck Test
[junit4:junit4]   2> 203 T3046 oass.IndexSchema.readSchema default search field in schema is text
[junit4:junit4]   2> 206 T3046 oass.IndexSchema.readSchema query parser default operator is OR
[junit4:junit4]   2> 208 T3046 oass.IndexSchema.readSchema unique key field: id
[junit4:junit4]   2> 213 T3046 oasc.SolrResourceLoader.locateSolrHome JNDI not configured for solr (NoInitialContextEx)
[junit4:junit4]   2> 213 T3046 oasc.SolrResourceLoader.locateSolrHome using system property solr.solr.home: C:\Jenkins\workspace\Lucene-Solr-trunk-Windows\solr\build\solr-core\test-files\solr
[junit4:junit4]   2> 214 T3046 oasc.SolrResourceLoader.<init> new SolrResourceLoader for directory: 'C:\Jenkins\workspace\Lucene-Solr-trunk-Windows\solr\build\solr-core\test-files\solr\'
[junit4:junit4]   2> 242 T3046 oasc.CoreContainer.<init> New CoreContainer 1413300688
[junit4:junit4]   2> 242 T3046 oasc.SolrCore.<init> [collection1] Opening new SolrCore at C:\Jenkins\workspace\Lucene-Solr-trunk-Windows\solr\build\solr-core\test-files\solr\collection1\, dataDir=C:\Jenkins\workspace\Lucene-Solr-trunk-Windows\solr\build\solr-core\test\J0\.\solrtest-SuggesterFSTTest-1346940643176\
[junit4:junit4]   2> 243 T3046 oasc.SolrCore.<init> JMX monitoring not detected for core: collection1
[junit4:junit4]   2> 244 T3046 oasc.SolrCore.getNewIndexDir WARNING New index directory detected: old=null new=C:\Jenkins\workspace\Lucene-Solr-trunk-Windows\solr\build\solr-core\test\J0\.\solrtest-SuggesterFSTTest-1346940643176\index/
[junit4:junit4]   2> 248 T3046 oasc.SolrCore.initIndex WARNING [collection1] Solr index directory 'C:\Jenkins\workspace\Lucene-Solr-trunk-Windows\solr\build\solr-core\test\J0\.\solrtest-SuggesterFSTTest-1346940643176\index' doesn't exist. Creating new index...
[junit4:junit4]   2> 248 T3046 oasc.CachingDirectoryFactory.get return new directory for C:\Jenkins\workspace\Lucene-Solr-trunk-Windows\solr\build\solr-core\test\J0\.\solrtest-SuggesterFSTTest-1346940643176\index forceNew:false
[junit4:junit4]   2> 257 T3046 oasc.SolrDeletionPolicy.onCommit SolrDeletionPolicy.onCommit: commits:num=1
[junit4:junit4]   2> 		commit{dir=MockDirWrapper(org.apache.lucene.store.NIOFSDirectory@C:\Jenkins\workspace\Lucene-Solr-trunk-Windows\solr\build\solr-core\test\J0\solrtest-SuggesterFSTTest-1346940643176\index lockFactory=org.apache.lucene.store.NativeFSLockFactory@3d88ba3e),segFN=segments_1,generation=1,filenames=[segments_1]
[junit4:junit4]   2> 258 T3046 oasc.SolrDeletionPolicy.updateCommits newest commit = 1
[junit4:junit4]   2> 260 T3046 oasc.RequestHandlers.initHandlersFromConfig created standard: solr.StandardRequestHandler
[junit4:junit4]   2> 260 T3046 oasc.RequestHandlers.initHandlersFromConfig created /suggest: org.apache.solr.handler.component.SearchHandler
[junit4:junit4]   2> 261 T3046 oasc.RequestHandlers.initHandlersFromConfig created /suggest_tst: org.apache.solr.handler.component.SearchHandler
[junit4:junit4]   2> 261 T3046 oasc.RequestHandlers.initHandlersFromConfig created /suggest_fst: org.apache.solr.handler.component.SearchHandler
[junit4:junit4]   2> 261 T3046 oasc.RequestHandlers.initHandlersFromConfig created /suggest_wfst: org.apache.solr.handler.component.SearchHandler
[junit4:junit4]   2> 276 T3046 oass.SolrIndexSearcher.<init> Opening Searcher@4b862e65 main
[junit4:junit4]   2> 277 T3046 oass.SolrIndexSearcher.getIndexDir WARNING WARNING: Directory impl does not support setting indexDir: org.apache.lucene.store.MockDirectoryWrapper
[junit4:junit4]   2> 277 T3046 oasu.CommitTracker.<init> Hard AutoCommit: disabled
[junit4:junit4]   2> 277 T3046 oasu.CommitTracker.<init> Soft AutoCommit: disabled
[junit4:junit4]   2> 277 T3046 oashc.SpellCheckComponent.inform Initializing spell checkers
[junit4:junit4]   2> 277 T3046 oasss.Suggester.init init: {name=suggest,classname=org.apache.solr.spelling.suggest.Suggester,lookupImpl=org.apache.solr.spelling.suggest.jaspell.JaspellLookup,field=suggest,storeDir=suggest,buildOnCommit=true,threshold=0.0}
[junit4:junit4]   2> 278 T3046 oasssj.JaspellLookupFactory.create init: {name=suggest,classname=org.apache.solr.spelling.suggest.Suggester,lookupImpl=org.apache.solr.spelling.suggest.jaspell.JaspellLookup,field=suggest,storeDir=suggest,buildOnCommit=true,threshold=0.0}
[junit4:junit4]   2> 279 T3046 oashc.SpellCheckComponent.inform Registering newSearcher listener for spellchecker: suggest
[junit4:junit4]   2> 280 T3046 oashc.SpellCheckComponent.inform No queryConverter defined, using default converter
[junit4:junit4]   2> 280 T3046 oashc.SpellCheckComponent.inform Initializing spell checkers
[junit4:junit4]   2> 281 T3046 oasss.Suggester.init init: {name=suggest_tst,classname=org.apache.solr.spelling.suggest.Suggester,lookupImpl=org.apache.solr.spelling.suggest.tst.TSTLookup,field=suggest,storeDir=suggest_tst,buildOnCommit=true,threshold=0.0}
[junit4:junit4]   2> 281 T3046 oashc.SpellCheckComponent.inform Registering newSearcher listener for spellchecker: suggest_tst
[junit4:junit4]   2> 281 T3046 oashc.SpellCheckComponent.inform No queryConverter defined, using default converter
[junit4:junit4]   2> 282 T3046 oashc.SpellCheckComponent.inform Initializing spell checkers
[junit4:junit4]   2> 282 T3046 oasss.Suggester.init init: {name=suggest_fst,classname=org.apache.solr.spelling.suggest.Suggester,lookupImpl=org.apache.solr.spelling.suggest.fst.FSTLookup,field=suggest,storeDir=suggest_fst,buildOnCommit=true,weightBuckets=5,exactMatchFirst=true}
[junit4:junit4]   2> 284 T3046 oashc.SpellCheckComponent.inform Registering newSearcher listener for spellchecker: suggest_fst
[junit4:junit4]   2> 284 T3046 oashc.SpellCheckComponent.inform No queryConverter defined, using default converter
[junit4:junit4]   2> 285 T3046 oashc.SpellCheckComponent.inform Initializing spell checkers
[junit4:junit4]   2> 285 T3046 oasss.Suggester.init init: {name=suggest_wfst,classname=org.apache.solr.spelling.suggest.Suggester,lookupImpl=org.apache.solr.spelling.suggest.fst.WFSTLookupFactory,field=suggest,storeDir=suggest_wfst,buildOnCommit=true,exactMatchFirst=true}
[junit4:junit4]   2> 285 T3046 oashc.SpellCheckComponent.inform Registering newSearcher listener for spellchecker: suggest_wfst
[junit4:junit4]   2> 286 T3046 oashc.SpellCheckComponent.inform No queryConverter defined, using default converter
[junit4:junit4]   2> 288 T3046 oashc.HttpShardHandlerFactory.getParameter Setting socketTimeout to: 0
[junit4:junit4]   2> 288 T3046 oashc.HttpShardHandlerFactory.getParameter Setting urlScheme to: http://
[junit4:junit4]   2> 288 T3046 oashc.HttpShardHandlerFactory.getParameter Setting connTimeout to: 0
[junit4:junit4]   2> 288 T3046 oashc.HttpShardHandlerFactory.getParameter Setting maxConnectionsPerHost to: 20
[junit4:junit4]   2> 289 T3046 oashc.HttpShardHandlerFactory.getParameter Setting corePoolSize to: 0
[junit4:junit4]   2> 289 T3046 oashc.HttpShardHandlerFactory.getParameter Setting maximumPoolSize to: 2147483647
[junit4:junit4]   2> 289 T3046 oashc.HttpShardHandlerFactory.getParameter Setting maxThreadIdleTime to: 5
[junit4:junit4]   2> 290 T3046 oashc.HttpShardHandlerFactory.getParameter Setting sizeOfQueue to: -1
[junit4:junit4]   2> 290 T3046 oashc.HttpShardHandlerFactory.getParameter Setting fairnessPolicy to: false
[junit4:junit4]   2> 290 T3046 oascsi.HttpClientUtil.createClient Creating new http client, config:maxConnectionsPerHost=20&maxConnections=10000&socketTimeout=0&connTimeout=0&retry=false
[junit4:junit4]   2> 302 T3046 oasc.CoreContainer.register registering core: collection1
[junit4:junit4]   2> 306 T3046 oas.SolrTestCaseJ4.initCore ####initCore end
[junit4:junit4]   2> 317 T3046 oas.SolrTestCaseJ4.setUp ###Starting testReload
[junit4:junit4]   2> ASYNC  NEW_CORE C241 name=collection1 org.apache.solr.core.SolrCore@201a3bdb
[junit4:junit4]   2> 329 T3046 C241 oasc.SolrDeletionPolicy.onInit SolrDeletionPolicy.onInit: commits:num=1
[junit4:junit4]   2> 		commit{dir=MockDirWrapper(org.apache.lucene.store.NIOFSDirectory@C:\Jenkins\workspace\Lucene-Solr-trunk-Windows\solr\build\solr-core\test\J0\solrtest-SuggesterFSTTest-1346940643176\index lockFactory=org.apache.lucene.store.NativeFSLockFactory@3d88ba3e),segFN=segments_1,generation=1,filenames=[segments_1]
[junit4:junit4]   2> 330 T3046 C241 oasc.SolrDeletionPolicy.updateCommits newest commit = 1
[junit4:junit4]   2> 332 T3046 C241 UPDATE [collection1] webapp=null path=null params={} {add=[1]} 0 8
[junit4:junit4]   2> 355 T3046 C241 UPDATE [collection1] webapp=null path=null params={} {add=[2]} 0 1
[junit4:junit4]   2> 362 T3046 C241 UPDATE [collection1] webapp=null path=null params={} {add=[3]} 0 1
[junit4:junit4]   2> 372 T3046 C241 oasu.DirectUpdateHandler2.commit start commit{flags=0,_version_=0,optimize=false,openSearcher=true,waitSearcher=true,expungeDeletes=false,softCommit=false}
[junit4:junit4]   2> 389 T3046 C241 oasc.SolrDeletionPolicy.onCommit SolrDeletionPolicy.onCommit: commits:num=2
[junit4:junit4]   2> 		commit{dir=MockDirWrapper(org.apache.lucene.store.NIOFSDirectory@C:\Jenkins\workspace\Lucene-Solr-trunk-Windows\solr\build\solr-core\test\J0\solrtest-SuggesterFSTTest-1346940643176\index lockFactory=org.apache.lucene.store.NativeFSLockFactory@3d88ba3e),segFN=segments_1,generation=1,filenames=[segments_1]
[junit4:junit4]   2> 		commit{dir=MockDirWrapper(org.apache.lucene.store.NIOFSDirectory@C:\Jenkins\workspace\Lucene-Solr-trunk-Windows\solr\build\solr-core\test\J0\solrtest-SuggesterFSTTest-1346940643176\index lockFactory=org.apache.lucene.store.NativeFSLockFactory@3d88ba3e),segFN=segments_2,generation=2,filenames=[_0_Asserting_0.tim, _0_TestBloomFilteredLucene40Postings_0.tim, _0_TestBloomFilteredLucene40Postings_0.blm, _0_TestBloomFilteredLucene40Postings_0.tip, _0.fnm, _0_Asserting_0.tip, _0_TestBloomFilteredLucene40Postings_0.prx, _0_nrm.cfs, _0_Direct_0.frq, _0_Asserting_0.prx, _0_Asserting_0.frq, _0_nrm.cfe, segments_2, _0_TestBloomFilteredLucene40Postings_0.frq, _0.fdx, _0_Direct_0.tip, _0_Direct_0.prx, _0.si, _0_Direct_0.tim, _0.fdt]
[junit4:junit4]   2> 390 T3046 C241 oasc.SolrDeletionPolicy.updateCommits newest commit = 2
[junit4:junit4]   2> 392 T3046 C241 oasc.SolrCore.getSearcher WARNING [collection1] PERFORMANCE WARNING: Overlapping onDeckSearchers=2
[junit4:junit4]   2> 403 T3046 C241 oass.SolrIndexSearcher.<init> Opening Searcher@13aa004e main
[junit4:junit4]   2> 404 T3046 C241 oass.SolrIndexSearcher.getIndexDir WARNING WARNING: Directory impl does not support setting indexDir: org.apache.lucene.store.MockDirectoryWrapper
[junit4:junit4]   2> 404 T3046 C241 oasu.DirectUpdateHandler2.commit end_commit_flush
[junit4:junit4]   2> 405 T3047 oasc.SolrCore.registerSearcher [collection1] Registered new searcher Searcher@4b862e65 main{StandardDirectoryReader(segments_1:1)}
[junit4:junit4]   2> 406 T3047 oashc.SpellCheckComponent$SpellCheckerListener.newSearcher Loading spell index for spellchecker: suggest
[junit4:junit4]   2> 406 T3047 oasss.Suggester.reload reload()
[junit4:junit4]   2> 408 T3047 oashc.SpellCheckComponent$SpellCheckerListener.newSearcher SEVERE Exception in reloading spell check index for spellchecker: suggest java.io.FileNotFoundException: C:\Jenkins\workspace\Lucene-Solr-trunk-Windows\solr\build\solr-core\test\J0\.\solrtest-SuggesterFSTTest-1346940643176\suggest\jaspell.dat (The system cannot find the file specified)
[junit4:junit4]   2> 	at java.io.FileInputStream.open(Native Method)
[junit4:junit4]   2> 	at java.io.FileInputStream.<init>(FileInputStream.java:138)
[junit4:junit4]   2> 	at org.apache.solr.spelling.suggest.Suggester.reload(Suggester.java:161)
[junit4:junit4]   2> 	at org.apache.solr.handler.component.SpellCheckComponent$SpellCheckerListener.newSearcher(SpellCheckComponent.java:673)
[junit4:junit4]   2> 	at org.apache.solr.core.SolrCore$5.call(SolrCore.java:1473)
[junit4:junit4]   2> 	at java.util.concurrent.FutureTask$Sync.innerRun(FutureTask.java:334)
[junit4:junit4]   2> 	at java.util.concurrent.FutureTask.run(FutureTask.java:166)
[junit4:junit4]   2> 	at java.util.concurrent.ThreadPoolExecutor.runWorker(ThreadPoolExecutor.java:1110)
[junit4:junit4]   2> 	at java.util.concurrent.ThreadPoolExecutor$Worker.run(ThreadPoolExecutor.java:603)
[junit4:junit4]   2> 	at java.lang.Thread.run(Thread.java:722)
[junit4:junit4]   2> 
[junit4:junit4]   2> 409 T3047 oashc.SpellCheckComponent$SpellCheckerListener.newSearcher Loading spell index for spellchecker: suggest_tst
[junit4:junit4]   2> 409 T3047 oasss.Suggester.reload reload()
[junit4:junit4]   2> 410 T3047 oashc.SpellCheckComponent$SpellCheckerListener.newSearcher SEVERE Exception in reloading spell check index for spellchecker: suggest_tst java.io.FileNotFoundException: C:\Jenkins\workspace\Lucene-Solr-trunk-Windows\solr\build\solr-core\test\J0\.\solrtest-SuggesterFSTTest-1346940643176\suggest_tst\tst.dat (The system cannot find the file specified)
[junit4:junit4]   2> 	at java.io.FileInputStream.open(Native Method)
[junit4:junit4]   2> 	at java.io.FileInputStream.<init>(FileInputStream.java:138)
[junit4:junit4]   2> 	at org.apache.solr.spelling.suggest.Suggester.reload(Suggester.java:161)
[junit4:junit4]   2> 	at org.apache.solr.handler.component.SpellCheckComponent$SpellCheckerListener.newSearcher(SpellCheckComponent.java:673)
[junit4:junit4]   2> 	at org.apache.solr.core.SolrCore$5.call(SolrCore.java:1473)
[junit4:junit4]   2> 	at java.util.concurrent.FutureTask$Sync.innerRun(FutureTask.java:334)
[junit4:junit4]   2> 	at java.util.concurrent.FutureTask.run(FutureTask.java:166)
[junit4:junit4]   2> 	at java.util.concurrent.ThreadPoolExecutor.runWorker(ThreadPoolExecutor.java:1110)
[junit4:junit4]   2> 	at java.util.concurrent.ThreadPoolExecutor$Worker.run(ThreadPoolExecutor.java:603)
[junit4:junit4]   2> 	at java.lang.Thread.run(Thread.java:722)
[junit4:junit4]   2> 
[junit4:junit4]   2> 410 T3047 oashc.SpellCheckComponent$SpellCheckerListener.newSearcher Loading spell index for spellchecker: suggest_fst
[junit4:junit4]   2> 410 T3047 oasss.Suggester.reload reload()
[junit4:junit4]   2> 412 T3047 oashc.SpellCheckComponent$SpellCheckerListener.newSearcher SEVERE Exception in reloading spell check index for spellchecker: suggest_fst java.io.FileNotFoundException: C:\Jenkins\workspace\Lucene-Solr-trunk-Windows\solr\build\solr-core\test\J0\.\solrtest-SuggesterFSTTest-1346940643176\suggest_fst\fst.bin (The system cannot find the file specified)
[junit4:junit4]   2> 	at java.io.FileInputStream.open(Native Method)
[junit4:junit4]   2> 	at java.io.FileInputStream.<init>(FileInputStream.java:138)
[junit4:junit4]   2> 	at org.apache.solr.spelling.suggest.Suggester.reload(Suggester.java:161)
[junit4:junit4]   2> 	at org.apache.solr.handler.component.SpellCheckComponent$SpellCheckerListener.newSearcher(SpellCheckComponent.java:673)
[junit4:junit4]   2> 	at org.apache.solr.core.SolrCore$5.call(SolrCore.java:1473)
[junit4:junit4]   2> 	at java.util.concurrent.FutureTask$Sync.innerRun(FutureTask.java:334)
[junit4:junit4]   2> 	at java.util.concurrent.FutureTask.run(FutureTask.java:166)
[junit4:junit4]   2> 	at java.util.concurrent.ThreadPoolExecutor.runWorker(ThreadPoolExecutor.java:1110)
[junit4:junit4]   2> 	at java.util.concurrent.ThreadPoolExecutor$Worker.run(ThreadPoolExecutor.java:603)
[junit4:junit4]   2> 	at java.lang.Thread.run(Thread.java:722)
[junit4:junit4]   2> 
[junit4:junit4]   2> 412 T3047 oashc.SpellCheckComponent$SpellCheckerListener.newSearcher Loading spell index for spellchecker: suggest_wfst
[junit4:junit4]   2> 412 T3047 oasss.Suggester.reload reload()
[junit4:junit4]   2> 413 T3047 oashc.SpellCheckComponent$SpellCheckerListener.newSearcher SEVERE Exception in reloading spell check index for spellchecker: suggest_wfst java.io.FileNotFoundException: C:\Jenkins\workspace\Lucene-Solr-trunk-Windows\solr\build\solr-core\test\J0\.\solrtest-SuggesterFSTTest-1346940643176\suggest_wfst\wfst.bin (The system cannot find the file specified)
[junit4:junit4]   2> 	at java.io.FileInputStream.open(Native Method)
[junit4:junit4]   2> 	at java.io.FileInputStream.<init>(FileInputStream.java:138)
[junit4:junit4]   2> 	at org.apache.solr.spelling.suggest.Suggester.reload(Suggester.java:161)
[junit4:junit4]   2> 	at org.apache.solr.handler.component.SpellCheckComponent$SpellCheckerListener.newSearcher(SpellCheckComponent.java:673)
[junit4:junit4]   2> 	at org.apache.solr.core.SolrCore$5.call(SolrCore.java:1473)
[junit4:junit4]   2> 	at java.util.concurrent.FutureTask$Sync.innerRun(FutureTask.java:334)
[junit4:junit4]   2> 	at java.util.concurrent.FutureTask.run(FutureTask.java:166)
[junit4:junit4]   2> 	at java.util.concurrent.ThreadPoolExecutor.runWorker(ThreadPoolExecutor.java:1110)
[junit4:junit4]   2> 	at java.util.concurrent.ThreadPoolExecutor$Worker.run(ThreadPoolExecutor.java:603)
[junit4:junit4]   2> 	at java.lang.Thread.run(Thread.java:722)
[junit4:junit4]   2> 
[junit4:junit4]   2> 414 T3047 oasc.SolrCore.registerSearcher [collection1] Registered new searcher Searcher@13aa004e main{StandardDirectoryReader(segments_2:3 _0(5.0):C3)}
[junit4:junit4]   2> 414 T3046 C241 UPDATE [collection1] webapp=null path=null params={} {commit=} 0 42
[junit4:junit4]   2> 419 T3046 oas.SolrTestCaseJ4.deleteCore ###deleteCore
[junit4:junit4]   2> 420 T3046 oasc.CoreContainer.shutdown Shutting down CoreContainer instance=1413300688
[junit4:junit4]   2> 420 T3046 oasc.SolrCore.close [collection1]  CLOSING SolrCore org.apache.solr.core.SolrCore@201a3bdb
[junit4:junit4]   2> 421 T3046 oasc.SolrCore.closeSearcher [collection1] Closing main searcher on request.
[junit4:junit4]   2> 422 T3046 oasu.DirectUpdateHandler2.close closing DirectUpdateHandler2{commits=1,autocommits=0,soft autocommits=0,optimizes=0,rollbacks=0,expungeDeletes=0,docsPending=0,adds=0,deletesById=0,deletesByQuery=0,errors=0,cumulative_adds=3,cumulative_deletesById=0,cumulative_deletesByQuery=0,cumulative_errors=0}
[junit4:junit4]   2> 422 T3046 oasu.DefaultSolrCoreState.decref SolrCoreState ref count has reached 0 - closing IndexWriter
[junit4:junit4]   2> 437 T3046 oasu.DefaultSolrCoreState.decref Closing SolrCoreState - canceling any ongoing recovery
[junit4:junit4]   2> NOTE: per solr.test.leavedatadir, dataDir will not be removed: C:\Jenkins\workspace\Lucene-Solr-trunk-Windows\solr\build\solr-core\test\J0\.\solrtest-SuggesterFSTTest-1346940643176
[junit4:junit4]   2> 437 T3046 oas.SolrTestCaseJ4.initCore ####initCore
[junit4:junit4]   2> 438 T3046 oasc.SolrResourceLoader.<init> new SolrResourceLoader for directory: 'C:\Jenkins\workspace\Lucene-Solr-trunk-Windows\solr\build\solr-core\test-files\solr\collection1\'
[junit4:junit4]   2> 440 T3046 oasc.SolrResourceLoader.replaceClassLoader Adding 'file:/C:/Jenkins/workspace/Lucene-Solr-trunk-Windows/solr/build/solr-core/test-files/solr/collection1/lib/classes/' to classloader
[junit4:junit4]   2> 440 T3046 oasc.SolrResourceLoader.replaceClassLoader Adding 'file:/C:/Jenkins/workspace/Lucene-Solr-trunk-Windows/solr/build/solr-core/test-files/solr/collection1/lib/README' to classloader
[junit4:junit4]   2> 510 T3046 oasc.SolrConfig.<init> Using Lucene MatchVersion: LUCENE_50
[junit4:junit4]   2> 584 T3046 oasc.SolrConfig.<init> Loaded SolrConfig: solrconfig-spellchecker.xml
[junit4:junit4]   2> 585 T3046 oass.IndexSchema.readSchema Reading Solr Schema
[junit4:junit4]   2> 594 T3046 oass.IndexSchema.readSchema Schema name=test
[junit4:junit4]   2> 1373 T3046 oass.OpenExchangeRatesOrgProvider.init Initialized with rates=open-exchange-rates.json, refreshInterval=1440.
[junit4:junit4]   2> 1393 T3046 oass.IndexSchema.readSchema default search field in schema is text
[junit4:junit4]   2> 1397 T3046 oass.IndexSchema.readSchema unique key field: id
[junit4:junit4]   2> 1407 T3046 oass.FileExchangeRateProvider.reload Reloading exchange rates from file currency.xml
[junit4:junit4]   2> 1411 T3046 oass.FileExchangeRateProvider.reload Reloading exchange rates from file currency.xml
[junit4:junit4]   2> 1417 T3046 oass.OpenExchangeRatesOrgProvider.reload Reloading exchange rates from open-exchange-rates.json
[junit4:junit4]   2> 1418 T3046 oass.OpenExchangeRatesOrgProvider.reload Reloading exchange rates from open-exchange-rates.json
[junit4:junit4]   2> 1419 T3046 oasc.SolrResourceLoader.locateSolrHome JNDI not configured for solr (NoInitialContextEx)
[junit4:junit4]   2> 1420 T3046 oasc.SolrResourceLoader.locateSolrHome using system property solr.solr.home: C:\Jenkins\workspace\Lucene-Solr-trunk-Windows\solr\build\solr-core\test-files\solr
[junit4:junit4]   2> 1420 T3046 oasc.SolrResourceLoader.<init> new SolrResourceLoader for directory: 'C:\Jenkins\workspace\Lucene-Solr-trunk-Windows\solr\build\solr-core\test-files\solr\'
[junit4:junit4]   2> 1437 T3046 oasc.CoreContainer.<init> New CoreContainer 1336397806
[junit4:junit4]   2> 1438 T3046 oasc.SolrCore.<init> [collection1] Opening new SolrCore at C:\Jenkins\workspace\Lucene-Solr-trunk-Windows\solr\build\solr-core\test-files\solr\collection1\, dataDir=C:\Jenkins\workspace\Lucene-Solr-trunk-Windows\solr\build\solr-core\test\J0\.\solrtest-SuggesterFSTTest-1346940643176\
[junit4:junit4]   2> 1438 T3046 oasc.SolrCore.<init> JMX monitoring not detected for core: collection1
[junit4:junit4]   2> 1440 T3046 oasc.SolrCore.getNewIndexDir WARNING New index directory detected: old=null new=C:\Jenkins\workspace\Lucene-Solr-trunk-Windows\solr\build\solr-core\test\J0\.\solrtest-SuggesterFSTTest-1346940643176\index/
[junit4:junit4]   2> 1443 T3046 oasc.RequestHandlers.initHandlersFromConfig created standard: solr.StandardRequestHandler
[junit4:junit4]   2> 1443 T3046 oasc.RequestHandlers.initHandlersFromConfig created /suggest: org.apache.solr.handler.component.SearchHandler
[junit4:junit4]   2> 1445 T3046 oasc.RequestHandlers.initHandlersFromConfig created /suggest_tst: org.apache.solr.handler.component.SearchHandler
[junit4:junit4]   2> 1445 T3046 oasc.RequestHandlers.initHandlersFromConfig created /suggest_fst: org.apache.solr.handler.component.SearchHandler
[junit4:junit4]   2> 1446 T3046 oasc.RequestHandlers.initHandlersFromConfig created /suggest_wfst: org.apache.solr.handler.component.SearchHandler
[junit4:junit4]   2> 1453 T3046 oasc.CachingDirectoryFactory.get return new directory for C:\Jenkins\workspace\Lucene-Solr-trunk-Windows\solr\build\solr-core\test\J0\.\solrtest-SuggesterFSTTest-1346940643176\index forceNew:false
[junit4:junit4]   2> 1460 T3046 oass.SolrIndexSearcher.<init> Opening Searcher@53c0add9 main
[junit4:junit4]   2> 1470 T3046 oass.SolrIndexSearcher.getIndexDir WARNING WARNING: Directory impl does not support setting indexDir: org.apache.lucene.store.MockDirectoryWrapper
[junit4:junit4]   2> 1470 T3046 oasu.CommitTracker.<init> Hard AutoCommit: disabled
[junit4:junit4]   2> 1470 T3046 oasu.CommitTracker.<init> Soft AutoCommit: disabled
[junit4:junit4]   2> 1470 T3046 oashc.SpellCheckComponent.inform Initializing spell checkers
[junit4:junit4]   2> 1470 T3046 oasss.Suggester.init init: {name=suggest,classname=org.apache.solr.spelling.suggest.Suggester,lookupImpl=org.apache.solr.spelling.suggest.jaspell.JaspellLookup,field=suggest,storeDir=suggest,buildOnCommit=true,threshold=0.0}
[junit4:junit4]   2> 1470 T3046 oasssj.JaspellLookupFactory.create init: {name=suggest,classname=org.apache.solr.spelling.suggest.Suggester,lookupImpl=org.apache.solr.spelling.suggest.jaspell.JaspellLookup,field=suggest,storeDir=suggest,buildOnCommit=true,threshold=0.0}
[junit4:junit4]   2> 1473 T3046 oasss.Suggester.init WARNING Loading stored lookup data failed java.io.FileNotFoundException: C:\Jenkins\workspace\Lucene-Solr-trunk-Windows\solr\build\solr-core\test\J0\.\solrtest-SuggesterFSTTest-1346940643176\suggest\jaspell.dat (The system cannot find the file specified)
[junit4:junit4]   2> 	at java.io.FileInputStream.open(Native Method)
[junit4:junit4]   2> 	at java.io.FileInputStream.<init>(FileInputStream.java:138)
[junit4:junit4]   2> 	at org.apache.solr.spelling.suggest.Suggester.init(Suggester.java:115)
[junit4:junit4]   2> 	at org.apache.solr.handler.component.SpellCheckComponent.inform(SpellCheckComponent.java:596)
[junit4:junit4]   2> 	at org.apache.solr.core.SolrResourceLoader.inform(SolrResourceLoader.java:589)
[junit4:junit4]   2> 	at org.apache.solr.core.SolrCore.<init>(SolrCore.java:718)
[junit4:junit4]   2> 	at org.apache.solr.core.SolrCore.<init>(SolrCore.java:567)
[junit4:junit4]   2> 	at org.apache.solr.util.TestHarness$Initializer.initialize(TestHarness.java:190)
[junit4:junit4]   2> 	at org.apache.solr.util.TestHarness.<init>(TestHarness.java:114)
[junit4:junit4]   2> 	at org.apache.solr.util.TestHarness.<init>(TestHarness.java:109)
[junit4:junit4]   2> 	at org.apache.solr.util.TestHarness.<init>(TestHarness.java:99)
[junit4:junit4]   2> 	at org.apache.solr.SolrTestCaseJ4.createCore(SolrTestCaseJ4.java:362)
[junit4:junit4]   2> 	at org.apache.solr.SolrTestCaseJ4.initCore(SolrTestCaseJ4.java:355)
[junit4:junit4]   2> 	at org.apache.solr.spelling.suggest.SuggesterTest.testReload(SuggesterTest.java:90)
[junit4:junit4]   2> 	at sun.reflect.NativeMethodAccessorImpl.invoke0(Native Method)
[junit4:junit4]   2> 	at sun.reflect.NativeMethodAccessorImpl.invoke(NativeMethodAccessorImpl.java:57)
[junit4:junit4]   2> 	at sun.reflect.DelegatingMethodAccessorImpl.invoke(DelegatingMethodAccessorImpl.java:43)
[junit4:junit4]   2> 	at java.lang.reflect.Method.invoke(Method.java:601)
[junit4:junit4]   2> 	at com.carrotsearch.randomizedtesting.RandomizedRunner.invoke(RandomizedRunner.java:1559)
[junit4:junit4]   2> 	at com.carrotsearch.randomizedtesting.RandomizedRunner.access$600(RandomizedRunner.java:79)
[junit4:junit4]   2> 	at com.carrotsearch.randomizedtesting.RandomizedRunner$6.evaluate(RandomizedRunner.java:737)
[junit4:junit4]   2> 	at com.carrotsearch.randomizedtesting.RandomizedRunner$7.evaluate(RandomizedRunner.java:773)
[junit4:junit4]   2> 	at com.carrotsearch.randomizedtesting.RandomizedRunner$8.evaluate(RandomizedRunner.java:787)
[junit4:junit4]   2> 	at com.carrotsearch.randomizedtesting.rules.SystemPropertiesRestoreRule$1.evaluate(SystemPropertiesRestoreRule.java:53)
[junit4:junit4]   2> 	at org.apache.lucene.util.TestRuleSetupTeardownChained$1.evaluate(TestRuleSetupTeardownChained.java:50)
[junit4:junit4]   2> 	at org.apache.lucene.util.TestRuleFieldCacheSanity$1.evaluate(TestRuleFieldCacheSanity.java:51)
[junit4:junit4]   2> 	at org.apache.lucene.util.AbstractBeforeAfterRule$1.evaluate(AbstractBeforeAfterRule.java:45)
[junit4:junit4]   2> 	at com.carrotsearch.randomizedtesting.rules.SystemPropertiesInvariantRule$1.evaluate(SystemPropertiesInvariantRule.java:55)
[junit4:junit4]   2> 	at org.apache.lucene.util.TestRuleThreadAndTestName$1.evaluate(TestRuleThreadAndTestName.java:48)
[junit4:junit4]   2> 	at org.apache.lucene.util.TestRuleIgnoreAfterMaxFailures$1.evaluate(TestRuleIgnoreAfterMaxFailures.java:70)
[junit4:junit4]   2> 	at org.apache.lucene.util.TestRuleMarkFailure$1.evaluate(TestRuleMarkFailure.java:48)
[junit4:junit4]   2> 	at com.carrotsearch.randomizedtesting.rules.StatementAdapter.evaluate(StatementAdapter.java:36)
[junit4:junit4]   2> 	at com.carrotsearch.randomizedtesting.ThreadLeakControl$StatementRunner.run(ThreadLeakControl.java:358)
[junit4:junit4]   2> 	at com.carrotsearch.randomizedtesting.ThreadLeakControl.forkTimeoutingTask(ThreadLeakControl.java:782)
[junit4:junit4]   2> 	at com.carrotsearch.randomizedtesting.ThreadLeakControl$3.evaluate(ThreadLeakControl.java:442)
[junit4:junit4]   2> 	at com.carrotsearch.randomizedtesting.RandomizedRunner.runSingleTest(RandomizedRunner.java:746)
[junit4:junit4]   2> 	at com.carrotsearch.randomizedtesting.RandomizedRunner$3.evaluate(RandomizedRunner.java:648)
[junit4:junit4]   2> 	at com.carrotsearch.randomizedtesting.RandomizedRunner$4.evaluate(RandomizedRunner.java:682)
[junit4:junit4]   2> 	at com.carrotsearch.randomizedtesting.RandomizedRunner$5.evaluate(RandomizedRunner.java:693)
[junit4:junit4]   2> 	at com.carrotsearch.randomizedtesting.rules.StatementAdapter.evaluate(StatementAdapter.java:36)
[junit4:junit4]   2> 	at com.carrotsearch.randomizedtesting.rules.SystemPropertiesRestoreRule$1.evaluate(SystemPropertiesRestoreRule.java:53)
[junit4:junit4]   2> 	at org.apache.lucene.util.AbstractBeforeAfterRule$1.evaluate(AbstractBeforeAfterRule.java:45)
[junit4:junit4]   2> 	at org.apache.lucene.util.TestRuleStoreClassName$1.evaluate(TestRuleStoreClassName.java:42)
[junit4:junit4]   2> 	at com.carrotsearch.randomizedtesting.rules.SystemPropertiesInvariantRule$1.evaluate(SystemPropertiesInvariantRule.java:55)
[junit4:junit4]   2> 	at com.carrotsearch.randomizedtesting.rules.NoShadowingOrOverridesOnMethodsRule$1.evaluate(NoShadowingOrOverridesOnMethodsRule.java:39)
[junit4:junit4]   2> 	at com.carrotsearch.randomizedtesting.rules.NoShadowingOrOverridesOnMethodsRule$1.evaluate(NoShadowingOrOverridesOnMethodsRule.java:39)
[junit4:junit4]   2> 	at org.apache.lucene.util.TestRuleAssertionsRequired$1.evaluate(TestRuleAssertionsRequired.java:40)
[junit4:junit4]   2> 	at org.apache.lucene.util.TestRuleMarkFailure$1.evaluate(TestRuleMarkFailure.java:48)
[junit4:junit4]   2> 	at org.apache.lucene.util.TestRuleIgnoreAfterMaxFailures$1.evaluate(TestRuleIgnoreAfterMaxFailures.java:70)
[junit4:junit4]   2> 	at org.apache.lucene.util.TestRuleIgnoreTestSuites$1.evaluate(TestRuleIgnoreTestSuites.java:55)
[junit4:junit4]   2> 	at com.carrotsearch.randomizedtesting.rules.StatementAdapter.evaluate(StatementAdapter.java:36)
[junit4:junit4]   2> 	at com.carrotsearch.randomizedtesting.ThreadLeakControl$StatementRunner.run(ThreadLeakControl.java:358)
[junit4:junit4]   2> 	at java.lang.Thread.run(Thread.java:722)
[junit4:junit4]   2> 
[junit4:junit4]   2> 1475 T3046 oashc.SpellCheckComponent.inform Registering newSearcher listener for spellchecker: suggest
[junit4:junit4]   2> 1476 T3046 oashc.SpellCheckComponent.inform No queryConverter defined, using default converter
[junit4:junit4]   2> 1477 T3046 oashc.SpellCheckComponent.inform Initializing spell checkers
[junit4:junit4]   2> 1477 T3046 oasss.Suggester.init init: {name=suggest_tst,classname=org.apache.solr.spelling.suggest.Suggester,lookupImpl=org.apache.solr.spelling.suggest.tst.TSTLookup,field=suggest,storeDir=suggest_tst,buildOnCommit=true,threshold=0.0}
[junit4:junit4]   2> 1478 T3046 oasss.Suggester.init WARNING Loading stored lookup data failed java.io.FileNotFoundException: C:\Jenkins\workspace\Lucene-Solr-trunk-Windows\solr\build\solr-core\test\J0\.\solrtest-SuggesterFSTTest-1346940643176\suggest_tst\tst.dat (The system cannot find the file specified)
[junit4:junit4]   2> 	at java.io.FileInputStream.open(Native Method)
[junit4:junit4]   2> 	at java.io.FileInputStream.<init>(FileInputStream.java:138)
[junit4:junit4]   2> 	at org.apache.solr.spelling.suggest.Suggester.init(Suggester.java:115)
[junit4:junit4]   2> 	at org.apache.solr.handler.component.SpellCheckComponent.inform(SpellCheckComponent.java:596)
[junit4:junit4]   2> 	at org.apache.solr.core.SolrResourceLoader.inform(SolrResourceLoader.java:589)
[junit4:junit4]   2> 	at org.apache.solr.core.SolrCore.<init>(SolrCore.java:718)
[junit4:junit4]   2> 	at org.apache.solr.core.SolrCore.<init>(SolrCore.java:567)
[junit4:junit4]   2> 	at org.apache.solr.util.TestHarness$Initializer.initialize(TestHarness.java:190)
[junit4:junit4]   2> 	at org.apache.solr.util.TestHarness.<init>(TestHarness.java:114)
[junit4:junit4]   2> 	at org.apache.solr.util.TestHarness.<init>(TestHarness.java:109)
[junit4:junit4]   2> 	at org.apache.solr.util.TestHarness.<init>(TestHarness.java:99)
[junit4:junit4]   2> 	at org.apache.solr.SolrTestCaseJ4.createCore(SolrTestCaseJ4.java:362)
[junit4:junit4]   2> 	at org.apache.solr.SolrTestCaseJ4.initCore(SolrTestCaseJ4.java:355)
[junit4:junit4]   2> 	at org.apache.solr.spelling.suggest.SuggesterTest.testReload(SuggesterTest.java:90)
[junit4:junit4]   2> 	at sun.reflect.NativeMethodAccessorImpl.invoke0(Native Method)
[junit4:junit4]   2> 	at sun.reflect.NativeMethodAccessorImpl.invoke(NativeMethodAccessorImpl.java:57)
[junit4:junit4]   2> 	at sun.reflect.DelegatingMethodAccessorImpl.invoke(DelegatingMethodAccessorImpl.java:43)
[junit4:junit4]   2> 	at java.lang.reflect.Method.invoke(Method.java:601)
[junit4:junit4]   2> 	at com.carrotsearch.randomizedtesting.RandomizedRunner.invoke(RandomizedRunner.java:1559)
[junit4:junit4]   2> 	at com.carrotsearch.randomizedtesting.RandomizedRunner.access$600(RandomizedRunner.java:79)
[junit4:junit4]   2> 	at com.carrotsearch.randomizedtesting.RandomizedRunner$6.evaluate(RandomizedRunner.java:737)
[junit4:junit4]   2> 	at com.carrotsearch.randomizedtesting.RandomizedRunner$7.evaluate(RandomizedRunner.java:773)
[junit4:junit4]   2> 	at com.carrotsearch.randomizedtesting.RandomizedRunner$8.evaluate(RandomizedRunner.java:787)
[junit4:junit4]   2> 	at com.carrotsearch.randomizedtesting.rules.SystemPropertiesRestoreRule$1.evaluate(SystemPropertiesRestoreRule.java:53)
[junit4:junit4]   2> 	at org.apache.lucene.util.TestRuleSetupTeardownChained$1.evaluate(TestRuleSetupTeardownChained.java:50)
[junit4:junit4]   2> 	at org.apache.lucene.util.TestRuleFieldCacheSanity$1.evaluate(TestRuleFieldCacheSanity.java:51)
[junit4:junit4]   2> 	at org.apache.lucene.util.AbstractBeforeAfterRule$1.evaluate(AbstractBeforeAfterRule.java:45)
[junit4:junit4]   2> 	at com.carrotsearch.randomizedtesting.rules.SystemPropertiesInvariantRule$1.evaluate(SystemPropertiesInvariantRule.java:55)
[junit4:junit4]   2> 	at org.apache.lucene.util.TestRuleThreadAndTestName$1.evaluate(TestRuleThreadAndTestName.java:48)
[junit4:junit4]   2> 	at org.apache.lucene.util.TestRuleIgnoreAfterMaxFailures$1.evaluate(TestRuleIgnoreAfterMaxFailures.java:70)
[junit4:junit4]   2> 	at org.apache.lucene.util.TestRuleMarkFailure$1.evaluate(TestRuleMarkFailure.java:48)
[junit4:junit4]   2> 	at com.carrotsearch.randomizedtesting.rules.StatementAdapter.evaluate(StatementAdapter.java:36)
[junit4:junit4]   2> 	at com.carrotsearch.randomizedtesting.ThreadLeakControl$StatementRunner.run(ThreadLeakControl.java:358)
[junit4:junit4]   2> 	at com.carrotsearch.randomizedtesting.ThreadLeakControl.forkTimeoutingTask(ThreadLeakControl.java:782)
[junit4:junit4]   2> 	at com.carrotsearch.randomizedtesting.ThreadLeakControl$3.evaluate(ThreadLeakControl.java:442)
[junit4:junit4]   2> 	at com.carrotsearch.randomizedtesting.RandomizedRunner.runSingleTest(RandomizedRunner.java:746)
[junit4:junit4]   2> 	at com.carrotsearch.randomizedtesting.RandomizedRunner$3.evaluate(RandomizedRunner.java:648)
[junit4:junit4]   2> 	at com.carrotsearch.randomizedtesting.RandomizedRunner$4.evaluate(RandomizedRunner.java:682)
[junit4:junit4]   2> 	at com.carrotsearch.randomizedtesting.RandomizedRunner$5.evaluate(RandomizedRunner.java:693)
[junit4:junit4]   2> 	at com.carrotsearch.randomizedtesting.rules.StatementAdapter.evaluate(StatementAdapter.java:36)
[junit4:junit4]   2> 	at com.carrotsearch.randomizedtesting.rules.SystemPropertiesRestoreRule$1.evaluate(SystemPropertiesRestoreRule.java:53)
[junit4:junit4]   2> 	at org.apache.lucene.util.AbstractBeforeAfterRule$1.evaluate(AbstractBeforeAfterRule.java:45)
[junit4:junit4]   2> 	at org.apache.lucene.util.TestRuleStoreClassName$1.evaluate(TestRuleStoreClassName.java:42)
[junit4:junit4]   2> 	at com.carrotsearch.randomizedtesting.rules.SystemPropertiesInvariantRule$1.evaluate(SystemPropertiesInvariantRule.java:55)
[junit4:junit4]   2> 	at com.carrotsearch.randomizedtesting.rules.NoShadowingOrOverridesOnMethodsRule$1.evaluate(NoShadowingOrOverridesOnMethodsRule.java:39)
[junit4:junit4]   2> 	at com.carrotsearch.randomizedtesting.rules.NoShadowingOrOverridesOnMethodsRule$1.evaluate(NoShadowingOrOverridesOnMethodsRule.java:39)
[junit4:junit4]   2> 	at org.apache.lucene.util.TestRuleAssertionsRequired$1.evaluate(TestRuleAssertionsRequired.java:40)
[junit4:junit4]   2> 	at org.apache.lucene.util.TestRuleMarkFailure$1.evaluate(TestRuleMarkFailure.java:48)
[junit4:junit4]   2> 	at org.apache.lucene.util.TestRuleIgnoreAfterMaxFailures$1.evaluate(TestRuleIgnoreAfterMaxFailures.java:70)
[junit4:junit4]   2> 	at org.apache.lucene.util.TestRuleIgnoreTestSuites$1.evaluate(TestRuleIgnoreTestSuites.java:55)
[junit4:junit4]   2> 	at com.carrotsearch.randomizedtesting.rules.StatementAdapter.evaluate(StatementAdapter.java:36)
[junit4:junit4]   2> 	at com.carrotsearch.randomizedtesting.ThreadLeakControl$StatementRunner.run(ThreadLeakControl.java:358)
[junit4:junit4]   2> 	at java.lang.Thread.run(Thread.java:722)
[junit4:junit4]   2> 
[junit4:junit4]   2> 1478 T3046 oashc.SpellCheckComponent.inform Registering newSearcher listener for spellchecker: suggest_tst
[junit4:junit4]   2> 1478 T3046 oashc.SpellCheckComponent.inform No queryConverter defined, using default converter
[junit4:junit4]   2> 1478 T3046 oashc.SpellCheckComponent.inform Initializing spell checkers
[junit4:junit4]   2> 1478 T3046 oasss.Suggester.init init: {name=suggest_fst,classname=org.apache.solr.spelling.suggest.Suggester,lookupImpl=org.apache.solr.spelling.suggest.fst.FSTLookup,field=suggest,storeDir=suggest_fst,buildOnCommit=true,weightBuckets=5,exactMatchFirst=true}
[junit4:junit4]   2> 1480 T3046 oasss.Suggester.init WARNING Loading stored lookup data failed java.io.FileNotFoundException: C:\Jenkins\workspace\Lucene-Solr-trunk-Windows\solr\build\solr-core\test\J0\.\solrtest-SuggesterFSTTest-1346940643176\suggest_fst\fst.bin (The system cannot find the file specified)
[junit4:junit4]   2> 	at java.io.FileInputStream.open(Native Method)
[junit4:junit4]   2> 	at java.io.FileInputStream.<init>(FileInputStream.java:138)
[junit4:junit4]   2> 	at org.apache.solr.spelling.suggest.Suggester.init(Suggester.java:115)
[junit4:junit4]   2> 	at org.apache.solr.handler.component.SpellCheckComponent.inform(SpellCheckComponent.java:596)
[junit4:junit4]   2> 	at org.apache.solr.core.SolrResourceLoader.inform(SolrResourceLoader.java:589)
[junit4:junit4]   2> 	at org.apache.solr.core.SolrCore.<init>(SolrCore.java:718)
[junit4:junit4]   2> 	at org.apache.solr.core.SolrCore.<init>(SolrCore.java:567)
[junit4:junit4]   2> 	at org.apache.solr.util.TestHarness$Initializer.initialize(TestHarness.java:190)
[junit4:junit4]   2> 	at org.apache.solr.util.TestHarness.<init>(TestHarness.java:114)
[junit4:junit4]   2> 	at org.apache.solr.util.TestHarness.<init>(TestHarness.java:109)
[junit4:junit4]   2> 	at org.apache.solr.util.TestHarness.<init>(TestHarness.java:99)
[junit4:junit4]   2> 	at org.apache.solr.SolrTestCaseJ4.createCore(SolrTestCaseJ4.java:362)
[junit4:junit4]   2> 	at org.apache.solr.SolrTestCaseJ4.initCore(SolrTestCaseJ4.java:355)
[junit4:junit4]   2> 	at org.apache.solr.spelling.suggest.SuggesterTest.testReload(SuggesterTest.java:90)
[junit4:junit4]   2> 	at sun.reflect.NativeMethodAccessorImpl.invoke0(Native Method)
[junit4:junit4]   2> 	at sun.reflect.NativeMethodAccessorImpl.invoke(NativeMethodAccessorImpl.java:57)
[junit4:junit4]   2> 	at sun.reflect.DelegatingMethodAccessorImpl.invoke(DelegatingMethodAccessorImpl.java:43)
[junit4:junit4]   2> 	at java.lang.reflect.Method.invoke(Method.java:601)
[junit4:junit4]   2> 	at com.carrotsearch.randomizedtesting.RandomizedRunner.invoke(RandomizedRunner.java:1559)
[junit4:junit4]   2> 	at com.carrotsearch.randomizedtesting.RandomizedRunner.access$600(RandomizedRunner.java:79)
[junit4:junit4]   2> 	at com.carrotsearch.randomizedtesting.RandomizedRunner$6.evaluate(RandomizedRunner.java:737)
[junit4:junit4]   2> 	at com.carrotsearch.randomizedtesting.RandomizedRunner$7.evaluate(RandomizedRunner.java:773)
[junit4:junit4]   2> 	at com.carrotsearch.randomizedtesting.RandomizedRunner$8.evaluate(RandomizedRunner.java:787)
[junit4:junit4]   2> 	at com.carrotsearch.randomizedtesting.rules.SystemPropertiesRestoreRule$1.evaluate(SystemPropertiesRestoreRule.java:53)
[junit4:junit4]   2> 	at org.apache.lucene.util.TestRuleSetupTeardownChained$1.evaluate(TestRuleSetupTeardownChained.java:50)
[junit4:junit4]   2> 	at org.apache.lucene.util.TestRuleFieldCacheSanity$1.evaluate(TestRuleFieldCacheSanity.java:51)
[junit4:junit4]   2> 	at org.apache.lucene.util.AbstractBeforeAfterRule$1.evaluate(AbstractBeforeAfterRule.java:45)
[junit4:junit4]   2> 	at com.carrotsearch.randomizedtesting.rules.SystemPropertiesInvariantRule$1.evaluate(SystemPropertiesInvariantRule.java:55)
[junit4:junit4]   2> 	at org.apache.lucene.util.TestRuleThreadAndTestName$1.evaluate(TestRuleThreadAndTestName.java:48)
[junit4:junit4]   2> 	at org.apache.lucene.util.TestRuleIgnoreAfterMaxFailures$1.evaluate(TestRuleIgnoreAfterMaxFailures.java:70)
[junit4:junit4]   2> 	at org.apache.lucene.util.TestRuleMarkFailure$1.evaluate(TestRuleMarkFailure.java:48)
[junit4:junit4]   2> 	at com.carrotsearch.randomizedtesting.rules.StatementAdapter.evaluate(StatementAdapter.java:36)
[junit4:junit4]   2> 	at com.carrotsearch.randomizedtesting.ThreadLeakControl$StatementRunner.run(ThreadLeakControl.java:358)
[junit4:junit4]   2> 	at com.carrotsearch.randomizedtesting.ThreadLeakControl.forkTimeoutingTask(ThreadLeakControl.java:782)
[junit4:junit4]   2> 	at com.carrotsearch.randomizedtesting.ThreadLeakControl$3.evaluate(ThreadLeakControl.java:442)
[junit4:junit4]   2> 	at com.carrotsearch.randomizedtesting.RandomizedRunner.runSingleTest(RandomizedRunner.java:746)
[junit4:junit4]   2> 	at com.carrotsearch.randomizedtesting.RandomizedRunner$3.evaluate(RandomizedRunner.java:648)
[junit4:junit4]   2> 	at com.carrotsearch.randomizedtesting.RandomizedRunner$4.evaluate(RandomizedRunner.java:682)
[junit4:junit4]   2> 	at com.carrotsearch.randomizedtesting.RandomizedRunner$5.evaluate(RandomizedRunner.java:693)
[junit4:junit4]   2> 	at com.carrotsearch.randomizedtesting.rules.StatementAdapter.evaluate(StatementAdapter.java:36)
[junit4:junit4]   2> 	at com.carrotsearch.randomizedtesting.rules.SystemPropertiesRestoreRule$1.evaluate(SystemPropertiesRestoreRule.java:53)
[junit4:junit4]   2> 	at org.apache.lucene.util.AbstractBeforeAfterRule$1.evaluate(AbstractBeforeAfterRule.java:45)
[junit4:junit4]   2> 	at org.apache.lucene.util.TestRuleStoreClassName$1.evaluate(TestRuleStoreClassName.java:42)
[junit4:junit4]   2> 	at com.carrotsearch.randomizedtesting.rules.SystemPropertiesInvariantRule$1.evaluate(SystemPropertiesInvariantRule.java:55)
[junit4:junit4]   2> 	at com.carrotsearch.randomizedtesting.rules.NoShadowingOrOverridesOnMethodsRule$1.evaluate(NoShadowingOrOverridesOnMethodsRule.java:39)
[junit4:junit4]   2> 	at com.carrotsearch.randomizedtesting.rules.NoShadowingOrOverridesOnMethodsRule$1.evaluate(NoShadowingOrOverridesOnMethodsRule.java:39)
[junit4:junit4]   2> 	at org.apache.lucene.util.TestRuleAssertionsRequired$1.evaluate(TestRuleAssertionsRequired.java:40)
[junit4:junit4]   2> 	at org.apache.lucene.util.TestRuleMarkFailure$1.evaluate(TestRuleMarkFailure.java:48)
[junit4:junit4]   2> 	at org.apache.lucene.util.TestRuleIgnoreAfterMaxFailures$1.evaluate(TestRuleIgnoreAfterMaxFailures.java:70)
[junit4:junit4]   2> 	at org.apache.lucene.util.TestRuleIgnoreTestSuites$1.evaluate(TestRuleIgnoreTestSuites.java:55)
[junit4:junit4]   2> 	at com.carrotsearch.randomizedtesting.rules.StatementAdapter.evaluate(StatementAdapter.java:36)
[junit4:junit4]   2> 	at com.carrotsearch.randomizedtesting.ThreadLeakControl$StatementRunner.run(ThreadLeakControl.java:358)
[junit4:junit4]   2> 	at java.lang.Thread.run(Thread.java:722)
[junit4:junit4]   2> 
[junit4:junit4]   2> 1482 T3046 oashc.SpellCheckComponent.inform Registering newSearcher listener for spellchecker: suggest_fst
[junit4:junit4]   2> 1482 T3046 oashc.SpellCheckComponent.inform No queryConverter defined, using default converter
[junit4:junit4]   2> 1482 T3046 oashc.SpellCheckComponent.inform Initializing spell checkers
[junit4:junit4]   2> 1482 T3046 oasss.Suggester.init init: {name=suggest_wfst,classname=org.apache.solr.spelling.suggest.Suggester,lookupImpl=org.apache.solr.spelling.suggest.fst.WFSTLookupFactory,field=suggest,storeDir=suggest_wfst,buildOnCommit=true,exactMatchFirst=true}
[junit4:junit4]   2> 1485 T3046 oasss.Suggester.init WARNING Loading stored lookup data failed java.io.FileNotFoundException: C:\Jenkins\workspace\Lucene-Solr-trunk-Windows\solr\build\solr-core\test\J0\.\solrtest-SuggesterFSTTest-1346940643176\suggest_wfst\wfst.bin (The system cannot find the file specified)
[junit4:junit4]   2> 	at java.io.FileInputStream.open(Native Method)
[junit4:junit4]   2> 	at java.io.FileInputStream.<init>(FileInputStream.java:138)
[junit4:junit4]   2> 	at org.apache.solr.spelling.suggest.Suggester.init(Suggester.java:115)
[junit4:junit4]   2> 	at org.apache.solr.handler.component.SpellCheckComponent.inform(SpellCheckComponent.java:596)
[junit4:junit4]   2> 	at org.apache.solr.core.SolrResourceLoader.inform(SolrResourceLoader.java:589)
[junit4:junit4]   2> 	at org.apache.solr.core.SolrCore.<init>(SolrCore.java:718)
[junit4:junit4]   2> 	at org.apache.solr.core.SolrCore.<init>(SolrCore.java:567)
[junit4:junit4]   2> 	at org.apache.solr.util.TestHarness$Initializer.initialize(TestHarness.java:190)
[junit4:junit4]   2> 	at org.apache.solr.util.TestHarness.<init>(TestHarness.java:114)
[junit4:junit4]   2> 	at org.apache.solr.util.TestHarness.<init>(TestHarness.java:109)
[junit4:junit4]   2> 	at org.apache.solr.util.TestHarness.<init>(TestHarness.java:99)
[junit4:junit4]   2> 	at org.apache.solr.SolrTestCaseJ4.createCore(SolrTestCaseJ4.java:362)
[junit4:junit4]   2> 	at org.apache.solr.SolrTestCaseJ4.initCore(SolrTestCaseJ4.java:355)
[junit4:junit4]   2> 	at org.apache.solr.spelling.suggest.SuggesterTest.testReload(SuggesterTest.java:90)
[junit4:junit4]   2> 	at sun.reflect.NativeMethodAccessorImpl.invoke0(Native Method)
[junit4:junit4]   2> 	at sun.reflect.NativeMethodAccessorImpl.invoke(NativeMethodAccessorImpl.java:57)
[junit4:junit4]   2> 	at sun.reflect.DelegatingMethodAccessorImpl.invoke(DelegatingMethodAccessorImpl.java:43)
[junit4:junit4]   2> 	at java.lang.reflect.Method.invoke(Method.java:601)
[junit4:junit4]   2> 	at com.carrotsearch.randomizedtesting.RandomizedRunner.invoke(RandomizedRunner.java:1559)
[junit4:junit4]   2> 	at com.carrotsearch.randomizedtesting.RandomizedRunner.access$600(RandomizedRunner.java:79)
[junit4:junit4]   2> 	at com.carrotsearch.randomizedtesting.RandomizedRunner$6.evaluate(RandomizedRunner.java:737)
[junit4:junit4]   2> 	at com.carrotsearch.randomizedtesting.RandomizedRunner$7.evaluate(RandomizedRunner.java:773)
[junit4:junit4]   2> 	at com.carrotsearch.randomizedtesting.RandomizedRunner$8.evaluate(RandomizedRunner.java:787)
[junit4:junit4]   2> 	at com.carrotsearch.randomizedtesting.rules.SystemPropertiesRestoreRule$1.evaluate(SystemPropertiesRestoreRule.java:53)
[junit4:junit4]   2> 	at org.apache.lucene.util.TestRuleSetupTeardownChained$1.evaluate(TestRuleSetupTeardownChained.java:50)
[junit4:junit4]   2> 	at org.apache.lucene.util.TestRuleFieldCacheSanity$1.evaluate(TestRuleFieldCacheSanity.java:51)
[junit4:junit4]   2> 	at org.apache.lucene.util.AbstractBeforeAfterRule$1.evaluate(AbstractBeforeAfterRule.java:45)
[junit4:junit4]   2> 	at com.carrotsearch.randomizedtesting.rules.SystemPropertiesInvariantRule$1.evaluate(SystemPropertiesInvariantRule.java:55)
[junit4:junit4]   2> 	at org.apache.lucene.util.TestRuleThreadAndTestName$1.evaluate(TestRuleThreadAndTestName.java:48)
[junit4:junit4]   2> 	at org.apache.lucene.util.TestRuleIgnoreAfterMaxFailures$1.evaluate(TestRuleIgnoreAfterMaxFailures.java:70)
[junit4:junit4]   2> 	at org.apache.lucene.util.TestRuleMarkFailure$1.evaluate(TestRuleMarkFailure.java:48)
[junit4:junit4]   2> 	at com.carrotsearch.randomizedtesting.rules.StatementAdapter.evaluate(StatementAdapter.java:36)
[junit4:junit4]   2> 	at com.carrotsearch.randomizedtesting.ThreadLeakControl$StatementRunner.run(ThreadLeakControl.java:358)
[junit4:junit4]   2> 	at com.carrotsearch.randomizedtesting.ThreadLeakControl.forkTimeoutingTask(ThreadLeakControl.java:782)
[junit4:junit4]   2> 	at com.carrotsearch.randomizedtesting.ThreadLeakControl$3.evaluate(ThreadLeakControl.java:442)
[junit4:junit4]   2> 	at com.carrotsearch.randomizedtesting.RandomizedRunner.runSingleTest(RandomizedRunner.java:746)
[junit4:junit4]   2> 	at com.carrotsearch.randomizedtesting.RandomizedRunner$3.evaluate(RandomizedRunner.java:648)
[junit4:junit4]   2> 	at com.carrotsearch.randomizedtesting.RandomizedRunner$4.evaluate(RandomizedRunner.java:682)
[junit4:junit4]   2> 	at com.carrotsearch.randomizedtesting.RandomizedRunner$5.evaluate(RandomizedRunner.java:693)
[junit4:junit4]   2> 	at com.carrotsearch.randomizedtesting.rules.StatementAdapter.evaluate(StatementAdapter.java:36)
[junit4:junit4]   2> 	at com.carrotsearch.randomizedtesting.rules.SystemPropertiesRestoreRule$1.evaluate(SystemPropertiesRestoreRule.java:53)
[junit4:junit4]   2> 	at org.apache.lucene.util.AbstractBeforeAfterRule$1.evaluate(AbstractBeforeAfterRule.java:45)
[junit4:junit4]   2> 	at org.apache.lucene.util.TestRuleStoreClassName$1.evaluate(TestRuleStoreClassName.java:42)
[junit4:junit4]   2> 	at com.carrotsearch.randomizedtesting.rules.SystemPropertiesInvariantRule$1.evaluate(SystemPropertiesInvariantRule.java:55)
[junit4:junit4]   2> 	at com.carrotsearch.randomizedtesting.rules.NoShadowingOrOverridesOnMethodsRule$1.evaluate(NoShadowingOrOverridesOnMethodsRule.java:39)
[junit4:junit4]   2> 	at com.carrotsearch.randomizedtesting.rules.NoShadowingOrOverridesOnMethodsRule$1.evaluate(NoShadowingOrOverridesOnMethodsRule.java:39)
[junit4:junit4]   2> 	at org.apache.lucene.util.TestRuleAssertionsRequired$1.evaluate(TestRuleAssertionsRequired.java:40)
[junit4:junit4]   2> 	at org.apache.lucene.util.TestRuleMarkFailure$1.evaluate(TestRuleMarkFailure.java:48)
[junit4:junit4]   2> 	at org.apache.lucene.util.TestRuleIgnoreAfterMaxFailures$1.evaluate(TestRuleIgnoreAfterMaxFailures.java:70)
[junit4:junit4]   2> 	at org.apache.lucene.util.TestRuleIgnoreTestSuites$1.evaluate(TestRuleIgnoreTestSuites.java:55)
[junit4:junit4]   2> 	at com.carrotsearch.randomizedtesting.rules.StatementAdapter.evaluate(StatementAdapter.java:36)
[junit4:junit4]   2> 	at com.carrotsearch.randomizedtesting.ThreadLeakControl$StatementRunner.run(ThreadLeakControl.java:358)
[junit4:junit4]   2> 	at java.lang.Thread.run(Thread.java:722)
[junit4:junit4]   2> 
[junit4:junit4]   2> 1485 T3046 oashc.SpellCheckComponent.inform Registering newSearcher listener for spellchecker: suggest_wfst
[junit4:junit4]   2> 1485 T3046 oashc.SpellCheckComponent.inform No queryConverter defined, using default converter
[junit4:junit4]   2> 1485 T3046 oashc.HttpShardHandlerFactory.getParameter Setting socketTimeout to: 0
[junit4:junit4]   2> 1485 T3046 oashc.HttpShardHandlerFactory.getParameter Setting urlScheme to: http://
[junit4:junit4]   2> 1487 T3046 oashc.HttpShardHandlerFactory.getParameter Setting connTimeout to: 0
[junit4:junit4]   2> 1487 T3046 oashc.HttpShardHandlerFactory.getParameter Setting maxConnectionsPerHost to: 20
[junit4:junit4]   2> 1487 T3046 oashc.HttpShardHandlerFactory.getParameter Setting corePoolSize to: 0
[junit4:junit4]   2> 1487 T3046 oashc.HttpShardHandlerFactory.getParameter Setting maximumPoolSize to: 2147483647
[junit4:junit4]   2> 1487 T3046 oashc.HttpShardHandlerFactory.getParameter Setting maxThreadIdleTime to: 5
[junit4:junit4]   2> 1487 T3046 oashc.HttpShardHandlerFactory.getParameter Setting sizeOfQueue to: -1
[junit4:junit4]   2> 1487 T3046 oashc.HttpShardHandlerFactory.getParameter Setting fairnessPolicy to: false
[junit4:junit4]   2> 1487 T3046 oascsi.HttpClientUtil.createClient Creating new http client, config:maxConnectionsPerHost=20&maxConnections=10000&socketTimeout=0&connTimeout=0&retry=false
[junit4:junit4]   2> 1496 T3048 oasc.SolrCore.registerSearcher [collection1] Registered new searcher Searcher@53c0add9 main{StandardDirectoryReader(segments_2:3 _0(5.0):C3)}
[junit4:junit4]   2> 1496 T3046 oasc.CoreContainer.register registering core: collection1
[junit4:junit4]   2> 1500 T3046 oas.SolrTestCaseJ4.initCore ####initCore end
[junit4:junit4]   2> ASYNC  NEW_CORE C242 name=collection1 org.apache.solr.core.SolrCore@722bddfb
[junit4:junit4]   2> 1502 T3046 C242 oasc.SolrException.log SEVERE java.lang.NullPointerException
[junit4:junit4]   2> 		at org.apache.lucene.search.suggest.fst.FSTCompletionLookup.lookup(FSTCompletionLookup.java:237)
[junit4:junit4]   2> 		at org.apache.solr.spelling.suggest.Suggester.getSuggestions(Suggester.java:190)
[junit4:junit4]   2> 		at org.apache.solr.handler.component.SpellCheckComponent.process(SpellCheckComponent.java:172)
[junit4:junit4]   2> 		at org.apache.solr.handler.component.SearchHandler.handleRequestBody(SearchHandler.java:206)
[junit4:junit4]   2> 		at org.apache.solr.handler.RequestHandlerBase.handleRequest(RequestHandlerBase.java:129)
[junit4:junit4]   2> 		at org.apache.solr.core.SolrCore.execute(SolrCore.java:1693)
[junit4:junit4]   2> 		at org.apache.solr.util.TestHarness.query(TestHarness.java:351)
[junit4:junit4]   2> 		at org.apache.solr.util.TestHarness.query(TestHarness.java:333)
[junit4:junit4]   2> 		at org.apache.solr.SolrTestCaseJ4.assertQ(SolrTestCaseJ4.java:467)
[junit4:junit4]   2> 		at org.apache.solr.SolrTestCaseJ4.assertQ(SolrTestCaseJ4.java:460)
[junit4:junit4]   2> 		at org.apache.solr.spelling.suggest.SuggesterTest.testReload(SuggesterTest.java:91)
[junit4:junit4]   2> 		at sun.reflect.NativeMethodAccessorImpl.invoke0(Native Method)
[junit4:junit4]   2> 		at sun.reflect.NativeMethodAccessorImpl.invoke(NativeMethodAccessorImpl.java:57)
[junit4:junit4]   2> 		at sun.reflect.DelegatingMethodAccessorImpl.invoke(DelegatingMethodAccessorImpl.java:43)
[junit4:junit4]   2> 		at java.lang.reflect.Method.invoke(Method.java:601)
[junit4:junit4]   2> 		at com.carrotsearch.randomizedtesting.RandomizedRunner.invoke(RandomizedRunner.java:1559)
[junit4:junit4]   2> 		at com.carrotsearch.randomizedtesting.RandomizedRunner.access$600(RandomizedRunner.java:79)
[junit4:junit4]   2> 		at com.carrotsearch.randomizedtesting.RandomizedRunner$6.evaluate(RandomizedRunner.java:737)
[junit4:junit4]   2> 		at com.carrotsearch.randomizedtesting.RandomizedRunner$7.evaluate(RandomizedRunner.java:773)
[junit4:junit4]   2> 		at com.carrotsearch.randomizedtesting.RandomizedRunner$8.evaluate(RandomizedRunner.java:787)
[junit4:junit4]   2> 		at com.carrotsearch.randomizedtesting.rules.SystemPropertiesRestoreRule$1.evaluate(SystemPropertiesRestoreRule.java:53)
[junit4:junit4]   2> 		at org.apache.lucene.util.TestRuleSetupTeardownChained$1.evaluate(TestRuleSetupTeardownChained.java:50)
[junit4:junit4]   2> 		at org.apache.lucene.util.TestRuleFieldCacheSanity$1.evaluate(TestRuleFieldCacheSanity.java:51)
[junit4:junit4]   2> 		at org.apache.lucene.util.AbstractBeforeAfterRule$1.evaluate(AbstractBeforeAfterRule.java:45)
[junit4:junit4]   2> 		at com.carrotsearch.randomizedtesting.rules.SystemPropertiesInvariantRule$1.evaluate(SystemPropertiesInvariantRule.java:55)
[junit4:junit4]   2> 		at org.apache.lucene.util.TestRuleThreadAndTestName$1.evaluate(TestRuleThreadAndTestName.java:48)
[junit4:junit4]   2> 		at org.apache.lucene.util.TestRuleIgnoreAfterMaxFailures$1.evaluate(TestRuleIgnoreAfterMaxFailures.java:70)
[junit4:junit4]   2> 		at org.apache.lucene.util.TestRuleMarkFailure$1.evaluate(TestRuleMarkFailure.java:48)
[junit4:junit4]   2> 		at com.carrotsearch.randomizedtesting.rules.StatementAdapter.evaluate(StatementAdapter.java:36)
[junit4:junit4]   2> 		at com.carrotsearch.randomizedtesting.ThreadLeakControl$StatementRunner.run(ThreadLeakControl.java:358)
[junit4:junit4]   2> 		at com.carrotsearch.randomizedtesting.ThreadLeakControl.forkTimeoutingTask(ThreadLeakControl.java:782)
[junit4:junit4]   2> 		at com.carrotsearch.randomizedtesting.ThreadLeakControl$3.evaluate(ThreadLeakControl.java:442)
[junit4:junit4]   2> 		at com.carrotsearch.randomizedtesting.RandomizedRunner.runSingleTest(RandomizedRunner.java:746)
[junit4:junit4]   2> 		at com.carrotsearch.randomizedtesting.RandomizedRunner$3.evaluate(RandomizedRunner.java:648)
[junit4:junit4]   2> 		at com.carrotsearch.randomizedtesting.RandomizedRunner$4.evaluate(RandomizedRunner.java:682)
[junit4:junit4]   2> 		at com.carrotsearch.randomizedtesting.RandomizedRunner$5.evaluate(RandomizedRunner.java:693)
[junit4:junit4]   2> 		at com.carrotsearch.randomizedtesting.rules.StatementAdapter.evaluate(StatementAdapter.java:36)
[junit4:junit4]   2> 		at com.carrotsearch.randomizedtesting.rules.SystemPropertiesRestoreRule$1.evaluate(SystemPropertiesRestoreRule.java:53)
[junit4:junit4]   2> 		at org.apache.lucene.util.AbstractBeforeAfterRule$1.evaluate(AbstractBeforeAfterRule.java:45)
[junit4:junit4]   2> 		at org.apache.lucene.util.TestRuleStoreClassName$1.evaluate(TestRuleStoreClassName.java:42)
[junit4:junit4]   2> 		at com.carrotsearch.randomizedtesting.rules.SystemPropertiesInvariantRule$1.evaluate(SystemPropertiesInvariantRule.java:55)
[junit4:junit4]   2> 		at com.carrotsearch.randomizedtesting.rules.NoShadowingOrOverridesOnMethodsRule$1.evaluate(NoShadowingOrOverridesOnMethodsRule.java:39)
[junit4:junit4]   2> 		at com.carrotsearch.randomizedtesting.rules.NoShadowingOrOverridesOnMethodsRule$1.evaluate(NoShadowingOrOverridesOnMethodsRule.java:39)
[junit4:junit4]   2> 		at org.apache.lucene.util.TestRuleAssertionsRequired$1.evaluate(TestRuleAssertionsRequired.java:40)
[junit4:junit4]   2> 		at org.apache.lucene.util.TestRuleMarkFailure$1.evaluate(TestRuleMarkFailure.java:48)
[junit4:junit4]   2> 		at org.apache.lucene.util.TestRuleIgnoreAfterMaxFailures$1.evaluate(TestRuleIgnoreAfterMaxFailures.java:70)
[junit4:junit4]   2> 		at org.apache.lucene.util.TestRuleIgnoreTestSuites$1.evaluate(TestRuleIgnoreTestSuites.java:55)
[junit4:junit4]   2> 		at com.carrotsearch.randomizedtesting.rules.StatementAdapter.evaluate(StatementAdapter.java:36)
[junit4:junit4]   2> 		at com.carrotsearch.randomizedtesting.ThreadLeakControl$StatementRunner.run(ThreadLeakControl.java:358)
[junit4:junit4]   2> 		at java.lang.Thread.run(Thread.java:722)
[junit4:junit4]   2> 	
[junit4:junit4]   2> 1504 T3046 C242 REQ [collection1] webapp=null path=null params={q=ac&spellcheck.count=2&qt=/suggest_fst&spellcheck.onlyMorePopular=true} status=500 QTime=3 
[junit4:junit4]   2> 1505 T3046 oasc.SolrException.log SEVERE REQUEST FAILED: q=ac&spellcheck.count=2&qt=/suggest_fst&spellcheck.onlyMorePopular=true:java.lang.NullPointerException
[junit4:junit4]   2> 		at org.apache.lucene.search.suggest.fst.FSTCompletionLookup.lookup(FSTCompletionLookup.java:237)
[junit4:junit4]   2> 		at org.apache.solr.spelling.suggest.Suggester.getSuggestions(Suggester.java:190)
[junit4:junit4]   2> 		at org.apache.solr.handler.component.SpellCheckComponent.process(SpellCheckComponent.java:172)
[junit4:junit4]   2> 		at org.apache.solr.handler.component.SearchHandler.handleRequestBody(SearchHandler.java:206)
[junit4:junit4]   2> 		at org.apache.solr.handler.RequestHandlerBase.handleRequest(RequestHandlerBase.java:129)
[junit4:junit4]   2> 		at org.apache.solr.core.SolrCore.execute(SolrCore.java:1693)
[junit4:junit4]   2> 		at org.apache.solr.util.TestHarness.query(TestHarness.java:351)
[junit4:junit4]   2> 		at org.apache.solr.util.TestHarness.query(TestHarness.java:333)
[junit4:junit4]   2> 		at org.apache.solr.SolrTestCaseJ4.assertQ(SolrTestCaseJ4.java:467)
[junit4:junit4]   2> 		at org.apache.solr.SolrTestCaseJ4.assertQ(SolrTestCaseJ4.java:460)
[junit4:junit4]   2> 		at org.apache.solr.spelling.suggest.SuggesterTest.testReload(SuggesterTest.java:91)
[junit4:junit4]   2> 		at sun.reflect.NativeMethodAccessorImpl.invoke0(Native Method)
[junit4:junit4]   2> 		at sun.reflect.NativeMethodAccessorImpl.invoke(NativeMethodAccessorImpl.java:57)
[junit4:junit4]   2> 		at sun.reflect.DelegatingMethodAccessorImpl.invoke(DelegatingMethodAccessorImpl.java:43)
[junit4:junit4]   2> 		at java.lang.reflect.Method.invoke(Method.java:601)
[junit4:junit4]   2> 		at com.carrotsearch.randomizedtesting.RandomizedRunner.invoke(RandomizedRunner.java:1559)
[junit4:junit4]   2> 		at com.carrotsearch.randomizedtesting.RandomizedRunner.access$600(RandomizedRunner.java:79)
[junit4:junit4]   2> 		at com.carrotsearch.randomizedtesting.RandomizedRunner$6.evaluate(RandomizedRunner.java:737)
[junit4:junit4]   2> 		at com.carrotsearch.randomizedtesting.RandomizedRunner$7.evaluate(RandomizedRunner.java:773)
[junit4:junit4]   2> 		at com.carrotsearch.randomizedtesting.RandomizedRunner$8.evaluate(RandomizedRunner.java:787)
[junit4:junit4]   2> 		at com.carrotsearch.randomizedtesting.rules.SystemPropertiesRestoreRule$1.evaluate(SystemPropertiesRestoreRule.java:53)
[junit4:junit4]   2> 		at org.apache.lucene.util.TestRuleSetupTeardownChained$1.evaluate(TestRuleSetupTeardownChained.java:50)
[junit4:junit4]   2> 		at org.apache.lucene.util.TestRuleFieldCacheSanity$1.evaluate(TestRuleFieldCacheSanity.java:51)
[junit4:junit4]   2> 		at org.apache.lucene.util.AbstractBeforeAfterRule$1.evaluate(AbstractBeforeAfterRule.java:45)
[junit4:junit4]   2> 		at com.carrotsearch.randomizedtesting.rules.SystemPropertiesInvariantRule$1.evaluate(SystemPropertiesInvariantRule.java:55)
[junit4:junit4]   2> 		at org.apache.lucene.util.TestRuleThreadAndTestName$1.evaluate(TestRuleThreadAndTestName.java:48)
[junit4:junit4]   2> 		at org.apache.lucene.util.TestRuleIgnoreAfterMaxFailures$1.evaluate(TestRuleIgnoreAfterMaxFailures.java:70)
[junit4:junit4]   2> 		at org.apache.lucene.util.TestRuleMarkFailure$1.evaluate(TestRuleMarkFailure.java:48)
[junit4:junit4]   2> 		at com.carrotsearch.randomizedtesting.rules.StatementAdapter.evaluate(StatementAdapter.java:36)
[junit4:junit4]   2> 		at com.carrotsearch.randomizedtesting.ThreadLeakControl$StatementRunner.run(ThreadLeakControl.java:358)
[junit4:junit4]   2> 		at com.carrotsearch.randomizedtesting.ThreadLeakControl.forkTimeoutingTask(ThreadLeakControl.java:782)
[junit4:junit4]   2> 		at com.carrotsearch.randomizedtesting.ThreadLeakControl$3.evaluate(ThreadLeakControl.java:442)
[junit4:junit4]   2> 		at com.carrotsearch.randomizedtesting.RandomizedRunner.runSingleTest(RandomizedRunner.java:746)
[junit4:junit4]   2> 		at com.carrotsearch.randomizedtesting.RandomizedRunner$3.evaluate(RandomizedRunner.java:648)
[junit4:junit4]   2> 		at com.carrotsearch.randomizedtesting.RandomizedRunner$4.evaluate(RandomizedRunner.java:682)
[junit4:junit4]   2> 		at com.carrotsearch.randomizedtesting.RandomizedRunner$5.evaluate(RandomizedRunner.java:693)
[junit4:junit4]   2> 		at com.carrotsearch.randomizedtesting.rules.StatementAdapter.evaluate(StatementAdapter.java:36)
[junit4:junit4]   2> 		at com.carrotsearch.randomizedtesting.rules.SystemPropertiesRestoreRule$1.evaluate(SystemPropertiesRestoreRule.java:53)
[junit4:junit4]   2> 		at org.apache.lucene.util.AbstractBeforeAfterRule$1.evaluate(AbstractBeforeAfterRule.java:45)
[junit4:junit4]   2> 		at org.apache.lucene.util.TestRuleStoreClassName$1.evaluate(TestRuleStoreClassName.java:42)
[junit4:junit4]   2> 		at com.carrotsearch.randomizedtesting.rules.SystemPropertiesInvariantRule$1.evaluate(SystemPropertiesInvariantRule.java:55)
[junit4:junit4]   2> 		at com.carrotsearch.randomizedtesting.rules.NoShadowingOrOverridesOnMethodsRule$1.evaluate(NoShadowingOrOverridesOnMethodsRule.java:39)
[junit4:junit4]   2> 		at com.carrotsearch.randomizedtesting.rules.NoShadowingOrOverridesOnMethodsRule$1.evaluate(NoShadowingOrOverridesOnMethodsRule.java:39)
[junit4:junit4]   2> 		at org.apache.lucene.util.TestRuleAssertionsRequired$1.evaluate(TestRuleAssertionsRequired.java:40)
[junit4:junit4]   2> 		at org.apache.lucene.util.TestRuleMarkFailure$1.evaluate(TestRuleMarkFailure.java:48)
[junit4:junit4]   2> 		at org.apache.lucene.util.TestRuleIgnoreAfterMaxFailures$1.evaluate(TestRuleIgnoreAfterMaxFailures.java:70)
[junit4:junit4]   2> 		at org.apache.lucene.util.TestRuleIgnoreTestSuites$1.evaluate(TestRuleIgnoreTestSuites.java:55)
[junit4:junit4]   2> 		at com.carrotsearch.randomizedtesting.rules.StatementAdapter.evaluate(StatementAdapter.java:36)
[junit4:junit4]   2> 		at com.carrotsearch.randomizedtesting.ThreadLeakControl$StatementRunner.run(ThreadLeakControl.java:358)
[junit4:junit4]   2> 		at java.lang.Thread.run(Thread.java:722)
[junit4:junit4]   2> 	
[junit4:junit4]   2> 1506 T3046 oas.SolrTestCaseJ4.tearDown ###Ending testReload
[junit4:junit4]   2> NOTE: reproduce with: ant test  -Dtestcase=SuggesterFSTTest -Dtests.method=testReload -Dtests.seed=A4B9BCD5B474F45C -Dtests.slow=true -Dtests.locale=sr_ME_#Latn -Dtests.timezone=America/Argentina/San_Juan -Dtests.file.encoding=Cp1252
[junit4:junit4] ERROR   1.23s | SuggesterFSTTest.testReload <<<
[junit4:junit4]    > Throwable #1: java.lang.RuntimeException: Exception during query
[junit4:junit4]    > 	at __randomizedtesting.SeedInfo.seed([A4B9BCD5B474F45C:6349C4D67E370C4E]:0)
[junit4:junit4]    > 	at org.apache.solr.SolrTestCaseJ4.assertQ(SolrTestCaseJ4.java:493)
[junit4:junit4]    > 	at org.apache.solr.SolrTestCaseJ4.assertQ(SolrTestCaseJ4.java:460)
[junit4:junit4]    > 	at org.apache.solr.spelling.suggest.SuggesterTest.testReload(SuggesterTest.java:91)
[junit4:junit4]    > 	at sun.reflect.NativeMethodAccessorImpl.invoke0(Native Method)
[junit4:junit4]    > 	at sun.reflect.NativeMethodAccessorImpl.invoke(NativeMethodAccessorImpl.java:57)
[junit4:junit4]    > 	at sun.reflect.DelegatingMethodAccessorImpl.invoke(DelegatingMethodAccessorImpl.java:43)
[junit4:junit4]    > 	at java.lang.reflect.Method.invoke(Method.java:601)
[junit4:junit4]    > 	at com.carrotsearch.randomizedtesting.RandomizedRunner.invoke(RandomizedRunner.java:1559)
[junit4:junit4]    > 	at com.carrotsearch.randomizedtesting.RandomizedRunner.access$600(RandomizedRunner.java:79)
[junit4:junit4]    > 	at com.carrotsearch.randomizedtesting.RandomizedRunner$6.evaluate(RandomizedRunner.java:737)
[junit4:junit4]    > 	at com.carrotsearch.randomizedtesting.RandomizedRunner$7.evaluate(RandomizedRunner.java:773)
[junit4:junit4]    > 	at com.carrotsearch.randomizedtesting.RandomizedRunner$8.evaluate(RandomizedRunner.java:787)
[junit4:junit4]    > 	at com.carrotsearch.randomizedtesting.rules.SystemPropertiesRestoreRule$1.evaluate(SystemPropertiesRestoreRule.java:53)
[junit4:junit4]    > 	at org.apache.lucene.util.TestRuleSetupTeardownChained$1.evaluate(TestRuleSetupTeardownChained.java:50)
[junit4:junit4]    > 	at org.apache.lucene.util.TestRuleFieldCacheSanity$1.evaluate(TestRuleFieldCacheSanity.java:51)
[junit4:junit4]    > 	at org.apache.lucene.util.AbstractBeforeAfterRule$1.evaluate(AbstractBeforeAfterRule.java:45)
[junit4:junit4]    > 	at com.carrotsearch.randomizedtesting.rules.SystemPropertiesInvariantRule$1.evaluate(SystemPropertiesInvariantRule.java:55)
[junit4:junit4]    > 	at org.apache.lucene.util.TestRuleThreadAndTestName$1.evaluate(TestRuleThreadAndTestName.java:48)
[junit4:junit4]    > 	at org.apache.lucene.util.TestRuleIgnoreAfterMaxFailures$1.evaluate(TestRuleIgnoreAfterMaxFailures.java:70)
[junit4:junit4]    > 	at org.apache.lucene.util.TestRuleMarkFailure$1.evaluate(TestRuleMarkFailure.java:48)
[junit4:junit4]    > 	at com.carrotsearch.randomizedtesting.rules.StatementAdapter.evaluate(StatementAdapter.java:36)
[junit4:junit4]    > 	at com.carrotsearch.randomizedtesting.ThreadLeakControl$StatementRunner.run(ThreadLeakControl.java:358)
[junit4:junit4]    > 	at com.carrotsearch.randomizedtesting.ThreadLeakControl.forkTimeoutingTask(ThreadLeakControl.java:782)
[junit4:junit4]    > 	at com.carrotsearch.randomizedtesting.ThreadLeakControl$3.evaluate(ThreadLeakControl.java:442)
[junit4:junit4]    > 	at com.carrotsearch.randomizedtesting.RandomizedRunner.runSingleTest(RandomizedRunner.java:746)
[junit4:junit4]    > 	at com.carrotsearch.randomizedtesting.RandomizedRunner$3.evaluate(RandomizedRunner.java:648)
[junit4:junit4]    > 	at com.carrotsearch.randomizedtesting.RandomizedRunner$4.evaluate(RandomizedRunner.java:682)
[junit4:junit4]    > 	at com.carrotsearch.randomizedtesting.RandomizedRunner$5.evaluate(RandomizedRunner.java:693)
[junit4:junit4]    > 	at com.carrotsearch.randomizedtesting.rules.StatementAdapter.evaluate(StatementAdapter.java:36)
[junit4:junit4]    > 	at com.carrotsearch.randomizedtesting.rules.SystemPropertiesRestoreRule$1.evaluate(SystemPropertiesRestoreRule.java:53)
[junit4:junit4]    > 	at org.apache.lucene.util.AbstractBeforeAfterRule$1.evaluate(AbstractBeforeAfterRule.java:45)
[junit4:junit4]    > 	at org.apache.lucene.util.TestRuleStoreClassName$1.evaluate(TestRuleStoreClassName.java:42)
[junit4:junit4]    > 	at com.carrotsearch.randomizedtesting.rules.SystemPropertiesInvariantRule$1.evaluate(SystemPropertiesInvariantRule.java:55)
[junit4:junit4]    > 	at com.carrotsearch.randomizedtesting.rules.NoShadowingOrOverridesOnMethodsRule$1.evaluate(NoShadowingOrOverridesOnMethodsRule.java:39)
[junit4:junit4]    > 	at com.carrotsearch.randomizedtesting.rules.NoShadowingOrOverridesOnMethodsRule$1.evaluate(NoShadowingOrOverridesOnMethodsRule.java:39)
[junit4:junit4]    > 	at org.apache.lucene.util.TestRuleAssertionsRequired$1.evaluate(TestRuleAssertionsRequired.java:40)
[junit4:junit4]    > 	at org.apache.lucene.util.TestRuleMarkFailure$1.evaluate(TestRuleMarkFailure.java:48)
[junit4:junit4]    > 	at org.apache.lucene.util.TestRuleIgnoreAfterMaxFailures$1.evaluate(TestRuleIgnoreAfterMaxFailures.java:70)
[junit4:junit4]    > 	at org.apache.lucene.util.TestRuleIgnoreTestSuites$1.evaluate(TestRuleIgnoreTestSuites.java:55)
[junit4:junit4]    > 	at com.carrotsearch.randomizedtesting.rules.StatementAdapter.evaluate(StatementAdapter.java:36)
[junit4:junit4]    > 	at com.carrotsearch.randomizedtesting.ThreadLeakControl$StatementRunner.run(ThreadLeakControl.java:358)
[junit4:junit4]    > 	at java.lang.Thread.run(Thread.java:722)
[junit4:junit4]    > Caused by: java.lang.NullPointerException
[junit4:junit4]    > 	at org.apache.lucene.search.suggest.fst.FSTCompletionLookup.lookup(FSTCompletionLookup.java:237)
[junit4:junit4]    > 	at org.apache.solr.spelling.suggest.Suggester.getSuggestions(Suggester.java:190)
[junit4:junit4]    > 	at org.apache.solr.handler.component.SpellCheckComponent.process(SpellCheckComponent.java:172)
[junit4:junit4]    > 	at org.apache.solr.handler.component.SearchHandler.handleRequestBody(SearchHandler.java:206)
[junit4:junit4]    > 	at org.apache.solr.handler.RequestHandlerBase.handleRequest(RequestHandlerBase.java:129)
[junit4:junit4]    > 	at org.apache.solr.core.SolrCore.execute(SolrCore.java:1693)
[junit4:junit4]    > 	at org.apache.solr.util.TestHarness.query(TestHarness.java:351)
[junit4:junit4]    > 	at org.apache.solr.util.TestHarness.query(TestHarness.java:333)
[junit4:junit4]    > 	at org.apache.solr.SolrTestCaseJ4.assertQ(SolrTestCaseJ4.java:467)
[junit4:junit4]    > 	... 41 more
[junit4:junit4]   2> 1541 T3046 oas.SolrTestCaseJ4.setUp ###Starting testRebuild
[junit4:junit4]   2> 1556 T3046 C242 oasc.SolrDeletionPolicy.onInit SolrDeletionPolicy.onInit: commits:num=1
[junit4:junit4]   2> 		commit{dir=MockDirWrapper(org.apache.lucene.store.NIOFSDirectory@C:\Jenkins\workspace\Lucene-Solr-trunk-Windows\solr\build\solr-core\test\J0\solrtest-SuggesterFSTTest-1346940643176\index lockFactory=org.apache.lucene.store.NativeFSLockFactory@80dfafc),segFN=segments_2,generation=2,filenames=[_0_Asserting_0.tim, _0_TestBloomFilteredLucene40Postings_0.tim, _0_TestBloomFilteredLucene40Postings_0.blm, _0_TestBloomFilteredLucene40Postings_0.tip, _0.fnm, _0_Asserting_0.tip, _0_TestBloomFilteredLucene40Postings_0.prx, _0_nrm.cfs, _0_Direct_0.frq, _0_Asserting_0.prx, _0_Asserting_0.frq, _0_nrm.cfe, segments_2, _0_Direct_0.tip, _0.fdx, _0_TestBloomFilteredLucene40Postings_0.frq, _0_Direct_0.prx, _0.si, _0_Direct_0.tim, _0.fdt]
[junit4:junit4]   2> 1557 T3046 C242 oasc.SolrDeletionPolicy.updateCommits newest commit = 2
[junit4:junit4]   2> 1560 T3046 C242 UPDATE [collection1] webapp=null path=null params={} {add=[1]} 0 12
[junit4:junit4]   2> 1573 T3046 C242 UPDATE [collection1] webapp=null path=null params={} {add=[2]} 0 1
[junit4:junit4]   2> 1584 T3046 C242 UPDATE [collection1] webapp=null path=null params={} {add=[3]} 0 2
[junit4:junit4]   2> 1593 T3046 C242 oasu.DirectUpdateHandler2.commit start commit{flags=0,_version_=0,optimize=false,openSearcher=true,waitSearcher=true,expungeDeletes=false,softCommit=false}
[junit4:junit4]   2> 1644 T3046 C242 oasc.SolrDeletionPolicy.onCommit SolrDeletionPolicy.onCommit: commits:num=2
[junit4:junit4]   2> 		commit{dir=MockDirWrapper(org.apache.lucene.store.NIOFSDirectory@C:\Jenkins\workspace\Lucene-Solr-trunk-Windows\solr\build\solr-core\test\J0\solrtest-SuggesterFSTTest-1346940643176\index lockFactory=org.apache.lucene.store.NativeFSLockFactory@80dfafc),segFN=segments_2,generation=2,filenames=[_0_Asserting_0.tim, _0_TestBloomFilteredLucene40Postings_0.tim, _0_TestBloomFilteredLucene40Postings_0.blm, _0_TestBloomFilteredLucene40Postings_0.tip, _0.fnm, _0_Asserting_0.tip, _0_TestBloomFilteredLucene40Postings_0.prx, _0_nrm.cfs, _0_Direct_0.frq, _0_Asserting_0.prx, _0_Asserting_0.frq, _0_nrm.cfe, segments_2, _0_Direct_0.tip, _0.fdx, _0_TestBloomFilteredLucene40Postings_0.frq, _0_Direct_0.prx, _0.si, _0_Direct_0.tim, _0.fdt]
[junit4:junit4]   2> 		commit{dir=MockDirWrapper(org.apache.lucene.store.NIOFSDirectory@C:\Jenkins\workspace\Lucene-Solr-trunk-Windows\solr\build\solr-core\test\J0\solrtest-SuggesterFSTTest-1346940643176\index lockFactory=org.apache.lucene.store.NativeFSLockFactory@80dfafc),segFN=segments_3,generation=3,filenames=[_0_Asserting_0.tim, _0_Asserting_0.tip, _0_TestBloomFilteredLucene40Postings_0.prx, _1_TestBloomFilteredLucene40Postings_0.blm, _1.fnm, _0_Asserting_0.prx, _1_TestBloomFilteredLucene40Postings_0.tip, _1_Asserting_0.tim, _1_Asserting_0.tip, _0_TestBloomFilteredLucene40Postings_0.frq, _1_Direct_0.tim, _1_TestBloomFilteredLucene40Postings_0.tim, _0.si, _1_Block_0.doc, _1_Direct_0.tip, _1_Block_0.pos, _1_Block_0.tip, _0_TestBloomFilteredLucene40Postings_0.tim, _1_nrm.cfs, _0_TestBloomFilteredLucene40Postings_0.tip, _0_TestBloomFilteredLucene40Postings_0.blm, _0.fnm, _1_TestBloomFilteredLucene40Postings_0.prx, _1_Block_0.tim, _1_Asserting_0.frq, _0_nrm.cfs, _0_Direct_0.frq, _1_Direct_0.prx, _1_TestBloomFilteredLucene40Postings_0.frq, _1_nrm.cfe, _1.fdx, _0_Asserting_0.frq, _1.fdt, _1_Asserting_0.prx, _1.si, _0_nrm.cfe, _0.fdx, _0_Direct_0.tip, _0_Direct_0.prx, _0_Direct_0.tim, segments_3, _0.fdt, _1_Direct_0.frq]
[junit4:junit4]   2> 1645 T3046 C242 oasc.SolrDeletionPolicy.updateCommits newest commit = 3
[junit4:junit4]   2> 1666 T3046 C242 oass.SolrIndexSearcher.<init> Opening Searcher@21aa419a main
[junit4:junit4]   2> 1667 T3046 C242 oass.SolrIndexSearcher.getIndexDir WARNING WARNING: Directory impl does not support setting indexDir: org.apache.lucene.store.MockDirectoryWrapper
[junit4:junit4]   2> 1668 T3046 C242 oasu.DirectUpdateHandler2.commit end_commit_flush
[junit4:junit4]   2> 1669 T3048 oashc.SpellCheckComponent$SpellCheckerListener.buildSpellIndex Building spell index for spell checker: suggest
[junit4:junit4]   2> 1669 T3048 oasss.Suggester.build build()
[junit4:junit4]   2> 1676 T3048 oasss.Suggester.build Stored suggest data to: C:\Jenkins\workspace\Lucene-Solr-trunk-Windows\solr\build\solr-core\test\J0\.\solrtest-SuggesterFSTTest-1346940643176\suggest\jaspell.dat
[junit4:junit4]   2> 1677 T3048 oashc.SpellCheckComponent$SpellCheckerListener.buildSpellIndex Building spell index for spell checker: suggest_tst
[junit4:junit4]   2> 1677 T3048 oasss.Suggester.build build()
[junit4:junit4]   2> 1694 T3048 oasss.Suggester.build Stored suggest data to: C:\Jenkins\workspace\Lucene-Solr-trunk-Windows\solr\build\solr-core\test\J0\.\solrtest-SuggesterFSTTest-1346940643176\suggest_tst\tst.dat
[junit4:junit4]   2> 1695 T3048 oashc.SpellCheckComponent$SpellCheckerListener.buildSpellIndex Building spell index for spell checker: suggest_fst
[junit4:junit4]   2> 1695 T3048 oasss.Suggester.build build()
[junit4:junit4]   2> 1719 T3048 oasss.Suggester.build Stored suggest data to: C:\Jenkins\workspace\Lucene-Solr-trunk-Windows\solr\build\solr-core\test\J0\.\solrtest-SuggesterFSTTest-1346940643176\suggest_fst\fst.bin
[junit4:junit4]   2> 1719 T3048 oashc.SpellCheckComponent$SpellCheckerListener.buildSpellIndex Building spell index for spell checker: suggest_wfst
[junit4:junit4]   2> 1719 T3048 oasss.Suggester.build build()
[junit4:junit4]   2> 1738 T3048 oasss.Suggester.build Stored suggest data to: C:\Jenkins\workspace\Lucene-Solr-trunk-Windows\solr\build\solr-core\test\J0\.\solrtest-SuggesterFSTTest-1346940643176\suggest_wfst\wfst.bin
[junit4:junit4]   2> 1739 T3048 oasc.SolrCore.registerSearcher [collection1] Registered new searcher Searcher@21aa419a main{StandardDirectoryReader(segments_3:5 _0(5.0):C3 _1(5.0):C3)}
[junit4:junit4]   2> 1740 T3046 C242 UPDATE [collection1] webapp=null path=null params={} {commit=} 0 148
[junit4:junit4]   2> 1756 T3046 C242 REQ [collection1] webapp=null path=null params={q=ac&spellcheck.count=2&qt=/suggest_fst&spellcheck.onlyMorePopular=true} status=0 QTime=7 
[junit4:junit4]   2> 1768 T3046 C242 UPDATE [collection1] webapp=null path=null params={} {add=[4]} 0 7
[junit4:junit4]   2> 1779 T3046 C242 oasu.DirectUpdateHandler2.commit start commit{flags=0,_version_=0,optimize=false,openSearcher=true,waitSearcher=true,expungeDeletes=false,softCommit=false}
[junit4:junit4]   2> 1846 T3046 C242 oasc.SolrDeletionPolicy.onCommit SolrDeletionPolicy.onCommit: commits:num=2
[junit4:junit4]   2> 		commit{dir=MockDirWrapper(org.apache.lucene.store.NIOFSDirectory@C:\Jenkins\workspace\Lucene-Solr-trunk-Windows\solr\build\solr-core\test\J0\solrtest-SuggesterFSTTest-1346940643176\index lockFactory=org.apache.lucene.store.NativeFSLockFactory@80dfafc),segFN=segments_3,generation=3,filenames=[_0_Asserting_0.tim, _0_Asserting_0.tip, _0_TestBloomFilteredLucene40Postings_0.prx, _1_TestBloomFilteredLucene40Postings_0.blm, _1.fnm, _0_Asserting_0.prx, _1_TestBloomFilteredLucene40Postings_0.tip, _1_Asserting_0.tim, _1_Asserting_0.tip, _0_TestBloomFilteredLucene40Postings_0.frq, _1_Direct_0.tim, _1_TestBloomFilteredLucene40Postings_0.tim, _0.si, _1_Block_0.doc, _1_Direct_0.tip, _1_Block_0.pos, _1_Block_0.tip, _0_TestBloomFilteredLucene40Postings_0.tim, _1_nrm.cfs, _0_TestBloomFilteredLucene40Postings_0.tip, _0_TestBloomFilteredLucene40Postings_0.blm, _0.fnm, _1_TestBloomFilteredLucene40Postings_0.prx, _1_Block_0.tim, _1_Asserting_0.frq, _0_nrm.cfs, _0_Direct_0.frq, _1_Direct_0.prx, _1_TestBloomFilteredLucene40Postings_0.frq, _1_nrm.cfe, _1.fdx, _0_Asserting_0.frq, _1.fdt, _1_Asserting_0.prx, _1.si, _0_nrm.cfe, _0.fdx, _0_Direct_0.tip, _0_Direct_0.prx, _0_Direct_0.tim, segments_3, _0.fdt, _1_Direct_0.frq]
[junit4:junit4]   2> 		commit{dir=MockDirWrapper(org.apache.lucene.store.NIOFSDirectory@C:\Jenkins\workspace\Lucene-Solr-trunk-Windows\solr\build\solr-core\test\J0\solrtest-SuggesterFSTTest-1346940643176\index lockFactory=org.apache.lucene.store.NativeFSLockFactory@80dfafc),segFN=segments_4,generation=4,filenames=[_2_Direct_0.tip, _2_Block_0.pos, _2_Direct_0.tim, _2_TestBloomFilteredLucene40Postings_0.prx, _2_TestBloomFilteredLucene40Postings_0.blm, _1.fnm, _0_Asserting_0.prx, _1_Asserting_0.tim, _1_Asserting_0.tip, _2_Asserting_0.prx, _0_TestBloomFilteredLucene40Postings_0.frq, _1_Direct_0.tim, _1_Block_0.doc, _1_Direct_0.tip, _1_Block_0.tip, _1_Block_0.pos, _0_TestBloomFilteredLucene40Postings_0.tim, _2_TestBloomFilteredLucene40Postings_0.tim, _0_TestBloomFilteredLucene40Postings_0.blm, _0_TestBloomFilteredLucene40Postings_0.tip, _0.fnm, _1_Block_0.tim, _2.fdt, _0_Direct_0.frq, _2.fdx, _2_TestBloomFilteredLucene40Postings_0.tip, _1_TestBloomFilteredLucene40Postings_0.frq, _2_Asserting_0.tim, _1.fdx, _0_Asserting_0.frq, _2_Asserting_0.tip, _1.fdt, _0_Asserting_0.tim, _2.si, _2_Block_0.tim, _0_Asserting_0.tip, _2_Block_0.tip, _0_TestBloomFilteredLucene40Postings_0.prx, _1_TestBloomFilteredLucene40Postings_0.blm, _1_TestBloomFilteredLucene40Postings_0.tip, _2_nrm.cfe, _2_Asserting_0.frq, _2_nrm.cfs, _0.si, _1_TestBloomFilteredLucene40Postings_0.tim, _2_TestBloomFilteredLucene40Postings_0.frq, _1_nrm.cfs, _1_TestBloomFilteredLucene40Postings_0.prx, _1_Asserting_0.frq, _0_nrm.cfs, _1_Direct_0.prx, _2.fnm, _1_nrm.cfe, _2_Direct_0.prx, _1_Asserting_0.prx, _1.si, _0_nrm.cfe, _2_Direct_0.frq, _0_Direct_0.tip, _0.fdx, _0_Direct_0.prx, _2_Block_0.doc, _0_Direct_0.tim, _0.fdt, segments_4, _1_Direct_0.frq]
[junit4:junit4]   2> 1857 T3046 C242 oasc.SolrDeletionPolicy.updateCommits newest commit = 4
[junit4:junit4]   2> 1887 T3046 C242 oass.SolrIndexSearcher.<init> Opening Searcher@7c319c39 main
[junit4:junit4]   2> 1888 T3046 C242 oass.SolrIndexSearcher.getIndexDir WARNING WARNING: Directory impl does not support setting indexDir: org.apache.lucene.store.MockDirectoryWrapper
[junit4:junit4]   2> 1888 T3048 oashc.SpellCheckComponent$SpellCheckerListener.buildSpellIndex Building spell index for spell checker: suggest
[junit4:junit4]   2> 1888 T3046 C242 oasu.DirectUpdateHandler2.commit end_commit_flush
[junit4:junit4]   2> 1888 T3048 oasss.Suggester.build build()
[junit4:junit4]   2> 1892 T3048 oasss.Suggester.build Stored suggest data to: C:\Jenkins\workspace\Lucene-Solr-trunk-Windows\solr\build\solr-core\test\J0\.\solrtest-SuggesterFSTTest-1346940643176\suggest\jaspell.dat
[junit4:junit4]   2> 1893 T3048 oashc.SpellCheckComponent$SpellCheckerListener.buildSpellIndex Building spell index for spell checker: suggest_tst
[junit4:junit4]   2> 1893 T3048 oasss.Suggester.build build()
[junit4:junit4]   2> 1907 T3048 oasss.Suggester.build Stored suggest data to: C:\Jenkins\workspace\Lucene-Solr-trunk-Windows\solr\build\solr-core\test\J0\.\solrtest-SuggesterFSTTest-1346940643176\suggest_tst\tst.dat
[junit4:junit4]   2> 1907 T3048 oashc.SpellCheckComponent$SpellCheckerListener.buildSpellIndex Building spell index for spell checker: suggest_fst
[junit4:junit4]   2> 1908 T3048 oasss.Suggester.build build()
[junit4:junit4]   2> 1927 T3048 oasss.Suggester.build Stored suggest data to: C:\Jenkins\workspace\Lucene-Solr-trunk-Windows\solr\build\solr-core\test\J0\.\solrtest-SuggesterFSTTest-1346940643176\suggest_fst\fst.bin
[junit4:junit4]   2> 1927 T3048 oashc.SpellCheckComponent$SpellCheckerListener.buildSpellIndex Building spell index for spell checker: suggest_wfst
[junit4:junit4]   2> 1927 T3048 oasss.Suggester.build build()
[junit4:junit4]   2> 1937 T3048 oasss.Suggester.build Stored suggest data to: C:\Jenkins\workspace\Lucene-Solr-trunk-Windows\solr\build\solr-core\test\J0\.\solrtest-SuggesterFSTTest-1346940643176\suggest_wfst\wfst.bin
[junit4:junit4]   2> 1937 T3048 oasc.SolrCore.registerSearcher [collection1] Registered new searcher Searcher@7c319c39 main{StandardDirectoryReader(segments_4:7 _0(5.0):C3 _1(5.0):C3 _2(5.0):C1)}
[junit4:junit4]   2> 1937 T3046 C242 UPDATE [collection1] webapp=null path=null params={} {commit=} 0 158
[junit4:junit4]   2> 1944 T3046 C242 REQ [collection1] webapp=null path=null params={q=ac&spellcheck.count=2&qt=/suggest_fst&spellcheck.onlyMorePopular=true} status=0 QTime=1 
[junit4:junit4]   2> 1946 T3046 oas.SolrTestCaseJ4.tearDown ###Ending testRebuild
[junit4:junit4]   2> 1949 T3046 oas.SolrTestCaseJ4.setUp ###Starting testSuggestions
[junit4:junit4]   2> 1957 T3046 C242 UPDATE [collection1] webapp=null path=null params={} {add=[1]} 0 4
[junit4:junit4]   2> 1964 T3046 C242 UPDATE [collection1] webapp=null path=null params={} {add=[2]} 0 1
[junit4:junit4]   2> 1970 T3046 C242 UPDATE [collection1] webapp=null path=null params={} {add=[3]} 0 0
[junit4:junit4]   2> 1977 T3046 C242 oasu.DirectUpdateHandler2.commit start commit{flags=0,_version_=0,optimize=false,openSearcher=true,waitSearcher=true,expungeDeletes=false,softCommit=false}
[junit4:junit4]   2> 2046 T3046 C242 oasc.SolrDeletionPolicy.onCommit SolrDeletionPolicy.onCommit: commits:num=2
[junit4:junit4]   2> 		commit{dir=MockDirWrapper(org.apache.lucene.store.NIOFSDirectory@C:\Jenkins\workspace\Lucene-Solr-trunk-Windows\solr\build\solr-core\test\J0\solrtest-SuggesterFSTTest-1346940643176\index lockFactory=org.apache.lucene.store.NativeFSLockFactory@80dfafc),segFN=segments_4,generation=4,filenames=[_2_Direct_0.tip, _2_Block_0.pos, _2_Direct_0.tim, _2_TestBloomFilteredLucene40Postings_0.prx, _2_TestBloomFilteredLucene40Postings_0.blm, _1.fnm, _0_Asserting_0.prx, _1_Asserting_0.tim, _1_Asserting_0.tip, _2_Asserting_0.prx, _0_TestBloomFilteredLucene40Postings_0.frq, _1_Direct_0.tim, _1_Block_0.doc, _1_Direct_0.tip, _1_Block_0.tip, _1_Block_0.pos, _0_TestBloomFilteredLucene40Postings_0.tim, _2_TestBloomFilteredLucene40Postings_0.tim, _0_TestBloomFilteredLucene40Postings_0.blm, _0_TestBloomFilteredLucene40Postings_0.tip, _0.fnm, _1_Block_0.tim, _2.fdt, _0_Direct_0.frq, _2.fdx, _2_TestBloomFilteredLucene40Postings_0.tip, _1_TestBloomFilteredLucene40Postings_0.frq, _2_Asserting_0.tim, _1.fdx, _0_Asserting_0.frq, _2_Asserting_0.tip, _1.fdt, _0_Asserting_0.tim, _2.si, _2_Block_0.tim, _0_Asserting_0.tip, _2_Block_0.tip, _0_TestBloomFilteredLucene40Postings_0.prx, _1_TestBloomFilteredLucene40Postings_0.blm, _1_TestBloomFilteredLucene40Postings_0.tip, _2_nrm.cfe, _2_Asserting_0.frq, _2_nrm.cfs, _0.si, _1_TestBloomFilteredLucene40Postings_0.tim, _2_TestBloomFilteredLucene40Postings_0.frq, _1_nrm.cfs, _1_TestBloomFilteredLucene40Postings_0.prx, _1_Asserting_0.frq, _0_nrm.cfs, _1_Direct_0.prx, _2.fnm, _1_nrm.cfe, _2_Direct_0.prx, _1_Asserting_0.prx, _1.si, _0_nrm.cfe, _2_Direct_0.frq, _0_Direct_0.tip, _0.fdx, _0_Direct_0.prx, _2_Block_0.doc, _0_Direct_0.tim, _0.fdt, segments_4, _1_Direct_0.frq]
[junit4:junit4]   2> 		commit{dir=MockDirWrapper(org.apache.lucene.store.NIOFSDirectory@C:\Jenkins\workspace\Lucene-Solr-trunk-Windows\solr\build\solr-core\test\J0\solrtest-SuggesterFSTTest-1346940643176\index lockFactory=org.apache.lucene.store.NativeFSLockFactory@80dfafc),segFN=segments_5,generation=5,filenames=[_2_Direct_0.tip, _3_nrm.cfe, _2_Block_0.pos, _3_Direct_0.frq, _2_Direct_0.tim, _3_TestBloomFilteredLucene40Postings_0.prx, _2_TestBloomFilteredLucene40Postings_0.prx, _2_TestBloomFilteredLucene40Postings_0.blm, _3.fdt, _0_Asserting_0.prx, _3_Block_0.tim, _3_Asserting_0.prx, _0_TestBloomFilteredLucene40Postings_0.frq, _2_Asserting_0.prx, _3_Direct_0.prx, _3_TestBloomFilteredLucene40Postings_0.frq, _2_TestBloomFilteredLucene40Postings_0.tim, _0_TestBloomFilteredLucene40Postings_0.tim, _3_TestBloomFilteredLucene40Postings_0.tim, _0_TestBloomFilteredLucene40Postings_0.blm, _0_TestBloomFilteredLucene40Postings_0.tip, _3_Direct_0.tip, _0.fnm, _2.fdt, _3_TestBloomFilteredLucene40Postings_0.tip, _0_Direct_0.frq, _2.fdx, _2_TestBloomFilteredLucene40Postings_0.tip, _3_Block_0.pos, _3_Block_0.doc, _3_nrm.cfs, _2_Asserting_0.tim, _0_Asserting_0.frq, _2_Asserting_0.tip, _3.si, _3_TestBloomFilteredLucene40Postings_0.blm, _3_Direct_0.tim, _2.si, _0_Asserting_0.tim, _2_Block_0.tim, _0_Asserting_0.tip, _2_Block_0.tip, _0_TestBloomFilteredLucene40Postings_0.prx, _3.fnm, _2_nrm.cfe, _2_Asserting_0.frq, _0.si, _2_nrm.cfs, _2_TestBloomFilteredLucene40Postings_0.frq, _3_Block_0.tip, _0_nrm.cfs, _2.fnm, _3_Asserting_0.frq, _3.fdx, _2_Direct_0.prx, _3_Asserting_0.tim, _3_Asserting_0.tip, _0_nrm.cfe, _0_Direct_0.tip, _0.fdx, _2_Direct_0.frq, _0_Direct_0.prx, segments_5, _2_Block_0.doc, _0_Direct_0.tim, _0.fdt]
[junit4:junit4]   2> 2047 T3046 C242 oasc.SolrDeletionPolicy.updateCommits newest commit = 5
[junit4:junit4]   2> 2086 T3046 C242 oass.SolrIndexSearcher.<init> Opening Searcher@155b70bf main
[junit4:junit4]   2> 2087 T3046 C242 oass.SolrIndexSearcher.getIndexDir WARNING WARNING: Directory impl does not support setting indexDir: org.apache.lucene.store.MockDirectoryWrapper
[junit4:junit4]   2> 2089 T3048 oashc.SpellCheckComponent$SpellCheckerListener.buildSpellIndex Building spell index for spell checker: suggest
[junit4:junit4]   2> 2089 T3048 oasss.Suggester.build build()
[junit4:junit4]   2> 2094 T3048 oasss.Suggester.build Stored suggest data to: C:\Jenkins\workspace\Lucene-Solr-trunk-Windows\solr\build\solr-core\test\J0\.\solrtest-SuggesterFSTTest-1346940643176\suggest\jaspell.dat
[junit4:junit4]   2> 2094 T3048 oashc.SpellCheckComponent$SpellCheckerListener.buildSpellIndex Building spell index for spell checker: suggest_tst
[junit4:junit4]   2> 2094 T3048 oasss.Suggester.build build()
[junit4:junit4]   2> 2104 T3046 C242 oasu.DirectUpdateHandler2.commit end_commit_flush
[junit4:junit4]   2> 2113 T3048 oasss.Suggester.build Stored suggest data to: C:\Jenkins\workspace\Lucene-Solr-trunk-Windows\solr\build\solr-core\test\J0\.\solrtest-SuggesterFSTTest-1346940643176\suggest_tst\tst.dat
[junit4:junit4]   2> 2114 T3048 oashc.SpellCheckComponent$SpellCheckerListener.buildSpellIndex Building spell index for spell checker: suggest_fst
[junit4:junit4]   2> 2114 T3048 oasss.Suggester.build build()
[junit4:junit4]   2> 2140 T3048 oasss.Suggester.build Stored suggest data to: C:\Jenkins\workspace\Lucene-Solr-trunk-Windows\solr\build\solr-core\test\J0\.\solrtest-SuggesterFSTTest-1346940643176\suggest_fst\fst.bin
[junit4:junit4]   2> 2140 T3048 oashc.SpellCheckComponent$SpellCheckerListener.buildSpellIndex Building spell index for spell checker: suggest_wfst
[junit4:junit4]   2> 2141 T3048 oasss.Suggester.build build()
[junit4:junit4]   2> 2154 T3048 oasss.Suggester.build Stored suggest data to: C:\Jenkins\workspace\Lucene-Solr-trunk-Windows\solr\build\solr-core\test\J0\.\solrtest-SuggesterFSTTest-1346940643176\suggest_wfst\wfst.bin
[junit4:junit4]   2> 2155 T3048 oasc.SolrCore.registerSearcher [collection1] Registered new searcher Searcher@155b70bf main{StandardDirectoryReader(segments_5:11 _0(5.0):C3 _2(5.0):C1 _3(5.0):C3)}
[junit4:junit4]   2> 2156 T3046 C242 UPDATE [collection1] webapp=null path=null params={} {commit=} 0 180
[junit4:junit4]   2> 2164 T3046 C242 REQ [collection1] webapp=null path=null params={q=ac&spellcheck.count=2&qt=/suggest_fst&spellcheck.onlyMorePopular=true} status=0 QTime=0 
[junit4:junit4]   2> 2170 T3046 oas.SolrTestCaseJ4.tearDown ###Ending testSuggestions
[junit4:junit4]   2> 2176 T3046 oas.SolrTestCaseJ4.setUp ###Starting testAnalyzer
[junit4:junit4]   2> 2176 T3046 oasss.Suggester.init init: {lookupImpl=org.apache.solr.spelling.suggest.tst.TSTLookupFactory}
[junit4:junit4]   2> 2177 T3046 oas.SolrTestCaseJ4.tearDown ###Ending testAnalyzer
[junit4:junit4]   2> 2179 T3046 oas.SolrTestCaseJ4.deleteCore ###deleteCore
[junit4:junit4]   2> 2179 T3046 oasc.CoreContainer.shutdown Shutting down CoreContainer instance=1336397806
[junit4:junit4]   2> 2179 T3046 oasc.SolrCore.close [collection1]  CLOSING SolrCore org.apache.solr.core.SolrCore@722bddfb
[junit4:junit4]   2> 2182 T3046 oasc.SolrCore.closeSearcher [collection1] Closing main searcher on request.
[junit4:junit4]   2> 2182 T3046 oasu.DirectUpdateHandler2.close closing DirectUpdateHandler2{commits=3,autocommits=0,soft autocommits=0,optimizes=0,rollbacks=0,expungeDeletes=0,docsPending=0,adds=0,deletesById=0,deletesByQuery=0,errors=0,cumulative_adds=7,cumulative_deletesById=0,cumulative_deletesByQuery=0,cumulative_errors=0}
[junit4:junit4]   2> 2183 T3046 oasu.DefaultSolrCoreState.decref SolrCoreState ref count has reached 0 - closing IndexWriter
[junit4:junit4]   2> 2262 T3046 oasu.DefaultSolrCoreState.decref Closing SolrCoreState - canceling any ongoing recovery
[junit4:junit4]   2> NOTE: test params are: codec=Lucene40: {timestamp=Block(blocksize=128), range_facet_l=Block(blocksize=128), id=PostingsFormat(name=TestBloomFilteredLucene40Postings), range_facet_sl=PostingsFormat(name=Direct), range_facet_si=PostingsFormat(name=Asserting), text=PostingsFormat(name=Direct), multiDefault=PostingsFormat(name=Asserting), suggest=PostingsFormat(name=Asserting), intDefault=Block(blocksize=128), spell=PostingsFormat(name=Asserting)}, sim=RandomSimilarityProvider(queryNorm=true,coord=yes): {}, locale=sr_ME_#Latn, timezone=America/Argentina/San_Juan
[junit4:junit4]   2> NOTE: Windows 7 6.1 amd64/Oracle Corporation 1.7.0_07 (64-bit)/cpus=2,threads=1,free=33370384,total=151244800
[junit4:junit4]   2> NOTE: All tests run in this JVM: [TestExtendedDismaxParser, TestCollationField, TestCSVLoader, TestArbitraryIndexDir, SolrCmdDistributorTest, StatelessScriptUpdateProcessorFactoryTest, CurrencyFieldTest, ZkControllerTest, HighlighterTest, TestCharFilters, JsonLoaderTest, TestDocumentBuilder, FastVectorHighlighterTest, TestSort, QueryParsingTest, TestLFUCache, AlternateDirectoryTest, SolrInfoMBeanTest, SolrCoreTest, TestStressVersions, ReturnFieldsTest, TestPerFieldSimilarity, ShowFileRequestHandlerTest, SimplePostToolTest, LeaderElectionTest, DebugComponentTest, TestLuceneMatchVersion, SpellingQueryConverterTest, TestDistributedSearch, TestJmxMonitoredMap, SuggesterWFSTTest, TestWordDelimiterFilterFactory, TestSolrDeletionPolicy2, SimpleFacetsTest, NumericFieldsTest, DirectSolrConnectionTest, NoCacheHeaderTest, DateMathParserTest, TestRemoteStreaming, TestCodecSupport, SpellCheckCollatorTest, ScriptEngineTest, TestStressReorder, SoftAutoCommitTest, MinimalSchemaTest, FieldMutatingUpdateProcessorTest, SolrCoreCheckLockOnStartupTest, TestReversedWildcardFilterFactory, UpdateParamsTest, TestSurroundQueryParser, ZkNodePropsTest, ClusterStateUpdateTest, SpellCheckComponentTest, TestTrie, TestCoreContainer, CopyFieldTest, BadIndexSchemaTest, TestSolrQueryParser, SolrPluginUtilsTest, TestOmitPositions, WordBreakSolrSpellCheckerTest, TimeZoneUtilsTest, TestRandomFaceting, XsltUpdateRequestHandlerTest, TestReplicationHandler, TestQueryUtils, IndexSchemaRuntimeFieldTest, PingRequestHandlerTest, TermsComponentTest, XmlUpdateRequestHandlerTest, ClusterStateTest, TestStressLucene, PreAnalyzedFieldTest, UpdateRequestProcessorFactoryTest, SOLR749Test, TestIndexSearcher, PathHierarchyTokenizerFactoryTest, TestGroupingSearch, TestPropInject, RequiredFieldsTest, TestMergePolicyConfig, SuggesterTest, TestDefaultSimilarityFactory, TestWriterPerf, BasicFunctionalityTest, TestBadConfig, TestMultiCoreConfBootstrap, ZkSolrClientTest, FileUtilsTest, TestSolrJ, AutoCommitTest, MultiTermTest, TestHashPartitioner, TestFunctionQuery, TestPhraseSuggestions, OutputWriterTest, FieldAnalysisRequestHandlerTest, SearchHandlerTest, TestPluginEnable, PeerSyncTest, TestJoin, URLClassifyProcessorTest, TestSolrXMLSerializer, DocumentBuilderTest, TestBinaryResponseWriter, ResourceLoaderTest, TestXIncludeConfig, TestIndexingPerformance, DocumentAnalysisRequestHandlerTest, TestRecovery, TestBinaryField, BasicDistributedZkTest, OverseerTest, RecoveryZkTest, FullSolrCloudDistribCmdsTest, LeaderElectionIntegrationTest, DistributedSpellCheckComponentTest, TestRealTimeGet, TestDistributedGrouping, BasicZkTest, TestFaceting, DistributedTermsComponentTest, StatsComponentTest, IndexBasedSpellCheckerTest, TestRangeQuery, DirectUpdateHandlerTest, LukeRequestHandlerTest, DirectSolrSpellCheckerTest, TestFiltering, FileBasedSpellCheckerTest, ConvertedLegacyTest, QueryElevationComponentTest, SortByFunctionTest, SignatureUpdateProcessorFactoryTest, TestJmxIntegration, SampleTest, CoreAdminHandlerTest, SolrRequestParserTest, CacheHeaderTest, QueryEqualityTest, PolyFieldTest, SpatialFilterTest, TestCSVResponseWriter, MoreLikeThisHandlerTest, MBeansHandlerTest, DistributedQueryElevationComponentTest, TestPseudoReturnFields, DisMaxRequestHandlerTest, IndexSchemaTest, BinaryUpdateRequestHandlerTest, DistanceFunctionTest, StandardRequestHandlerTest, TestQueryTypes, TestPHPSerializedResponseWriter, TermVectorComponentTest, DirectUpdateHandlerOptimizeTest, TestValueSourceCache, JSONWriterTest, RequestHandlersTest, SuggesterFSTTest]
[junit4:junit4] Completed in 2.42s, 4 tests, 1 error <<< FAILURES!

[...truncated 204 lines...]
BUILD FAILED
C:\Jenkins\workspace\Lucene-Solr-trunk-Windows\build.xml:29: The following error occurred while executing this line:
C:\Jenkins\workspace\Lucene-Solr-trunk-Windows\solr\build.xml:146: The following error occurred while executing this line:
C:\Jenkins\workspace\Lucene-Solr-trunk-Windows\lucene\module-build.xml:63: The following error occurred while executing this line:
C:\Jenkins\workspace\Lucene-Solr-trunk-Windows\lucene\common-build.xml:1095: The following error occurred while executing this line:
C:\Jenkins\workspace\Lucene-Solr-trunk-Windows\lucene\common-build.xml:772: There were test failures: 228 suites, 918 tests, 1 error, 11 ignored (6 assumptions)

Total time: 34 minutes 40 seconds
Build step 'Invoke Ant' marked build as failure
Recording test results
Description set: Java: 64bit/jdk1.7.0_07 -XX:+UseConcMarkSweepGC
Email was triggered for: Failure
Sending email for trigger: Failure



Mime
View raw message