lucene-dev mailing list archives

Site index · List index
Message view « Date » · « Thread »
Top « Date » · « Thread »
From Apache Jenkins Server <jenk...@builds.apache.org>
Subject [JENKINS] Lucene-Solr-Tests-4.x-java7 - Build # 480 - Still Failing
Date Fri, 21 Sep 2012 10:05:24 GMT
Build: https://builds.apache.org/job/Lucene-Solr-Tests-4.x-java7/480/

1 tests failed.
FAILED:  org.apache.solr.cloud.BasicDistributedZk2Test.testDistribSearch

Error Message:
Shard still reported as live in zk

Stack Trace:
java.lang.AssertionError: Shard still reported as live in zk
	at __randomizedtesting.SeedInfo.seed([8C71AA9AAB8FEF7B:D972482DCD08F47]:0)
	at org.junit.Assert.fail(Assert.java:93)
	at org.apache.solr.cloud.AbstractFullDistribZkTestBase.waitToSeeNotLive(AbstractFullDistribZkTestBase.java:1220)
	at org.apache.solr.cloud.BasicDistributedZk2Test.brindDownShardIndexSomeDocsAndRecover(BasicDistributedZk2Test.java:190)
	at org.apache.solr.cloud.BasicDistributedZk2Test.doTest(BasicDistributedZk2Test.java:83)
	at org.apache.solr.BaseDistributedSearchTestCase.testDistribSearch(BaseDistributedSearchTestCase.java:695)
	at sun.reflect.NativeMethodAccessorImpl.invoke0(Native Method)
	at sun.reflect.NativeMethodAccessorImpl.invoke(NativeMethodAccessorImpl.java:57)
	at sun.reflect.DelegatingMethodAccessorImpl.invoke(DelegatingMethodAccessorImpl.java:43)
	at java.lang.reflect.Method.invoke(Method.java:601)
	at com.carrotsearch.randomizedtesting.RandomizedRunner.invoke(RandomizedRunner.java:1559)
	at com.carrotsearch.randomizedtesting.RandomizedRunner.access$600(RandomizedRunner.java:79)
	at com.carrotsearch.randomizedtesting.RandomizedRunner$6.evaluate(RandomizedRunner.java:737)
	at com.carrotsearch.randomizedtesting.RandomizedRunner$7.evaluate(RandomizedRunner.java:773)
	at com.carrotsearch.randomizedtesting.RandomizedRunner$8.evaluate(RandomizedRunner.java:787)
	at com.carrotsearch.randomizedtesting.rules.SystemPropertiesRestoreRule$1.evaluate(SystemPropertiesRestoreRule.java:53)
	at org.apache.lucene.util.TestRuleSetupTeardownChained$1.evaluate(TestRuleSetupTeardownChained.java:50)
	at org.apache.lucene.util.TestRuleFieldCacheSanity$1.evaluate(TestRuleFieldCacheSanity.java:51)
	at org.apache.lucene.util.AbstractBeforeAfterRule$1.evaluate(AbstractBeforeAfterRule.java:45)
	at com.carrotsearch.randomizedtesting.rules.SystemPropertiesInvariantRule$1.evaluate(SystemPropertiesInvariantRule.java:55)
	at org.apache.lucene.util.TestRuleThreadAndTestName$1.evaluate(TestRuleThreadAndTestName.java:48)
	at org.apache.lucene.util.TestRuleIgnoreAfterMaxFailures$1.evaluate(TestRuleIgnoreAfterMaxFailures.java:70)
	at org.apache.lucene.util.TestRuleMarkFailure$1.evaluate(TestRuleMarkFailure.java:48)
	at com.carrotsearch.randomizedtesting.rules.StatementAdapter.evaluate(StatementAdapter.java:36)
	at com.carrotsearch.randomizedtesting.ThreadLeakControl$StatementRunner.run(ThreadLeakControl.java:358)
	at com.carrotsearch.randomizedtesting.ThreadLeakControl.forkTimeoutingTask(ThreadLeakControl.java:782)
	at com.carrotsearch.randomizedtesting.ThreadLeakControl$3.evaluate(ThreadLeakControl.java:442)
	at com.carrotsearch.randomizedtesting.RandomizedRunner.runSingleTest(RandomizedRunner.java:746)
	at com.carrotsearch.randomizedtesting.RandomizedRunner$3.evaluate(RandomizedRunner.java:648)
	at com.carrotsearch.randomizedtesting.RandomizedRunner$4.evaluate(RandomizedRunner.java:682)
	at com.carrotsearch.randomizedtesting.RandomizedRunner$5.evaluate(RandomizedRunner.java:693)
	at com.carrotsearch.randomizedtesting.rules.StatementAdapter.evaluate(StatementAdapter.java:36)
	at com.carrotsearch.randomizedtesting.rules.SystemPropertiesRestoreRule$1.evaluate(SystemPropertiesRestoreRule.java:53)
	at org.apache.lucene.util.AbstractBeforeAfterRule$1.evaluate(AbstractBeforeAfterRule.java:45)
	at org.apache.lucene.util.TestRuleStoreClassName$1.evaluate(TestRuleStoreClassName.java:42)
	at com.carrotsearch.randomizedtesting.rules.SystemPropertiesInvariantRule$1.evaluate(SystemPropertiesInvariantRule.java:55)
	at com.carrotsearch.randomizedtesting.rules.NoShadowingOrOverridesOnMethodsRule$1.evaluate(NoShadowingOrOverridesOnMethodsRule.java:39)
	at com.carrotsearch.randomizedtesting.rules.NoShadowingOrOverridesOnMethodsRule$1.evaluate(NoShadowingOrOverridesOnMethodsRule.java:39)
	at com.carrotsearch.randomizedtesting.rules.StatementAdapter.evaluate(StatementAdapter.java:36)
	at org.apache.lucene.util.TestRuleAssertionsRequired$1.evaluate(TestRuleAssertionsRequired.java:43)
	at org.apache.lucene.util.TestRuleMarkFailure$1.evaluate(TestRuleMarkFailure.java:48)
	at org.apache.lucene.util.TestRuleIgnoreAfterMaxFailures$1.evaluate(TestRuleIgnoreAfterMaxFailures.java:70)
	at org.apache.lucene.util.TestRuleIgnoreTestSuites$1.evaluate(TestRuleIgnoreTestSuites.java:55)
	at com.carrotsearch.randomizedtesting.rules.StatementAdapter.evaluate(StatementAdapter.java:36)
	at com.carrotsearch.randomizedtesting.ThreadLeakControl$StatementRunner.run(ThreadLeakControl.java:358)
	at java.lang.Thread.run(Thread.java:722)




Build Log:
[...truncated 7756 lines...]
[junit4:junit4] Suite: org.apache.solr.cloud.BasicDistributedZk2Test
[junit4:junit4]   2> 4 T200 oas.SolrTestCaseJ4.setUp ###Starting testDistribSearch
[junit4:junit4]   2> Creating dataDir: /usr/home/hudson/hudson-slave/workspace/Lucene-Solr-Tests-4.x-java7/solr/build/solr-core/test/J1/./solrtest-BasicDistributedZk2Test-1348220937555
[junit4:junit4]   2> 11 T200 oasc.ZkTestServer.run STARTING ZK TEST SERVER
[junit4:junit4]   2> 89 T201 oaz.Environment.logEnv Server environment:zookeeper.version=3.3.6-1366786, built on 07/29/2012 06:22 GMT
[junit4:junit4]   2> 90 T201 oaz.Environment.logEnv Server environment:host.name=lucene.zones.apache.org
[junit4:junit4]   2> 90 T201 oaz.Environment.logEnv Server environment:java.version=1.7.0_06
[junit4:junit4]   2> 90 T201 oaz.Environment.logEnv Server environment:java.vendor=Oracle Corporation
[junit4:junit4]   2> 90 T201 oaz.Environment.logEnv Server environment:java.home=/usr/local/openjdk7/jre
[junit4:junit4]   2> 90 T201 oaz.Environment.logEnv Server environment:java.class.path=/usr/home/hudson/hudson-slave/workspace/Lucene-Solr-Tests-4.x-java7/solr/build/solr-core/classes/test:/usr/home/hudson/hudson-slave/workspace/Lucene-Solr-Tests-4.x-java7/solr/build/solr-test-framework/classes/java:/usr/home/hudson/hudson-slave/workspace/Lucene-Solr-Tests-4.x-java7/solr/build/solr-core/test-files:/usr/home/hudson/hudson-slave/workspace/Lucene-Solr-Tests-4.x-java7/lucene/build/codecs/classes/java:/usr/home/hudson/hudson-slave/workspace/Lucene-Solr-Tests-4.x-java7/lucene/build/test-framework/classes/java:/usr/home/hudson/hudson-slave/workspace/Lucene-Solr-Tests-4.x-java7/solr/build/solr-solrj/classes/java:/usr/home/hudson/hudson-slave/workspace/Lucene-Solr-Tests-4.x-java7/solr/build/solr-core/classes/java:/usr/home/hudson/hudson-slave/workspace/Lucene-Solr-Tests-4.x-java7/lucene/build/analysis/common/lucene-analyzers-common-4.0-SNAPSHOT.jar:/usr/home/hudson/hudson-slave/workspace/Lucene-Solr-Tests-4.x-java7/lucene/build/analysis/kuromoji/lucene-analyzers-kuromoji-4.0-SNAPSHOT.jar:/usr/home/hudson/hudson-slave/workspace/Lucene-Solr-Tests-4.x-java7/lucene/build/analysis/phonetic/lucene-analyzers-phonetic-4.0-SNAPSHOT.jar:/usr/home/hudson/hudson-slave/workspace/Lucene-Solr-Tests-4.x-java7/lucene/build/highlighter/lucene-highlighter-4.0-SNAPSHOT.jar:/usr/home/hudson/hudson-slave/workspace/Lucene-Solr-Tests-4.x-java7/lucene/build/memory/lucene-memory-4.0-SNAPSHOT.jar:/usr/home/hudson/hudson-slave/workspace/Lucene-Solr-Tests-4.x-java7/lucene/build/misc/lucene-misc-4.0-SNAPSHOT.jar:/usr/home/hudson/hudson-slave/workspace/Lucene-Solr-Tests-4.x-java7/lucene/build/spatial/lucene-spatial-4.0-SNAPSHOT.jar:/usr/home/hudson/hudson-slave/workspace/Lucene-Solr-Tests-4.x-java7/lucene/build/suggest/lucene-suggest-4.0-SNAPSHOT.jar:/usr/home/hudson/hudson-slave/workspace/Lucene-Solr-Tests-4.x-java7/lucene/build/grouping/lucene-grouping-4.0-SNAPSHOT.jar:/usr/home/hudson/hudson-slave/workspace/Lucene-Solr-Tests-4.x-java7/lucene/build/queries/lucene-queries-4.0-SNAPSHOT.jar:/usr/home/hudson/hudson-slave/workspace/Lucene-Solr-Tests-4.x-java7/lucene/build/queryparser/lucene-queryparser-4.0-SNAPSHOT.jar:/usr/home/hudson/hudson-slave/workspace/Lucene-Solr-Tests-4.x-java7/solr/core/lib/commons-cli-1.2.jar:/usr/home/hudson/hudson-slave/workspace/Lucene-Solr-Tests-4.x-java7/solr/core/lib/commons-codec-1.7.jar:/usr/home/hudson/hudson-slave/workspace/Lucene-Solr-Tests-4.x-java7/solr/core/lib/commons-fileupload-1.2.1.jar:/usr/home/hudson/hudson-slave/workspace/Lucene-Solr-Tests-4.x-java7/solr/core/lib/commons-lang-2.6.jar:/usr/home/hudson/hudson-slave/workspace/Lucene-Solr-Tests-4.x-java7/solr/core/lib/easymock-2.2.jar:/usr/home/hudson/hudson-slave/workspace/Lucene-Solr-Tests-4.x-java7/solr/core/lib/guava-r05.jar:/usr/home/hudson/hudson-slave/workspace/Lucene-Solr-Tests-4.x-java7/solr/core/lib/javax.servlet-api-3.0.1.jar:/usr/home/hudson/hudson-slave/workspace/Lucene-Solr-Tests-4.x-java7/solr/core/lib/spatial4j-0.3.jar:/usr/home/hudson/hudson-slave/workspace/Lucene-Solr-Tests-4.x-java7/solr/solrj/lib/commons-io-2.1.jar:/usr/home/hudson/hudson-slave/workspace/Lucene-Solr-Tests-4.x-java7/solr/solrj/lib/httpclient-4.1.3.jar:/usr/home/hudson/hudson-slave/workspace/Lucene-Solr-Tests-4.x-java7/solr/solrj/lib/httpcore-4.1.4.jar:/usr/home/hudson/hudson-slave/workspace/Lucene-Solr-Tests-4.x-java7/solr/solrj/lib/httpmime-4.1.3.jar:/usr/home/hudson/hudson-slave/workspace/Lucene-Solr-Tests-4.x-java7/solr/solrj/lib/jcl-over-slf4j-1.6.4.jar:/usr/home/hudson/hudson-slave/workspace/Lucene-Solr-Tests-4.x-java7/solr/solrj/lib/log4j-over-slf4j-1.6.4.jar:/usr/home/hudson/hudson-slave/workspace/Lucene-Solr-Tests-4.x-java7/solr/solrj/lib/slf4j-api-1.6.4.jar:/usr/home/hudson/hudson-slave/workspace/Lucene-Solr-Tests-4.x-java7/solr/solrj/lib/slf4j-jdk14-1.6.4.jar:/usr/home/hudson/hudson-slave/workspace/Lucene-Solr-Tests-4.x-java7/solr/solrj/lib/wstx-asl-3.2.7.jar:/usr/home/hudson/hudson-slave/workspace/Lucene-Solr-Tests-4.x-java7/solr/solrj/lib/zookeeper-3.3.6.jar:/usr/home/hudson/hudson-slave/workspace/Lucene-Solr-Tests-4.x-java7/solr/example/lib/jetty-continuation-8.1.2.v20120308.jar:/usr/home/hudson/hudson-slave/workspace/Lucene-Solr-Tests-4.x-java7/solr/example/lib/jetty-deploy-8.1.2.v20120308.jar:/usr/home/hudson/hudson-slave/workspace/Lucene-Solr-Tests-4.x-java7/solr/example/lib/jetty-http-8.1.2.v20120308.jar:/usr/home/hudson/hudson-slave/workspace/Lucene-Solr-Tests-4.x-java7/solr/example/lib/jetty-io-8.1.2.v20120308.jar:/usr/home/hudson/hudson-slave/workspace/Lucene-Solr-Tests-4.x-java7/solr/example/lib/jetty-jmx-8.1.2.v20120308.jar:/usr/home/hudson/hudson-slave/workspace/Lucene-Solr-Tests-4.x-java7/solr/example/lib/jetty-security-8.1.2.v20120308.jar:/usr/home/hudson/hudson-slave/workspace/Lucene-Solr-Tests-4.x-java7/solr/example/lib/jetty-server-8.1.2.v20120308.jar:/usr/home/hudson/hudson-slave/workspace/Lucene-Solr-Tests-4.x-java7/solr/example/lib/jetty-servlet-8.1.2.v20120308.jar:/usr/home/hudson/hudson-slave/workspace/Lucene-Solr-Tests-4.x-java7/solr/example/lib/jetty-util-8.1.2.v20120308.jar:/usr/home/hudson/hudson-slave/workspace/Lucene-Solr-Tests-4.x-java7/solr/example/lib/jetty-webapp-8.1.2.v20120308.jar:/usr/home/hudson/hudson-slave/workspace/Lucene-Solr-Tests-4.x-java7/solr/example/lib/jetty-xml-8.1.2.v20120308.jar:/usr/home/hudson/hudson-slave/workspace/Lucene-Solr-Tests-4.x-java7/solr/example/lib/servlet-api-3.0.jar:/usr/home/hudson/hudson-slave/workspace/Lucene-Solr-Tests-4.x-java7/solr/example/example-DIH/solr/db/lib/hsqldb-1.8.0.10.jar:/usr/home/hudson/hudson-slave/workspace/Lucene-Solr-Tests-4.x-java7/lucene/build/core/classes/java:/usr/home/hudson/hudson-slave/workspace/Lucene-Solr-Tests-4.x-java7/lucene/test-framework/lib/junit-4.10.jar:/usr/home/hudson/hudson-slave/workspace/Lucene-Solr-Tests-4.x-java7/lucene/test-framework/lib/randomizedtesting-runner-2.0.1.jar:/home/hudson/hudson-slave/tools/Ant/ant-1.8.2/lib/ant-launcher.jar:/home/hudson/.ant/lib/ivy-2.2.0.jar:/home/hudson/hudson-slave/tools/Ant/ant-1.8.2/lib/ant-apache-regexp.jar:/home/hudson/hudson-slave/tools/Ant/ant-1.8.2/lib/ant-junit.jar:/home/hudson/hudson-slave/tools/Ant/ant-1.8.2/lib/ant-apache-bsf.jar:/home/hudson/hudson-slave/tools/Ant/ant-1.8.2/lib/ant-commons-net.jar:/home/hudson/hudson-slave/tools/Ant/ant-1.8.2/lib/ant-antlr.jar:/home/hudson/hudson-slave/tools/Ant/ant-1.8.2/lib/ant-apache-log4j.jar:/home/hudson/hudson-slave/tools/Ant/ant-1.8.2/lib/ant-commons-logging.jar:/home/hudson/hudson-slave/tools/Ant/ant-1.8.2/lib/ant-apache-xalan2.jar:/home/hudson/hudson-slave/tools/Ant/ant-1.8.2/lib/ant-apache-oro.jar:/home/hudson/hudson-slave/tools/Ant/ant-1.8.2/lib/ant-junit4.jar:/home/hudson/hudson-slave/tools/Ant/ant-1.8.2/lib/ant-netrexx.jar:/home/hudson/hudson-slave/tools/Ant/ant-1.8.2/lib/ant-swing.jar:/home/hudson/hudson-slave/tools/Ant/ant-1.8.2/lib/ant-javamail.jar:/home/hudson/hudson-slave/tools/Ant/ant-1.8.2/lib/ant-jsch.jar:/home/hudson/hudson-slave/tools/Ant/ant-1.8.2/lib/ant-jmf.jar:/home/hudson/hudson-slave/tools/Ant/ant-1.8.2/lib/ant.jar:/home/hudson/hudson-slave/tools/Ant/ant-1.8.2/lib/ant-apache-bcel.jar:/home/hudson/hudson-slave/tools/Ant/ant-1.8.2/lib/ant-jai.jar:/home/hudson/hudson-slave/tools/Ant/ant-1.8.2/lib/ant-testutil.jar:/home/hudson/hudson-slave/tools/Ant/ant-1.8.2/lib/ant-apache-resolver.jar:/home/hudson/hudson-slave/tools/Ant/ant-1.8.2/lib/ant-jdepend.jar:/usr/local/openjdk7/lib/tools.jar:/home/hudson/.ivy2/cache/com.carrotsearch.randomizedtesting/junit4-ant/jars/junit4-ant-2.0.1.jar
[junit4:junit4]   2> 92 T201 oaz.Environment.logEnv Server environment:java.library.path=/usr/local/openjdk7/jre/lib/amd64/server:/usr/local/openjdk7/jre/lib/amd64:/usr/local/openjdk7/jre/../lib/amd64:/usr/local/openjdk6/jre/lib/amd64/server:/usr/local/openjdk6/jre/lib/amd64:/usr/local/openjdk6/jre/../lib/amd64:/usr/java/packages/lib/amd64:/lib:/usr/lib:/usr/local/lib
[junit4:junit4]   2> 92 T201 oaz.Environment.logEnv Server environment:java.io.tmpdir=.
[junit4:junit4]   2> 92 T201 oaz.Environment.logEnv Server environment:java.compiler=<NA>
[junit4:junit4]   2> 92 T201 oaz.Environment.logEnv Server environment:os.name=FreeBSD
[junit4:junit4]   2> 92 T201 oaz.Environment.logEnv Server environment:os.arch=amd64
[junit4:junit4]   2> 92 T201 oaz.Environment.logEnv Server environment:os.version=9.0-RELEASE
[junit4:junit4]   2> 93 T201 oaz.Environment.logEnv Server environment:user.name=hudson
[junit4:junit4]   2> 93 T201 oaz.Environment.logEnv Server environment:user.home=/home/hudson
[junit4:junit4]   2> 93 T201 oaz.Environment.logEnv Server environment:user.dir=/usr/home/hudson/hudson-slave/workspace/Lucene-Solr-Tests-4.x-java7/solr/build/solr-core/test/J1
[junit4:junit4]   2> 138 T201 oazs.ZooKeeperServer.setTickTime tickTime set to 1000
[junit4:junit4]   2> 179 T201 oazs.NIOServerCnxn$Factory.<init> binding to port 0.0.0.0/0.0.0.0:0
[junit4:junit4]   2> 217 T200 oasc.ZkTestServer.run start zk server on port:37002
[junit4:junit4]   2> 300 T200 oaz.Environment.logEnv Client environment:zookeeper.version=3.3.6-1366786, built on 07/29/2012 06:22 GMT
[junit4:junit4]   2> 301 T200 oaz.Environment.logEnv Client environment:host.name=lucene.zones.apache.org
[junit4:junit4]   2> 301 T200 oaz.Environment.logEnv Client environment:java.version=1.7.0_06
[junit4:junit4]   2> 302 T200 oaz.Environment.logEnv Client environment:java.vendor=Oracle Corporation
[junit4:junit4]   2> 302 T200 oaz.Environment.logEnv Client environment:java.home=/usr/local/openjdk7/jre
[junit4:junit4]   2> 303 T200 oaz.Environment.logEnv Client environment:java.class.path=/usr/home/hudson/hudson-slave/workspace/Lucene-Solr-Tests-4.x-java7/solr/build/solr-core/classes/test:/usr/home/hudson/hudson-slave/workspace/Lucene-Solr-Tests-4.x-java7/solr/build/solr-test-framework/classes/java:/usr/home/hudson/hudson-slave/workspace/Lucene-Solr-Tests-4.x-java7/solr/build/solr-core/test-files:/usr/home/hudson/hudson-slave/workspace/Lucene-Solr-Tests-4.x-java7/lucene/build/codecs/classes/java:/usr/home/hudson/hudson-slave/workspace/Lucene-Solr-Tests-4.x-java7/lucene/build/test-framework/classes/java:/usr/home/hudson/hudson-slave/workspace/Lucene-Solr-Tests-4.x-java7/solr/build/solr-solrj/classes/java:/usr/home/hudson/hudson-slave/workspace/Lucene-Solr-Tests-4.x-java7/solr/build/solr-core/classes/java:/usr/home/hudson/hudson-slave/workspace/Lucene-Solr-Tests-4.x-java7/lucene/build/analysis/common/lucene-analyzers-common-4.0-SNAPSHOT.jar:/usr/home/hudson/hudson-slave/workspace/Lucene-Solr-Tests-4.x-java7/lucene/build/analysis/kuromoji/lucene-analyzers-kuromoji-4.0-SNAPSHOT.jar:/usr/home/hudson/hudson-slave/workspace/Lucene-Solr-Tests-4.x-java7/lucene/build/analysis/phonetic/lucene-analyzers-phonetic-4.0-SNAPSHOT.jar:/usr/home/hudson/hudson-slave/workspace/Lucene-Solr-Tests-4.x-java7/lucene/build/highlighter/lucene-highlighter-4.0-SNAPSHOT.jar:/usr/home/hudson/hudson-slave/workspace/Lucene-Solr-Tests-4.x-java7/lucene/build/memory/lucene-memory-4.0-SNAPSHOT.jar:/usr/home/hudson/hudson-slave/workspace/Lucene-Solr-Tests-4.x-java7/lucene/build/misc/lucene-misc-4.0-SNAPSHOT.jar:/usr/home/hudson/hudson-slave/workspace/Lucene-Solr-Tests-4.x-java7/lucene/build/spatial/lucene-spatial-4.0-SNAPSHOT.jar:/usr/home/hudson/hudson-slave/workspace/Lucene-Solr-Tests-4.x-java7/lucene/build/suggest/lucene-suggest-4.0-SNAPSHOT.jar:/usr/home/hudson/hudson-slave/workspace/Lucene-Solr-Tests-4.x-java7/lucene/build/grouping/lucene-grouping-4.0-SNAPSHOT.jar:/usr/home/hudson/hudson-slave/workspace/Lucene-Solr-Tests-4.x-java7/lucene/build/queries/lucene-queries-4.0-SNAPSHOT.jar:/usr/home/hudson/hudson-slave/workspace/Lucene-Solr-Tests-4.x-java7/lucene/build/queryparser/lucene-queryparser-4.0-SNAPSHOT.jar:/usr/home/hudson/hudson-slave/workspace/Lucene-Solr-Tests-4.x-java7/solr/core/lib/commons-cli-1.2.jar:/usr/home/hudson/hudson-slave/workspace/Lucene-Solr-Tests-4.x-java7/solr/core/lib/commons-codec-1.7.jar:/usr/home/hudson/hudson-slave/workspace/Lucene-Solr-Tests-4.x-java7/solr/core/lib/commons-fileupload-1.2.1.jar:/usr/home/hudson/hudson-slave/workspace/Lucene-Solr-Tests-4.x-java7/solr/core/lib/commons-lang-2.6.jar:/usr/home/hudson/hudson-slave/workspace/Lucene-Solr-Tests-4.x-java7/solr/core/lib/easymock-2.2.jar:/usr/home/hudson/hudson-slave/workspace/Lucene-Solr-Tests-4.x-java7/solr/core/lib/guava-r05.jar:/usr/home/hudson/hudson-slave/workspace/Lucene-Solr-Tests-4.x-java7/solr/core/lib/javax.servlet-api-3.0.1.jar:/usr/home/hudson/hudson-slave/workspace/Lucene-Solr-Tests-4.x-java7/solr/core/lib/spatial4j-0.3.jar:/usr/home/hudson/hudson-slave/workspace/Lucene-Solr-Tests-4.x-java7/solr/solrj/lib/commons-io-2.1.jar:/usr/home/hudson/hudson-slave/workspace/Lucene-Solr-Tests-4.x-java7/solr/solrj/lib/httpclient-4.1.3.jar:/usr/home/hudson/hudson-slave/workspace/Lucene-Solr-Tests-4.x-java7/solr/solrj/lib/httpcore-4.1.4.jar:/usr/home/hudson/hudson-slave/workspace/Lucene-Solr-Tests-4.x-java7/solr/solrj/lib/httpmime-4.1.3.jar:/usr/home/hudson/hudson-slave/workspace/Lucene-Solr-Tests-4.x-java7/solr/solrj/lib/jcl-over-slf4j-1.6.4.jar:/usr/home/hudson/hudson-slave/workspace/Lucene-Solr-Tests-4.x-java7/solr/solrj/lib/log4j-over-slf4j-1.6.4.jar:/usr/home/hudson/hudson-slave/workspace/Lucene-Solr-Tests-4.x-java7/solr/solrj/lib/slf4j-api-1.6.4.jar:/usr/home/hudson/hudson-slave/workspace/Lucene-Solr-Tests-4.x-java7/solr/solrj/lib/slf4j-jdk14-1.6.4.jar:/usr/home/hudson/hudson-slave/workspace/Lucene-Solr-Tests-4.x-java7/solr/solrj/lib/wstx-asl-3.2.7.jar:/usr/home/hudson/hudson-slave/workspace/Lucene-Solr-Tests-4.x-java7/solr/solrj/lib/zookeeper-3.3.6.jar:/usr/home/hudson/hudson-slave/workspace/Lucene-Solr-Tests-4.x-java7/solr/example/lib/jetty-continuation-8.1.2.v20120308.jar:/usr/home/hudson/hudson-slave/workspace/Lucene-Solr-Tests-4.x-java7/solr/example/lib/jetty-deploy-8.1.2.v20120308.jar:/usr/home/hudson/hudson-slave/workspace/Lucene-Solr-Tests-4.x-java7/solr/example/lib/jetty-http-8.1.2.v20120308.jar:/usr/home/hudson/hudson-slave/workspace/Lucene-Solr-Tests-4.x-java7/solr/example/lib/jetty-io-8.1.2.v20120308.jar:/usr/home/hudson/hudson-slave/workspace/Lucene-Solr-Tests-4.x-java7/solr/example/lib/jetty-jmx-8.1.2.v20120308.jar:/usr/home/hudson/hudson-slave/workspace/Lucene-Solr-Tests-4.x-java7/solr/example/lib/jetty-security-8.1.2.v20120308.jar:/usr/home/hudson/hudson-slave/workspace/Lucene-Solr-Tests-4.x-java7/solr/example/lib/jetty-server-8.1.2.v20120308.jar:/usr/home/hudson/hudson-slave/workspace/Lucene-Solr-Tests-4.x-java7/solr/example/lib/jetty-servlet-8.1.2.v20120308.jar:/usr/home/hudson/hudson-slave/workspace/Lucene-Solr-Tests-4.x-java7/solr/example/lib/jetty-util-8.1.2.v20120308.jar:/usr/home/hudson/hudson-slave/workspace/Lucene-Solr-Tests-4.x-java7/solr/example/lib/jetty-webapp-8.1.2.v20120308.jar:/usr/home/hudson/hudson-slave/workspace/Lucene-Solr-Tests-4.x-java7/solr/example/lib/jetty-xml-8.1.2.v20120308.jar:/usr/home/hudson/hudson-slave/workspace/Lucene-Solr-Tests-4.x-java7/solr/example/lib/servlet-api-3.0.jar:/usr/home/hudson/hudson-slave/workspace/Lucene-Solr-Tests-4.x-java7/solr/example/example-DIH/solr/db/lib/hsqldb-1.8.0.10.jar:/usr/home/hudson/hudson-slave/workspace/Lucene-Solr-Tests-4.x-java7/lucene/build/core/classes/java:/usr/home/hudson/hudson-slave/workspace/Lucene-Solr-Tests-4.x-java7/lucene/test-framework/lib/junit-4.10.jar:/usr/home/hudson/hudson-slave/workspace/Lucene-Solr-Tests-4.x-java7/lucene/test-framework/lib/randomizedtesting-runner-2.0.1.jar:/home/hudson/hudson-slave/tools/Ant/ant-1.8.2/lib/ant-launcher.jar:/home/hudson/.ant/lib/ivy-2.2.0.jar:/home/hudson/hudson-slave/tools/Ant/ant-1.8.2/lib/ant-apache-regexp.jar:/home/hudson/hudson-slave/tools/Ant/ant-1.8.2/lib/ant-junit.jar:/home/hudson/hudson-slave/tools/Ant/ant-1.8.2/lib/ant-apache-bsf.jar:/home/hudson/hudson-slave/tools/Ant/ant-1.8.2/lib/ant-commons-net.jar:/home/hudson/hudson-slave/tools/Ant/ant-1.8.2/lib/ant-antlr.jar:/home/hudson/hudson-slave/tools/Ant/ant-1.8.2/lib/ant-apache-log4j.jar:/home/hudson/hudson-slave/tools/Ant/ant-1.8.2/lib/ant-commons-logging.jar:/home/hudson/hudson-slave/tools/Ant/ant-1.8.2/lib/ant-apache-xalan2.jar:/home/hudson/hudson-slave/tools/Ant/ant-1.8.2/lib/ant-apache-oro.jar:/home/hudson/hudson-slave/tools/Ant/ant-1.8.2/lib/ant-junit4.jar:/home/hudson/hudson-slave/tools/Ant/ant-1.8.2/lib/ant-netrexx.jar:/home/hudson/hudson-slave/tools/Ant/ant-1.8.2/lib/ant-swing.jar:/home/hudson/hudson-slave/tools/Ant/ant-1.8.2/lib/ant-javamail.jar:/home/hudson/hudson-slave/tools/Ant/ant-1.8.2/lib/ant-jsch.jar:/home/hudson/hudson-slave/tools/Ant/ant-1.8.2/lib/ant-jmf.jar:/home/hudson/hudson-slave/tools/Ant/ant-1.8.2/lib/ant.jar:/home/hudson/hudson-slave/tools/Ant/ant-1.8.2/lib/ant-apache-bcel.jar:/home/hudson/hudson-slave/tools/Ant/ant-1.8.2/lib/ant-jai.jar:/home/hudson/hudson-slave/tools/Ant/ant-1.8.2/lib/ant-testutil.jar:/home/hudson/hudson-slave/tools/Ant/ant-1.8.2/lib/ant-apache-resolver.jar:/home/hudson/hudson-slave/tools/Ant/ant-1.8.2/lib/ant-jdepend.jar:/usr/local/openjdk7/lib/tools.jar:/home/hudson/.ivy2/cache/com.carrotsearch.randomizedtesting/junit4-ant/jars/junit4-ant-2.0.1.jar
[junit4:junit4]   2> 305 T200 oaz.Environment.logEnv Client environment:java.library.path=/usr/local/openjdk7/jre/lib/amd64/server:/usr/local/openjdk7/jre/lib/amd64:/usr/local/openjdk7/jre/../lib/amd64:/usr/local/openjdk6/jre/lib/amd64/server:/usr/local/openjdk6/jre/lib/amd64:/usr/local/openjdk6/jre/../lib/amd64:/usr/java/packages/lib/amd64:/lib:/usr/lib:/usr/local/lib
[junit4:junit4]   2> 305 T200 oaz.Environment.logEnv Client environment:java.io.tmpdir=.
[junit4:junit4]   2> 306 T200 oaz.Environment.logEnv Client environment:java.compiler=<NA>
[junit4:junit4]   2> 306 T200 oaz.Environment.logEnv Client environment:os.name=FreeBSD
[junit4:junit4]   2> 307 T200 oaz.Environment.logEnv Client environment:os.arch=amd64
[junit4:junit4]   2> 307 T200 oaz.Environment.logEnv Client environment:os.version=9.0-RELEASE
[junit4:junit4]   2> 307 T200 oaz.Environment.logEnv Client environment:user.name=hudson
[junit4:junit4]   2> 308 T200 oaz.Environment.logEnv Client environment:user.home=/home/hudson
[junit4:junit4]   2> 308 T200 oaz.Environment.logEnv Client environment:user.dir=/usr/home/hudson/hudson-slave/workspace/Lucene-Solr-Tests-4.x-java7/solr/build/solr-core/test/J1
[junit4:junit4]   2> 314 T200 oaz.ZooKeeper.<init> Initiating client connection, connectString=127.0.0.1:37002 sessionTimeout=10000 watcher=org.apache.solr.common.cloud.ConnectionManager@642e1d80
[junit4:junit4]   2> 321 T201 oazsp.FileTxnSnapLog.save Snapshotting: 0
[junit4:junit4]   2> 372 T203 oaz.ClientCnxn$SendThread.startConnect Opening socket connection to server /127.0.0.1:37002
[junit4:junit4]   2> 372 T200 oascc.ConnectionManager.waitForConnected Waiting for client to connect to ZooKeeper
[junit4:junit4]   2> 375 T203 oaz.ClientCnxn$SendThread.primeConnection Socket connection established to localhost/127.0.0.1:37002, initiating session
[junit4:junit4]   2> 376 T202 oazs.NIOServerCnxn$Factory.run Accepted socket connection from /140.211.11.196:37004
[junit4:junit4]   2> 396 T202 oazs.NIOServerCnxn.doIO WARNING Exception causing close of session 0x0 due to java.io.IOException: ZooKeeperServer not running
[junit4:junit4]   2> 397 T202 oazs.NIOServerCnxn.closeSock Closed socket connection for client /140.211.11.196:37004 (no session established for client)
[junit4:junit4]   2> 398 T203 oaz.ClientCnxn$SendThread.run Unable to read additional data from server sessionid 0x0, likely server has closed socket, closing socket connection and attempting reconnect
[junit4:junit4]   2> 1818 T203 oaz.ClientCnxn$SendThread.startConnect Opening socket connection to server localhost/127.0.0.1:37002
[junit4:junit4]   2> 1818 T203 oaz.ClientCnxn$SendThread.primeConnection Socket connection established to localhost/127.0.0.1:37002, initiating session
[junit4:junit4]   2> 1819 T202 oazs.NIOServerCnxn$Factory.run Accepted socket connection from /140.211.11.196:37005
[junit4:junit4]   2> 1820 T202 oazs.NIOServerCnxn.readConnectRequest Client attempting to establish new session at /140.211.11.196:37005
[junit4:junit4]   2> 1834 T206 oazsp.FileTxnLog.append Creating new log file: log.1
[junit4:junit4]   2> 1863 T206 oazs.NIOServerCnxn.finishSessionInit Established session 0x139e83ae6bc0000 with negotiated timeout 10000 for client /140.211.11.196:37005
[junit4:junit4]   2> 1863 T203 oaz.ClientCnxn$SendThread.readConnectResult Session establishment complete on server localhost/127.0.0.1:37002, sessionid = 0x139e83ae6bc0000, negotiated timeout = 10000
[junit4:junit4]   2> 1866 T205 oascc.ConnectionManager.process Watcher org.apache.solr.common.cloud.ConnectionManager@642e1d80 name:ZooKeeperConnection Watcher:127.0.0.1:37002 got event WatchedEvent state:SyncConnected type:None path:null path:null type:None
[junit4:junit4]   2> 1867 T200 oascc.ConnectionManager.waitForConnected Client is connected to ZooKeeper
[junit4:junit4]   2> 1870 T200 oascc.SolrZkClient.makePath makePath: /solr
[junit4:junit4]   2> 1924 T207 oazs.PrepRequestProcessor.pRequest Processed session termination for sessionid: 0x139e83ae6bc0000
[junit4:junit4]   2> 1926 T205 oaz.ClientCnxn$EventThread.run EventThread shut down
[junit4:junit4]   2> 1926 T200 oaz.ZooKeeper.close Session: 0x139e83ae6bc0000 closed
[junit4:junit4]   2> 1926 T200 oaz.ZooKeeper.<init> Initiating client connection, connectString=127.0.0.1:37002/solr sessionTimeout=10000 watcher=org.apache.solr.common.cloud.ConnectionManager@7725310f
[junit4:junit4]   2> 1927 T202 oazs.NIOServerCnxn.closeSock Closed socket connection for client /140.211.11.196:37005 which had sessionid 0x139e83ae6bc0000
[junit4:junit4]   2> 1927 T208 oaz.ClientCnxn$SendThread.startConnect Opening socket connection to server /127.0.0.1:37002
[junit4:junit4]   2> 1927 T200 oascc.ConnectionManager.waitForConnected Waiting for client to connect to ZooKeeper
[junit4:junit4]   2> 1928 T208 oaz.ClientCnxn$SendThread.primeConnection Socket connection established to localhost/127.0.0.1:37002, initiating session
[junit4:junit4]   2> 1928 T202 oazs.NIOServerCnxn$Factory.run Accepted socket connection from /140.211.11.196:37006
[junit4:junit4]   2> 1929 T202 oazs.NIOServerCnxn.readConnectRequest Client attempting to establish new session at /140.211.11.196:37006
[junit4:junit4]   2> 1931 T206 oazs.NIOServerCnxn.finishSessionInit Established session 0x139e83ae6bc0001 with negotiated timeout 10000 for client /140.211.11.196:37006
[junit4:junit4]   2> 1931 T208 oaz.ClientCnxn$SendThread.readConnectResult Session establishment complete on server localhost/127.0.0.1:37002, sessionid = 0x139e83ae6bc0001, negotiated timeout = 10000
[junit4:junit4]   2> 1932 T209 oascc.ConnectionManager.process Watcher org.apache.solr.common.cloud.ConnectionManager@7725310f name:ZooKeeperConnection Watcher:127.0.0.1:37002/solr got event WatchedEvent state:SyncConnected type:None path:null path:null type:None
[junit4:junit4]   2> 1932 T200 oascc.ConnectionManager.waitForConnected Client is connected to ZooKeeper
[junit4:junit4]   2> 1941 T200 oascc.SolrZkClient.makePath makePath: /collections/collection1
[junit4:junit4]   2> 1946 T200 oascc.SolrZkClient.makePath makePath: /collections/collection1/shards
[junit4:junit4]   2> 1956 T200 oascc.SolrZkClient.makePath makePath: /collections/control_collection
[junit4:junit4]   2> 1959 T200 oascc.SolrZkClient.makePath makePath: /collections/control_collection/shards
[junit4:junit4]   2> 1967 T200 oasc.AbstractZkTestCase.putConfig put /usr/home/hudson/hudson-slave/workspace/Lucene-Solr-Tests-4.x-java7/solr/build/solr-core/test-files/solr/collection1/conf/solrconfig.xml to /configs/conf1/solrconfig.xml
[junit4:junit4]   2> 1969 T200 oascc.SolrZkClient.makePath makePath: /configs/conf1/solrconfig.xml
[junit4:junit4]   2> 1983 T200 oasc.AbstractZkTestCase.putConfig put /usr/home/hudson/hudson-slave/workspace/Lucene-Solr-Tests-4.x-java7/solr/build/solr-core/test-files/solr/collection1/conf/schema.xml to /configs/conf1/schema.xml
[junit4:junit4]   2> 1984 T200 oascc.SolrZkClient.makePath makePath: /configs/conf1/schema.xml
[junit4:junit4]   2> 2112 T200 oasc.AbstractZkTestCase.putConfig put /usr/home/hudson/hudson-slave/workspace/Lucene-Solr-Tests-4.x-java7/solr/build/solr-core/test-files/solr/collection1/conf/solrconfig.xml to /configs/conf1/solrconfig.xml
[junit4:junit4]   2> 2113 T200 oascc.SolrZkClient.makePath makePath: /configs/conf1/solrconfig.xml
[junit4:junit4]   2> 2126 T200 oasc.AbstractZkTestCase.putConfig put /usr/home/hudson/hudson-slave/workspace/Lucene-Solr-Tests-4.x-java7/solr/build/solr-core/test-files/solr/collection1/conf/stopwords.txt to /configs/conf1/stopwords.txt
[junit4:junit4]   2> 2127 T200 oascc.SolrZkClient.makePath makePath: /configs/conf1/stopwords.txt
[junit4:junit4]   2> 2131 T200 oasc.AbstractZkTestCase.putConfig put /usr/home/hudson/hudson-slave/workspace/Lucene-Solr-Tests-4.x-java7/solr/build/solr-core/test-files/solr/collection1/conf/protwords.txt to /configs/conf1/protwords.txt
[junit4:junit4]   2> 2132 T200 oascc.SolrZkClient.makePath makePath: /configs/conf1/protwords.txt
[junit4:junit4]   2> 2135 T200 oasc.AbstractZkTestCase.putConfig put /usr/home/hudson/hudson-slave/workspace/Lucene-Solr-Tests-4.x-java7/solr/build/solr-core/test-files/solr/collection1/conf/currency.xml to /configs/conf1/currency.xml
[junit4:junit4]   2> 2136 T200 oascc.SolrZkClient.makePath makePath: /configs/conf1/currency.xml
[junit4:junit4]   2> 2140 T200 oasc.AbstractZkTestCase.putConfig put /usr/home/hudson/hudson-slave/workspace/Lucene-Solr-Tests-4.x-java7/solr/build/solr-core/test-files/solr/collection1/conf/open-exchange-rates.json to /configs/conf1/open-exchange-rates.json
[junit4:junit4]   2> 2141 T200 oascc.SolrZkClient.makePath makePath: /configs/conf1/open-exchange-rates.json
[junit4:junit4]   2> 2144 T200 oasc.AbstractZkTestCase.putConfig put /usr/home/hudson/hudson-slave/workspace/Lucene-Solr-Tests-4.x-java7/solr/build/solr-core/test-files/solr/collection1/conf/mapping-ISOLatin1Accent.txt to /configs/conf1/mapping-ISOLatin1Accent.txt
[junit4:junit4]   2> 2145 T200 oascc.SolrZkClient.makePath makePath: /configs/conf1/mapping-ISOLatin1Accent.txt
[junit4:junit4]   2> 2148 T200 oasc.AbstractZkTestCase.putConfig put /usr/home/hudson/hudson-slave/workspace/Lucene-Solr-Tests-4.x-java7/solr/build/solr-core/test-files/solr/collection1/conf/old_synonyms.txt to /configs/conf1/old_synonyms.txt
[junit4:junit4]   2> 2149 T200 oascc.SolrZkClient.makePath makePath: /configs/conf1/old_synonyms.txt
[junit4:junit4]   2> 2153 T200 oasc.AbstractZkTestCase.putConfig put /usr/home/hudson/hudson-slave/workspace/Lucene-Solr-Tests-4.x-java7/solr/build/solr-core/test-files/solr/collection1/conf/synonyms.txt to /configs/conf1/synonyms.txt
[junit4:junit4]   2> 2153 T200 oascc.SolrZkClient.makePath makePath: /configs/conf1/synonyms.txt
[junit4:junit4]   2> 2158 T207 oazs.PrepRequestProcessor.pRequest Processed session termination for sessionid: 0x139e83ae6bc0001
[junit4:junit4]   2> 2159 T209 oaz.ClientCnxn$EventThread.run EventThread shut down
[junit4:junit4]   2> 2159 T200 oaz.ZooKeeper.close Session: 0x139e83ae6bc0001 closed
[junit4:junit4]   2> 2159 T202 oazs.NIOServerCnxn.closeSock Closed socket connection for client /140.211.11.196:37006 which had sessionid 0x139e83ae6bc0001
[junit4:junit4]   2> 2161 T200 oejs.Server.doStart jetty-8.1.2.v20120308
[junit4:junit4]   2> 2164 T200 oejs.AbstractConnector.doStart Started SocketConnector@0.0.0.0:37007
[junit4:junit4]   2> 2165 T200 oasc.SolrResourceLoader.locateSolrHome JNDI not configured for solr (NoInitialContextEx)
[junit4:junit4]   2> 2165 T200 oasc.SolrResourceLoader.locateSolrHome using system property solr.solr.home: /usr/home/hudson/hudson-slave/workspace/Lucene-Solr-Tests-4.x-java7/solr/build/solr-core/test-files/solr
[junit4:junit4]   2> 2166 T200 oasc.SolrResourceLoader.<init> new SolrResourceLoader for deduced Solr Home: '/usr/home/hudson/hudson-slave/workspace/Lucene-Solr-Tests-4.x-java7/solr/build/solr-core/test-files/solr/'
[junit4:junit4]   2> 2195 T200 oass.SolrDispatchFilter.init SolrDispatchFilter.init()
[junit4:junit4]   2> 2196 T200 oasc.SolrResourceLoader.locateSolrHome JNDI not configured for solr (NoInitialContextEx)
[junit4:junit4]   2> 2196 T200 oasc.SolrResourceLoader.locateSolrHome using system property solr.solr.home: /usr/home/hudson/hudson-slave/workspace/Lucene-Solr-Tests-4.x-java7/solr/build/solr-core/test-files/solr
[junit4:junit4]   2> 2197 T200 oasc.CoreContainer$Initializer.initialize looking for solr.xml: /usr/home/hudson/hudson-slave/workspace/Lucene-Solr-Tests-4.x-java7/solr/build/solr-core/test-files/solr/solr.xml
[junit4:junit4]   2> 2197 T200 oasc.CoreContainer.<init> New CoreContainer 935633010
[junit4:junit4]   2> 2198 T200 oasc.CoreContainer.load Loading CoreContainer using Solr Home: '/usr/home/hudson/hudson-slave/workspace/Lucene-Solr-Tests-4.x-java7/solr/build/solr-core/test-files/solr/'
[junit4:junit4]   2> 2198 T200 oasc.SolrResourceLoader.<init> new SolrResourceLoader for directory: '/usr/home/hudson/hudson-slave/workspace/Lucene-Solr-Tests-4.x-java7/solr/build/solr-core/test-files/solr/'
[junit4:junit4]   2> 2224 T200 oasc.CoreContainer.load Registering Log Listener
[junit4:junit4]   2> 2236 T200 oasc.CoreContainer.initZooKeeper Zookeeper client=127.0.0.1:37002/solr
[junit4:junit4]   2> 2260 T200 oaz.ZooKeeper.<init> Initiating client connection, connectString=127.0.0.1:37002/solr sessionTimeout=5000 watcher=org.apache.solr.common.cloud.ConnectionManager@6316e085
[junit4:junit4]   2> 2261 T219 oaz.ClientCnxn$SendThread.startConnect Opening socket connection to server /127.0.0.1:37002
[junit4:junit4]   2> 2261 T200 oascc.ConnectionManager.waitForConnected Waiting for client to connect to ZooKeeper
[junit4:junit4]   2> 2262 T219 oaz.ClientCnxn$SendThread.primeConnection Socket connection established to localhost/127.0.0.1:37002, initiating session
[junit4:junit4]   2> 2262 T202 oazs.NIOServerCnxn$Factory.run Accepted socket connection from /140.211.11.196:37008
[junit4:junit4]   2> 2263 T202 oazs.NIOServerCnxn.readConnectRequest Client attempting to establish new session at /140.211.11.196:37008
[junit4:junit4]   2> 2268 T206 oazs.NIOServerCnxn.finishSessionInit Established session 0x139e83ae6bc0002 with negotiated timeout 5000 for client /140.211.11.196:37008
[junit4:junit4]   2> 2268 T219 oaz.ClientCnxn$SendThread.readConnectResult Session establishment complete on server localhost/127.0.0.1:37002, sessionid = 0x139e83ae6bc0002, negotiated timeout = 5000
[junit4:junit4]   2> 2268 T220 oascc.ConnectionManager.process Watcher org.apache.solr.common.cloud.ConnectionManager@6316e085 name:ZooKeeperConnection Watcher:127.0.0.1:37002/solr got event WatchedEvent state:SyncConnected type:None path:null path:null type:None
[junit4:junit4]   2> 2268 T200 oascc.ConnectionManager.waitForConnected Client is connected to ZooKeeper
[junit4:junit4]   2> 2284 T207 oazs.PrepRequestProcessor.pRequest Got user-level KeeperException when processing sessionid:0x139e83ae6bc0002 type:create cxid:0x2 zxid:0xfffffffffffffffe txntype:unknown reqpath:n/a Error Path:/solr/overseer Error:KeeperErrorCode = NodeExists for /solr/overseer
[junit4:junit4]   2> 2292 T200 oascc.SolrZkClient.makePath makePath: /live_nodes
[junit4:junit4]   2> 2295 T200 oasc.ZkController.createEphemeralLiveNode Register node as live in ZooKeeper:/live_nodes/127.0.0.1:37007_solr
[junit4:junit4]   2> 2300 T207 oazs.PrepRequestProcessor.pRequest Got user-level KeeperException when processing sessionid:0x139e83ae6bc0002 type:delete cxid:0x7 zxid:0xfffffffffffffffe txntype:unknown reqpath:n/a Error Path:/solr/live_nodes/127.0.0.1:37007_solr Error:KeeperErrorCode = NoNode for /solr/live_nodes/127.0.0.1:37007_solr
[junit4:junit4]   2> 2302 T200 oascc.SolrZkClient.makePath makePath: /live_nodes/127.0.0.1:37007_solr
[junit4:junit4]   2> 2305 T200 oashc.HttpShardHandlerFactory.getParameter Setting socketTimeout to: 0
[junit4:junit4]   2> 2306 T200 oashc.HttpShardHandlerFactory.getParameter Setting urlScheme to: http://
[junit4:junit4]   2> 2306 T200 oashc.HttpShardHandlerFactory.getParameter Setting connTimeout to: 0
[junit4:junit4]   2> 2307 T200 oashc.HttpShardHandlerFactory.getParameter Setting maxConnectionsPerHost to: 20
[junit4:junit4]   2> 2307 T200 oashc.HttpShardHandlerFactory.getParameter Setting corePoolSize to: 0
[junit4:junit4]   2> 2307 T200 oashc.HttpShardHandlerFactory.getParameter Setting maximumPoolSize to: 2147483647
[junit4:junit4]   2> 2308 T200 oashc.HttpShardHandlerFactory.getParameter Setting maxThreadIdleTime to: 5
[junit4:junit4]   2> 2308 T200 oashc.HttpShardHandlerFactory.getParameter Setting sizeOfQueue to: -1
[junit4:junit4]   2> 2308 T200 oashc.HttpShardHandlerFactory.getParameter Setting fairnessPolicy to: false
[junit4:junit4]   2> 2309 T200 oascsi.HttpClientUtil.createClient Creating new http client, config:maxConnectionsPerHost=20&maxConnections=10000&socketTimeout=0&connTimeout=0&retry=false
[junit4:junit4]   2> 2322 T200 oascc.SolrZkClient.makePath makePath: /overseer_elect/election
[junit4:junit4]   2> 2340 T207 oazs.PrepRequestProcessor.pRequest Got user-level KeeperException when processing sessionid:0x139e83ae6bc0002 type:delete cxid:0x15 zxid:0xfffffffffffffffe txntype:unknown reqpath:n/a Error Path:/solr/overseer_elect/leader Error:KeeperErrorCode = NoNode for /solr/overseer_elect/leader
[junit4:junit4]   2> 2342 T200 oascc.SolrZkClient.makePath makePath: /overseer_elect/leader
[junit4:junit4]   2> 2345 T200 oasc.Overseer.start Overseer (id=88357007387262978-127.0.0.1:37007_solr-n_0000000000) starting
[junit4:junit4]   2> 2345 T207 oazs.PrepRequestProcessor.pRequest Got user-level KeeperException when processing sessionid:0x139e83ae6bc0002 type:create cxid:0x1a zxid:0xfffffffffffffffe txntype:unknown reqpath:n/a Error Path:/solr/overseer Error:KeeperErrorCode = NodeExists for /solr/overseer
[junit4:junit4]   2> 2362 T207 oazs.PrepRequestProcessor.pRequest Got user-level KeeperException when processing sessionid:0x139e83ae6bc0002 type:create cxid:0x1b zxid:0xfffffffffffffffe txntype:unknown reqpath:n/a Error Path:/solr/overseer Error:KeeperErrorCode = NodeExists for /solr/overseer
[junit4:junit4]   2> 2364 T207 oazs.PrepRequestProcessor.pRequest Got user-level KeeperException when processing sessionid:0x139e83ae6bc0002 type:create cxid:0x1c zxid:0xfffffffffffffffe txntype:unknown reqpath:n/a Error Path:/solr/overseer Error:KeeperErrorCode = NodeExists for /solr/overseer
[junit4:junit4]   2> 2375 T207 oazs.PrepRequestProcessor.pRequest Got user-level KeeperException when processing sessionid:0x139e83ae6bc0002 type:create cxid:0x1d zxid:0xfffffffffffffffe txntype:unknown reqpath:n/a Error Path:/solr/overseer Error:KeeperErrorCode = NodeExists for /solr/overseer
[junit4:junit4]   2> 2376 T222 oasc.OverseerCollectionProcessor.run Process current queue of collection creations
[junit4:junit4]   2> 2377 T200 oascc.SolrZkClient.makePath makePath: /clusterstate.json
[junit4:junit4]   2> 2379 T200 oascc.ZkStateReader.createClusterStateWatchersAndUpdate Updating cluster state from ZooKeeper... 
[junit4:junit4]   2> 2398 T221 oasc.Overseer$ClusterStateUpdater.run Starting to work on the main queue
[junit4:junit4]   2> 2406 T200 oasc.CoreContainer.create Creating SolrCore 'collection1' using instanceDir: /usr/home/hudson/hudson-slave/workspace/Lucene-Solr-Tests-4.x-java7/solr/build/solr-core/test-files/solr/collection1
[junit4:junit4]   2> 2407 T200 oasc.ZkController.createCollectionZkNode Check for collection zkNode:control_collection
[junit4:junit4]   2> 2408 T200 oasc.ZkController.createCollectionZkNode Collection zkNode exists
[junit4:junit4]   2> 2408 T200 oasc.ZkController.readConfigName Load collection config from:/collections/control_collection
[junit4:junit4]   2> 2410 T200 oasc.SolrResourceLoader.<init> new SolrResourceLoader for directory: '/usr/home/hudson/hudson-slave/workspace/Lucene-Solr-Tests-4.x-java7/solr/build/solr-core/test-files/solr/collection1/'
[junit4:junit4]   2> 2411 T200 oasc.SolrResourceLoader.replaceClassLoader Adding 'file:/usr/home/hudson/hudson-slave/workspace/Lucene-Solr-Tests-4.x-java7/solr/build/solr-core/test-files/solr/collection1/lib/README' to classloader
[junit4:junit4]   2> 2412 T200 oasc.SolrResourceLoader.replaceClassLoader Adding 'file:/usr/home/hudson/hudson-slave/workspace/Lucene-Solr-Tests-4.x-java7/solr/build/solr-core/test-files/solr/collection1/lib/classes/' to classloader
[junit4:junit4]   2> 2466 T200 oasc.SolrConfig.<init> Using Lucene MatchVersion: LUCENE_40
[junit4:junit4]   2> 2516 T200 oasc.SolrConfig.<init> Loaded SolrConfig: solrconfig.xml
[junit4:junit4]   2> 2617 T200 oass.IndexSchema.readSchema Reading Solr Schema
[junit4:junit4]   2> 2623 T200 oass.IndexSchema.readSchema Schema name=test
[junit4:junit4]   2> 3118 T200 oass.OpenExchangeRatesOrgProvider.init Initialized with rates=open-exchange-rates.json, refreshInterval=1440.
[junit4:junit4]   2> 3127 T200 oass.IndexSchema.readSchema default search field in schema is text
[junit4:junit4]   2> 3130 T200 oass.IndexSchema.readSchema unique key field: id
[junit4:junit4]   2> 3154 T200 oass.FileExchangeRateProvider.reload Reloading exchange rates from file currency.xml
[junit4:junit4]   2> 3159 T200 oass.FileExchangeRateProvider.reload Reloading exchange rates from file currency.xml
[junit4:junit4]   2> 3164 T200 oass.OpenExchangeRatesOrgProvider.reload Reloading exchange rates from open-exchange-rates.json
[junit4:junit4]   2> 3167 T200 oass.OpenExchangeRatesOrgProvider.reload Reloading exchange rates from open-exchange-rates.json
[junit4:junit4]   2> 3169 T200 oasc.SolrCore.<init> [collection1] Opening new SolrCore at /usr/home/hudson/hudson-slave/workspace/Lucene-Solr-Tests-4.x-java7/solr/build/solr-core/test-files/solr/collection1/, dataDir=./org.apache.solr.cloud.BasicDistributedZk2Test-1348220937555/control/data/
[junit4:junit4]   2> 3180 T200 oasc.JmxMonitoredMap.<init> JMX monitoring is enabled. Adding Solr mbeans to JMX Server: com.sun.jmx.mbeanserver.JmxMBeanServer@4a635f47
[junit4:junit4]   2> 3205 T200 oasc.SolrCore.getNewIndexDir WARNING New index directory detected: old=null new=./org.apache.solr.cloud.BasicDistributedZk2Test-1348220937555/control/data/index/
[junit4:junit4]   2> 3206 T200 oasc.SolrCore.initIndex WARNING [collection1] Solr index directory './org.apache.solr.cloud.BasicDistributedZk2Test-1348220937555/control/data/index' doesn't exist. Creating new index...
[junit4:junit4]   2> 3207 T200 oasc.CachingDirectoryFactory.get return new directory for /usr/home/hudson/hudson-slave/workspace/Lucene-Solr-Tests-4.x-java7/solr/build/solr-core/test/J1/./org.apache.solr.cloud.BasicDistributedZk2Test-1348220937555/control/data/index forceNew:false
[junit4:junit4]   2> 3213 T200 oasc.SolrDeletionPolicy.onCommit SolrDeletionPolicy.onCommit: commits:num=1
[junit4:junit4]   2> 		commit{dir=NRTCachingDirectory(org.apache.lucene.store.NIOFSDirectory@/usr/home/hudson/hudson-slave/workspace/Lucene-Solr-Tests-4.x-java7/solr/build/solr-core/test/J1/org.apache.solr.cloud.BasicDistributedZk2Test-1348220937555/control/data/index lockFactory=org.apache.lucene.store.NativeFSLockFactory@5706f972; maxCacheMB=48.0 maxMergeSizeMB=4.0),segFN=segments_1,generation=1,filenames=[segments_1]
[junit4:junit4]   2> 3213 T200 oasc.SolrDeletionPolicy.updateCommits newest commit = 1
[junit4:junit4]   2> 3214 T200 oasc.SolrCore.initWriters created xml: solr.XMLResponseWriter
[junit4:junit4]   2> 3216 T200 oasup.UpdateRequestProcessorChain.init inserting DistributedUpdateProcessorFactory into updateRequestProcessorChain "dedupe"
[junit4:junit4]   2> 3216 T200 oasup.UpdateRequestProcessorChain.init inserting DistributedUpdateProcessorFactory into updateRequestProcessorChain "dedupe-allfields"
[junit4:junit4]   2> 3217 T200 oasup.UpdateRequestProcessorChain.init inserting DistributedUpdateProcessorFactory into updateRequestProcessorChain "stored_sig"
[junit4:junit4]   2> 3217 T200 oasup.UpdateRequestProcessorChain.init inserting DistributedUpdateProcessorFactory into updateRequestProcessorChain "uniq-fields"
[junit4:junit4]   2> 3218 T200 oasup.UpdateRequestProcessorChain.init inserting DistributedUpdateProcessorFactory into updateRequestProcessorChain "distrib-dup-test-chain-implicit"
[junit4:junit4]   2> 3218 T200 oasc.RequestHandlers.initHandlersFromConfig adding lazy requestHandler: solr.ReplicationHandler
[junit4:junit4]   2> 3219 T200 oasc.RequestHandlers.initHandlersFromConfig created /replication: solr.ReplicationHandler
[junit4:junit4]   2> 3219 T200 oasc.RequestHandlers.initHandlersFromConfig created standard: solr.StandardRequestHandler
[junit4:junit4]   2> 3220 T200 oasc.RequestHandlers.initHandlersFromConfig created /get: solr.RealTimeGetHandler
[junit4:junit4]   2> 3220 T200 oasc.RequestHandlers.initHandlersFromConfig created dismax: solr.SearchHandler
[junit4:junit4]   2> 3221 T200 oasc.RequestHandlers.initHandlersFromConfig created mock: org.apache.solr.core.MockQuerySenderListenerReqHandler
[junit4:junit4]   2> 3221 T200 oasc.RequestHandlers.initHandlersFromConfig created /admin/: org.apache.solr.handler.admin.AdminHandlers
[junit4:junit4]   2> 3222 T200 oasc.RequestHandlers.initHandlersFromConfig created defaults: solr.StandardRequestHandler
[junit4:junit4]   2> 3222 T200 oasc.RequestHandlers.initHandlersFromConfig adding lazy requestHandler: solr.StandardRequestHandler
[junit4:junit4]   2> 3223 T200 oasc.RequestHandlers.initHandlersFromConfig created lazy: solr.StandardRequestHandler
[junit4:junit4]   2> 3223 T200 oasc.RequestHandlers.initHandlersFromConfig created /update: solr.UpdateRequestHandler
[junit4:junit4]   2> 3224 T200 oasc.RequestHandlers.initHandlersFromConfig created /terms: org.apache.solr.handler.component.SearchHandler
[junit4:junit4]   2> 3224 T200 oasc.RequestHandlers.initHandlersFromConfig created spellCheckCompRH: org.apache.solr.handler.component.SearchHandler
[junit4:junit4]   2> 3225 T200 oasc.RequestHandlers.initHandlersFromConfig created spellCheckCompRH_Direct: org.apache.solr.handler.component.SearchHandler
[junit4:junit4]   2> 3226 T200 oasc.RequestHandlers.initHandlersFromConfig created spellCheckWithWordbreak: org.apache.solr.handler.component.SearchHandler
[junit4:junit4]   2> 3226 T200 oasc.RequestHandlers.initHandlersFromConfig created spellCheckWithWordbreak_Direct: org.apache.solr.handler.component.SearchHandler
[junit4:junit4]   2> 3227 T200 oasc.RequestHandlers.initHandlersFromConfig created spellCheckCompRH1: org.apache.solr.handler.component.SearchHandler
[junit4:junit4]   2> 3227 T200 oasc.RequestHandlers.initHandlersFromConfig created tvrh: org.apache.solr.handler.component.SearchHandler
[junit4:junit4]   2> 3228 T200 oasc.RequestHandlers.initHandlersFromConfig created /mlt: solr.MoreLikeThisHandler
[junit4:junit4]   2> 3228 T200 oasc.RequestHandlers.initHandlersFromConfig created /debug/dump: solr.DumpRequestHandler
[junit4:junit4]   2> 3231 T200 oashl.XMLLoader.init xsltCacheLifetimeSeconds=60
[junit4:junit4]   2> 3235 T200 oasc.SolrCore.initDeprecatedSupport WARNING solrconfig.xml uses deprecated <admin/gettableFiles>, Please update your config to use the ShowFileRequestHandler.
[junit4:junit4]   2> 3237 T200 oasc.SolrCore.initDeprecatedSupport WARNING adding ShowFileRequestHandler with hidden files: [SCHEMA.XML, OLD_SYNONYMS.TXT, STOPWORDS.TXT, PROTWORDS.TXT, OPEN-EXCHANGE-RATES.JSON, SYNONYMS.TXT, CURRENCY.XML, MAPPING-ISOLATIN1ACCENT.TXT]
[junit4:junit4]   2> 3240 T200 oass.SolrIndexSearcher.<init> Opening Searcher@29af94e2 main
[junit4:junit4]   2> 3258 T200 oasu.CommitTracker.<init> Hard AutoCommit: disabled
[junit4:junit4]   2> 3259 T200 oasu.CommitTracker.<init> Soft AutoCommit: disabled
[junit4:junit4]   2> 3259 T200 oashc.SpellCheckComponent.inform Initializing spell checkers
[junit4:junit4]   2> 3276 T200 oass.DirectSolrSpellChecker.init init: {name=direct,classname=DirectSolrSpellChecker,field=lowerfilt,minQueryLength=3}
[junit4:junit4]   2> 3355 T223 oasc.SolrCore.registerSearcher [collection1] Registered new searcher Searcher@29af94e2 main{StandardDirectoryReader(segments_1:1)}
[junit4:junit4]   2> 3361 T207 oazs.PrepRequestProcessor.pRequest Got user-level KeeperException when processing sessionid:0x139e83ae6bc0002 type:create cxid:0x53 zxid:0xfffffffffffffffe txntype:unknown reqpath:n/a Error Path:/solr/overseer/queue Error:KeeperErrorCode = NoNode for /solr/overseer/queue
[junit4:junit4]   2> 3374 T200 oasc.CoreContainer.register registering core: collection1
[junit4:junit4]   2> 3375 T200 oasc.ZkController.register Register shard - core:collection1 address:http://127.0.0.1:37007/solr shardId:control_shard
[junit4:junit4]   2> 3397 T200 oascsi.HttpClientUtil.createClient Creating new http client, config:maxConnections=10000&maxConnectionsPerHost=20&connTimeout=30000&socketTimeout=30000&retry=false
[junit4:junit4]   2> 3406 T221 oascc.ZkStateReader.updateClusterState Updating cloud state from ZooKeeper... 
[junit4:junit4]   2> 3411 T200 oascc.SolrZkClient.makePath makePath: /collections/control_collection/leader_elect/control_shard/election
[junit4:junit4]   2> 3422 T207 oazs.PrepRequestProcessor.pRequest Got user-level KeeperException when processing sessionid:0x139e83ae6bc0002 type:create cxid:0x62 zxid:0xfffffffffffffffe txntype:unknown reqpath:n/a Error Path:/solr/overseer/queue-work Error:KeeperErrorCode = NoNode for /solr/overseer/queue-work
[junit4:junit4]   2> 3442 T207 oazs.PrepRequestProcessor.pRequest Got user-level KeeperException when processing sessionid:0x139e83ae6bc0002 type:delete cxid:0x6d zxid:0xfffffffffffffffe txntype:unknown reqpath:n/a Error Path:/solr/collections/control_collection/leaders Error:KeeperErrorCode = NoNode for /solr/collections/control_collection/leaders
[junit4:junit4]   2> 3452 T200 oasc.ShardLeaderElectionContext.runLeaderProcess Running the leader process.
[junit4:junit4]   2> 3453 T207 oazs.PrepRequestProcessor.pRequest Got user-level KeeperException when processing sessionid:0x139e83ae6bc0002 type:create cxid:0x70 zxid:0xfffffffffffffffe txntype:unknown reqpath:n/a Error Path:/solr/overseer Error:KeeperErrorCode = NodeExists for /solr/overseer
[junit4:junit4]   2> 3458 T220 oascc.ZkStateReader$2.process A cluster state change has occurred - updating...
[junit4:junit4]   2> 3962 T200 oasc.ShardLeaderElectionContext.waitForReplicasToComeUp Enough replicas found to continue.
[junit4:junit4]   2> 3962 T200 oasc.ShardLeaderElectionContext.runLeaderProcess I may be the new leader - try and sync
[junit4:junit4]   2> 3964 T221 oascc.ZkStateReader.updateClusterState Updating cloud state from ZooKeeper... 
[junit4:junit4]   2> 3966 T200 oasc.SyncStrategy.sync Sync replicas to http://127.0.0.1:37007/solr/collection1/
[junit4:junit4]   2> 3967 T200 oasc.SyncStrategy.syncReplicas Sync Success - now sync replicas to me
[junit4:junit4]   2> 3968 T200 oasc.SyncStrategy.syncToMe http://127.0.0.1:37007/solr/collection1/ has no replicas
[junit4:junit4]   2> 3968 T200 oasc.ShardLeaderElectionContext.runLeaderProcess I am the new leader: http://127.0.0.1:37007/solr/collection1/
[junit4:junit4]   2> 3969 T200 oascc.SolrZkClient.makePath makePath: /collections/control_collection/leaders/control_shard
[junit4:junit4]   2> 4013 T220 oascc.ZkStateReader$2.process A cluster state change has occurred - updating...
[junit4:junit4]   2> 4026 T207 oazs.PrepRequestProcessor.pRequest Got user-level KeeperException when processing sessionid:0x139e83ae6bc0002 type:create cxid:0x8e zxid:0xfffffffffffffffe txntype:unknown reqpath:n/a Error Path:/solr/overseer Error:KeeperErrorCode = NodeExists for /solr/overseer
[junit4:junit4]   2> 4529 T221 oascc.ZkStateReader.updateClusterState Updating cloud state from ZooKeeper... 
[junit4:junit4]   2> 4573 T220 oascc.ZkStateReader$2.process A cluster state change has occurred - updating...
[junit4:junit4]   2> 4624 T200 oasc.ZkController.register We are http://127.0.0.1:37007/solr/collection1/ and leader is http://127.0.0.1:37007/solr/collection1/
[junit4:junit4]   2> 4628 T200 oasc.ZkController.register No LogReplay needed for core=collection1 baseURL=http://127.0.0.1:37007/solr
[junit4:junit4]   2> 4629 T200 oasc.ZkController.checkRecovery I am the leader, no recovery necessary
[junit4:junit4]   2> 4633 T200 oascc.ZkStateReader.updateClusterState Updating cloud state from ZooKeeper... 
[junit4:junit4]   2> 4635 T200 oass.SolrDispatchFilter.init user.dir=/usr/home/hudson/hudson-slave/workspace/Lucene-Solr-Tests-4.x-java7/solr/build/solr-core/test/J1
[junit4:junit4]   2> 4635 T200 oass.SolrDispatchFilter.init SolrDispatchFilter.init() done
[junit4:junit4]   2> 4636 T200 oascsi.HttpClientUtil.createClient Creating new http client, config:maxConnections=128&maxConnectionsPerHost=32&followRedirects=false
[junit4:junit4]   2> 4770 T200 oejs.Server.doStart jetty-8.1.2.v20120308
[junit4:junit4]   2> 4772 T200 oejs.AbstractConnector.doStart Started SocketConnector@0.0.0.0:37013
[junit4:junit4]   2> 4773 T200 oasc.SolrResourceLoader.locateSolrHome JNDI not configured for solr (NoInitialContextEx)
[junit4:junit4]   2> 4773 T200 oasc.SolrResourceLoader.locateSolrHome using system property solr.solr.home: /usr/home/hudson/hudson-slave/workspace/Lucene-Solr-Tests-4.x-java7/solr/build/solr-core/test/J1/./solrtest-jetty1-1348220942195
[junit4:junit4]   2> 4774 T200 oasc.SolrResourceLoader.<init> new SolrResourceLoader for deduced Solr Home: '/usr/home/hudson/hudson-slave/workspace/Lucene-Solr-Tests-4.x-java7/solr/build/solr-core/test/J1/./solrtest-jetty1-1348220942195/'
[junit4:junit4]   2> 4805 T200 oass.SolrDispatchFilter.init SolrDispatchFilter.init()
[junit4:junit4]   2> 4805 T200 oasc.SolrResourceLoader.locateSolrHome JNDI not configured for solr (NoInitialContextEx)
[junit4:junit4]   2> 4805 T200 oasc.SolrResourceLoader.locateSolrHome using system property solr.solr.home: /usr/home/hudson/hudson-slave/workspace/Lucene-Solr-Tests-4.x-java7/solr/build/solr-core/test/J1/./solrtest-jetty1-1348220942195
[junit4:junit4]   2> 4806 T200 oasc.CoreContainer$Initializer.initialize looking for solr.xml: /usr/home/hudson/hudson-slave/workspace/Lucene-Solr-Tests-4.x-java7/solr/build/solr-core/test/J1/./solrtest-jetty1-1348220942195/solr.xml
[junit4:junit4]   2> 4806 T200 oasc.CoreContainer.<init> New CoreContainer 1415801324
[junit4:junit4]   2> 4807 T200 oasc.CoreContainer.load Loading CoreContainer using Solr Home: '/usr/home/hudson/hudson-slave/workspace/Lucene-Solr-Tests-4.x-java7/solr/build/solr-core/test/J1/./solrtest-jetty1-1348220942195/'
[junit4:junit4]   2> 4807 T200 oasc.SolrResourceLoader.<init> new SolrResourceLoader for directory: '/usr/home/hudson/hudson-slave/workspace/Lucene-Solr-Tests-4.x-java7/solr/build/solr-core/test/J1/./solrtest-jetty1-1348220942195/'
[junit4:junit4]   2> 4829 T200 oasc.CoreContainer.load Registering Log Listener
[junit4:junit4]   2> 4840 T200 oasc.CoreContainer.initZooKeeper Zookeeper client=127.0.0.1:37002/solr
[junit4:junit4]   2> 4841 T200 oaz.ZooKeeper.<init> Initiating client connection, connectString=127.0.0.1:37002/solr sessionTimeout=5000 watcher=org.apache.solr.common.cloud.ConnectionManager@603698f
[junit4:junit4]   2> 4842 T233 oaz.ClientCnxn$SendThread.startConnect Opening socket connection to server /127.0.0.1:37002
[junit4:junit4]   2> 4842 T200 oascc.ConnectionManager.waitForConnected Waiting for client to connect to ZooKeeper
[junit4:junit4]   2> 4843 T233 oaz.ClientCnxn$SendThread.primeConnection Socket connection established to localhost/127.0.0.1:37002, initiating session
[junit4:junit4]   2> 4843 T202 oazs.NIOServerCnxn$Factory.run Accepted socket connection from /140.211.11.196:37014
[junit4:junit4]   2> 4843 T202 oazs.NIOServerCnxn.readConnectRequest Client attempting to establish new session at /140.211.11.196:37014
[junit4:junit4]   2> 4846 T206 oazs.NIOServerCnxn.finishSessionInit Established session 0x139e83ae6bc0003 with negotiated timeout 5000 for client /140.211.11.196:37014
[junit4:junit4]   2> 4846 T233 oaz.ClientCnxn$SendThread.readConnectResult Session establishment complete on server localhost/127.0.0.1:37002, sessionid = 0x139e83ae6bc0003, negotiated timeout = 5000
[junit4:junit4]   2> 4846 T234 oascc.ConnectionManager.process Watcher org.apache.solr.common.cloud.ConnectionManager@603698f name:ZooKeeperConnection Watcher:127.0.0.1:37002/solr got event WatchedEvent state:SyncConnected type:None path:null path:null type:None
[junit4:junit4]   2> 4846 T200 oascc.ConnectionManager.waitForConnected Client is connected to ZooKeeper
[junit4:junit4]   2> 4847 T207 oazs.PrepRequestProcessor.pRequest Got user-level KeeperException when processing sessionid:0x139e83ae6bc0003 type:create cxid:0x1 zxid:0xfffffffffffffffe txntype:unknown reqpath:n/a Error Path:/solr/overseer Error:KeeperErrorCode = NodeExists for /solr/overseer
[junit4:junit4]   2> 4857 T207 oazs.PrepRequestProcessor.pRequest Got user-level KeeperException when processing sessionid:0x139e83ae6bc0003 type:create cxid:0x2 zxid:0xfffffffffffffffe txntype:unknown reqpath:n/a Error Path:/solr/overseer Error:KeeperErrorCode = NodeExists for /solr/overseer
[junit4:junit4]   2> 4859 T200 oasc.ZkController.createEphemeralLiveNode Register node as live in ZooKeeper:/live_nodes/127.0.0.1:37013_solr
[junit4:junit4]   2> 4860 T207 oazs.PrepRequestProcessor.pRequest Got user-level KeeperException when processing sessionid:0x139e83ae6bc0003 type:delete cxid:0x4 zxid:0xfffffffffffffffe txntype:unknown reqpath:n/a Error Path:/solr/live_nodes/127.0.0.1:37013_solr Error:KeeperErrorCode = NoNode for /solr/live_nodes/127.0.0.1:37013_solr
[junit4:junit4]   2> 4861 T200 oascc.SolrZkClient.makePath makePath: /live_nodes/127.0.0.1:37013_solr
[junit4:junit4]   2> 4868 T220 oascc.ZkStateReader$3.process Updating live nodes
[junit4:junit4]   2> 4869 T200 oashc.HttpShardHandlerFactory.getParameter Setting socketTimeout to: 0
[junit4:junit4]   2> 4869 T200 oashc.HttpShardHandlerFactory.getParameter Setting urlScheme to: http://
[junit4:junit4]   2> 4870 T200 oashc.HttpShardHandlerFactory.getParameter Setting connTimeout to: 0
[junit4:junit4]   2> 4870 T200 oashc.HttpShardHandlerFactory.getParameter Setting maxConnectionsPerHost to: 20
[junit4:junit4]   2> 4871 T200 oashc.HttpShardHandlerFactory.getParameter Setting corePoolSize to: 0
[junit4:junit4]   2> 4871 T200 oashc.HttpShardHandlerFactory.getParameter Setting maximumPoolSize to: 2147483647
[junit4:junit4]   2> 4871 T200 oashc.HttpShardHandlerFactory.getParameter Setting maxThreadIdleTime to: 5
[junit4:junit4]   2> 4872 T200 oashc.HttpShardHandlerFactory.getParameter Setting sizeOfQueue to: -1
[junit4:junit4]   2> 4872 T200 oashc.HttpShardHandlerFactory.getParameter Setting fairnessPolicy to: false
[junit4:junit4]   2> 4872 T200 oascsi.HttpClientUtil.createClient Creating new http client, config:maxConnectionsPerHost=20&maxConnections=10000&socketTimeout=0&connTimeout=0&retry=false
[junit4:junit4]   2> 4890 T200 oascc.ZkStateReader.createClusterStateWatchersAndUpdate Updating cluster state from ZooKeeper... 
[junit4:junit4]   2> 4895 T200 oasc.CoreContainer.create Creating SolrCore 'collection1' using instanceDir: /usr/home/hudson/hudson-slave/workspace/Lucene-Solr-Tests-4.x-java7/solr/build/solr-core/test/J1/./solrtest-jetty1-1348220942195/collection1
[junit4:junit4]   2> 4895 T200 oasc.ZkController.createCollectionZkNode Check for collection zkNode:collection1
[junit4:junit4]   2> 4896 T200 oasc.ZkController.createCollectionZkNode Collection zkNode exists
[junit4:junit4]   2> 4896 T200 oasc.ZkController.readConfigName Load collection config from:/collections/collection1
[junit4:junit4]   2> 4898 T200 oasc.SolrResourceLoader.<init> new SolrResourceLoader for directory: '/usr/home/hudson/hudson-slave/workspace/Lucene-Solr-Tests-4.x-java7/solr/build/solr-core/test/J1/./solrtest-jetty1-1348220942195/collection1/'
[junit4:junit4]   2> 4899 T200 oasc.SolrResourceLoader.replaceClassLoader Adding 'file:/usr/home/hudson/hudson-slave/workspace/Lucene-Solr-Tests-4.x-java7/solr/build/solr-core/test/J1/solrtest-jetty1-1348220942195/collection1/lib/classes/' to classloader
[junit4:junit4]   2> 4899 T200 oasc.SolrResourceLoader.replaceClassLoader Adding 'file:/usr/home/hudson/hudson-slave/workspace/Lucene-Solr-Tests-4.x-java7/solr/build/solr-core/test/J1/solrtest-jetty1-1348220942195/collection1/lib/README' to classloader
[junit4:junit4]   2> 4935 T200 oasc.SolrConfig.<init> Using Lucene MatchVersion: LUCENE_40
[junit4:junit4]   2> 4982 T200 oasc.SolrConfig.<init> Loaded SolrConfig: solrconfig.xml
[junit4:junit4]   2> 5082 T221 oascc.ZkStateReader.updateClusterState Updating cloud state from ZooKeeper... 
[junit4:junit4]   2> 5084 T200 oass.IndexSchema.readSchema Reading Solr Schema
[junit4:junit4]   2> 5090 T200 oass.IndexSchema.readSchema Schema name=test
[junit4:junit4]   2> 5100 T234 oascc.ZkStateReader$2.process A cluster state change has occurred - updating...
[junit4:junit4]   2> 5100 T220 oascc.ZkStateReader$2.process A cluster state change has occurred - updating...
[junit4:junit4]   2> 5583 T200 oass.OpenExchangeRatesOrgProvider.init Initialized with rates=open-exchange-rates.json, refreshInterval=1440.
[junit4:junit4]   2> 5594 T200 oass.IndexSchema.readSchema default search field in schema is text
[junit4:junit4]   2> 5597 T200 oass.IndexSchema.readSchema unique key field: id
[junit4:junit4]   2> 5617 T200 oass.FileExchangeRateProvider.reload Reloading exchange rates from file currency.xml
[junit4:junit4]   2> 5622 T200 oass.FileExchangeRateProvider.reload Reloading exchange rates from file currency.xml
[junit4:junit4]   2> 5628 T200 oass.OpenExchangeRatesOrgProvider.reload Reloading exchange rates from open-exchange-rates.json
[junit4:junit4]   2> 5630 T200 oass.OpenExchangeRatesOrgProvider.reload Reloading exchange rates from open-exchange-rates.json
[junit4:junit4]   2> 5633 T200 oasc.SolrCore.<init> [collection1] Opening new SolrCore at /usr/home/hudson/hudson-slave/workspace/Lucene-Solr-Tests-4.x-java7/solr/build/solr-core/test/J1/./solrtest-jetty1-1348220942195/collection1/, dataDir=./org.apache.solr.cloud.BasicDistributedZk2Test-1348220937555/jetty1/
[junit4:junit4]   2> 5634 T200 oasc.JmxMonitoredMap.<init> JMX monitoring is enabled. Adding Solr mbeans to JMX Server: com.sun.jmx.mbeanserver.JmxMBeanServer@4a635f47
[junit4:junit4]   2> 5635 T200 oasc.SolrCore.getNewIndexDir WARNING New index directory detected: old=null new=./org.apache.solr.cloud.BasicDistributedZk2Test-1348220937555/jetty1/index/
[junit4:junit4]   2> 5635 T200 oasc.SolrCore.initIndex WARNING [collection1] Solr index directory './org.apache.solr.cloud.BasicDistributedZk2Test-1348220937555/jetty1/index' doesn't exist. Creating new index...
[junit4:junit4]   2> 5636 T200 oasc.CachingDirectoryFactory.get return new directory for /usr/home/hudson/hudson-slave/workspace/Lucene-Solr-Tests-4.x-java7/solr/build/solr-core/test/J1/./org.apache.solr.cloud.BasicDistributedZk2Test-1348220937555/jetty1/index forceNew:false
[junit4:junit4]   2> 5647 T200 oasc.SolrDeletionPolicy.onCommit SolrDeletionPolicy.onCommit: commits:num=1
[junit4:junit4]   2> 		commit{dir=NRTCachingDirectory(org.apache.lucene.store.NIOFSDirectory@/usr/home/hudson/hudson-slave/workspace/Lucene-Solr-Tests-4.x-java7/solr/build/solr-core/test/J1/org.apache.solr.cloud.BasicDistributedZk2Test-1348220937555/jetty1/index lockFactory=org.apache.lucene.store.NativeFSLockFactory@43bc16f5; maxCacheMB=48.0 maxMergeSizeMB=4.0),segFN=segments_1,generation=1,filenames=[segments_1]
[junit4:junit4]   2> 5648 T200 oasc.SolrDeletionPolicy.updateCommits newest commit = 1
[junit4:junit4]   2> 5649 T200 oasc.SolrCore.initWriters created xml: solr.XMLResponseWriter
[junit4:junit4]   2> 5653 T200 oasup.UpdateRequestProcessorChain.init inserting DistributedUpdateProcessorFactory into updateRequestProcessorChain "dedupe"
[junit4:junit4]   2> 5653 T200 oasup.UpdateRequestProcessorChain.init inserting DistributedUpdateProcessorFactory into updateRequestProcessorChain "dedupe-allfields"
[junit4:junit4]   2> 5654 T200 oasup.UpdateRequestProcessorChain.init inserting DistributedUpdateProcessorFactory into updateRequestProcessorChain "stored_sig"
[junit4:junit4]   2> 5655 T200 oasup.UpdateRequestProcessorChain.init inserting DistributedUpdateProcessorFactory into updateRequestProcessorChain "uniq-fields"
[junit4:junit4]   2> 5656 T200 oasup.UpdateRequestProcessorChain.init inserting DistributedUpdateProcessorFactory into updateRequestProcessorChain "distrib-dup-test-chain-implicit"
[junit4:junit4]   2> 5657 T200 oasc.RequestHandlers.initHandlersFromConfig adding lazy requestHandler: solr.ReplicationHandler
[junit4:junit4]   2> 5657 T200 oasc.RequestHandlers.initHandlersFromConfig created /replication: solr.ReplicationHandler
[junit4:junit4]   2> 5658 T200 oasc.RequestHandlers.initHandlersFromConfig created standard: solr.StandardRequestHandler
[junit4:junit4]   2> 5659 T200 oasc.RequestHandlers.initHandlersFromConfig created /get: solr.RealTimeGetHandler
[junit4:junit4]   2> 5660 T200 oasc.RequestHandlers.initHandlersFromConfig created dismax: solr.SearchHandler
[junit4:junit4]   2> 5661 T200 oasc.RequestHandlers.initHandlersFromConfig created mock: org.apache.solr.core.MockQuerySenderListenerReqHandler
[junit4:junit4]   2> 5662 T200 oasc.RequestHandlers.initHandlersFromConfig created /admin/: org.apache.solr.handler.admin.AdminHandlers
[junit4:junit4]   2> 5663 T200 oasc.RequestHandlers.initHandlersFromConfig created defaults: solr.StandardRequestHandler
[junit4:junit4]   2> 5663 T200 oasc.RequestHandlers.initHandlersFromConfig adding lazy requestHandler: solr.StandardRequestHandler
[junit4:junit4]   2> 5664 T200 oasc.RequestHandlers.initHandlersFromConfig created lazy: solr.StandardRequestHandler
[junit4:junit4]   2> 5665 T200 oasc.RequestHandlers.initHandlersFromConfig created /update: solr.UpdateRequestHandler
[junit4:junit4]   2> 5666 T200 oasc.RequestHandlers.initHandlersFromConfig created /terms: org.apache.solr.handler.component.SearchHandler
[junit4:junit4]   2> 5667 T200 oasc.RequestHandlers.initHandlersFromConfig created spellCheckCompRH: org.apache.solr.handler.component.SearchHandler
[junit4:junit4]   2> 5668 T200 oasc.RequestHandlers.initHandlersFromConfig created spellCheckCompRH_Direct: org.apache.solr.handler.component.SearchHandler
[junit4:junit4]   2> 5669 T200 oasc.RequestHandlers.initHandlersFromConfig created spellCheckWithWordbreak: org.apache.solr.handler.component.SearchHandler
[junit4:junit4]   2> 5669 T200 oasc.RequestHandlers.initHandlersFromConfig created spellCheckWithWordbreak_Direct: org.apache.solr.handler.component.SearchHandler
[junit4:junit4]   2> 5670 T200 oasc.RequestHandlers.initHandlersFromConfig created spellCheckCompRH1: org.apache.solr.handler.component.SearchHandler
[junit4:junit4]   2> 5671 T200 oasc.RequestHandlers.initHandlersFromConfig created tvrh: org.apache.solr.handler.component.SearchHandler
[junit4:junit4]   2> 5672 T200 oasc.RequestHandlers.initHandlersFromConfig created /mlt: solr.MoreLikeThisHandler
[junit4:junit4]   2> 5673 T200 oasc.RequestHandlers.initHandlersFromConfig created /debug/dump: solr.DumpRequestHandler
[junit4:junit4]   2> 5678 T200 oashl.XMLLoader.init xsltCacheLifetimeSeconds=60
[junit4:junit4]   2> 5683 T200 oasc.SolrCore.initDeprecatedSupport WARNING solrconfig.xml uses deprecated <admin/gettableFiles>, Please update your config to use the ShowFileRequestHandler.
[junit4:junit4]   2> 5686 T200 oasc.SolrCore.initDeprecatedSupport WARNING adding ShowFileRequestHandler with hidden files: [SCHEMA.XML, OLD_SYNONYMS.TXT, STOPWORDS.TXT, PROTWORDS.TXT, OPEN-EXCHANGE-RATES.JSON, SYNONYMS.TXT, CURRENCY.XML, MAPPING-ISOLATIN1ACCENT.TXT]
[junit4:junit4]   2> 5691 T200 oass.SolrIndexSearcher.<init> Opening Searcher@3ff2947d main
[junit4:junit4]   2> 5693 T200 oasu.CommitTracker.<init> Hard AutoCommit: disabled
[junit4:junit4]   2> 5694 T200 oasu.CommitTracker.<init> Soft AutoCommit: disabled
[junit4:junit4]   2> 5695 T200 oashc.SpellCheckComponent.inform Initializing spell checkers
[junit4:junit4]   2> 5704 T200 oass.DirectSolrSpellChecker.init init: {name=direct,classname=DirectSolrSpellChecker,field=lowerfilt,minQueryLength=3}
[junit4:junit4]   2> 5756 T235 oasc.SolrCore.registerSearcher [collection1] Registered new searcher Searcher@3ff2947d main{StandardDirectoryReader(segments_1:1)}
[junit4:junit4]   2> 6109 T221 oascc.ZkStateReader.updateClusterState Updating cloud state from ZooKeeper... 
[junit4:junit4]   2> 6132 T220 oascc.ZkStateReader$2.process A cluster state change has occurred - updating...
[junit4:junit4]   2> 6132 T234 oascc.ZkStateReader$2.process A cluster state change has occurred - updating...
[junit4:junit4]   2> 6266 T200 oasc.CoreContainer.register registering core: collection1
[junit4:junit4]   2> 6267 T200 oasc.ZkController.register Register shard - core:collection1 address:http://127.0.0.1:37013/solr shardId:shard1
[junit4:junit4]   2> 6268 T200 oascc.SolrZkClient.makePath makePath: /collections/collection1/leader_elect/shard1/election
[junit4:junit4]   2> 6287 T207 oazs.PrepRequestProcessor.pRequest Got user-level KeeperException when processing sessionid:0x139e83ae6bc0003 type:delete cxid:0x43 zxid:0xfffffffffffffffe txntype:unknown reqpath:n/a Error Path:/solr/collections/collection1/leaders Error:KeeperErrorCode = NoNode for /solr/collections/collection1/leaders
[junit4:junit4]   2> 6288 T200 oasc.ShardLeaderElectionContext.runLeaderProcess Running the leader process.
[junit4:junit4]   2> 6289 T207 oazs.PrepRequestProcessor.pRequest Got user-level KeeperException when processing sessionid:0x139e83ae6bc0003 type:create cxid:0x44 zxid:0xfffffffffffffffe txntype:unknown reqpath:n/a Error Path:/solr/overseer Error:KeeperErrorCode = NodeExists for /solr/overseer
[junit4:junit4]   2> 6298 T200 oasc.ShardLeaderElectionContext.waitForReplicasToComeUp Enough replicas found to continue.
[junit4:junit4]   2> 6299 T200 oasc.ShardLeaderElectionContext.runLeaderProcess I may be the new leader - try and sync
[junit4:junit4]   2> 6299 T200 oasc.SyncStrategy.sync Sync replicas to http://127.0.0.1:37013/solr/collection1/
[junit4:junit4]   2> 6300 T200 oasc.SyncStrategy.syncReplicas Sync Success - now sync replicas to me
[junit4:junit4]   2> 6301 T200 oasc.SyncStrategy.syncToMe http://127.0.0.1:37013/solr/collection1/ has no replicas
[junit4:junit4]   2> 6301 T200 oasc.ShardLeaderElectionContext.runLeaderProcess I am the new leader: http://127.0.0.1:37013/solr/collection1/
[junit4:junit4]   2> 6302 T200 oascc.SolrZkClient.makePath makePath: /collections/collection1/leaders/shard1
[junit4:junit4]   2> 6309 T207 oazs.PrepRequestProcessor.pRequest Got user-level KeeperException when processing sessionid:0x139e83ae6bc0003 type:create cxid:0x4e zxid:0xfffffffffffffffe txntype:unknown reqpath:n/a Error Path:/solr/overseer Error:KeeperErrorCode = NodeExists for /solr/overseer
[junit4:junit4]   2> 6639 T221 oascc.ZkStateReader.updateClusterState Updating cloud state from ZooKeeper... 
[junit4:junit4]   2> 6664 T220 oascc.ZkStateReader$2.process A cluster state change has occurred - updating...
[junit4:junit4]   2> 6664 T234 oascc.ZkStateReader$2.process A cluster state change has occurred - updating...
[junit4:junit4]   2> 6669 T200 oasc.ZkController.register We are http://127.0.0.1:37013/solr/collection1/ and leader is http://127.0.0.1:37013/solr/collection1/
[junit4:junit4]   2> 6669 T200 oasc.ZkController.register No LogReplay needed for core=collection1 baseURL=http://127.0.0.1:37013/solr
[junit4:junit4]   2> 6670 T200 oasc.ZkController.checkRecovery I am the leader, no recovery necessary
[junit4:junit4]   2> 6677 T200 oascc.ZkStateReader.updateClusterState Updating cloud state from ZooKeeper... 
[junit4:junit4]   2> 6678 T200 oass.SolrDispatchFilter.init user.dir=/usr/home/hudson/hudson-slave/workspace/Lucene-Solr-Tests-4.x-java7/solr/build/solr-core/test/J1
[junit4:junit4]   2> 6678 T200 oass.SolrDispatchFilter.init SolrDispatchFilter.init() done
[junit4:junit4]   2> 6679 T200 oascsi.HttpClientUtil.createClient Creating new http client, config:maxConnections=128&maxConnectionsPerHost=32&followRedirects=false
[junit4:junit4]   2> 6857 T200 oejs.Server.doStart jetty-8.1.2.v20120308
[junit4:junit4]   2> 6860 T200 oejs.AbstractConnector.doStart Started SocketConnector@0.0.0.0:37016
[junit4:junit4]   2> 6861 T200 oasc.SolrResourceLoader.locateSolrHome JNDI not configured for solr (NoInitialContextEx)
[junit4:junit4]   2> 6862 T200 oasc.SolrResourceLoader.locateSolrHome using system property solr.solr.home: /usr/home/hudson/hudson-slave/workspace/Lucene-Solr-Tests-4.x-java7/solr/build/solr-core/test/J1/./solrtest-jetty2-1348220944244
[junit4:junit4]   2> 6863 T200 oasc.SolrResourceLoader.<init> new SolrResourceLoader for deduced Solr Home: '/usr/home/hudson/hudson-slave/workspace/Lucene-Solr-Tests-4.x-java7/solr/build/solr-core/test/J1/./solrtest-jetty2-1348220944244/'
[junit4:junit4]   2> 6905 T200 oass.SolrDispatchFilter.init SolrDispatchFilter.init()
[junit4:junit4]   2> 6906 T200 oasc.SolrResourceLoader.locateSolrHome JNDI not configured for solr (NoInitialContextEx)
[junit4:junit4]   2> 6907 T200 oasc.SolrResourceLoader.locateSolrHome using system property solr.solr.home: /usr/home/hudson/hudson-slave/workspace/Lucene-Solr-Tests-4.x-java7/solr/build/solr-core/test/J1/./solrtest-jetty2-1348220944244
[junit4:junit4]   2> 6907 T200 oasc.CoreContainer$Initializer.initialize looking for solr.xml: /usr/home/hudson/hudson-slave/workspace/Lucene-Solr-Tests-4.x-java7/solr/build/solr-core/test/J1/./solrtest-jetty2-1348220944244/solr.xml
[junit4:junit4]   2> 6908 T200 oasc.CoreContainer.<init> New CoreContainer 686698957
[junit4:junit4]   2> 6909 T200 oasc.CoreContainer.load Loading CoreContainer using Solr Home: '/usr/home/hudson/hudson-slave/workspace/Lucene-Solr-Tests-4.x-java7/solr/build/solr-core/test/J1/./solrtest-jetty2-1348220944244/'
[junit4:junit4]   2> 6910 T200 oasc.SolrResourceLoader.<init> new SolrResourceLoader for directory: '/usr/home/hudson/hudson-slave/workspace/Lucene-Solr-Tests-4.x-java7/solr/build/solr-core/test/J1/./solrtest-jetty2-1348220944244/'
[junit4:junit4]   2> 6943 T200 oasc.CoreContainer.load Registering Log Listener
[junit4:junit4]   2> 6958 T200 oasc.CoreContainer.initZooKeeper Zookeeper client=127.0.0.1:37002/solr
[junit4:junit4]   2> 6959 T200 oaz.ZooKeeper.<init> Initiating client connection, connectString=127.0.0.1:37002/solr sessionTimeout=5000 watcher=org.apache.solr.common.cloud.ConnectionManager@249a2815
[junit4:junit4]   2> 6960 T245 oaz.ClientCnxn$SendThread.startConnect Opening socket connection to server /127.0.0.1:37002
[junit4:junit4]   2> 6960 T200 oascc.ConnectionManager.waitForConnected Waiting for client to connect to ZooKeeper
[junit4:junit4]   2> 6961 T245 oaz.ClientCnxn$SendThread.primeConnection Socket connection established to localhost/127.0.0.1:37002, initiating session
[junit4:junit4]   2> 6962 T202 oazs.NIOServerCnxn$Factory.run Accepted socket connection from /140.211.11.196:37017
[junit4:junit4]   2> 6962 T202 oazs.NIOServerCnxn.readConnectRequest Client attempting to establish new session at /140.211.11.196:37017
[junit4:junit4]   2> 6965 T206 oazs.NIOServerCnxn.finishSessionInit Established session 0x139e83ae6bc0004 with negotiated timeout 5000 for client /140.211.11.196:37017
[junit4:junit4]   2> 6965 T245 oaz.ClientCnxn$SendThread.readConnectResult Session establishment complete on server localhost/127.0.0.1:37002, sessionid = 0x139e83ae6bc0004, negotiated timeout = 5000
[junit4:junit4]   2> 6965 T246 oascc.ConnectionManager.process Watcher org.apache.solr.common.cloud.ConnectionManager@249a2815 name:ZooKeeperConnection Watcher:127.0.0.1:37002/solr got event WatchedEvent state:SyncConnected type:None path:null path:null type:None
[junit4:junit4]   2> 6966 T200 oascc.ConnectionManager.waitForConnected Client is connected to ZooKeeper
[junit4:junit4]   2> 6967 T207 oazs.PrepRequestProcessor.pRequest Got user-level KeeperException when processing sessionid:0x139e83ae6bc0004 type:create cxid:0x1 zxid:0xfffffffffffffffe txntype:unknown reqpath:n/a Error Path:/solr/overseer Error:KeeperErrorCode = NodeExists for /solr/overseer
[junit4:junit4]   2> 6980 T207 oazs.PrepRequestProcessor.pRequest Got user-level KeeperException when processing sessionid:0x139e83ae6bc0004 type:create cxid:0x2 zxid:0xfffffffffffffffe txntype:unknown reqpath:n/a Error Path:/solr/overseer Error:KeeperErrorCode = NodeExists for /solr/overseer
[junit4:junit4]   2> 6982 T200 oasc.ZkController.createEphemeralLiveNode Register node as live in ZooKeeper:/live_nodes/127.0.0.1:37016_solr
[junit4:junit4]   2> 6983 T207 oazs.PrepRequestProcessor.pRequest Got user-level KeeperException when processing sessionid:0x139e83ae6bc0004 type:delete cxid:0x4 zxid:0xfffffffffffffffe txntype:unknown reqpath:n/a Error Path:/solr/live_nodes/127.0.0.1:37016_solr Error:KeeperErrorCode = NoNode for /solr/live_nodes/127.0.0.1:37016_solr
[junit4:junit4]   2> 6985 T200 oascc.SolrZkClient.makePath makePath: /live_nodes/127.0.0.1:37016_solr
[junit4:junit4]   2> 6988 T234 oascc.ZkStateReader$3.process Updating live nodes
[junit4:junit4]   2> 6988 T220 oascc.ZkStateReader$3.process Updating live nodes
[junit4:junit4]   2> 6989 T200 oashc.HttpShardHandlerFactory.getParameter Setting socketTimeout to: 0
[junit4:junit4]   2> 6990 T200 oashc.HttpShardHandlerFactory.getParameter Setting urlScheme to: http://
[junit4:junit4]   2> 6990 T200 oashc.HttpShardHandlerFactory.getParameter Setting connTimeout to: 0
[junit4:junit4]   2> 6991 T200 oashc.HttpShardHandlerFactory.getParameter Setting maxConnectionsPerHost to: 20
[junit4:junit4]   2> 6991 T200 oashc.HttpShardHandlerFactory.getParameter Setting corePoolSize to: 0
[junit4:junit4]   2> 6991 T200 oashc.HttpShardHandlerFactory.getParameter Setting maximumPoolSize to: 2147483647
[junit4:junit4]   2> 6992 T200 oashc.HttpShardHandlerFactory.getParameter Setting maxThreadIdleTime to: 5
[junit4:junit4]   2> 6992 T200 oashc.HttpShardHandlerFactory.getParameter Setting sizeOfQueue to: -1
[junit4:junit4]   2> 6993 T200 oashc.HttpShardHandlerFactory.getParameter Setting fairnessPolicy to: false
[junit4:junit4]   2> 6993 T200 oascsi.HttpClientUtil.createClient Creating new http client, config:maxConnectionsPerHost=20&maxConnections=10000&socketTimeout=0&connTimeout=0&retry=false
[junit4:junit4]   2> 7008 T200 oascc.ZkStateReader.createClusterStateWatchersAndUpdate Updating cluster state from ZooKeeper... 
[junit4:junit4]   2> 7014 T200 oasc.CoreContainer.create Creating SolrCore 'collection1' using instanceDir: /usr/home/hudson/hudson-slave/workspace/Lucene-Solr-Tests-4.x-java7/solr/build/solr-core/test/J1/./solrtest-jetty2-1348220944244/collection1
[junit4:junit4]   2> 7015 T200 oasc.ZkController.createCollectionZkNode Check for collection zkNode:collection1
[junit4:junit4]   2> 7016 T200 oasc.ZkController.createCollectionZkNode Collection zkNode exists
[junit4:junit4]   2> 7016 T200 oasc.ZkController.readConfigName Load collection config from:/collections/collection1
[junit4:junit4]   2> 7018 T200 oasc.SolrResourceLoader.<init> new SolrResourceLoader for directory: '/usr/home/hudson/hudson-slave/workspace/Lucene-Solr-Tests-4.x-java7/solr/build/solr-core/test/J1/./solrtest-jetty2-1348220944244/collection1/'
[junit4:junit4]   2> 7019 T200 oasc.SolrResourceLoader.replaceClassLoader Adding 'file:/usr/home/hudson/hudson-slave/workspace/Lucene-Solr-Tests-4.x-java7/solr/build/solr-core/test/J1/solrtest-jetty2-1348220944244/collection1/lib/README' to classloader
[junit4:junit4]   2> 7020 T200 oasc.SolrResourceLoader.replaceClassLoader Adding 'file:/usr/home/hudson/hudson-slave/workspace/Lucene-Solr-Tests-4.x-java7/solr/build/solr-core/test/J1/solrtest-jetty2-1348220944244/collection1/lib/classes/' to classloader
[junit4:junit4]   2> 7057 T200 oasc.SolrConfig.<init> Using Lucene MatchVersion: LUCENE_40
[junit4:junit4]   2> 7119 T200 oasc.SolrConfig.<init> Loaded SolrConfig: solrconfig.xml
[junit4:junit4]   2> 7179 T221 oascc.ZkStateReader.updateClusterState Updating cloud state from ZooKeeper... 
[junit4:junit4]   2> 7193 T234 oascc.ZkStateReader$2.process A cluster state change has occurred - updating...
[junit4:junit4]   2> 7193 T220 oascc.ZkStateReader$2.process A cluster state change has occurred - updating...
[junit4:junit4]   2> 7220 T246 oascc.ZkStateReader$2.process A cluster state change has occurred - updating...
[junit4:junit4]   2> 7220 T200 oass.IndexSchema.readSchema Reading Solr Schema
[junit4:junit4]   2> 7226 T200 oass.IndexSchema.readSchema Schema name=test
[junit4:junit4]   2> 7682 T200 oass.OpenExchangeRatesOrgProvider.init Initialized with rates=open-exchange-rates.json, refreshInterval=1440.
[junit4:junit4]   2> 7691 T200 oass.IndexSchema.readSchema default search field in schema is text
[junit4:junit4]   2> 7695 T200 oass.IndexSchema.readSchema unique key field: id
[junit4:junit4]   2> 7719 T200 oass.FileExchangeRateProvider.reload Reloading exchange rates from file currency.xml
[junit4:junit4]   2> 7727 T200 oass.FileExchangeRateProvider.reload Reloading exchange rates from file currency.xml
[junit4:junit4]   2> 7734 T200 oass.OpenExchangeRatesOrgProvider.reload Reloading exchange rates from open-exchange-rates.json
[junit4:junit4]   2> 7737 T200 oass.OpenExchangeRatesOrgProvider.reload Reloading exchange rates from open-exchange-rates.json
[junit4:junit4]   2> 7740 T200 oasc.SolrCore.<init> [collection1] Opening new SolrCore at /usr/home/hudson/hudson-slave/workspace/Lucene-Solr-Tests-4.x-java7/solr/build/solr-core/test/J1/./solrtest-jetty2-1348220944244/collection1/, dataDir=./org.apache.solr.cloud.BasicDistributedZk2Test-1348220937555/jetty2/
[junit4:junit4]   2> 7740 T200 oasc.JmxMonitoredMap.<init> JMX monitoring is enabled. Adding Solr mbeans to JMX Server: com.sun.jmx.mbeanserver.JmxMBeanServer@4a635f47
[junit4:junit4]   2> 7742 T200 oasc.SolrCore.getNewIndexDir WARNING New index directory detected: old=null new=./org.apache.solr.cloud.BasicDistributedZk2Test-1348220937555/jetty2/index/
[junit4:junit4]   2> 7743 T200 oasc.SolrCore.initIndex WARNING [collection1] Solr index directory './org.apache.solr.cloud.BasicDistributedZk2Test-1348220937555/jetty2/index' doesn't exist. Creating new index...
[junit4:junit4]   2> 7744 T200 oasc.CachingDirectoryFactory.get return new directory for /usr/home/hudson/hudson-slave/workspace/Lucene-Solr-Tests-4.x-java7/solr/build/solr-core/test/J1/./org.apache.solr.cloud.BasicDistributedZk2Test-1348220937555/jetty2/index forceNew:false
[junit4:junit4]   2> 7758 T200 oasc.SolrDeletionPolicy.onCommit SolrDeletionPolicy.onCommit: commits:num=1
[junit4:junit4]   2> 		commit{dir=NRTCachingDirectory(org.apache.lucene.store.NIOFSDirectory@/usr/home/hudson/hudson-slave/workspace/Lucene-Solr-Tests-4.x-java7/solr/build/solr-core/test/J1/org.apache.solr.cloud.BasicDistributedZk2Test-1348220937555/jetty2/index lockFactory=org.apache.lucene.store.NativeFSLockFactory@63ac3790; maxCacheMB=48.0 maxMergeSizeMB=4.0),segFN=segments_1,generation=1,filenames=[segments_1]
[junit4:junit4]   2> 7759 T200 oasc.SolrDeletionPolicy.updateCommits newest commit = 1
[junit4:junit4]   2> 7760 T200 oasc.SolrCore.initWriters created xml: solr.XMLResponseWriter
[junit4:junit4]   2> 7763 T200 oasup.UpdateRequestProcessorChain.init inserting DistributedUpdateProcessorFactory into updateRequestProcessorChain "dedupe"
[junit4:junit4]   2> 7764 T200 oasup.UpdateRequestProcessorChain.init inserting DistributedUpdateProcessorFactory into updateRequestProcessorChain "dedupe-allfields"
[junit4:junit4]   2> 7765 T200 oasup.UpdateRequestProcessorChain.init inserting DistributedUpdateProcessorFactory into updateRequestProcessorChain "stored_sig"
[junit4:junit4]   2> 7766 T200 oasup.UpdateRequestProcessorChain.init inserting DistributedUpdateProcessorFactory into updateRequestProcessorChain "uniq-fields"
[junit4:junit4]   2> 7767 T200 oasup.UpdateRequestProcessorChain.init inserting DistributedUpdateProcessorFactory into updateRequestProcessorChain "distrib-dup-test-chain-implicit"
[junit4:junit4]   2> 7767 T200 oasc.RequestHandlers.initHandlersFromConfig adding lazy requestHandler: solr.ReplicationHandler
[junit4:junit4]   2> 7768 T200 oasc.RequestHandlers.initHandlersFromConfig created /replication: solr.ReplicationHandler
[junit4:junit4]   2> 7769 T200 oasc.RequestHandlers.initHandlersFromConfig created standard: solr.StandardRequestHandler
[junit4:junit4]   2> 7770 T200 oasc.RequestHandlers.initHandlersFromConfig created /get: solr.RealTimeGetHandler
[junit4:junit4]   2> 7771 T200 oasc.RequestHandlers.initHandlersFromConfig created dismax: solr.SearchHandler
[junit4:junit4]   2> 7772 T200 oasc.RequestHandlers.initHandlersFromConfig created mock: org.apache.solr.core.MockQuerySenderListenerReqHandler
[junit4:junit4]   2> 7773 T200 oasc.RequestHandlers.initHandlersFromConfig created /admin/: org.apache.solr.handler.admin.AdminHandlers
[junit4:junit4]   2> 7774 T200 oasc.RequestHandlers.initHandlersFromConfig created defaults: solr.StandardRequestHandler
[junit4:junit4]   2> 7774 T200 oasc.RequestHandlers.initHandlersFromConfig adding lazy requestHandler: solr.StandardRequestHandler
[junit4:junit4]   2> 7775 T200 oasc.RequestHandlers.initHandlersFromConfig created lazy: solr.StandardRequestHandler
[junit4:junit4]   2> 7776 T200 oasc.RequestHandlers.initHandlersFromConfig created /update: solr.UpdateRequestHandler
[junit4:junit4]   2> 7777 T200 oasc.RequestHandlers.initHandlersFromConfig created /terms: org.apache.solr.handler.component.SearchHandler
[junit4:junit4]   2> 7778 T200 oasc.RequestHandlers.initHandlersFromConfig created spellCheckCompRH: org.apache.solr.handler.component.SearchHandler
[junit4:junit4]   2> 7779 T200 oasc.RequestHandlers.initHandlersFromConfig created spellCheckCompRH_Direct: org.apache.solr.handler.component.SearchHandler
[junit4:junit4]   2> 7780 T200 oasc.RequestHandlers.initHandlersFromConfig created spellCheckWithWordbreak: org.apache.solr.handler.component.SearchHandler
[junit4:junit4]   2> 7781 T200 oasc.RequestHandlers.initHandlersFromConfig created spellCheckWithWordbreak_Direct: org.apache.solr.handler.component.SearchHandler
[junit4:junit4]   2> 7782 T200 oasc.RequestHandlers.initHandlersFromConfig created spellCheckCompRH1: org.apache.solr.handler.component.SearchHandler
[junit4:junit4]   2> 7783 T200 oasc.RequestHandlers.initHandlersFromConfig created tvrh: org.apache.solr.handler.component.SearchHandler
[junit4:junit4]   2> 7784 T200 oasc.RequestHandlers.initHandlersFromConfig created /mlt: solr.MoreLikeThisHandler
[junit4:junit4]   2> 7785 T200 oasc.RequestHandlers.initHandlersFromConfig created /debug/dump: solr.DumpRequestHandler
[junit4:junit4]   2> 7789 T200 oashl.XMLLoader.init xsltCacheLifetimeSeconds=60
[junit4:junit4]   2> 7795 T200 oasc.SolrCore.initDeprecatedSupport WARNING solrconfig.xml uses deprecated <admin/gettableFiles>, Please update your config to use the ShowFileRequestHandler.
[junit4:junit4]   2> 7797 T200 oasc.SolrCore.initDeprecatedSupport WARNING adding ShowFileRequestHandler with hidden files: [SCHEMA.XML, OLD_SYNONYMS.TXT, STOPWORDS.TXT, PROTWORDS.TXT, OPEN-EXCHANGE-RATES.JSON, SYNONYMS.TXT, CURRENCY.XML, MAPPING-ISOLATIN1ACCENT.TXT]
[junit4:junit4]   2> 7802 T200 oass.SolrIndexSearcher.<init> Opening Searcher@2499c773 main
[junit4:junit4]   2> 7804 T200 oasu.CommitTracker.<init> Hard AutoCommit: disabled
[junit4:junit4]   2> 7804 T200 oasu.CommitTracker.<init> Soft AutoCommit: disabled
[junit4:junit4]   2> 7805 T200 oashc.SpellCheckComponent.inform Initializing spell checkers
[junit4:junit4]   2> 7814 T200 oass.DirectSolrSpellChecker.init init: {name=direct,classname=DirectSolrSpellChecker,field=lowerfilt,minQueryLength=3}
[junit4:junit4]   2> 7869 T247 oasc.SolrCore.registerSearcher [collection1] Registered new searcher Searcher@2499c773 main{StandardDirectoryReader(segments_1:1)}
[junit4:junit4]   2> 8205 T221 oascc.ZkStateReader.updateClusterState Updating cloud state from ZooKeeper... 
[junit4:junit4]   2> 8245 T246 oascc.ZkStateReader$2.process A cluster state change has occurred - updating...
[junit4:junit4]   2> 8245 T234 oascc.ZkStateReader$2.process A cluster state change has occurred - updating...
[junit4:junit4]   2> 8245 T220 oascc.ZkStateReader$2.process A cluster state change has occurred - updating...
[junit4:junit4]   2> 8379 T200 oasc.CoreContainer.register registering core: collection1
[junit4:junit4]   2> 8379 T200 oasc.ZkController.register Register shard - core:collection1 address:http://127.0.0.1:37016/solr shardId:shard2
[junit4:junit4]   2> 8381 T200 oascc.SolrZkClient.makePath makePath: /collections/collection1/leader_elect/shard2/election
[junit4:junit4]   2> 8387 T207 oazs.PrepRequestProcessor.pRequest Got user-level KeeperException when processing sessionid:0x139e83ae6bc0004 type:delete cxid:0x42 zxid:0xfffffffffffffffe txntype:unknown reqpath:n/a Error Path:/solr/collections/collection1/leaders/shard2 Error:KeeperErrorCode = NoNode for /solr/collections/collection1/leaders/shard2
[junit4:junit4]   2> 8397 T200 oasc.ShardLeaderElectionContext.runLeaderProcess Running the leader process.
[junit4:junit4]   2> 8398 T207 oazs.PrepRequestProcessor.pRequest Got user-level KeeperException when processing sessionid:0x139e83ae6bc0004 type:create cxid:0x43 zxid:0xfffffffffffffffe txntype:unknown reqpath:n/a Error Path:/solr/overseer Error:KeeperErrorCode = NodeExists for /solr/overseer
[junit4:junit4]   2> 8400 T200 oasc.ShardLeaderElectionContext.waitForReplicasToComeUp Enough replicas found to continue.
[junit4:junit4]   2> 8401 T200 oasc.ShardLeaderElectionContext.runLeaderProcess I may be the new leader - try and sync
[junit4:junit4]   2> 8401 T200 oasc.SyncStrategy.sync Sync replicas to http://127.0.0.1:37016/solr/collection1/
[junit4:junit4]   2> 8402 T200 oasc.SyncStrategy.syncReplicas Sync Success - now sync replicas to me
[junit4:junit4]   2> 8402 T200 oasc.SyncStrategy.syncToMe http://127.0.0.1:37016/solr/collection1/ has no replicas
[junit4:junit4]   2> 8402 T200 oasc.ShardLeaderElectionContext.runLeaderProcess I am the new leader: http://127.0.0.1:37016/solr/collection1/
[junit4:junit4]   2> 8403 T200 oascc.SolrZkClient.makePath makePath: /collections/collection1/leaders/shard2
[junit4:junit4]   2> 8406 T207 oazs.PrepRequestProcessor.pRequest Got user-level KeeperException when processing sessionid:0x139e83ae6bc0004 type:create cxid:0x4c zxid:0xfffffffffffffffe txntype:unknown reqpath:n/a Error Path:/solr/overseer Error:KeeperErrorCode = NodeExists for /solr/overseer
[junit4:junit4]   2> 8751 T221 oascc.ZkStateReader.updateClusterState Updating cloud state from ZooKeeper... 
[junit4:junit4]   2> 8767 T220 oascc.ZkStateReader$2.process A cluster state change has occurred - updating...
[junit4:junit4]   2> 8768 T246 oascc.ZkStateReader$2.process A cluster state change has occurred - updating...
[junit4:junit4]   2> 8768 T234 oascc.ZkStateReader$2.process A cluster state change has occurred - updating...
[junit4:junit4]   2> 8774 T200 oasc.ZkController.register We are http://127.0.0.1:37016/solr/collection1/ and leader is http://127.0.0.1:37016/solr/collection1/
[junit4:junit4]   2> 8774 T200 oasc.ZkController.register No LogReplay needed for core=collection1 baseURL=http://127.0.0.1:37016/solr
[junit4:junit4]   2> 8774 T200 oasc.ZkController.checkRecovery I am the leader, no recovery necessary
[junit4:junit4]   2> 8778 T200 oascc.ZkStateReader.updateClusterState Updating cloud state from ZooKeeper... 
[junit4:junit4]   2> 8779 T200 oass.SolrDispatchFilter.init user.dir=/usr/home/hudson/hudson-slave/workspace/Lucene-Solr-Tests-4.x-java7/solr/build/solr-core/test/J1
[junit4:junit4]   2> 8780 T200 oass.SolrDispatchFilter.init SolrDispatchFilter.init() done
[junit4:junit4]   2> 8780 T200 oascsi.HttpClientUtil.createClient Creating new http client, config:maxConnections=128&maxConnectionsPerHost=32&followRedirects=false
[junit4:junit4]   2> 8907 T200 oejs.Server.doStart jetty-8.1.2.v20120308
[junit4:junit4]   2> 8910 T200 oejs.AbstractConnector.doStart Started SocketConnector@0.0.0.0:37018
[junit4:junit4]   2> 8911 T200 oasc.SolrResourceLoader.locateSolrHome JNDI not configured for solr (NoInitialContextEx)
[junit4:junit4]   2> 8911 T200 oasc.SolrResourceLoader.locateSolrHome using system property solr.solr.home: /usr/home/hudson/hudson-slave/workspace/Lucene-Solr-Tests-4.x-java7/solr/build/solr-core/test/J1/./solrtest-jetty3-1348220946341
[junit4:junit4]   2> 8911 T200 oasc.SolrResourceLoader.<init> new SolrResourceLoader for deduced Solr Home: '/usr/home/hudson/hudson-slave/workspace/Lucene-Solr-Tests-4.x-java7/solr/build/solr-core/test/J1/./solrtest-jetty3-1348220946341/'
[junit4:junit4]   2> 8940 T200 oass.SolrDispatchFilter.init SolrDispatchFilter.init()
[junit4:junit4]   2> 8941 T200 oasc.SolrResourceLoader.locateSolrHome JNDI not configured for solr (NoInitialContextEx)
[junit4:junit4]   2> 8941 T200 oasc.SolrResourceLoader.locateSolrHome using system property solr.solr.home: /usr/home/hudson/hudson-slave/workspace/Lucene-Solr-Tests-4.x-java7/solr/build/solr-core/test/J1/./solrtest-jetty3-1348220946341
[junit4:junit4]   2> 8941 T200 oasc.CoreContainer$Initializer.initialize looking for solr.xml: /usr/home/hudson/hudson-slave/workspace/Lucene-Solr-Tests-4.x-java7/solr/build/solr-core/test/J1/./solrtest-jetty3-1348220946341/solr.xml
[junit4:junit4]   2> 8942 T200 oasc.CoreContainer.<init> New CoreContainer 16259287
[junit4:junit4]   2> 8942 T200 oasc.CoreContainer.load Loading CoreContainer using Solr Home: '/usr/home/hudson/hudson-slave/workspace/Lucene-Solr-Tests-4.x-java7/solr/build/solr-core/test/J1/./solrtest-jetty3-1348220946341/'
[junit4:junit4]   2> 8943 T200 oasc.SolrResourceLoader.<init> new SolrResourceLoader for directory: '/usr/home/hudson/hudson-slave/workspace/Lucene-Solr-Tests-4.x-java7/solr/build/solr-core/test/J1/./solrtest-jetty3-1348220946341/'
[junit4:junit4]   2> 8966 T200 oasc.CoreContainer.load Registering Log Listener
[junit4:junit4]   2> 8988 T200 oasc.CoreContainer.initZooKeeper Zookeeper client=127.0.0.1:37002/solr
[junit4:junit4]   2> 8989 T200 oaz.ZooKeeper.<init> Initiating client connection, connectString=127.0.0.1:37002/solr sessionTimeout=5000 watcher=org.apache.solr.common.cloud.ConnectionManager@138f4128
[junit4:junit4]   2> 8990 T257 oaz.ClientCnxn$SendThread.startConnect Opening socket connection to server /127.0.0.1:37002
[junit4:junit4]   2> 8990 T200 oascc.ConnectionManager.waitForConnected Waiting for client to connect to ZooKeeper
[junit4:junit4]   2> 8991 T257 oaz.ClientCnxn$SendThread.primeConnection Socket connection established to localhost/127.0.0.1:37002, initiating session
[junit4:junit4]   2> 8991 T202 oazs.NIOServerCnxn$Factory.run Accepted socket connection from /140.211.11.196:37019
[junit4:junit4]   2> 8992 T202 oazs.NIOServerCnxn.readConnectRequest Client attempting to establish new session at /140.211.11.196:37019
[junit4:junit4]   2> 9008 T206 oazs.NIOServerCnxn.finishSessionInit Established session 0x139e83ae6bc0005 with negotiated timeout 5000 for client /140.211.11.196:37019
[junit4:junit4]   2> 9009 T257 oaz.ClientCnxn$SendThread.readConnectResult Session establishment complete on server localhost/127.0.0.1:37002, sessionid = 0x139e83ae6bc0005, negotiated timeout = 5000
[junit4:junit4]   2> 9009 T258 oascc.ConnectionManager.process Watcher org.apache.solr.common.cloud.ConnectionManager@138f4128 name:ZooKeeperConnection Watcher:127.0.0.1:37002/solr got event WatchedEvent state:SyncConnected type:None path:null path:null type:None
[junit4:junit4]   2> 9009 T200 oascc.ConnectionManager.waitForConnected Client is connected to ZooKeeper
[junit4:junit4]   2> 9010 T207 oazs.PrepRequestProcessor.pRequest Got user-level KeeperException when processing sessionid:0x139e83ae6bc0005 type:create cxid:0x1 zxid:0xfffffffffffffffe txntype:unknown reqpath:n/a Error Path:/solr/overseer Error:KeeperErrorCode = NodeExists for /solr/overseer
[junit4:junit4]   2> 9035 T207 oazs.PrepRequestProcessor.pRequest Got user-level KeeperException when processing sessionid:0x139e83ae6bc0005 type:create cxid:0x2 zxid:0xfffffffffffffffe txntype:unknown reqpath:n/a Error Path:/solr/overseer Error:KeeperErrorCode = NodeExists for /solr/overseer
[junit4:junit4]   2> 9067 T200 oasc.ZkController.createEphemeralLiveNode Register node as live in ZooKeeper:/live_nodes/127.0.0.1:37018_solr
[junit4:junit4]   2> 9067 T207 oazs.PrepRequestProcessor.pRequest Got user-level KeeperException when processing sessionid:0x139e83ae6bc0005 type:delete cxid:0x4 zxid:0xfffffffffffffffe txntype:unknown reqpath:n/a Error Path:/solr/live_nodes/127.0.0.1:37018_solr Error:KeeperErrorCode = NoNode for /solr/live_nodes/127.0.0.1:37018_solr
[junit4:junit4]   2> 9098 T200 oascc.SolrZkClient.makePath makePath: /live_nodes/127.0.0.1:37018_solr
[junit4:junit4]   2> 9101 T246 oascc.ZkStateReader$3.process Updating live nodes
[junit4:junit4]   2> 9101 T234 oascc.ZkStateReader$3.process Updating live nodes
[junit4:junit4]   2> 9101 T220 oascc.ZkStateReader$3.process Updating live nodes
[junit4:junit4]   2> 9102 T200 oashc.HttpShardHandlerFactory.getParameter Setting socketTimeout to: 0
[junit4:junit4]   2> 9103 T200 oashc.HttpShardHandlerFactory.getParameter Setting urlScheme to: http://
[junit4:junit4]   2> 9103 T200 oashc.HttpShardHandlerFactory.getParameter Setting connTimeout to: 0
[junit4:junit4]   2> 9103 T200 oashc.HttpShardHandlerFactory.getParameter Setting maxConnectionsPerHost to: 20
[junit4:junit4]   2> 9104 T200 oashc.HttpShardHandlerFactory.getParameter Setting corePoolSize to: 0
[junit4:junit4]   2> 9104 T200 oashc.HttpShardHandlerFactory.getParameter Setting maximumPoolSize to: 2147483647
[junit4:junit4]   2> 9105 T200 oashc.HttpShardHandlerFactory.getParameter Setting maxThreadIdleTime to: 5
[junit4:junit4]   2> 9105 T200 oashc.HttpShardHandlerFactory.getParameter Setting sizeOfQueue to: -1
[junit4:junit4]   2> 9105 T200 oashc.HttpShardHandlerFactory.getParameter Setting fairnessPolicy to: false
[junit4:junit4]   2> 9106 T200 oascsi.HttpClientUtil.createClient Creating new http client, config:maxConnectionsPerHost=20&maxConnections=10000&socketTimeout=0&connTimeout=0&retry=false
[junit4:junit4]   2> 9120 T200 oascc.ZkStateReader.createClusterStateWatchersAndUpdate Updating cluster state from ZooKeeper... 
[junit4:junit4]   2> 9126 T200 oasc.CoreContainer.create Creating SolrCore 'collection1' using instanceDir: /usr/home/hudson/hudson-slave/workspace/Lucene-Solr-Tests-4.x-java7/solr/build/solr-core/test/J1/./solrtest-jetty3-1348220946341/collection1
[junit4:junit4]   2> 9126 T200 oasc.ZkController.createCollectionZkNode Check for collection zkNode:collection1
[junit4:junit4]   2> 9127 T200 oasc.ZkController.createCollectionZkNode Collection zkNode exists
[junit4:junit4]   2> 9127 T200 oasc.ZkController.readConfigName Load collection config from:/collections/collection1
[junit4:junit4]   2> 9129 T200 oasc.SolrResourceLoader.<init> new SolrResourceLoader for directory: '/usr/home/hudson/hudson-slave/workspace/Lucene-Solr-Tests-4.x-java7/solr/build/solr-core/test/J1/./solrtest-jetty3-1348220946341/collection1/'
[junit4:junit4]   2> 9130 T200 oasc.SolrResourceLoader.replaceClassLoader Adding 'file:/usr/home/hudson/hudson-slave/workspace/Lucene-Solr-Tests-4.x-java7/solr/build/solr-core/test/J1/solrtest-jetty3-1348220946341/collection1/lib/classes/' to classloader
[junit4:junit4]   2> 9131 T200 oasc.SolrResourceLoader.replaceClassLoader Adding 'file:/usr/home/hudson/hudson-slave/workspace/Lucene-Solr-Tests-4.x-java7/solr/build/solr-core/test/J1/solrtest-jetty3-1348220946341/collection1/lib/README' to classloader
[junit4:junit4]   2> 9167 T200 oasc.SolrConfig.<init> Using Lucene MatchVersion: LUCENE_40
[junit4:junit4]   2> 9215 T200 oasc.SolrConfig.<init> Loaded SolrConfig: solrconfig.xml
[junit4:junit4]   2> 9281 T221 oascc.ZkStateReader.updateClusterState Updating cloud state from ZooKeeper... 
[junit4:junit4]   2> 9298 T220 oascc.ZkStateReader$2.process A cluster state change has occurred - updating...
[junit4:junit4]   2> 9298 T234 oascc.ZkStateReader$2.process A cluster state change has occurred - updating...
[junit4:junit4]   2> 9298 T246 oascc.ZkStateReader$2.process A cluster state change has occurred - updating...
[junit4:junit4]   2> 9317 T258 oascc.ZkStateReader$2.process A cluster state change has occurred - updating...
[junit4:junit4]   2> 9317 T200 oass.IndexSchema.readSchema Reading Solr Schema
[junit4:junit4]   2> 9323 T200 oass.IndexSchema.readSchema Schema name=test
[junit4:junit4]   2> 9804 T200 oass.OpenExchangeRatesOrgProvider.init Initialized with rates=open-exchange-rates.json, refreshInterval=1440.
[junit4:junit4]   2> 9814 T200 oass.IndexSchema.readSchema default search field in schema is text
[junit4:junit4]   2> 9817 T200 oass.IndexSchema.readSchema unique key field: id
[junit4:junit4]   2> 9835 T200 oass.FileExchangeRateProvider.reload Reloading exchange rates from file currency.xml
[junit4:junit4]   2> 9839 T200 oass.FileExchangeRateProvider.reload Reloading exchange rates from file currency.xml
[junit4:junit4]   2> 9845 T200 oass.OpenExchangeRatesOrgProvider.reload Reloading exchange rates from open-exchange-rates.json
[junit4:junit4]   2> 9847 T200 oass.OpenExchangeRatesOrgProvider.reload Reloading exchange rates from open-exchange-rates.json
[junit4:junit4]   2> 9849 T200 oasc.SolrCore.<init> [collection1] Opening new SolrCore at /usr/home/hudson/hudson-slave/workspace/Lucene-Solr-Tests-4.x-java7/solr/build/solr-core/test/J1/./solrtest-jetty3-1348220946341/collection1/, dataDir=./org.apache.solr.cloud.BasicDistributedZk2Test-1348220937555/jetty3/
[junit4:junit4]   2> 9849 T200 oasc.JmxMonitoredMap.<init> JMX monitoring is enabled. Adding Solr mbeans to JMX Server: com.sun.jmx.mbeanserver.JmxMBeanServer@4a635f47
[junit4:junit4]   2> 9850 T200 oasc.SolrCore.getNewIndexDir WARNING New index directory detected: old=null new=./org.apache.solr.cloud.BasicDistributedZk2Test-1348220937555/jetty3/index/
[junit4:junit4]   2> 9851 T200 oasc.SolrCore.initIndex WARNING [collection1] Solr index directory './org.apache.solr.cloud.BasicDistributedZk2Test-1348220937555/jetty3/index' doesn't exist. Creating new index...
[junit4:junit4]   2> 9852 T200 oasc.CachingDirectoryFactory.get return new directory for /usr/home/hudson/hudson-slave/workspace/Lucene-Solr-Tests-4.x-java7/solr/build/solr-core/test/J1/./org.apache.solr.cloud.BasicDistributedZk2Test-1348220937555/jetty3/index forceNew:false
[junit4:junit4]   2> 9859 T200 oasc.SolrDeletionPolicy.onCommit SolrDeletionPolicy.onCommit: commits:num=1
[junit4:junit4]   2> 		commit{dir=NRTCachingDirectory(org.apache.lucene.store.NIOFSDirectory@/usr/home/hudson/hudson-slave/workspace/Lucene-Solr-Tests-4.x-java7/solr/build/solr-core/test/J1/org.apache.solr.cloud.BasicDistributedZk2Test-1348220937555/jetty3/index lockFactory=org.apache.lucene.store.NativeFSLockFactory@65409e23; maxCacheMB=48.0 maxMergeSizeMB=4.0),segFN=segments_1,generation=1,filenames=[segments_1]
[junit4:junit4]   2> 9860 T200 oasc.SolrDeletionPolicy.updateCommits newest commit = 1
[junit4:junit4]   2> 9861 T200 oasc.SolrCore.initWriters created xml: solr.XMLResponseWriter
[junit4:junit4]   2> 9863 T200 oasup.UpdateRequestProcessorChain.init inserting DistributedUpdateProcessorFactory into updateRequestProcessorChain "dedupe"
[junit4:junit4]   2> 9863 T200 oasup.UpdateRequestProcessorChain.init inserting DistributedUpdateProcessorFactory into updateRequestProcessorChain "dedupe-allfields"
[junit4:junit4]   2> 9864 T200 oasup.UpdateRequestProcessorChain.init inserting DistributedUpdateProcessorFactory into updateRequestProcessorChain "stored_sig"
[junit4:junit4]   2> 9864 T200 oasup.UpdateRequestProcessorChain.init inserting DistributedUpdateProcessorFactory into updateRequestProcessorChain "uniq-fields"
[junit4:junit4]   2> 9865 T200 oasup.UpdateRequestProcessorChain.init inserting DistributedUpdateProcessorFactory into updateRequestProcessorChain "distrib-dup-test-chain-implicit"
[junit4:junit4]   2> 9865 T200 oasc.RequestHandlers.initHandlersFromConfig adding lazy requestHandler: solr.ReplicationHandler
[junit4:junit4]   2> 9866 T200 oasc.RequestHandlers.initHandlersFromConfig created /replication: solr.ReplicationHandler
[junit4:junit4]   2> 9867 T200 oasc.RequestHandlers.initHandlersFromConfig created standard: solr.StandardRequestHandler
[junit4:junit4]   2> 9867 T200 oasc.RequestHandlers.initHandlersFromConfig created /get: solr.RealTimeGetHandler
[junit4:junit4]   2> 9868 T200 oasc.RequestHandlers.initHandlersFromConfig created dismax: solr.SearchHandler
[junit4:junit4]   2> 9868 T200 oasc.RequestHandlers.initHandlersFromConfig created mock: org.apache.solr.core.MockQuerySenderListenerReqHandler
[junit4:junit4]   2> 9869 T200 oasc.RequestHandlers.initHandlersFromConfig created /admin/: org.apache.solr.handler.admin.AdminHandlers
[junit4:junit4]   2> 9870 T200 oasc.RequestHandlers.initHandlersFromConfig created defaults: solr.StandardRequestHandler
[junit4:junit4]   2> 9870 T200 oasc.RequestHandlers.initHandlersFromConfig adding lazy requestHandler: solr.StandardRequestHandler
[junit4:junit4]   2> 9871 T200 oasc.RequestHandlers.initHandlersFromConfig created lazy: solr.StandardRequestHandler
[junit4:junit4]   2> 9871 T200 oasc.RequestHandlers.initHandlersFromConfig created /update: solr.UpdateRequestHandler
[junit4:junit4]   2> 9872 T200 oasc.RequestHandlers.initHandlersFromConfig created /terms: org.apache.solr.handler.component.SearchHandler
[junit4:junit4]   2> 9872 T200 oasc.RequestHandlers.initHandlersFromConfig created spellCheckCompRH: org.apache.solr.handler.component.SearchHandler
[junit4:junit4]   2> 9873 T200 oasc.RequestHandlers.initHandlersFromConfig created spellCheckCompRH_Direct: org.apache.solr.handler.component.SearchHandler
[junit4:junit4]   2> 9873 T200 oasc.RequestHandlers.initHandlersFromConfig created spellCheckWithWordbreak: org.apache.solr.handler.component.SearchHandler
[junit4:junit4]   2> 9874 T200 oasc.RequestHandlers.initHandlersFromConfig created spellCheckWithWordbreak_Direct: org.apache.solr.handler.component.SearchHandler
[junit4:junit4]   2> 9875 T200 oasc.RequestHandlers.initHandlersFromConfig created spellCheckCompRH1: org.apache.solr.handler.component.SearchHandler
[junit4:junit4]   2> 9875 T200 oasc.RequestHandlers.initHandlersFromConfig created tvrh: org.apache.solr.handler.component.SearchHandler
[junit4:junit4]   2> 9876 T200 oasc.RequestHandlers.initHandlersFromConfig created /mlt: solr.MoreLikeThisHandler
[junit4:junit4]   2> 9877 T200 oasc.RequestHandlers.initHandlersFromConfig created /debug/dump: solr.DumpRequestHandler
[junit4:junit4]   2> 9879 T200 oashl.XMLLoader.init xsltCacheLifetimeSeconds=60
[junit4:junit4]   2> 9883 T200 oasc.SolrCore.initDeprecatedSupport WARNING solrconfig.xml uses deprecated <admin/gettableFiles>, Please update your config to use the ShowFileRequestHandler.
[junit4:junit4]   2> 9884 T200 oasc.SolrCore.initDeprecatedSupport WARNING adding ShowFileRequestHandler with hidden files: [SCHEMA.XML, OLD_SYNONYMS.TXT, STOPWORDS.TXT, PROTWORDS.TXT, OPEN-EXCHANGE-RATES.JSON, SYNONYMS.TXT, CURRENCY.XML, MAPPING-ISOLATIN1ACCENT.TXT]
[junit4:junit4]   2> 9888 T200 oass.SolrIndexSearcher.<init> Opening Searcher@6fc99b43 main
[junit4:junit4]   2> 9889 T200 oasu.CommitTracker.<init> Hard AutoCommit: disabled
[junit4:junit4]   2> 9889 T200 oasu.CommitTracker.<init> Soft AutoCommit: disabled
[junit4:junit4]   2> 9890 T200 oashc.SpellCheckComponent.inform Initializing spell checkers
[junit4:junit4]   2> 9896 T200 oass.DirectSolrSpellChecker.init init: {name=direct,classname=DirectSolrSpellChecker,field=lowerfilt,minQueryLength=3}
[junit4:junit4]   2> 9945 T259 oasc.SolrCore.registerSearcher [collection1] Registered new searcher Searcher@6fc99b43 main{StandardDirectoryReader(segments_1:1)}
[junit4:junit4]   2> 10308 T221 oascc.ZkStateReader.updateClusterState Updating cloud state from ZooKeeper... 
[junit4:junit4]   2> 10322 T220 oascc.ZkStateReader$2.process A cluster state change has occurred - updating...
[junit4:junit4]   2> 10322 T258 oascc.ZkStateReader$2.process A cluster state change has occurred - updating...
[junit4:junit4]   2> 10322 T246 oascc.ZkStateReader$2.process A cluster state change has occurred - updating...
[junit4:junit4]   2> 10322 T234 oascc.ZkStateReader$2.process A cluster state change has occurred - updating...
[junit4:junit4]   2> 10453 T200 oasc.CoreContainer.register registering core: collection1
[junit4:junit4]   2> 10453 T200 oasc.ZkController.register Register shard - core:collection1 address:http://127.0.0.1:37018/solr shardId:shard1
[junit4:junit4]   2> 10457 T200 oasc.ZkController.register We are http://127.0.0.1:37018/solr/collection1/ and leader is http://127.0.0.1:37013/solr/collection1/
[junit4:junit4]   2> 10457 T200 oasc.ZkController.register No LogReplay needed for core=collection1 baseURL=http://127.0.0.1:37018/solr
[junit4:junit4]   2> 10458 T200 oasc.ZkController.checkRecovery Core needs to recover:collection1
[junit4:junit4]   2> 10458 T200 oasu.DefaultSolrCoreState.doRecovery Running recovery - first canceling any ongoing recovery
[junit4:junit4]   2> ASYNC  NEW_CORE C24 name=collection1 org.apache.solr.core.SolrCore@11cb4bd3 url=http://127.0.0.1:37018/solr/collection1 node=127.0.0.1:37018_solr
[junit4:junit4]   2> 10464 T260 C24 P37018 oasc.RecoveryStrategy.run Starting recovery process.  core=collection1 recoveringAfterStartup=true
[junit4:junit4]   2> 10464 T200 oascc.ZkStateReader.updateClusterState Updating cloud state from ZooKeeper... 
[junit4:junit4]   2> 10464 T260 C24 P37018 oasc.RecoveryStrategy.doRecovery ###### startupVersions=[]
[junit4:junit4]   2> 10465 T200 oass.SolrDispatchFilter.init user.dir=/usr/home/hudson/hudson-slave/workspace/Lucene-Solr-Tests-4.x-java7/solr/build/solr-core/test/J1
[junit4:junit4]   2> 10466 T260 C24 P37018 oasc.RecoveryStrategy.doRecovery Attempting to PeerSync from http://127.0.0.1:37013/solr/collection1/ core=collection1 - recoveringAfterStartup=true
[junit4:junit4]   2> 10466 T200 oass.SolrDispatchFilter.init SolrDispatchFilter.init() done
[junit4:junit4]   2> 10467 T200 oascsi.HttpClientUtil.createClient Creating new http client, config:maxConnections=128&maxConnectionsPerHost=32&followRedirects=false
[junit4:junit4]   2> 10473 T260 C24 P37018 oascsi.HttpClientUtil.createClient Creating new http client, config:maxConnectionsPerHost=20&maxConnections=10000&connTimeout=30000&socketTimeout=30000&retry=false
[junit4:junit4]   2> 10491 T260 C24 P37018 oasu.PeerSync.sync PeerSync: core=collection1 url=http://127.0.0.1:37018/solr START replicas=[http://127.0.0.1:37013/solr/collection1/] nUpdates=100
[junit4:junit4]   2> 10491 T260 C24 P37018 oasu.PeerSync.sync WARNING no frame of reference to tell of we've missed updates
[junit4:junit4]   2> 10492 T260 C24 P37018 oasc.RecoveryStrategy.doRecovery PeerSync Recovery was not successful - trying replication. core=collection1
[junit4:junit4]   2> 10492 T260 C24 P37018 oasc.RecoveryStrategy.doRecovery Starting Replication Recovery. core=collection1
[junit4:junit4]   2> 10493 T260 C24 P37018 oascsi.HttpClientUtil.createClient Creating new http client, config:maxConnections=128&maxConnectionsPerHost=32&followRedirects=false
[junit4:junit4]   2> ASYNC  NEW_CORE C25 name=collection1 org.apache.solr.core.SolrCore@2ae0952f url=http://127.0.0.1:37013/solr/collection1 node=127.0.0.1:37013_solr
[junit4:junit4]   2> 10501 T226 C25 P37013 REQ /get {distrib=false&qt=/get&wt=javabin&version=2&getVersions=100} status=0 QTime=1 
[junit4:junit4]   2> 10603 T200 oejs.Server.doStart jetty-8.1.2.v20120308
[junit4:junit4]   2> 10606 T200 oejs.AbstractConnector.doStart Started SocketConnector@0.0.0.0:37023
[junit4:junit4]   2> 10606 T200 oasc.SolrResourceLoader.locateSolrHome JNDI not configured for solr (NoInitialContextEx)
[junit4:junit4]   2> 10607 T200 oasc.SolrResourceLoader.locateSolrHome using system property solr.solr.home: /usr/home/hudson/hudson-slave/workspace/Lucene-Solr-Tests-4.x-java7/solr/build/solr-core/test/J1/./solrtest-jetty4-1348220948029
[junit4:junit4]   2> 10607 T200 oasc.SolrResourceLoader.<init> new SolrResourceLoader for deduced Solr Home: '/usr/home/hudson/hudson-slave/workspace/Lucene-Solr-Tests-4.x-java7/solr/build/solr-core/test/J1/./solrtest-jetty4-1348220948029/'
[junit4:junit4]   2> 10636 T200 oass.SolrDispatchFilter.init SolrDispatchFilter.init()
[junit4:junit4]   2> 10637 T200 oasc.SolrResourceLoader.locateSolrHome JNDI not configured for solr (NoInitialContextEx)
[junit4:junit4]   2> 10637 T200 oasc.SolrResourceLoader.locateSolrHome using system property solr.solr.home: /usr/home/hudson/hudson-slave/workspace/Lucene-Solr-Tests-4.x-java7/solr/build/solr-core/test/J1/./solrtest-jetty4-1348220948029
[junit4:junit4]   2> 10638 T200 oasc.CoreContainer$Initializer.initialize looking for solr.xml: /usr/home/hudson/hudson-slave/workspace/Lucene-Solr-Tests-4.x-java7/solr/build/solr-core/test/J1/./solrtest-jetty4-1348220948029/solr.xml
[junit4:junit4]   2> 10638 T200 oasc.CoreContainer.<init> New CoreContainer 114535745
[junit4:junit4]   2> 10639 T200 oasc.CoreContainer.load Loading CoreContainer using Solr Home: '/usr/home/hudson/hudson-slave/workspace/Lucene-Solr-Tests-4.x-java7/solr/build/solr-core/test/J1/./solrtest-jetty4-1348220948029/'
[junit4:junit4]   2> 10639 T200 oasc.SolrResourceLoader.<init> new SolrResourceLoader for directory: '/usr/home/hudson/hudson-slave/workspace/Lucene-Solr-Tests-4.x-java7/solr/build/solr-core/test/J1/./solrtest-jetty4-1348220948029/'
[junit4:junit4]   2> 10662 T200 oasc.CoreContainer.load Registering Log Listener
[junit4:junit4]   2> 10673 T200 oasc.CoreContainer.initZooKeeper Zookeeper client=127.0.0.1:37002/solr
[junit4:junit4]   2> 10674 T200 oaz.ZooKeeper.<init> Initiating client connection, connectString=127.0.0.1:37002/solr sessionTimeout=5000 watcher=org.apache.solr.common.cloud.ConnectionManager@3f157686
[junit4:junit4]   2> 10675 T271 oaz.ClientCnxn$SendThread.startConnect Opening socket connection to server /127.0.0.1:37002
[junit4:junit4]   2> 10675 T200 oascc.ConnectionManager.waitForConnected Waiting for client to connect to ZooKeeper
[junit4:junit4]   2> 10676 T271 oaz.ClientCnxn$SendThread.primeConnection Socket connection established to localhost/127.0.0.1:37002, initiating session
[junit4:junit4]   2> 10677 T202 oazs.NIOServerCnxn$Factory.run Accepted socket connection from /140.211.11.196:37024
[junit4:junit4]   2> 10677 T202 oazs.NIOServerCnxn.readConnectRequest Client attempting to establish new session at /140.211.11.196:37024
[junit4:junit4]   2> 10679 T206 oazs.NIOServerCnxn.finishSessionInit Established session 0x139e83ae6bc0006 with negotiated timeout 5000 for client /140.211.11.196:37024
[junit4:junit4]   2> 10679 T271 oaz.ClientCnxn$SendThread.readConnectResult Session establishment complete on server localhost/127.0.0.1:37002, sessionid = 0x139e83ae6bc0006, negotiated timeout = 5000
[junit4:junit4]   2> 10680 T272 oascc.ConnectionManager.process Watcher org.apache.solr.common.cloud.ConnectionManager@3f157686 name:ZooKeeperConnection Watcher:127.0.0.1:37002/solr got event WatchedEvent state:SyncConnected type:None path:null path:null type:None
[junit4:junit4]   2> 10680 T200 oascc.ConnectionManager.waitForConnected Client is connected to ZooKeeper
[junit4:junit4]   2> 10681 T207 oazs.PrepRequestProcessor.pRequest Got user-level KeeperException when processing sessionid:0x139e83ae6bc0006 type:create cxid:0x1 zxid:0xfffffffffffffffe txntype:unknown reqpath:n/a Error Path:/solr/overseer Error:KeeperErrorCode = NodeExists for /solr/overseer
[junit4:junit4]   2> 10693 T207 oazs.PrepRequestProcessor.pRequest Got user-level KeeperException when processing sessionid:0x139e83ae6bc0006 type:create cxid:0x2 zxid:0xfffffffffffffffe txntype:unknown reqpath:n/a Error Path:/solr/overseer Error:KeeperErrorCode = NodeExists for /solr/overseer
[junit4:junit4]   2> 10695 T200 oasc.ZkController.createEphemeralLiveNode Register node as live in ZooKeeper:/live_nodes/127.0.0.1:37023_solr
[junit4:junit4]   2> 10695 T207 oazs.PrepRequestProcessor.pRequest Got user-level KeeperException when processing sessionid:0x139e83ae6bc0006 type:delete cxid:0x4 zxid:0xfffffffffffffffe txntype:unknown reqpath:n/a Error Path:/solr/live_nodes/127.0.0.1:37023_solr Error:KeeperErrorCode = NoNode for /solr/live_nodes/127.0.0.1:37023_solr
[junit4:junit4]   2> 10701 T200 oascc.SolrZkClient.makePath makePath: /live_nodes/127.0.0.1:37023_solr
[junit4:junit4]   2> 10703 T246 oascc.ZkStateReader$3.process Updating live nodes
[junit4:junit4]   2> 10703 T258 oascc.ZkStateReader$3.process Updating live nodes
[junit4:junit4]   2> 10703 T234 oascc.ZkStateReader$3.process Updating live nodes
[junit4:junit4]   2> 10703 T220 oascc.ZkStateReader$3.process Updating live nodes
[junit4:junit4]   2> 10705 T200 oashc.HttpShardHandlerFactory.getParameter Setting socketTimeout to: 0
[junit4:junit4]   2> 10705 T200 oashc.HttpShardHandlerFactory.getParameter Setting urlScheme to: http://
[junit4:junit4]   2> 10705 T200 oashc.HttpShardHandlerFactory.getParameter Setting connTimeout to: 0
[junit4:junit4]   2> 10706 T200 oashc.HttpShardHandlerFactory.getParameter Setting maxConnectionsPerHost to: 20
[junit4:junit4]   2> 10706 T200 oashc.HttpShardHandlerFactory.getParameter Setting corePoolSize to: 0
[junit4:junit4]   2> 10706 T200 oashc.HttpShardHandlerFactory.getParameter Setting maximumPoolSize to: 2147483647
[junit4:junit4]   2> 10707 T200 oashc.HttpShardHandlerFactory.getParameter Setting maxThreadIdleTime to: 5
[junit4:junit4]   2> 10707 T200 oashc.HttpShardHandlerFactory.getParameter Setting sizeOfQueue to: -1
[junit4:junit4]   2> 10708 T200 oashc.HttpShardHandlerFactory.getParameter Setting fairnessPolicy to: false
[junit4:junit4]   2> 10708 T200 oascsi.HttpClientUtil.createClient Creating new http client, config:maxConnectionsPerHost=20&maxConnections=10000&socketTimeout=0&connTimeout=0&retry=false
[junit4:junit4]   2> 10724 T200 oascc.ZkStateReader.createClusterStateWatchersAndUpdate Updating cluster state from ZooKeeper... 
[junit4:junit4]   2> 10729 T200 oasc.CoreContainer.create Creating SolrCore 'collection1' using instanceDir: /usr/home/hudson/hudson-slave/workspace/Lucene-Solr-Tests-4.x-java7/solr/build/solr-core/test/J1/./solrtest-jetty4-1348220948029/collection1
[junit4:junit4]   2> 10730 T200 oasc.ZkController.createCollectionZkNode Check for collection zkNode:collection1
[junit4:junit4]   2> 10731 T200 oasc.ZkController.createCollectionZkNode Collection zkNode exists
[junit4:junit4]   2> 10731 T200 oasc.ZkController.readConfigName Load collection config from:/collections/collection1
[junit4:junit4]   2> 10732 T200 oasc.SolrResourceLoader.<init> new SolrResourceLoader for directory: '/usr/home/hudson/hudson-slave/workspace/Lucene-Solr-Tests-4.x-java7/solr/build/solr-core/test/J1/./solrtest-jetty4-1348220948029/collection1/'
[junit4:junit4]   2> 10733 T200 oasc.SolrResourceLoader.replaceClassLoader Adding 'file:/usr/home/hudson/hudson-slave/workspace/Lucene-Solr-Tests-4.x-java7/solr/build/solr-core/test/J1/solrtest-jetty4-1348220948029/collection1/lib/README' to classloader
[junit4:junit4]   2> 10734 T200 oasc.SolrResourceLoader.replaceClassLoader Adding 'file:/usr/home/hudson/hudson-slave/workspace/Lucene-Solr-Tests-4.x-java7/solr/build/solr-core/test/J1/solrtest-jetty4-1348220948029/collection1/lib/classes/' to classloader
[junit4:junit4]   2> 10771 T200 oasc.SolrConfig.<init> Using Lucene MatchVersion: LUCENE_40
[junit4:junit4]   2> 10825 T200 oasc.SolrConfig.<init> Loaded SolrConfig: solrconfig.xml
[junit4:junit4]   2> 10827 T221 oascc.ZkStateReader.updateClusterState Updating cloud state from ZooKeeper... 
[junit4:junit4]   2> 10842 T246 oascc.ZkStateReader$2.process A cluster state change has occurred - updating...
[junit4:junit4]   2> 10842 T220 oascc.ZkStateReader$2.process A cluster state change has occurred - updating...
[junit4:junit4]   2> 10842 T234 oascc.ZkStateReader$2.process A cluster state change has occurred - updating...
[junit4:junit4]   2> 10842 T258 oascc.ZkStateReader$2.process A cluster state change has occurred - updating...
[junit4:junit4]   2> 10926 T272 oascc.ZkStateReader$2.process A cluster state change has occurred - updating...
[junit4:junit4]   2> 10926 T200 oass.IndexSchema.readSchema Reading Solr Schema
[junit4:junit4]   2> 10932 T200 oass.IndexSchema.readSchema Schema name=test
[junit4:junit4]   2> 11409 T200 oass.OpenExchangeRatesOrgProvider.init Initialized with rates=open-exchange-rates.json, refreshInterval=1440.
[junit4:junit4]   2> 11418 T200 oass.IndexSchema.readSchema default search field in schema is text
[junit4:junit4]   2> 11422 T200 oass.IndexSchema.readSchema unique key field: id
[junit4:junit4]   2> 11449 T200 oass.FileExchangeRateProvider.reload Reloading exchange rates from file currency.xml
[junit4:junit4]   2> 11454 T200 oass.FileExchangeRateProvider.reload Reloading exchange rates from file currency.xml
[junit4:junit4]   2> 11458 T200 oass.OpenExchangeRatesOrgProvider.reload Reloading exchange rates from open-exchange-rates.json
[junit4:junit4]   2> 11460 T200 oass.OpenExchangeRatesOrgProvider.reload Reloading exchange rates from open-exchange-rates.json
[junit4:junit4]   2> 11462 T200 oasc.SolrCore.<init> [collection1] Opening new SolrCore at /usr/home/hudson/hudson-slave/workspace/Lucene-Solr-Tests-4.x-java7/solr/build/solr-core/test/J1/./solrtest-jetty4-1348220948029/collection1/, dataDir=./org.apache.solr.cloud.BasicDistributedZk2Test-1348220937555/jetty4/
[junit4:junit4]   2> 11462 T200 oasc.JmxMonitoredMap.<init> JMX monitoring is enabled. Adding Solr mbeans to JMX Server: com.sun.jmx.mbeanserver.JmxMBeanServer@4a635f47
[junit4:junit4]   2> 11463 T200 oasc.SolrCore.getNewIndexDir WARNING New index directory detected: old=null new=./org.apache.solr.cloud.BasicDistributedZk2Test-1348220937555/jetty4/index/
[junit4:junit4]   2> 11464 T200 oasc.SolrCore.initIndex WARNING [collection1] Solr index directory './org.apache.solr.cloud.BasicDistributedZk2Test-1348220937555/jetty4/index' doesn't exist. Creating new index...
[junit4:junit4]   2> 11465 T200 oasc.CachingDirectoryFactory.get return new directory for /usr/home/hudson/hudson-slave/workspace/Lucene-Solr-Tests-4.x-java7/solr/build/solr-core/test/J1/./org.apache.solr.cloud.BasicDistributedZk2Test-1348220937555/jetty4/index forceNew:false
[junit4:junit4]   2> 11553 T200 oasc.SolrDeletionPolicy.onCommit SolrDeletionPolicy.onCommit: commits:num=1
[junit4:junit4]   2> 		commit{dir=NRTCachingDirectory(org.apache.lucene.store.NIOFSDirectory@/usr/home/hudson/hudson-slave/workspace/Lucene-Solr-Tests-4.x-java7/solr/build/solr-core/test/J1/org.apache.solr.cloud.BasicDistributedZk2Test-1348220937555/jetty4/index lockFactory=org.apache.lucene.store.NativeFSLockFactory@191d0f2c; maxCacheMB=48.0 maxMergeSizeMB=4.0),segFN=segments_1,generation=1,filenames=[segments_1]
[junit4:junit4]   2> 11554 T200 oasc.SolrDeletionPolicy.updateCommits newest commit = 1
[junit4:junit4]   2> 11555 T200 oasc.SolrCore.initWriters created xml: solr.XMLResponseWriter
[junit4:junit4]   2> 11558 T200 oasup.UpdateRequestProcessorChain.init inserting DistributedUpdateProcessorFactory into updateRequestProcessorChain "dedupe"
[junit4:junit4]   2> 11558 T200 oasup.UpdateRequestProcessorChain.init inserting DistributedUpdateProcessorFactory into updateRequestProcessorChain "dedupe-allfields"
[junit4:junit4]   2> 11559 T200 oasup.UpdateRequestProcessorChain.init inserting DistributedUpdateProcessorFactory into updateRequestProcessorChain "stored_sig"
[junit4:junit4]   2> 11559 T200 oasup.UpdateRequestProcessorChain.init inserting DistributedUpdateProcessorFactory into updateRequestProcessorChain "uniq-fields"
[junit4:junit4]   2> 11560 T200 oasup.UpdateRequestProcessorChain.init inserting DistributedUpdateProcessorFactory into updateRequestProcessorChain "distrib-dup-test-chain-implicit"
[junit4:junit4]   2> 11560 T200 oasc.RequestHandlers.initHandlersFromConfig adding lazy requestHandler: solr.ReplicationHandler
[junit4:junit4]   2> 11561 T200 oasc.RequestHandlers.initHandlersFromConfig created /replication: solr.ReplicationHandler
[junit4:junit4]   2> 11562 T200 oasc.RequestHandlers.initHandlersFromConfig created standard: solr.StandardRequestHandler
[junit4:junit4]   2> 11562 T200 oasc.RequestHandlers.initHandlersFromConfig created /get: solr.RealTimeGetHandler
[junit4:junit4]   2> 11563 T200 oasc.RequestHandlers.initHandlersFromConfig created dismax: solr.SearchHandler
[junit4:junit4]   2> 11564 T200 oasc.RequestHandlers.initHandlersFromConfig created mock: org.apache.solr.core.MockQuerySenderListenerReqHandler
[junit4:junit4]   2> 11564 T200 oasc.RequestHandlers.initHandlersFromConfig created /admin/: org.apache.solr.handler.admin.AdminHandlers
[junit4:junit4]   2> 11565 T200 oasc.RequestHandlers.initHandlersFromConfig created defaults: solr.StandardRequestHandler
[junit4:junit4]   2> 11565 T200 oasc.RequestHandlers.initHandlersFromConfig adding lazy requestHandler: solr.StandardRequestHandler
[junit4:junit4]   2> 11566 T200 oasc.RequestHandlers.initHandlersFromConfig created lazy: solr.StandardRequestHandler
[junit4:junit4]   2> 11566 T200 oasc.RequestHandlers.initHandlersFromConfig created /update: solr.UpdateRequestHandler
[junit4:junit4]   2> 11567 T200 oasc.RequestHandlers.initHandlersFromConfig created /terms: org.apache.solr.handler.component.SearchHandler
[junit4:junit4]   2> 11567 T200 oasc.RequestHandlers.initHandlersFromConfig created spellCheckCompRH: org.apache.solr.handler.component.SearchHandler
[junit4:junit4]   2> 11568 T200 oasc.RequestHandlers.initHandlersFromConfig created spellCheckCompRH_Direct: org.apache.solr.handler.component.SearchHandler
[junit4:junit4]   2> 11569 T200 oasc.RequestHandlers.initHandlersFromConfig created spellCheckWithWordbreak: org.apache.solr.handler.component.SearchHandler
[junit4:junit4]   2> 11569 T200 oasc.RequestHandlers.initHandlersFromConfig created spellCheckWithWordbreak_Direct: org.apache.solr.handler.component.SearchHandler
[junit4:junit4]   2> 11570 T200 oasc.RequestHandlers.initHandlersFromConfig created spellCheckCompRH1: org.apache.solr.handler.component.SearchHandler
[junit4:junit4]   2> 11571 T200 oasc.RequestHandlers.initHandlersFromConfig created tvrh: org.apache.solr.handler.component.SearchHandler
[junit4:junit4]   2> 11571 T200 oasc.RequestHandlers.initHandlersFromConfig created /mlt: solr.MoreLikeThisHandler
[junit4:junit4]   2> 11572 T200 oasc.RequestHandlers.initHandlersFromConfig created /debug/dump: solr.DumpRequestHandler
[junit4:junit4]   2> 11575 T200 oashl.XMLLoader.init xsltCacheLifetimeSeconds=60
[junit4:junit4]   2> 11578 T200 oasc.SolrCore.initDeprecatedSupport WARNING solrconfig.xml uses deprecated <admin/gettableFiles>, Please update your config to use the ShowFileRequestHandler.
[junit4:junit4]   2> 11580 T200 oasc.SolrCore.initDeprecatedSupport WARNING adding ShowFileRequestHandler with hidden files: [SCHEMA.XML, OLD_SYNONYMS.TXT, STOPWORDS.TXT, PROTWORDS.TXT, OPEN-EXCHANGE-RATES.JSON, SYNONYMS.TXT, CURRENCY.XML, MAPPING-ISOLATIN1ACCENT.TXT]
[junit4:junit4]   2> 11584 T200 oass.SolrIndexSearcher.<init> Opening Searcher@6faeb521 main
[junit4:junit4]   2> 11586 T200 oasu.CommitTracker.<init> Hard AutoCommit: disabled
[junit4:junit4]   2> 11586 T200 oasu.CommitTracker.<init> Soft AutoCommit: disabled
[junit4:junit4]   2> 11587 T200 oashc.SpellCheckComponent.inform Initializing spell checkers
[junit4:junit4]   2> 11602 T200 oass.DirectSolrSpellChecker.init init: {name=direct,classname=DirectSolrSpellChecker,field=lowerfilt,minQueryLength=3}
[junit4:junit4]   2> 11654 T273 oasc.SolrCore.registerSearcher [collection1] Registered new searcher Searcher@6faeb521 main{StandardDirectoryReader(segments_1:1)}
[junit4:junit4]   2> 11852 T221 oascc.ZkStateReader.updateClusterState Updating cloud state from ZooKeeper... 
[junit4:junit4]   2> 11869 T220 oascc.ZkStateReader$2.process A cluster state change has occurred - updating...
[junit4:junit4]   2> 11869 T234 oascc.ZkStateReader$2.process A cluster state change has occurred - updating...
[junit4:junit4]   2> 11869 T272 oascc.ZkStateReader$2.process A cluster state change has occurred - updating...
[junit4:junit4]   2> 11869 T258 oascc.ZkStateReader$2.process A cluster state change has occurred - updating...
[junit4:junit4]   2> 11869 T246 oascc.ZkStateReader$2.process A cluster state change has occurred - updating...
[junit4:junit4]   2> 12162 T200 oasc.CoreContainer.register registering core: collection1
[junit4:junit4]   2> 12163 T200 oasc.ZkController.register Register shard - core:collection1 address:http://127.0.0.1:37023/solr shardId:shard2
[junit4:junit4]   2> 12167 T200 oasc.ZkController.register We are http://127.0.0.1:37023/solr/collection1/ and leader is http://127.0.0.1:37016/solr/collection1/
[junit4:junit4]   2> 12168 T200 oasc.ZkController.register No LogReplay needed for core=collection1 baseURL=http://127.0.0.1:37023/solr
[junit4:junit4]   2> 12169 T200 oasc.ZkController.checkRecovery Core needs to recover:collection1
[junit4:junit4]   2> 12169 T200 oasu.DefaultSolrCoreState.doRecovery Running recovery - first canceling any ongoing recovery
[junit4:junit4]   2> ASYNC  NEW_CORE C26 name=collection1 org.apache.solr.core.SolrCore@31410e0d url=http://127.0.0.1:37023/solr/collection1 node=127.0.0.1:37023_solr
[junit4:junit4]   2> 12170 T274 C26 P37023 oasc.RecoveryStrategy.run Starting recovery process.  core=collection1 recoveringAfterStartup=true
[junit4:junit4]   2> 12171 T274 C26 P37023 oasc.RecoveryStrategy.doRecovery ###### startupVersions=[]
[junit4:junit4]   2> 12171 T200 oascc.ZkStateReader.updateClusterState Updating cloud state from ZooKeeper... 
[junit4:junit4]   2> 12173 T274 C26 P37023 oasc.RecoveryStrategy.doRecovery Attempting to PeerSync from http://127.0.0.1:37016/solr/collection1/ core=collection1 - recoveringAfterStartup=true
[junit4:junit4]   2> 12174 T274 C26 P37023 oasu.PeerSync.sync PeerSync: core=collection1 url=http://127.0.0.1:37023/solr START replicas=[http://127.0.0.1:37016/solr/collection1/] nUpdates=100
[junit4:junit4]   2> 12174 T200 oass.SolrDispatchFilter.init user.dir=/usr/home/hudson/hudson-slave/workspace/Lucene-Solr-Tests-4.x-java7/solr/build/solr-core/test/J1
[junit4:junit4]   2> 12174 T274 C26 P37023 oasu.PeerSync.sync WARNING no frame of reference to tell of we've missed updates
[junit4:junit4]   2> 12174 T200 oass.SolrDispatchFilter.init SolrDispatchFilter.init() done
[junit4:junit4]   2> 12175 T274 C26 P37023 oasc.RecoveryStrategy.doRecovery PeerSync Recovery was not successful - trying replication. core=collection1
[junit4:junit4]   2> 12176 T274 C26 P37023 oasc.RecoveryStrategy.doRecovery Starting Replication Recovery. core=collection1
[junit4:junit4]   2> 12176 T200 oascsi.HttpClientUtil.createClient Creating new http client, config:maxConnections=128&maxConnectionsPerHost=32&followRedirects=false
[junit4:junit4]   2> 12176 T274 C26 P37023 oascsi.HttpClientUtil.createClient Creating new http client, config:maxConnections=128&maxConnectionsPerHost=32&followRedirects=false
[junit4:junit4]   2> ASYNC  NEW_CORE C27 name=collection1 org.apache.solr.core.SolrCore@4dd63d6a url=http://127.0.0.1:37016/solr/collection1 node=127.0.0.1:37016_solr
[junit4:junit4]   2> 12185 T238 C27 P37016 REQ /get {distrib=false&qt=/get&wt=javabin&version=2&getVersions=100} status=0 QTime=0 
[junit4:junit4]   2> 12199 T200 oaz.ZooKeeper.<init> Initiating client connection, connectString=127.0.0.1:37002/solr sessionTimeout=10000 watcher=org.apache.solr.common.cloud.ConnectionManager@4fc50363
[junit4:junit4]   2> 12200 T276 oaz.ClientCnxn$SendThread.startConnect Opening socket connection to server /127.0.0.1:37002
[junit4:junit4]   2> 12200 T200 oascc.ConnectionManager.waitForConnected Waiting for client to connect to ZooKeeper
[junit4:junit4]   2> 12201 T276 oaz.ClientCnxn$SendThread.primeConnection Socket connection established to localhost/127.0.0.1:37002, initiating session
[junit4:junit4]   2> 12202 T202 oazs.NIOServerCnxn$Factory.run Accepted socket connection from /140.211.11.196:37027
[junit4:junit4]   2> 12202 T202 oazs.NIOServerCnxn.readConnectRequest Client attempting to establish new session at /140.211.11.196:37027
[junit4:junit4]   2> 12204 T206 oazs.NIOServerCnxn.finishSessionInit Established session 0x139e83ae6bc0007 with negotiated timeout 10000 for client /140.211.11.196:37027
[junit4:junit4]   2> 12204 T276 oaz.ClientCnxn$SendThread.readConnectResult Session establishment complete on server localhost/127.0.0.1:37002, sessionid = 0x139e83ae6bc0007, negotiated timeout = 10000
[junit4:junit4]   2> 12205 T277 oascc.ConnectionManager.process Watcher org.apache.solr.common.cloud.ConnectionManager@4fc50363 name:ZooKeeperConnection Watcher:127.0.0.1:37002/solr got event WatchedEvent state:SyncConnected type:None path:null path:null type:None
[junit4:junit4]   2> 12205 T200 oascc.ConnectionManager.waitForConnected Client is connected to ZooKeeper
[junit4:junit4]   2> 12206 T200 oascc.ZkStateReader.createClusterStateWatchersAndUpdate Updating cluster state from ZooKeeper... 
[junit4:junit4]   2> 12211 T200 oasc.ChaosMonkey.monkeyLog monkey: init - expire sessions:true cause connection loss:true
[junit4:junit4]   2> 12212 T200 oascsi.HttpClientUtil.createClient Creating new http client, config:
[junit4:junit4]   2> 12228 T200 oascc.ZkStateReader.updateClusterState Updating cloud state from ZooKeeper... 
[junit4:junit4]   2> ASYNC  NEW_CORE C28 name=collection1 org.apache.solr.core.SolrCore@2fedab00 url=http://127.0.0.1:37007/solr/collection1 node=127.0.0.1:37007_solr
[junit4:junit4]   2> 12248 T212 C28 P37007 oascsi.HttpClientUtil.createClient Creating new http client, config:maxConnections=500&maxConnectionsPerHost=16
[junit4:junit4]   2> 12267 T212 C28 P37007 oasc.SolrDeletionPolicy.onInit SolrDeletionPolicy.onInit: commits:num=1
[junit4:junit4]   2> 		commit{dir=NRTCachingDirectory(org.apache.lucene.store.NIOFSDirectory@/usr/home/hudson/hudson-slave/workspace/Lucene-Solr-Tests-4.x-java7/solr/build/solr-core/test/J1/org.apache.solr.cloud.BasicDistributedZk2Test-1348220937555/control/data/index lockFactory=org.apache.lucene.store.NativeFSLockFactory@5706f972; maxCacheMB=48.0 maxMergeSizeMB=4.0),segFN=segments_1,generation=1,filenames=[segments_1]
[junit4:junit4]   2> 12268 T212 C28 P37007 oasc.SolrDeletionPolicy.updateCommits newest commit = 1
[junit4:junit4]   2> 12294 T212 C28 P37007 /update {wt=javabin&version=2} {add=[1 (1413712130671116288)]} 0 55
[junit4:junit4]   2> 12295 T200 oaz.ZooKeeper.<init> Initiating client connection, connectString=127.0.0.1:37002/solr sessionTimeout=10000 watcher=org.apache.solr.common.cloud.ConnectionManager@2f5fddb7
[junit4:junit4]   2> 12296 T278 oaz.ClientCnxn$SendThread.startConnect Opening socket connection to server /127.0.0.1:37002
[junit4:junit4]   2> 12296 T200 oascc.ConnectionManager.waitForConnected Waiting for client to connect to ZooKeeper
[junit4:junit4]   2> 12298 T278 oaz.ClientCnxn$SendThread.primeConnection Socket connection established to localhost/127.0.0.1:37002, initiating session
[junit4:junit4]   2> 12298 T202 oazs.NIOServerCnxn$Factory.run Accepted socket connection from /140.211.11.196:37029
[junit4:junit4]   2> 12299 T202 oazs.NIOServerCnxn.readConnectRequest Client attempting to establish new session at /140.211.11.196:37029
[junit4:junit4]   2> 12300 T206 oazs.NIOServerCnxn.finishSessionInit Established session 0x139e83ae6bc0008 with negotiated timeout 10000 for client /140.211.11.196:37029
[junit4:junit4]   2> 12301 T278 oaz.ClientCnxn$SendThread.readConnectResult Session establishment complete on server localhost/127.0.0.1:37002, sessionid = 0x139e83ae6bc0008, negotiated timeout = 10000
[junit4:junit4]   2> 12301 T279 oascc.ConnectionManager.process Watcher org.apache.solr.common.cloud.ConnectionManager@2f5fddb7 name:ZooKeeperConnection Watcher:127.0.0.1:37002/solr got event WatchedEvent state:SyncConnected type:None path:null path:null type:None
[junit4:junit4]   2> 12302 T200 oascc.ConnectionManager.waitForConnected Client is connected to ZooKeeper
[junit4:junit4]   2> 12303 T200 oascc.ZkStateReader.createClusterStateWatchersAndUpdate Updating cluster state from ZooKeeper... 
[junit4:junit4]   2> 12364 T228 C25 P37013 oasc.SolrDeletionPolicy.onInit SolrDeletionPolicy.onInit: commits:num=1
[junit4:junit4]   2> 		commit{dir=NRTCachingDirectory(org.apache.lucene.store.NIOFSDirectory@/usr/home/hudson/hudson-slave/workspace/Lucene-Solr-Tests-4.x-java7/solr/build/solr-core/test/J1/org.apache.solr.cloud.BasicDistributedZk2Test-1348220937555/jetty1/index lockFactory=org.apache.lucene.store.NativeFSLockFactory@43bc16f5; maxCacheMB=48.0 maxMergeSizeMB=4.0),segFN=segments_1,generation=1,filenames=[segments_1]
[junit4:junit4]   2> 12365 T228 C25 P37013 oasc.SolrDeletionPolicy.updateCommits newest commit = 1
[junit4:junit4]   2> 12384 T221 oascc.ZkStateReader.updateClusterState Updating cloud state from ZooKeeper... 
[junit4:junit4]   2>  C24_STATE=coll:collection1 core:collection1 props:{shard=shard1, roles=null, state=recovering, core=collection1, collection=collection1, node_name=127.0.0.1:37018_solr, base_url=http://127.0.0.1:37018/solr}
[junit4:junit4]   2> 12385 T250 C24 P37018 oasc.SolrDeletionPolicy.onInit SolrDeletionPolicy.onInit: commits:num=1
[junit4:junit4]   2> 		commit{dir=NRTCachingDirectory(org.apache.lucene.store.NIOFSDirectory@/usr/home/hudson/hudson-slave/workspace/Lucene-Solr-Tests-4.x-java7/solr/build/solr-core/test/J1/org.apache.solr.cloud.BasicDistributedZk2Test-1348220937555/jetty3/index lockFactory=org.apache.lucene.store.NativeFSLockFactory@65409e23; maxCacheMB=48.0 maxMergeSizeMB=4.0),segFN=segments_1,generation=1,filenames=[segments_1]
[junit4:junit4]   2> 12386 T250 C24 P37018 oasc.SolrDeletionPolicy.updateCommits newest commit = 1
[junit4:junit4]   2> 12392 T250 C24 P37018 REQ /update {update.distrib=FROMLEADER&distrib.from=http://127.0.0.1:37013/solr/collection1/&wt=javabin&version=2} status=0 QTime=11 
[junit4:junit4]   2> 12393 T228 C25 P37013 REQ /update {distrib.from=http://127.0.0.1:37016/solr/collection1/&update.distrib=TOLEADER&wt=javabin&version=2} status=0 QTime=35 
[junit4:junit4]   2> 12394 T240 C27 P37016 /update {wt=javabin&version=2} {add=[1]} 0 86
[junit4:junit4]   2> 12395 T200 oasc.AbstractDistribZkTestBase.waitForRecoveriesToFinish Wait for recoveries to finish - collection: collection1 failOnTimeout:true timeout (sec):1800
[junit4:junit4]   2> 12398 T277 oascc.ZkStateReader$2.process A cluster state change has occurred - updating...
[junit4:junit4]   2> 12398 T220 oascc.ZkStateReader$2.process A cluster state change has occurred - updating...
[junit4:junit4]   2> 12399 T258 oascc.ZkStateReader$2.process A cluster state change has occurred - updating...
[junit4:junit4]   2> 12399 T272 oascc.ZkStateReader$2.process A cluster state change has occurred - updating...
[junit4:junit4]   2> 12399 T279 oascc.ZkStateReader$2.process A cluster state change has occurred - updating...
[junit4:junit4]   2> 12399 T246 oascc.ZkStateReader$2.process A cluster state change has occurred - updating...
[junit4:junit4]   2> 12399 T234 oascc.ZkStateReader$2.process A cluster state change has occurred - updating...
[junit4:junit4]   2> 12399 T200 oascc.ZkStateReader.updateClusterState Updating cloud state from ZooKeeper... 
[junit4:junit4]   2> 13405 T200 oascc.ZkStateReader.updateClusterState Updating cloud state from ZooKeeper... 
[junit4:junit4]   2> 13523 T260 C24 P37018 oasc.RecoveryStrategy.doRecovery Begin buffering updates. core=collection1
[junit4:junit4]   2> 13523 T260 C24 P37018 oasu.UpdateLog.bufferUpdates Starting to buffer updates. FSUpdateLog{state=ACTIVE, tlog=tlog{file=./org.apache.solr.cloud.BasicDistributedZk2Test-1348220937555/jetty3/tlog/tlog.0000000000000000000 refcount=1}}
[junit4:junit4]   2> 13524 T260 C24 P37018 oasc.RecoveryStrategy.replicate Attempting to replicate from http://127.0.0.1:37013/solr/collection1/. core=collection1
[junit4:junit4]   2> 13524 T260 C24 P37018 oascsi.HttpClientUtil.createClient Creating new http client, config:maxConnections=128&maxConnectionsPerHost=32&followRedirects=false
[junit4:junit4]   2> 13543 T229 C25 P37013 oasu.DirectUpdateHandler2.commit start commit{flags=0,_version_=0,optimize=false,openSearcher=true,waitSearcher=true,expungeDeletes=false,softCommit=false}
[junit4:junit4]   2> 13620 T229 C25 P37013 oasc.SolrDeletionPolicy.onCommit SolrDeletionPolicy.onCommit: commits:num=2
[junit4:junit4]   2> 		commit{dir=NRTCachingDirectory(org.apache.lucene.store.NIOFSDirectory@/usr/home/hudson/hudson-slave/workspace/Lucene-Solr-Tests-4.x-java7/solr/build/solr-core/test/J1/org.apache.solr.cloud.BasicDistributedZk2Test-1348220937555/jetty1/index lockFactory=org.apache.lucene.store.NativeFSLockFactory@43bc16f5; maxCacheMB=48.0 maxMergeSizeMB=4.0),segFN=segments_1,generation=1,filenames=[segments_1]
[junit4:junit4]   2> 		commit{dir=NRTCachingDirectory(org.apache.lucene.store.NIOFSDirectory@/usr/home/hudson/hudson-slave/workspace/Lucene-Solr-Tests-4.x-java7/solr/build/solr-core/test/J1/org.apache.solr.cloud.BasicDistributedZk2Test-1348220937555/jetty1/index lockFactory=org.apache.lucene.store.NativeFSLockFactory@43bc16f5; maxCacheMB=48.0 maxMergeSizeMB=4.0),segFN=segments_2,generation=2,filenames=[_0.fnm, _0.frq, _0.tim, _0_nrm.cfe, segments_2, _0.fdx, _0_nrm.cfs, _0.si, _0.prx, _0.tip, _0.fdt]
[junit4:junit4]   2> 13622 T229 C25 P37013 oasc.SolrDeletionPolicy.updateCommits newest commit = 2
[junit4:junit4]   2> 13639 T229 C25 P37013 oass.SolrIndexSearcher.<init> Opening Searcher@d1ba8bc main
[junit4:junit4]   2> 13642 T229 C25 P37013 oasu.DirectUpdateHandler2.commit end_commit_flush
[junit4:junit4]   2> 13643 T235 oasc.SolrCore.registerSearcher [collection1] Registered new searcher Searcher@d1ba8bc main{StandardDirectoryReader(segments_2:3 _0(4.0.0.2):C1)}
[junit4:junit4]   2> 13643 T229 C25 P37013 /update {waitSearcher=true&commit=true&commit_end_point=true&wt=javabin&softCommit=false&version=2} {commit=} 0 100
[junit4:junit4]   2> 13645 T260 C24 P37018 oash.ReplicationHandler.inform Commits will be reserved for  10000
[junit4:junit4]   2> 13646 T260 C24 P37018 oascsi.HttpClientUtil.createClient Creating new http client, config:connTimeout=5000&socketTimeout=20000&allowCompression=false&maxConnections=10000&maxConnectionsPerHost=10000
[junit4:junit4]   2> 13671 T260 C24 P37018 oash.SnapPuller.<init>  No value set for 'pollInterval'. Timer Task not started.
[junit4:junit4]   2> 13675 T230 C25 P37013 oash.ReplicationHandler.inform Commits will be reserved for  10000
[junit4:junit4]   2> 13675 T230 C25 P37013 REQ /replication {command=indexversion&wt=javabin&qt=/replication&version=2} status=0 QTime=1 
[junit4:junit4]   2> 13676 T260 C24 P37018 oash.SnapPuller.fetchLatestIndex Master's generation: 2
[junit4:junit4]   2> 13677 T260 C24 P37018 oash.SnapPuller.fetchLatestIndex Slave's generation: 1
[junit4:junit4]   2> 13677 T260 C24 P37018 oash.SnapPuller.fetchLatestIndex Starting replication process
[junit4:junit4]   2> 13681 T230 C25 P37013 REQ /replication {command=filelist&generation=2&wt=javabin&qt=/replication&version=2} status=0 QTime=2 
[junit4:junit4]   2> 13682 T260 C24 P37018 oash.SnapPuller.fetchLatestIndex Number of files in latest index in master: 11
[junit4:junit4]   2> 13685 T260 C24 P37018 oash.SnapPuller.fetchLatestIndex Starting download to ./org.apache.solr.cloud.BasicDistributedZk2Test-1348220937555/jetty3/index.20120921034911233 fullCopy=true
[junit4:junit4]   2> 13701 T230 C25 P37013 REQ /replication {file=_0.fnm&command=filecontent&checksum=true&generation=2&qt=/replication&wt=filestream} status=0 QTime=8 
[junit4:junit4]   2> 13722 T230 C25 P37013 REQ /replication {file=_0_nrm.cfe&command=filecontent&checksum=true&generation=2&qt=/replication&wt=filestream} status=0 QTime=1 
[junit4:junit4]   2> 13726 T230 C25 P37013 REQ /replication {file=_0.tim&command=filecontent&checksum=true&generation=2&qt=/replication&wt=filestream} status=0 QTime=0 
[junit4:junit4]   2> 13731 T230 C25 P37013 REQ /replication {file=_0.frq&command=filecontent&checksum=true&generation=2&qt=/replication&wt=filestream} status=0 QTime=0 
[junit4:junit4]   2> 13737 T230 C25 P37013 REQ /replication {file=segments_2&command=filecontent&checksum=true&generation=2&qt=/replication&wt=filestream} status=0 QTime=0 
[junit4:junit4]   2> 13743 T230 C25 P37013 REQ /replication {file=_0.fdx&command=filecontent&checksum=true&generation=2&qt=/replication&wt=filestream} status=0 QTime=0 
[junit4:junit4]   2> 13749 T230 C25 P37013 REQ /replication {file=_0_nrm.cfs&command=filecontent&checksum=true&generation=2&qt=/replication&wt=filestream} status=0 QTime=0 
[junit4:junit4]   2> 13755 T230 C25 P37013 REQ /replication {file=_0.si&command=filecontent&checksum=true&generation=2&qt=/replication&wt=filestream} status=0 QTime=0 
[junit4:junit4]   2> 13761 T230 C25 P37013 REQ /replication {file=_0.tip&command=filecontent&checksum=true&generation=2&qt=/replication&wt=filestream} status=0 QTime=0 
[junit4:junit4]   2> 13767 T230 C25 P37013 REQ /replication {file=_0.prx&command=filecontent&checksum=true&generation=2&qt=/replication&wt=filestream} status=0 QTime=0 
[junit4:junit4]   2> 13787 T230 C25 P37013 REQ /replication {file=_0.fdt&command=filecontent&checksum=true&generation=2&qt=/replication&wt=filestream} status=0 QTime=1 
[junit4:junit4]   2> 13789 T260 C24 P37018 oash.SnapPuller.fetchLatestIndex Total time taken for download : 0 secs
[junit4:junit4]   2> 13789 T260 C24 P37018 oash.SnapPuller.modifyIndexProps New index installed. Updating index properties... index=index.20120921034911233
[junit4:junit4]   2> 13796 T260 C24 P37018 oasu.DefaultSolrCoreState.newIndexWriter Creating new IndexWriter...
[junit4:junit4]   2> 13797 T260 C24 P37018 oasu.DefaultSolrCoreState.newIndexWriter Waiting until IndexWriter is unused... core=collection1
[junit4:junit4]   2> 13797 T260 C24 P37018 oasu.DefaultSolrCoreState.newIndexWriter Rollback old IndexWriter... core=collection1
[junit4:junit4]   2> 13813 T260 C24 P37018 oasc.SolrCore.getNewIndexDir WARNING New index directory detected: old=./org.apache.solr.cloud.BasicDistributedZk2Test-1348220937555/jetty3/index/ new=./org.apache.solr.cloud.BasicDistributedZk2Test-1348220937555/jetty3/index.20120921034911233
[junit4:junit4]   2> 13814 T260 C24 P37018 oasc.CachingDirectoryFactory.get return new directory for /usr/home/hudson/hudson-slave/workspace/Lucene-Solr-Tests-4.x-java7/solr/build/solr-core/test/J1/./org.apache.solr.cloud.BasicDistributedZk2Test-1348220937555/jetty3/index.20120921034911233 forceNew:true
[junit4:junit4]   2> 13823 T260 C24 P37018 oasc.SolrDeletionPolicy.onInit SolrDeletionPolicy.onInit: commits:num=1
[junit4:junit4]   2> 		commit{dir=NRTCachingDirectory(org.apache.lucene.store.NIOFSDirectory@/usr/home/hudson/hudson-slave/workspace/Lucene-Solr-Tests-4.x-java7/solr/build/solr-core/test/J1/org.apache.solr.cloud.BasicDistributedZk2Test-1348220937555/jetty3/index.20120921034911233 lockFactory=org.apache.lucene.store.NativeFSLockFactory@7072ba17; maxCacheMB=48.0 maxMergeSizeMB=4.0),segFN=segments_2,generation=2,filenames=[_0.fnm, _0_nrm.cfe, _0.tim, _0.frq, segments_2, _0.fdx, _0_nrm.cfs, _0.si, _0.tip, _0.prx, _0.fdt]
[junit4:junit4]   2> 13823 T260 C24 P37018 oasc.SolrDeletionPolicy.updateCommits newest commit = 2
[junit4:junit4]   2> 13824 T260 C24 P37018 oasu.DefaultSolrCoreState.newIndexWriter New IndexWriter is ready to be used.
[junit4:junit4]   2> 13829 T260 C24 P37018 oass.SolrIndexSearcher.<init> Opening Searcher@4f61a503 main
[junit4:junit4]   2> 13832 T259 oasc.SolrCore.registerSearcher [collection1] Registered new searcher Searcher@4f61a503 main{StandardDirectoryReader(segments_2:3:nrt _0(4.0.0.2):C1)}
[junit4:junit4]   2> 13833 T259 oasc.CachingDirectoryFactory.close Closing directory:/usr/home/hudson/hudson-slave/workspace/Lucene-Solr-Tests-4.x-java7/solr/build/solr-core/test/J1/./org.apache.solr.cloud.BasicDistributedZk2Test-1348220937555/jetty3/index
[junit4:junit4]   2> 13833 T259 oash.SnapPuller$2.onClose removing old index directory ./org.apache.solr.cloud.BasicDistributedZk2Test-1348220937555/jetty3/index
[junit4:junit4]   2> 13836 T260 C24 P37018 oasu.DirectUpdateHandler2.commit start commit{flags=0,_version_=0,optimize=false,openSearcher=false,waitSearcher=false,expungeDeletes=false,softCommit=false}
[junit4:junit4]   2> 13837 T260 C24 P37018 oasu.DirectUpdateHandler2.commit end_commit_flush
[junit4:junit4]   2> 13845 T260 C24 P37018 oasc.RecoveryStrategy.replay Replaying buffered documents. core=collection1
[junit4:junit4]   2> 13845 T283 C24 P37018 oasu.UpdateLog$LogReplayer.doReplay WARNING Starting log replay tlog{file=./org.apache.solr.cloud.BasicDistributedZk2Test-1348220937555/jetty3/tlog/tlog.0000000000000000000 refcount=2} active=true starting pos=432
[junit4:junit4]   2> 13851 T283 C24 P37018 oasu.DirectUpdateHandler2.commit start commit{flags=2,_version_=0,optimize=false,openSearcher=true,waitSearcher=true,expungeDeletes=false,softCommit=false}
[junit4:junit4]   2> 13853 T283 C24 P37018 oass.SolrIndexSearcher.<init> Opening Searcher@2247e423 main
[junit4:junit4]   2> 13855 T283 C24 P37018 oasu.DirectUpdateHandler2.commit end_commit_flush
[junit4:junit4]   2> 13857 T259 oasc.SolrCore.registerSearcher [collection1] Registered new searcher Searcher@2247e423 main{StandardDirectoryReader(segments_2:3:nrt _0(4.0.0.2):C1)}
[junit4:junit4]   2> 13857 T283 C24 P37018 oasu.UpdateLog$LogReplayer.run WARNING Log replay finished. recoveryInfo=RecoveryInfo{adds=0 deletes=0 deleteByQuery=0 errors=0 positionOfStart=432}
[junit4:junit4]   2> 13858 T260 C24 P37018 oasc.RecoveryStrategy.doRecovery Replication Recovery was successful - registering as Active. core=collection1
[junit4:junit4]   2> 13913 T260 C24 P37018 oasc.RecoveryStrategy.doRecovery Finished recovery process. core=collection1
[junit4:junit4]   2> 13914 T221 oascc.ZkStateReader.updateClusterState Updating cloud state from ZooKeeper... 
[junit4:junit4]   2> 13950 T234 oascc.ZkStateReader$2.process A cluster state change has occurred - updating...
[junit4:junit4]   2> 13950 T279 oascc.ZkStateReader$2.process A cluster state change has occurred - updating...
[junit4:junit4]   2> 13950 T277 oascc.ZkStateReader$2.process A cluster state change has occurred - updating...
[junit4:junit4]   2> 13950 T220 oascc.ZkStateReader$2.process A cluster state change has occurred - updating...
[junit4:junit4]   2> 13950 T246 oascc.ZkStateReader$2.process A cluster state change has occurred - updating...
[junit4:junit4]   2> 13950 T258 oascc.ZkStateReader$2.process A cluster state change has occurred - updating...
[junit4:junit4]   2> 13950 T272 oascc.ZkStateReader$2.process A cluster state change has occurred - updating...
[junit4:junit4]   2> 14408 T200 oascc.ZkStateReader.updateClusterState Updating cloud state from ZooKeeper... 
[junit4:junit4]   2>  C26_STATE=coll:collection1 core:collection1 props:{shard=shard2, roles=null, state=recovering, core=collection1, collection=collection1, node_name=127.0.0.1:37023_solr, base_url=http://127.0.0.1:37023/solr}
[junit4:junit4]   2> 15198 T274 C26 P37023 oasc.RecoveryStrategy.doRecovery Begin buffering updates. core=collection1
[junit4:junit4]   2> 15198 T274 C26 P37023 oasu.UpdateLog.bufferUpdates Starting to buffer updates. FSUpdateLog{state=ACTIVE, tlog=null}
[junit4:junit4]   2> 15199 T274 C26 P37023 oasc.RecoveryStrategy.replicate Attempting to replicate from http://127.0.0.1:37016/solr/collection1/. core=collection1
[junit4:junit4]   2> 15199 T274 C26 P37023 oascsi.HttpClientUtil.createClient Creating new http client, config:maxConnections=128&maxConnectionsPerHost=32&followRedirects=false
[junit4:junit4]   2> 15217 T241 C27 P37016 oasu.DirectUpdateHandler2.commit start commit{flags=0,_version_=0,optimize=false,openSearcher=true,waitSearcher=true,expungeDeletes=false,softCommit=false}
[junit4:junit4]   2> 15221 T241 C27 P37016 oasc.SolrDeletionPolicy.onInit SolrDeletionPolicy.onInit: commits:num=1
[junit4:junit4]   2> 		commit{dir=NRTCachingDirectory(org.apache.lucene.store.NIOFSDirectory@/usr/home/hudson/hudson-slave/workspace/Lucene-Solr-Tests-4.x-java7/solr/build/solr-core/test/J1/org.apache.solr.cloud.BasicDistributedZk2Test-1348220937555/jetty2/index lockFactory=org.apache.lucene.store.NativeFSLockFactory@63ac3790; maxCacheMB=48.0 maxMergeSizeMB=4.0),segFN=segments_1,generation=1,filenames=[segments_1]
[junit4:junit4]   2> 15221 T241 C27 P37016 oasc.SolrDeletionPolicy.updateCommits newest commit = 1
[junit4:junit4]   2> 15223 T241 C27 P37016 oass.SolrIndexSearcher.<init> Opening Searcher@f94be93 main
[junit4:junit4]   2> 15223 T241 C27 P37016 oasu.DirectUpdateHandler2.commit end_commit_flush
[junit4:junit4]   2> 15225 T247 oasc.SolrCore.registerSearcher [collection1] Registered new searcher Searcher@f94be93 main{StandardDirectoryReader(segments_1:1)}
[junit4:junit4]   2> 15226 T241 C27 P37016 /update {waitSearcher=true&commit=true&commit_end_point=true&wt=javabin&softCommit=false&version=2} {commit=} 0 9
[junit4:junit4]   2> 15227 T274 C26 P37023 oash.ReplicationHandler.inform Commits will be reserved for  10000
[junit4:junit4]   2> 15227 T274 C26 P37023 oash.SnapPuller.<init>  No value set for 'pollInterval'. Timer Task not started.
[junit4:junit4]   2> 15230 T242 C27 P37016 oash.ReplicationHandler.inform Commits will be reserved for  10000
[junit4:junit4]   2> 15231 T242 C27 P37016 REQ /replication {command=indexversion&wt=javabin&qt=/replication&version=2} status=0 QTime=1 
[junit4:junit4]   2> 15236 T274 C26 P37023 oasc.SolrDeletionPolicy.onInit SolrDeletionPolicy.onInit: commits:num=1
[junit4:junit4]   2> 		commit{dir=NRTCachingDirectory(org.apache.lucene.store.NIOFSDirectory@/usr/home/hudson/hudson-slave/workspace/Lucene-Solr-Tests-4.x-java7/solr/build/solr-core/test/J1/org.apache.solr.cloud.BasicDistributedZk2Test-1348220937555/jetty4/index lockFactory=org.apache.lucene.store.NativeFSLockFactory@191d0f2c; maxCacheMB=48.0 maxMergeSizeMB=4.0),segFN=segments_1,generation=1,filenames=[segments_1]
[junit4:junit4]   2> 15236 T274 C26 P37023 oasc.SolrDeletionPolicy.updateCommits newest commit = 1
[junit4:junit4]   2> 15237 T274 C26 P37023 oasu.DirectUpdateHandler2.commit start commit{flags=0,_version_=0,optimize=false,openSearcher=true,waitSearcher=true,expungeDeletes=false,softCommit=false}
[junit4:junit4]   2> 15241 T274 C26 P37023 oasc.SolrDeletionPolicy.onCommit SolrDeletionPolicy.onCommit: commits:num=2
[junit4:junit4]   2> 		commit{dir=NRTCachingDirectory(org.apache.lucene.store.NIOFSDirectory@/usr/home/hudson/hudson-slave/workspace/Lucene-Solr-Tests-4.x-java7/solr/build/solr-core/test/J1/org.apache.solr.cloud.BasicDistributedZk2Test-1348220937555/jetty4/index lockFactory=org.apache.lucene.store.NativeFSLockFactory@191d0f2c; maxCacheMB=48.0 maxMergeSizeMB=4.0),segFN=segments_1,generation=1,filenames=[segments_1]
[junit4:junit4]   2> 		commit{dir=NRTCachingDirectory(org.apache.lucene.store.NIOFSDirectory@/usr/home/hudson/hudson-slave/workspace/Lucene-Solr-Tests-4.x-java7/solr/build/solr-core/test/J1/org.apache.solr.cloud.BasicDistributedZk2Test-1348220937555/jetty4/index lockFactory=org.apache.lucene.store.NativeFSLockFactory@191d0f2c; maxCacheMB=48.0 maxMergeSizeMB=4.0),segFN=segments_2,generation=2,filenames=[segments_2]
[junit4:junit4]   2> 15242 T274 C26 P37023 oasc.SolrDeletionPolicy.updateCommits newest commit = 2
[junit4:junit4]   2> 15245 T274 C26 P37023 oass.SolrIndexSearcher.<init> Opening Searcher@2118108a main
[junit4:junit4]   2> 15246 T274 C26 P37023 oasu.DirectUpdateHandler2.commit end_commit_flush
[junit4:junit4]   2> 15248 T273 oasc.SolrCore.registerSearcher [collection1] Registered new searcher Searcher@2118108a main{StandardDirectoryReader(segments_2:2)}
[junit4:junit4]   2> 15248 T274 C26 P37023 oasc.RecoveryStrategy.replay No replay needed. core=collection1
[junit4:junit4]   2> 15249 T274 C26 P37023 oasc.RecoveryStrategy.doRecovery Replication Recovery was successful - registering as Active. core=collection1
[junit4:junit4]   2> 15255 T274 C26 P37023 oasc.RecoveryStrategy.doRecovery Finished recovery process. core=collection1
[junit4:junit4]   2> 15411 T200 oascc.ZkStateReader.updateClusterState Updating cloud state from ZooKeeper... 
[junit4:junit4]   2> 15468 T221 oascc.ZkStateReader.updateClusterState Updating cloud state from ZooKeeper... 
[junit4:junit4]   2> 15481 T220 oascc.ZkStateReader$2.process A cluster state change has occurred - updating...
[junit4:junit4]   2> 15481 T234 oascc.ZkStateReader$2.process A cluster state change has occurred - updating...
[junit4:junit4]   2> 15482 T279 oascc.ZkStateReader$2.process A cluster state change has occurred - updating...
[junit4:junit4]   2> 15482 T277 oascc.ZkStateReader$2.process A cluster state change has occurred - updating...
[junit4:junit4]   2> 15482 T246 oascc.ZkStateReader$2.process A cluster state change has occurred - updating...
[junit4:junit4]   2> 15481 T258 oascc.ZkStateReader$2.process A cluster state change has occurred - updating...
[junit4:junit4]   2> 15481 T272 oascc.ZkStateReader$2.process A cluster state change has occurred - updating...
[junit4:junit4]   2> 16413 T200 oascc.ZkStateReader.updateClusterState Updating cloud state from ZooKeeper... 
[junit4:junit4]   2> 16418 T212 C28 P37007 oasu.DirectUpdateHandler2.commit start commit{flags=0,_version_=0,optimize=false,openSearcher=true,waitSearcher=true,expungeDeletes=false,softCommit=false}
[junit4:junit4]   2> 16499 T212 C28 P37007 oasc.SolrDeletionPolicy.onCommit SolrDeletionPolicy.onCommit: commits:num=2
[junit4:junit4]   2> 		commit{dir=NRTCachingDirectory(org.apache.lucene.store.NIOFSDirectory@/usr/home/hudson/hudson-slave/workspace/Lucene-Solr-Tests-4.x-java7/solr/build/solr-core/test/J1/org.apache.solr.cloud.BasicDistributedZk2Test-1348220937555/control/data/index lockFactory=org.apache.lucene.store.NativeFSLockFactory@5706f972; maxCacheMB=48.0 maxMergeSizeMB=4.0),segFN=segments_1,generation=1,filenames=[segments_1]
[junit4:junit4]   2> 		commit{dir=NRTCachingDirectory(org.apache.lucene.store.NIOFSDirectory@/usr/home/hudson/hudson-slave/workspace/Lucene-Solr-Tests-4.x-java7/solr/build/solr-core/test/J1/org.apache.solr.cloud.BasicDistributedZk2Test-1348220937555/control/data/index lockFactory=org.apache.lucene.store.NativeFSLockFactory@5706f972; maxCacheMB=48.0 maxMergeSizeMB=4.0),segFN=segments_2,generation=2,filenames=[_0.fnm, _0.frq, _0.tim, _0_nrm.cfe, segments_2, _0.fdx, _0_nrm.cfs, _0.si, _0.prx, _0.tip, _0.fdt]
[junit4:junit4]   2> 16500 T212 C28 P37007 oasc.SolrDeletionPolicy.updateCommits newest commit = 2
[junit4:junit4]   2> 16521 T212 C28 P37007 oass.SolrIndexSearcher.<init> Opening Searcher@6baa167a main
[junit4:junit4]   2> 16523 T212 C28 P37007 oasu.DirectUpdateHandler2.commit end_commit_flush
[junit4:junit4]   2> 16524 T223 oasc.SolrCore.registerSearcher [collection1] Registered new searcher Searcher@6baa167a main{StandardDirectoryReader(segments_2:3 _0(4.0.0.2):C1)}
[junit4:junit4]   2> 16525 T212 C28 P37007 /update {waitSearcher=true&wt=javabin&commit=true&softCommit=false&version=2} {commit=} 0 107
[junit4:junit4]   2> 16529 T240 C27 P37016 oasu.DirectUpdateHandler2.commit start commit{flags=0,_version_=0,optimize=false,openSearcher=true,waitSearcher=true,expungeDeletes=false,softCommit=false}
[junit4:junit4]   2> 16532 T240 C27 P37016 oass.SolrIndexSearcher.<init> Opening Searcher@2dc584da main
[junit4:junit4]   2> 16532 T240 C27 P37016 oasu.DirectUpdateHandler2.commit end_commit_flush
[junit4:junit4]   2> 16534 T247 oasc.SolrCore.registerSearcher [collection1] Registered new searcher Searcher@2dc584da main{StandardDirectoryReader(segments_1:1)}
[junit4:junit4]   2> 16535 T240 C27 P37016 oasu.SolrCmdDistributor.distribCommit Distrib commit to:[StdNode: http://127.0.0.1:37013/solr/collection1/, StdNode: http://127.0.0.1:37018/solr/collection1/, StdNode: http://127.0.0.1:37023/solr/collection1/]
[junit4:junit4]   2> 16537 T228 C25 P37013 oasu.DirectUpdateHandler2.commit start commit{flags=0,_version_=0,optimize=false,openSearcher=true,waitSearcher=true,expungeDeletes=false,softCommit=false}
[junit4:junit4]   2>  C24_STATE=coll:collection1 core:collection1 props:{shard=shard1, roles=null, state=active, core=collection1, collection=collection1, node_name=127.0.0.1:37018_solr, base_url=http://127.0.0.1:37018/solr}
[junit4:junit4]   2> 16539 T250 C24 P37018 oasu.DirectUpdateHandler2.commit start commit{flags=0,_version_=0,optimize=false,openSearcher=true,waitSearcher=true,expungeDeletes=false,softCommit=false}
[junit4:junit4]   2> 16541 T250 C24 P37018 oass.SolrIndexSearcher.<init> Opening Searcher@fc6c742 main
[junit4:junit4]   2> 16543 T250 C24 P37018 oasu.DirectUpdateHandler2.commit end_commit_flush
[junit4:junit4]   2> 16543 T228 C25 P37013 oass.SolrIndexSearcher.<init> Opening Searcher@1685c9a3 main
[junit4:junit4]   2>  C26_STATE=coll:collection1 core:collection1 props:{shard=shard2, roles=null, state=active, core=collection1, collection=collection1, node_name=127.0.0.1:37023_solr, base_url=http://127.0.0.1:37023/solr}
[junit4:junit4]   2> 16543 T264 C26 P37023 oasu.DirectUpdateHandler2.commit start commit{flags=0,_version_=0,optimize=false,openSearcher=true,waitSearcher=true,expungeDeletes=false,softCommit=false}
[junit4:junit4]   2> 16545 T228 C25 P37013 oasu.DirectUpdateHandler2.commit end_commit_flush
[junit4:junit4]   2> 16545 T259 oasc.SolrCore.registerSearcher [collection1] Registered new searcher Searcher@fc6c742 main{StandardDirectoryReader(segments_2:3:nrt _0(4.0.0.2):C1)}
[junit4:junit4]   2> 16546 T250 C24 P37018 /update {waitSearcher=true&commit=true&wt=javabin&commit_end_point=true&expungeDeletes=false&softCommit=false&version=2} {commit=} 0 7
[junit4:junit4]   2> 16546 T264 C26 P37023 oass.SolrIndexSearcher.<init> Opening Searcher@a45e697 main
[junit4:junit4]   2> 16547 T264 C26 P37023 oasu.DirectUpdateHandler2.commit end_commit_flush
[junit4:junit4]   2> 16547 T235 oasc.SolrCore.registerSearcher [collection1] Registered new searcher Searcher@1685c9a3 main{StandardDirectoryReader(segments_2:3 _0(4.0.0.2):C1)}
[junit4:junit4]   2> 16548 T228 C25 P37013 /update {waitSearcher=true&commit=true&wt=javabin&commit_end_point=true&expungeDeletes=false&softCommit=false&version=2} {commit=} 0 11
[junit4:junit4]   2> 16549 T273 oasc.SolrCore.registerSearcher [collection1] Registered new searcher Searcher@a45e697 main{StandardDirectoryReader(segments_2:2)}
[junit4:junit4]   2> 16549 T264 C26 P37023 /update {waitSearcher=true&commit=true&wt=javabin&commit_end_point=true&expungeDeletes=false&softCommit=false&version=2} {commit=} 0 6
[junit4:junit4]   2> 16550 T240 C27 P37016 /update {waitSearcher=true&wt=javabin&commit=true&softCommit=false&version=2} {commit=} 0 21
[junit4:junit4]   2> 16557 T213 C28 P37007 REQ /select {fl=id,score&shard.url=127.0.0.1:37007/solr/collection1/&NOW=1348220954103&start=0&q=*:*&distrib=false&isShard=true&wt=javabin&fsv=true&rows=10&version=2} hits=1 status=0 QTime=0 
[junit4:junit4]   2> 16569 T213 C28 P37007 REQ /select {shard.url=127.0.0.1:37007/solr/collection1/&NOW=1348220954103&q=*:*&ids=1&distrib=false&isShard=true&wt=javabin&version=2} status=0 QTime=1 
[junit4:junit4]   2> 16570 T212 C28 P37007 REQ /select {wt=javabin&q=*:*&version=2} hits=1 status=0 QTime=17 
[junit4:junit4]   2> 16572 T200 oaz.ZooKeeper.<init> Initiating client connection, connectString=127.0.0.1:37002/solr sessionTimeout=10000 watcher=org.apache.solr.common.cloud.ConnectionManager@6ae8e5dd
[junit4:junit4]   2> 16573 T287 oaz.ClientCnxn$SendThread.startConnect Opening socket connection to server /127.0.0.1:37002
[junit4:junit4]   2> 16573 T200 oascc.ConnectionManager.waitForConnected Waiting for client to connect to ZooKeeper
[junit4:junit4]   2> 16574 T287 oaz.ClientCnxn$SendThread.primeConnection Socket connection established to localhost/127.0.0.1:37002, initiating session
[junit4:junit4]   2> 16574 T202 oazs.NIOServerCnxn$Factory.run Accepted socket connection from /140.211.11.196:37042
[junit4:junit4]   2> 16575 T202 oazs.NIOServerCnxn.readConnectRequest Client attempting to establish new session at /140.211.11.196:37042
[junit4:junit4]   2> 16577 T206 oazs.NIOServerCnxn.finishSessionInit Established session 0x139e83ae6bc0009 with negotiated timeout 10000 for client /140.211.11.196:37042
[junit4:junit4]   2> 16577 T287 oaz.ClientCnxn$SendThread.readConnectResult Session establishment complete on server localhost/127.0.0.1:37002, sessionid = 0x139e83ae6bc0009, negotiated timeout = 10000
[junit4:junit4]   2> 16578 T288 oascc.ConnectionManager.process Watcher org.apache.solr.common.cloud.ConnectionManager@6ae8e5dd name:ZooKeeperConnection Watcher:127.0.0.1:37002/solr got event WatchedEvent state:SyncConnected type:None path:null path:null type:None
[junit4:junit4]   2> 16578 T200 oascc.ConnectionManager.waitForConnected Client is connected to ZooKeeper
[junit4:junit4]   2> 16580 T200 oascc.ZkStateReader.createClusterStateWatchersAndUpdate Updating cluster state from ZooKeeper... 
[junit4:junit4]   2> 16583 T207 oazs.PrepRequestProcessor.pRequest Processed session termination for sessionid: 0x139e83ae6bc0009
[junit4:junit4]   2> 16584 T288 oaz.ClientCnxn$EventThread.run EventThread shut down
[junit4:junit4]   2> 16584 T200 oaz.ZooKeeper.close Session: 0x139e83ae6bc0009 closed
[junit4:junit4]   2> 16584 T202 oazs.NIOServerCnxn.closeSock Closed socket connection for client /140.211.11.196:37042 which had sessionid 0x139e83ae6bc0009
[junit4:junit4]   2> 16590 T231 C25 P37013 REQ /select {distrib=false&wt=javabin&q=*:*&version=2} hits=1 status=0 QTime=0 
[junit4:junit4]   2> 16596 T243 C27 P37016 REQ /select {distrib=false&wt=javabin&q=*:*&version=2} hits=0 status=0 QTime=0 
[junit4:junit4]   2> 16606 T265 C26 P37023 REQ /select {fl=id,score&shard.url=127.0.0.1:37016/solr/collection1/|127.0.0.1:37023/solr/collection1/&NOW=1348220954152&start=0&q=*:*&distrib=false&isShard=true&wt=javabin&fsv=true&rows=10&version=2} hits=0 status=0 QTime=0 
[junit4:junit4]   2> 16606 T252 C24 P37018 REQ /select {fl=id,score&shard.url=127.0.0.1:37013/solr/collection1/|127.0.0.1:37018/solr/collection1/&NOW=1348220954152&start=0&q=*:*&distrib=false&isShard=true&wt=javabin&fsv=true&rows=10&version=2} hits=1 status=0 QTime=0 
[junit4:junit4]   2> 16612 T252 C24 P37018 REQ /select {shard.url=127.0.0.1:37013/solr/collection1/|127.0.0.1:37018/solr/collection1/&NOW=1348220954152&q=*:*&ids=1&distrib=false&isShard=true&wt=javabin&version=2} status=0 QTime=1 
[junit4:junit4]   2> 16614 T251 C24 P37018 REQ /select {wt=javabin&q=*:*&version=2} hits=1 status=0 QTime=11 
[junit4:junit4]   2> 16622 T212 C28 P37007 /update {wt=javabin&version=2} {add=[2 (1413712135237664768)]} 0 5
[junit4:junit4]   2> 16642 T264 C26 P37023 REQ /update {update.distrib=FROMLEADER&distrib.from=http://127.0.0.1:37016/solr/collection1/&wt=javabin&version=2} status=0 QTime=5 
[junit4:junit4]   2> 16643 T244 C27 P37016 REQ /update {distrib.from=http://127.0.0.1:37013/solr/collection1/&update.distrib=TOLEADER&wt=javabin&version=2} status=0 QTime=15 
[junit4:junit4]   2> 16644 T232 C25 P37013 /update {wt=javabin&version=2} {add=[2]} 0 18
[junit4:junit4]   2> 16652 T212 C28 P37007 /update {wt=javabin&version=2} {add=[3 (1413712135271219200)]} 0 3
[junit4:junit4]   2> 16665 T264 C26 P37023 REQ /update {distrib.from=http://127.0.0.1:37016/solr/collection1/&update.distrib=FROMLEADER&wt=javabin&version=2} status=0 QTime=5 
[junit4:junit4]   2> 16666 T240 C27 P37016 /update {wt=javabin&version=2} {add=[3 (1413712135277510656)]} 0 11
[junit4:junit4]   2> 16673 T212 C28 P37007 /update {wt=javabin&version=2} {add=[4 (1413712135293239296)]} 0 3
[junit4:junit4]   2> 16695 T250 C24 P37018 REQ /update {distrib.from=http://127.0.0.1:37013/solr/collection1/&update.distrib=FROMLEADER&wt=javabin&version=2} status=0 QTime=6 
[junit4:junit4]   2> 16697 T232 C25 P37013 /update {wt=javabin&version=2} {add=[4 (1413712135299530752)]} 0 21
[junit4:junit4]   2> 16705 T212 C28 P37007 /update {wt=javabin&version=2} {add=[5 (1413712135324696576)]} 0 5
[junit4:junit4]   2> 16721 T264 C26 P37023 REQ /update {update.distrib=FROMLEADER&distrib.from=http://127.0.0.1:37016/solr/collection1/&wt=javabin&version=2} status=0 QTime=3 
[junit4:junit4]   2> 16722 T244 C27 P37016 REQ /update {distrib.from=http://127.0.0.1:37013/solr/collection1/&update.distrib=TOLEADER&wt=javabin&version=2} status=0 QTime=11 
[junit4:junit4]   2> 16723 T232 C25 P37013 /update {wt=javabin&version=2} {add=[5]} 0 15
[junit4:junit4]   2> 16732 T212 C28 P37007 /update {wt=javabin&version=2} {add=[6 (1413712135353008128)]} 0 4
[junit4:junit4]   2> 16749 T264 C26 P37023 REQ /update {update.distrib=FROMLEADER&distrib.from=http://127.0.0.1:37016/solr/collection1/&wt=javabin&version=2} status=0 QTime=4 
[junit4:junit4]   2> 16750 T244 C27 P37016 REQ /update {distrib.from=http://127.0.0.1:37013/solr/collection1/&update.distrib=TOLEADER&wt=javabin&version=2} status=0 QTime=12 
[junit4:junit4]   2> 16751 T232 C25 P37013 /update {wt=javabin&version=2} {add=[6]} 0 16
[junit4:junit4]   2> 16758 T212 C28 P37007 /update {wt=javabin&version=2} {add=[7 (1413712135381319680)]} 0 4
[junit4:junit4]   2> 16771 T264 C26 P37023 REQ /update {distrib.from=http://127.0.0.1:37016/solr/collection1/&update.distrib=FROMLEADER&wt=javabin&version=2} status=0 QTime=5 
[junit4:junit4]   2> 16772 T240 C27 P37016 /update {wt=javabin&version=2} {add=[7 (1413712135388659712)]} 0 11
[junit4:junit4]   2> 16780 T212 C28 P37007 /update {wt=javabin&version=2} {add=[8 (1413712135403339776)]} 0 5
[junit4:junit4]   2> 16797 T250 C24 P37018 REQ /update {update.distrib=FROMLEADER&distrib.from=http://127.0.0.1:37013/solr/collection1/&wt=javabin&version=2} status=0 QTime=5 
[junit4:junit4]   2> 16798 T228 C25 P37013 REQ /update {distrib.from=http://127.0.0.1:37016/solr/collection1/&update.distrib=TOLEADER&wt=javabin&version=2} status=0 QTime=12 
[junit4:junit4]   2> 16799 T240 C27 P37016 /update {wt=javabin&version=2} {add=[8]} 0 16
[junit4:junit4]   2> 16807 T212 C28 P37007 /update {wt=javabin&version=2} {add=[9 (1413712135431651328)]} 0 5
[junit4:junit4]   2> 16821 T264 C26 P37023 REQ /update {distrib.from=http://127.0.0.1:37016/solr/collection1/&update.distrib=FROMLEADER&wt=javabin&version=2} status=0 QTime=5 
[junit4:junit4]   2> 16822 T240 C27 P37016 /update {wt=javabin&version=2} {add=[9 (1413712135440039936)]} 0 12
[junit4:junit4]   2> 16829 T212 C28 P37007 /update {wt=javabin&version=2} {add=[10 (1413712135455768576)]} 0 3
[junit4:junit4]   2> 16850 T250 C24 P37018 REQ /update {update.distrib=FROMLEADER&distrib.from=http://127.0.0.1:37013/solr/collection1/&wt=javabin&version=2} status=0 QTime=5 
[junit4:junit4]   2> 16851 T228 C25 P37013 REQ /update {distrib.from=http://127.0.0.1:37016/solr/collection1/&update.distrib=TOLEADER&wt=javabin&version=2} status=0 QTime=13 
[junit4:junit4]   2> 16852 T240 C27 P37016 /update {wt=javabin&version=2} {add=[10]} 0 17
[junit4:junit4]   2> 16872 T212 C28 P37007 /update {wt=javabin&version=2} {add=[11 (1413712135488274432)]} 0 16
[junit4:junit4]   2> 16888 T250 C24 P37018 REQ /update {distrib.from=http://127.0.0.1:37013/solr/collection1/&update.distrib=FROMLEADER&wt=javabin&version=2} status=0 QTime=4 
[junit4:junit4]   2> 16889 T232 C25 P37013 /update {wt=javabin&version=2} {add=[11 (1413712135509245952)]} 0 13
[junit4:junit4]   2> 16896 T212 C28 P37007 /update {wt=javabin&version=2} {add=[12 (1413712135526023168)]} 0 4
[junit4:junit4]   2> 16910 T250 C24 P37018 REQ /update {distrib.from=http://127.0.0.1:37013/solr/collection1/&update.distrib=FROMLEADER&wt=javabin&version=2} status=0 QTime=5 
[junit4:junit4]   2> 16911 T232 C25 P37013 /update {wt=javabin&version=2} {add=[12 (1413712135533363200)]} 0 12
[junit4:junit4]   2> 16918 T212 C28 P37007 /update {wt=javabin&version=2} {add=[13 (1413712135549091840)]} 0 4
[junit4:junit4]   2> 16934 T250 C24 P37018 REQ /update {update.distrib=FROMLEADER&distrib.from=http://127.0.0.1:37013/solr/collection1/&wt=javabin&version=2} status=0 QTime=5 
[junit4:junit4]   2> 16935 T228 C25 P37013 REQ /update {distrib.from=http://127.0.0.1:37016/solr/collection1/&update.distrib=TOLEADER&wt=javabin&version=2} status=0 QTime=11 
[junit4:junit4]   2> 16936 T240 C27 P37016 /update {wt=javabin&version=2} {add=[13]} 0 15
[junit4:junit4]   2> 16943 T212 C28 P37007 /update {wt=javabin&version=2} {add=[14 (1413712135576354816)]} 0 3
[junit4:junit4]   2> 16960 T250 C24 P37018 REQ /update {distrib.from=http://127.0.0.1:37013/solr/collection1/&update.distrib=FROMLEADER&wt=javabin&version=2} status=0 QTime=5 
[junit4:junit4]   2> 16961 T232 C25 P37013 /update {wt=javabin&version=2} {add=[14 (1413712135582646272)]} 0 15
[junit4:junit4]   2> 16967 T212 C28 P37007 /update {wt=javabin&version=2} {add=[15 (1413712135601520640)]} 0 3
[junit4:junit4]   2> 16987 T250 C24 P37018 REQ /update {update.distrib=FROMLEADER&distrib.from=http://127.0.0.1:37013/solr/collection1/&wt=javabin&version=2} status=0 QTime=4 
[junit4:junit4]   2> 16988 T228 C25 P37013 REQ /update {distrib.from=http://127.0.0.1:37016/solr/collection1/&update.distrib=TOLEADER&wt=javabin&version=2} status=0 QTime=12 
[junit4:junit4]   2> 16989 T240 C27 P37016 /update {wt=javabin&version=2} {add=[15]} 0 17
[junit4:junit4]   2> 16997 T212 C28 P37007 /update {wt=javabin&version=2} {add=[16 (1413712135631929344)]} 0 4
[junit4:junit4]   2> 17018 T250 C24 P37018 REQ /update {update.distrib=FROMLEADER&distrib.from=http://127.0.0.1:37013/solr/collection1/&wt=javabin&version=2} status=0 QTime=5 
[junit4:junit4]   2> 17020 T228 C25 P37013 REQ /update {distrib.from=http://127.0.0.1:37016/solr/collection1/&update.distrib=TOLEADER&wt=javabin&version=2} status=0 QTime=15 
[junit4:junit4]   2> 17021 T240 C27 P37016 /update {wt=javabin&version=2} {add=[16]} 0 20
[junit4:junit4]   2> 17037 T212 C28 P37007 /update {wt=javabin&version=2} {add=[17 (1413712135667580928)]} 0 12
[junit4:junit4]   2> 17066 T264 C26 P37023 REQ /update {distrib.from=http://127.0.0.1:37016/solr/collection1/&update.distrib=FROMLEADER&wt=javabin&version=2} status=0 QTime=12 
[junit4:junit4]   2> 17067 T240 C27 P37016 /update {wt=javabin&version=2} {add=[17 (1413712135684358144)]} 0 25
[junit4:junit4]   2> 17075 T212 C28 P37007 /update {wt=javabin&version=2} {add=[100 (1413712135713718272)]} 0 4
[junit4:junit4]   2> 17121 T250 C24 P37018 REQ /update {update.distrib=FROMLEADER&distrib.from=http://127.0.0.1:37013/solr/collection1/&wt=javabin&version=2} status=0 QTime=22 
[junit4:junit4]   2> 17122 T228 C25 P37013 REQ /update {distrib.from=http://127.0.0.1:37016/solr/collection1/&update.distrib=TOLEADER&wt=javabin&version=2} status=0 QTime=41 
[junit4:junit4]   2> 17123 T240 C27 P37016 /update {wt=javabin&version=2} {add=[100]} 0 45
[junit4:junit4]   2> 17128 T212 C28 P37007 /update {wt=javabin&version=2} {add=[101 (1413712135771389952)]} 0 2
[junit4:junit4]   2> 17146 T250 C24 P37018 REQ /update {update.distrib=FROMLEADER&distrib.from=http://127.0.0.1:37013/solr/collection1/&wt=javabin&version=2} status=0 QTime=5 
[junit4:junit4]   2> 17147 T228 C25 P37013 REQ /update {distrib.from=http://127.0.0.1:37016/solr/collection1/&update.distrib=TOLEADER&wt=javabin&version=2} status=0 QTime=13 
[junit4:junit4]   2> 17148 T240 C27 P37016 /update {wt=javabin&version=2} {add=[101]} 0 17
[junit4:junit4]   2> 17156 T212 C28 P37007 /update {wt=javabin&version=2} {add=[102 (1413712135797604352)]} 0 5
[junit4:junit4]   2> 17169 T250 C24 P37018 REQ /update {distrib.from=http://127.0.0.1:37013/solr/collection1/&update.distrib=FROMLEADER&wt=javabin&version=2} status=0 QTime=3 
[junit4:junit4]   2> 17170 T232 C25 P37013 /update {wt=javabin&version=2} {add=[102 (1413712135805992960)]} 0 10
[junit4:junit4]   2> 17210 T212 C28 P37007 /update {wt=javabin&version=2} {add=[103 (1413712135821721600)]} 0 35
[junit4:junit4]   2> 17226 T264 C26 P37023 REQ /update {update.distrib=FROMLEADER&distrib.from=http://127.0.0.1:37016/solr/collection1/&wt=javabin&version=2} status=0 QTime=3 
[junit4:junit4]   2> 17227 T244 C27 P37016 REQ /update {distrib.from=http://127.0.0.1:37013/solr/collection1/&update.distrib=TOLEADER&wt=javabin&version=2} status=0 QTime=10 
[junit4:junit4]   2> 17228 T232 C25 P37013 /update {wt=javabin&version=2} {add=[103]} 0 14
[junit4:junit4]   2> 17239 T212 C28 P37007 /update {wt=javabin&version=2} {add=[104 (1413712135881490432)]} 0 7
[junit4:junit4]   2> 17252 T264 C26 P37023 REQ /update {distrib.from=http://127.0.0.1:37016/solr/collection1/&update.distrib=FROMLEADER&wt=javabin&version=2} status=0 QTime=3 
[junit4:junit4]   2> 17253 T240 C27 P37016 /update {wt=javabin&version=2} {add=[104 (1413712135894073344)]} 0 10
[junit4:junit4]   2> 17260 T212 C28 P37007 /update {wt=javabin&version=2} {add=[105 (1413712135907704832)]} 0 3
[junit4:junit4]   2> 17303 T264 C26 P37023 REQ /update {distrib.from=http://127.0.0.1:37016/solr/collection1/&update.distrib=FROMLEADER&wt=javabin&version=2} status=0 QTime=16 
[junit4:junit4]   2> 17304 T240 C27 P37016 /update {wt=javabin&version=2} {add=[105 (1413712135916093440)]} 0 39
[junit4:junit4]   2> 17313 T212 C28 P37007 /update {wt=javabin&version=2} {add=[106 (1413712135962230784)]} 0 4
[junit4:junit4]   2> 17336 T264 C26 P37023 REQ /update {update.distrib=FROMLEADER&distrib.from=http://127.0.0.1:37016/solr/collection1/&wt=javabin&version=2} status=0 QTime=5 
[junit4:junit4]   2> 17337 T244 C27 P37016 REQ /update {distrib.from=http://127.0.0.1:37013/solr/collection1/&update.distrib=TOLEADER&wt=javabin&version=2} status=0 QTime=16 
[junit4:junit4]   2> 17339 T232 C25 P37013 /update {wt=javabin&version=2} {add=[106]} 0 22
[junit4:junit4]   2> 17347 T212 C28 P37007 /update {wt=javabin&version=2} {add=[107 (1413712135998930944)]} 0 4
[junit4:junit4]   2> 17365 T250 C24 P37018 REQ /update {update.distrib=FROMLEADER&distrib.from=http://127.0.0.1:37013/solr/collection1/&wt=javabin&version=2} status=0 QTime=5 
[junit4:junit4]   2> 17366 T228 C25 P37013 REQ /update {distrib.from=http://127.0.0.1:37016/solr/collection1/&update.distrib=TOLEADER&wt=javabin&version=2} status=0 QTime=12 
[junit4:junit4]   2> 17367 T240 C27 P37016 /update {wt=javabin&version=2} {add=[107]} 0 16
[junit4:junit4]   2> 17375 T212 C28 P37007 /update {wt=javabin&version=2} {add=[108 (1413712136028291072)]} 0 5
[junit4:junit4]   2> 17407 T250 C24 P37018 REQ /update {update.distrib=FROMLEADER&distrib.from=http://127.0.0.1:37013/solr/collection1/&wt=javabin&version=2} status=0 QTime=2 
[junit4:junit4]   2> 17408 T228 C25 P37013 REQ /update {distrib.from=http://127.0.0.1:37016/solr/collection1/&update.distrib=TOLEADER&wt=javabin&version=2} status=0 QTime=26 
[junit4:junit4]   2> 17409 T240 C27 P37016 /update {wt=javabin&version=2} {add=[108]} 0 30
[junit4:junit4]   2> 17418 T212 C28 P37007 /update {wt=javabin&version=2} {add=[109 (1413712136072331264)]} 0 5
[junit4:junit4]   2> 17434 T250 C24 P37018 REQ /update {update.distrib=FROMLEADER&distrib.from=http://127.0.0.1:37013/solr/collection1/&wt=javabin&version=2} status=0 QTime=3 
[junit4:junit4]   2> 17435 T228 C25 P37013 REQ /update {distrib.from=http://127.0.0.1:37016/solr/collection1/&update.distrib=TOLEADER&wt=javabin&version=2} status=0 QTime=10 
[junit4:junit4]   2> 17435 T240 C27 P37016 /update {wt=javabin&version=2} {add=[109]} 0 13
[junit4:junit4]   2> 17444 T212 C28 P37007 /update {wt=javabin&version=2} {add=[110 (1413712136099594240)]} 0 4
[junit4:junit4]   2> 17457 T250 C24 P37018 REQ /update {update.distrib=FROMLEADER&distrib.from=http://127.0.0.1:37013/solr/collection1/&wt=javabin&version=2} status=0 QTime=2 
[junit4:junit4]   2> 17458 T228 C25 P37013 REQ /update {distrib.from=http://127.0.0.1:37016/solr/collection1/&update.distrib=TOLEADER&wt=javabin&version=2} status=0 QTime=8 
[junit4:junit4]   2> 17459 T240 C27 P37016 /update {wt=javabin&version=2} {add=[110]} 0 12
[junit4:junit4]   2> 17467 T212 C28 P37007 /update {wt=javabin&version=2} {add=[111 (1413712136124760064)]} 0 4
[junit4:junit4]   2> 17480 T250 C24 P37018 REQ /update {distrib.from=http://127.0.0.1:37013/solr/collection1/&update.distrib=FROMLEADER&wt=javabin&version=2} status=0 QTime=2 
[junit4:junit4]   2> 17481 T232 C25 P37013 /update {wt=javabin&version=2} {add=[111 (1413712136133148672)]} 0 10
[junit4:junit4]   2> 17490 T212 C28 P37007 /update {wt=javabin&version=2} {add=[112 (1413712136147828736)]} 0 5
[junit4:junit4]   2> 17502 T264 C26 P37023 REQ /update {distrib.from=http://127.0.0.1:37016/solr/collection1/&update.distrib=FROMLEADER&wt=javabin&version=2} status=0 QTime=3 
[junit4:junit4]   2> 17503 T240 C27 P37016 /update {wt=javabin&version=2} {add=[112 (1413712136156217344)]} 0 10
[junit4:junit4]   2> 17530 T212 C28 P37007 /update {wt=javabin&version=2} {add=[113 (1413712136171945984)]} 0 21
[junit4:junit4]   2> 17544 T250 C24 P37018 REQ /update {distrib.from=http://127.0.0.1:37013/solr/collection1/&update.distrib=FROMLEADER&wt=javabin&version=2} status=0 QTime=4 
[junit4:junit4]   2> 17545 T232 C25 P37013 /update {wt=javabin&version=2} {add=[113 (1413712136198160384)]} 0 12
[junit4:junit4]   2> 17557 T212 C28 P37007 /update {wt=javabin&version=2} {add=[114 (1413712136215986176)]} 0 7
[junit4:junit4]   2> 17571 T250 C24 P37018 REQ /update {distrib.from=http://127.0.0.1:37013/solr/collection1/&update.distrib=FROMLEADER&wt=javabin&version=2} status=0 QTime=3 
[junit4:junit4]   2> 17572 T232 C25 P37013 /update {wt=javabin&version=2} {add=[114 (1413712136227520512)]} 0 11
[junit4:junit4]   2> 17582 T212 C28 P37007 /update {wt=javabin&version=2} {add=[115 (1413712136244297728)]} 0 4
[junit4:junit4]   2> 17596 T264 C26 P37023 REQ /update {update.distrib=FROMLEADER&distrib.from=http://127.0.0.1:37016/solr/collection1/&wt=javabin&version=2} status=0 QTime=2 
[junit4:junit4]   2> 17598 T244 C27 P37016 REQ /update {distrib.from=http://127.0.0.1:37013/solr/collection1/&update.distrib=TOLEADER&wt=javabin&version=2} status=0 QTime=9 
[junit4:junit4]   2> 17598 T232 C25 P37013 /update {wt=javabin&version=2} {add=[115]} 0 13
[junit4:junit4]   2> 17607 T212 C28 P37007 /update {wt=javabin&version=2} {add=[116 (1413712136270512128)]} 0 5
[junit4:junit4]   2> 17619 T264 C26 P37023 REQ /update {distrib.from=http://127.0.0.1:37016/solr/collection1/&update.distrib=FROMLEADER&wt=javabin&version=2} status=0 QTime=3 
[junit4:junit4]   2> 17620 T240 C27 P37016 /update {wt=javabin&version=2} {add=[116 (1413712136278900736)]} 0 10
[junit4:junit4]   2> 17626 T212 C28 P37007 /update {wt=javabin&version=2} {add=[117 (1413712136292532224)]} 0 2
[junit4:junit4]   2> 17639 T264 C26 P37023 REQ /update {update.distrib=FROMLEADER&distrib.from=http://127.0.0.1:37016/solr/collection1/&wt=javabin&version=2} status=0 QTime=2 
[junit4:junit4]   2> 17640 T244 C27 P37016 REQ /update {distrib.from=http://127.0.0.1:37013/solr/collection1/&update.distrib=TOLEADER&wt=javabin&version=2} status=0 QTime=7 
[junit4:junit4]   2> 17641 T232 C25 P37013 /update {wt=javabin&version=2} {add=[117]} 0 11
[junit4:junit4]   2> 17648 T212 C28 P37007 /update {wt=javabin&version=2} {add=[118 (1413712136314552320)]} 0 4
[junit4:junit4]   2> 17675 T250 C24 P37018 REQ /update {distrib.from=http://127.0.0.1:37013/solr/collection1/&update.distrib=FROMLEADER&wt=javabin&version=2} status=0 QTime=9 
[junit4:junit4]   2> 17676 T232 C25 P37013 /update {wt=javabin&version=2} {add=[118 (1413712136321892352)]} 0 25
[junit4:junit4]   2> 17682 T212 C28 P37007 /update {wt=javabin&version=2} {add=[119 (1413712136351252480)]} 0 3
[junit4:junit4]   2> 17694 T264 C26 P37023 REQ /update {update.distrib=FROMLEADER&distrib.from=http://127.0.0.1:37016/solr/collection1/&wt=javabin&version=2} status=0 QTime=2 
[junit4:junit4]   2> 17695 T244 C27 P37016 REQ /update {distrib.from=http://127.0.0.1:37013/solr/collection1/&update.distrib=TOLEADER&wt=javabin&version=2} status=0 QTime=7 
[junit4:junit4]   2> 17695 T232 C25 P37013 /update {wt=javabin&version=2} {add=[119]} 0 10
[junit4:junit4]   2> 17701 T212 C28 P37007 /update {wt=javabin&version=2} {add=[120 (1413712136371175424)]} 0 3
[junit4:junit4]   2> 17713 T264 C26 P37023 REQ /update {update.distrib=FROMLEADER&distrib.from=http://127.0.0.1:37016/solr/collection1/&wt=javabin&version=2} status=0 QTime=2 
[junit4:junit4]   2> 17714 T244 C27 P37016 REQ /update {distrib.from=http://127.0.0.1:37013/solr/collection1/&update.distrib=TOLEADER&wt=javabin&version=2} status=0 QTime=7 
[junit4:junit4]   2> 17714 T232 C25 P37013 /update {wt=javabin&version=2} {add=[120]} 0 10
[junit4:junit4]   2> 17722 T212 C28 P37007 /update {wt=javabin&version=2} {add=[121 (1413712136392146944)]} 0 3
[junit4:junit4]   2> 17734 T264 C26 P37023 REQ /update {update.distrib=FROMLEADER&distrib.from=http://127.0.0.1:37016/solr/collection1/&wt=javabin&version=2} status=0 QTime=2 
[junit4:junit4]   2> 17735 T244 C27 P37016 REQ /update {distrib.from=http://127.0.0.1:37013/solr/collection1/&update.distrib=TOLEADER&wt=javabin&version=2} status=0 QTime=7 
[junit4:junit4]   2> 17737 T232 C25 P37013 /update {wt=javabin&version=2} {add=[121]} 0 12
[junit4:junit4]   2> 17744 T212 C28 P37007 /update {wt=javabin&version=2} {add=[122 (1413712136416264192)]} 0 3
[junit4:junit4]   2> 17760 T250 C24 P37018 REQ /update {distrib.from=http://127.0.0.1:37013/solr/collection1/&update.distrib=FROMLEADER&wt=javabin&version=2} status=0 QTime=5 
[junit4:junit4]   2> 17761 T232 C25 P37013 /update {wt=javabin&version=2} {add=[122 (1413712136423604224)]} 0 13
[junit4:junit4]   2> 17777 T212 C28 P37007 /update {wt=javabin&version=2} {add=[123 (1413712136440381440)]} 0 13
[junit4:junit4]   2> 17788 T250 C24 P37018 REQ /update {distrib.from=http://127.0.0.1:37013/solr/collection1/&update.distrib=FROMLEADER&wt=javabin&version=2} status=0 QTime=2 
[junit4:junit4]   2> 17790 T232 C25 P37013 /update {wt=javabin&version=2} {add=[123 (1413712136458207232)]} 0 9
[junit4:junit4]   2> 17798 T212 C28 P37007 /update {wt=javabin&version=2} {add=[124 (1413712136470790144)]} 0 5
[junit4:junit4]   2> 17812 T250 C24 P37018 REQ /update {update.distrib=FROMLEADER&distrib.from=http://127.0.0.1:37013/solr/collection1/&wt=javabin&version=2} status=0 QTime=2 
[junit4:junit4]   2> 17812 T228 C25 P37013 REQ /update {distrib.from=http://127.0.0.1:37016/solr/collection1/&update.distrib=TOLEADER&wt=javabin&version=2} status=0 QTime=8 
[junit4:junit4]   2> 17813 T240 C27 P37016 /update {wt=javabin&version=2} {add=[124]} 0 12
[junit4:junit4]   2> 17824 T212 C28 P37007 /update {wt=javabin&version=2} {add=[125 (1413712136501198848)]} 0 2
[junit4:junit4]   2> 17836 T250 C24 P37018 REQ /update {update.distrib=FROMLEADER&distrib.from=http://127.0.0.1:37013/solr/collection1/&wt=javabin&version=2} status=0 QTime=2 
[junit4:junit4]   2> 17837 T228 C25 P37013 REQ /update {distrib.from=http://127.0.0.1:37016/solr/collection1/&update.distrib=TOLEADER&wt=javabin&version=2} status=0 QTime=7 
[junit4:junit4]   2> 17838 T240 C27 P37016 /update {wt=javabin&version=2} {add=[125]} 0 11
[junit4:junit4]   2> 17843 T212 C28 P37007 /update {wt=javabin&version=2} {add=[126 (1413712136521121792)]} 0 2
[junit4:junit4]   2> 17856 T264 C26 P37023 REQ /update {update.distrib=FROMLEADER&distrib.from=http://127.0.0.1:37016/solr/collection1/&wt=javabin&version=2} status=0 QTime=2 
[junit4:junit4]   2> 17857 T244 C27 P37016 REQ /update {distrib.from=http://127.0.0.1:37013/solr/collection1/&update.distrib=TOLEADER&wt=javabin&version=2} status=0 QTime=8 
[junit4:junit4]   2> 17858 T232 C25 P37013 /update {wt=javabin&version=2} {add=[126]} 0 12
[junit4:junit4]   2> 17863 T212 C28 P37007 /update {wt=javabin&version=2} {add=[127 (1413712136542093312)]} 0 2
[junit4:junit4]   2> 17891 T264 C26 P37023 REQ /update {update.distrib=FROMLEADER&distrib.from=http://127.0.0.1:37016/solr/collection1/&wt=javabin&version=2} status=0 QTime=8 
[junit4:junit4]   2> 17892 T244 C27 P37016 REQ /update {distrib.from=http://127.0.0.1:37013/solr/collection1/&updat

[...truncated too long message...]

n(AbstractPooledConnAdapter.java:121)
[junit4:junit4]   2> 	at org.apache.http.impl.client.DefaultRequestDirector.tryConnect(DefaultRequestDirector.java:575)
[junit4:junit4]   2> 	at org.apache.http.impl.client.DefaultRequestDirector.execute(DefaultRequestDirector.java:425)
[junit4:junit4]   2> 	at org.apache.http.impl.client.AbstractHttpClient.execute(AbstractHttpClient.java:820)
[junit4:junit4]   2> 	at org.apache.http.impl.client.AbstractHttpClient.execute(AbstractHttpClient.java:754)
[junit4:junit4]   2> 	at org.apache.http.impl.client.AbstractHttpClient.execute(AbstractHttpClient.java:732)
[junit4:junit4]   2> 	at org.apache.solr.client.solrj.impl.HttpSolrServer.request(HttpSolrServer.java:353)
[junit4:junit4]   2> 	... 11 more
[junit4:junit4]   2> 
[junit4:junit4]   2> 311448 T272 oasu.PeerSync.sync PeerSync: core=collection1 url=http://127.0.0.1:37023/solr DONE. sync failed
[junit4:junit4]   2> 311449 T272 oasc.SolrException.log SEVERE Sync Failed
[junit4:junit4]   2> 311449 T272 oasc.ShardLeaderElectionContext.rejoinLeaderElection Not rejoining election because CoreContainer is shutdown
[junit4:junit4]   2> 311449 T272 oasc.SolrCore.close [collection1]  CLOSING SolrCore org.apache.solr.core.SolrCore@31410e0d
[junit4:junit4]   2> 311453 T272 oasc.JmxMonitoredMap$SolrDynamicMBean.getMBeanInfo WARNING Could not getStatistics on info bean Lazy[solr.ReplicationHandler] java.lang.IllegalArgumentException: /usr/home/hudson/hudson-slave/workspace/Lucene-Solr-Tests-4.x-java7/solr/build/solr-core/test/J1/org.apache.solr.cloud.BasicDistributedZk2Test-1348220937555/jetty4/index does not exist
[junit4:junit4]   2> 	at org.apache.commons.io.FileUtils.sizeOfDirectory(FileUtils.java:2074)
[junit4:junit4]   2> 	at org.apache.solr.handler.ReplicationHandler.getIndexSize(ReplicationHandler.java:477)
[junit4:junit4]   2> 	at org.apache.solr.handler.ReplicationHandler.getStatistics(ReplicationHandler.java:525)
[junit4:junit4]   2> 	at org.apache.solr.core.RequestHandlers$LazyRequestHandlerWrapper.getStatistics(RequestHandlers.java:310)
[junit4:junit4]   2> 	at org.apache.solr.core.JmxMonitoredMap$SolrDynamicMBean.getMBeanInfo(JmxMonitoredMap.java:231)
[junit4:junit4]   2> 	at com.sun.jmx.interceptor.DefaultMBeanServerInterceptor.getClassName(DefaultMBeanServerInterceptor.java:1804)
[junit4:junit4]   2> 	at com.sun.jmx.interceptor.DefaultMBeanServerInterceptor.safeGetClassName(DefaultMBeanServerInterceptor.java:1595)
[junit4:junit4]   2> 	at com.sun.jmx.interceptor.DefaultMBeanServerInterceptor.checkMBeanPermission(DefaultMBeanServerInterceptor.java:1813)
[junit4:junit4]   2> 	at com.sun.jmx.interceptor.DefaultMBeanServerInterceptor.getAttribute(DefaultMBeanServerInterceptor.java:644)
[junit4:junit4]   2> 	at com.sun.jmx.mbeanserver.JmxMBeanServer.getAttribute(JmxMBeanServer.java:668)
[junit4:junit4]   2> 	at org.apache.solr.core.JmxMonitoredMap.unregister(JmxMonitoredMap.java:174)
[junit4:junit4]   2> 	at org.apache.solr.core.JmxMonitoredMap.clear(JmxMonitoredMap.java:116)
[junit4:junit4]   2> 	at org.apache.solr.core.SolrCore.close(SolrCore.java:864)
[junit4:junit4]   2> 	at org.apache.solr.cloud.ShardLeaderElectionContext.runLeaderProcess(ElectionContext.java:213)
[junit4:junit4]   2> 	at org.apache.solr.cloud.LeaderElector.runIamLeaderProcess(LeaderElector.java:158)
[junit4:junit4]   2> 	at org.apache.solr.cloud.LeaderElector.checkIfIamLeader(LeaderElector.java:102)
[junit4:junit4]   2> 	at org.apache.solr.cloud.LeaderElector.access$000(LeaderElector.java:56)
[junit4:junit4]   2> 	at org.apache.solr.cloud.LeaderElector$1.process(LeaderElector.java:131)
[junit4:junit4]   2> 	at org.apache.zookeeper.ClientCnxn$EventThread.processEvent(ClientCnxn.java:526)
[junit4:junit4]   2> 	at org.apache.zookeeper.ClientCnxn$EventThread.run(ClientCnxn.java:502)
[junit4:junit4]   2> 
[junit4:junit4]   2> 311454 T272 oasc.JmxMonitoredMap$SolrDynamicMBean.getMBeanInfo WARNING Could not getStatistics on info bean Lazy[solr.ReplicationHandler] java.lang.IllegalArgumentException: /usr/home/hudson/hudson-slave/workspace/Lucene-Solr-Tests-4.x-java7/solr/build/solr-core/test/J1/org.apache.solr.cloud.BasicDistributedZk2Test-1348220937555/jetty4/index does not exist
[junit4:junit4]   2> 	at org.apache.commons.io.FileUtils.sizeOfDirectory(FileUtils.java:2074)
[junit4:junit4]   2> 	at org.apache.solr.handler.ReplicationHandler.getIndexSize(ReplicationHandler.java:477)
[junit4:junit4]   2> 	at org.apache.solr.handler.ReplicationHandler.getStatistics(ReplicationHandler.java:525)
[junit4:junit4]   2> 	at org.apache.solr.core.RequestHandlers$LazyRequestHandlerWrapper.getStatistics(RequestHandlers.java:310)
[junit4:junit4]   2> 	at org.apache.solr.core.JmxMonitoredMap$SolrDynamicMBean.getMBeanInfo(JmxMonitoredMap.java:231)
[junit4:junit4]   2> 	at com.sun.jmx.interceptor.DefaultMBeanServerInterceptor.getClassName(DefaultMBeanServerInterceptor.java:1804)
[junit4:junit4]   2> 	at com.sun.jmx.interceptor.DefaultMBeanServerInterceptor.safeGetClassName(DefaultMBeanServerInterceptor.java:1595)
[junit4:junit4]   2> 	at com.sun.jmx.interceptor.DefaultMBeanServerInterceptor.checkMBeanPermission(DefaultMBeanServerInterceptor.java:1813)
[junit4:junit4]   2> 	at com.sun.jmx.interceptor.DefaultMBeanServerInterceptor.exclusiveUnregisterMBean(DefaultMBeanServerInterceptor.java:430)
[junit4:junit4]   2> 	at com.sun.jmx.interceptor.DefaultMBeanServerInterceptor.unregisterMBean(DefaultMBeanServerInterceptor.java:415)
[junit4:junit4]   2> 	at com.sun.jmx.mbeanserver.JmxMBeanServer.unregisterMBean(JmxMBeanServer.java:536)
[junit4:junit4]   2> 	at org.apache.solr.core.JmxMonitoredMap.unregister(JmxMonitoredMap.java:175)
[junit4:junit4]   2> 	at org.apache.solr.core.JmxMonitoredMap.clear(JmxMonitoredMap.java:116)
[junit4:junit4]   2> 	at org.apache.solr.core.SolrCore.close(SolrCore.java:864)
[junit4:junit4]   2> 	at org.apache.solr.cloud.ShardLeaderElectionContext.runLeaderProcess(ElectionContext.java:213)
[junit4:junit4]   2> 	at org.apache.solr.cloud.LeaderElector.runIamLeaderProcess(LeaderElector.java:158)
[junit4:junit4]   2> 	at org.apache.solr.cloud.LeaderElector.checkIfIamLeader(LeaderElector.java:102)
[junit4:junit4]   2> 	at org.apache.solr.cloud.LeaderElector.access$000(LeaderElector.java:56)
[junit4:junit4]   2> 	at org.apache.solr.cloud.LeaderElector$1.process(LeaderElector.java:131)
[junit4:junit4]   2> 	at org.apache.zookeeper.ClientCnxn$EventThread.processEvent(ClientCnxn.java:526)
[junit4:junit4]   2> 	at org.apache.zookeeper.ClientCnxn$EventThread.run(ClientCnxn.java:502)
[junit4:junit4]   2> 
[junit4:junit4]   2> 311458 T272 oasc.SolrCore.closeSearcher [collection1] Closing main searcher on request.
[junit4:junit4]   2> 311460 T272 oasu.DirectUpdateHandler2.close closing DirectUpdateHandler2{commits=5,autocommits=0,soft autocommits=0,optimizes=0,rollbacks=0,expungeDeletes=0,docsPending=0,adds=0,deletesById=0,deletesByQuery=0,errors=0,cumulative_adds=35,cumulative_deletesById=0,cumulative_deletesByQuery=0,cumulative_errors=0}
[junit4:junit4]   2> 311460 T272 oasu.DefaultSolrCoreState.decref SolrCoreState ref count has reached 0 - closing IndexWriter
[junit4:junit4]   2> 311462 T272 oasu.DefaultSolrCoreState.decref Closing SolrCoreState - canceling any ongoing recovery
[junit4:junit4]   2> 311462 T272 oascc.ZkStateReader$3.process Updating live nodes
[junit4:junit4]   2> 311462 T272 oascc.ZkStateReader$3.process WARNING ZooKeeper watch triggered, but Solr cannot talk to ZK
[junit4:junit4]   2> 311462 T272 oascc.ZkStateReader$2.process A cluster state change has occurred - updating...
[junit4:junit4]   2> 311463 T272 oascc.ZkStateReader$2.process WARNING ZooKeeper watch triggered, but Solr cannot talk to ZK
[junit4:junit4]   2> 311463 T272 oascc.ConnectionManager.process Watcher org.apache.solr.common.cloud.ConnectionManager@3f157686 name:ZooKeeperConnection Watcher:127.0.0.1:37002/solr got event WatchedEvent state:Disconnected type:None path:null path:null type:None
[junit4:junit4]   2> 311463 T272 oascc.ConnectionManager.process Client->ZooKeeper status change trigger but we are already closed
[junit4:junit4]   2> 311463 T272 oaz.ClientCnxn$EventThread.run EventThread shut down
[junit4:junit4]   2> NOTE: test params are: codec=Appending, sim=DefaultSimilarity, locale=fr, timezone=America/Chihuahua
[junit4:junit4]   2> NOTE: FreeBSD 9.0-RELEASE amd64/Oracle Corporation 1.7.0_06 (64-bit)/cpus=16,threads=2,free=59371072,total=139460608
[junit4:junit4]   2> NOTE: All tests run in this JVM: [TermVectorComponentTest, DOMUtilTest, TestSort, TestBinaryField, RAMDirectoryFactoryTest, TestDocSet, SuggesterTSTTest, EchoParamsTest, TestSolrCoreProperties, TermVectorComponentDistributedTest, TestSolrXMLSerializer, TestSurroundQueryParser, TestPropInjectDefaults, StandardRequestHandlerTest, StatsComponentTest, TestDFRSimilarityFactory, TimeZoneUtilsTest, URLClassifyProcessorTest, TestMergePolicyConfig, BasicDistributedZk2Test]
[junit4:junit4] Completed on J1 in 312.20s, 1 test, 1 failure <<< FAILURES!

[...truncated 478 lines...]
BUILD FAILED
/usr/home/hudson/hudson-slave/workspace/Lucene-Solr-Tests-4.x-java7/build.xml:32: The following error occurred while executing this line:
/usr/home/hudson/hudson-slave/workspace/Lucene-Solr-Tests-4.x-java7/solr/build.xml:179: The following error occurred while executing this line:
/usr/home/hudson/hudson-slave/workspace/Lucene-Solr-Tests-4.x-java7/lucene/module-build.xml:63: The following error occurred while executing this line:
/usr/home/hudson/hudson-slave/workspace/Lucene-Solr-Tests-4.x-java7/lucene/common-build.xml:1140: The following error occurred while executing this line:
/usr/home/hudson/hudson-slave/workspace/Lucene-Solr-Tests-4.x-java7/lucene/common-build.xml:813: There were test failures: 231 suites, 954 tests, 1 failure, 7 ignored (2 assumptions)

Total time: 34 minutes 20 seconds
Build step 'Invoke Ant' marked build as failure
Recording test results
Email was triggered for: Failure
Sending email for trigger: Failure



Mime
View raw message