lucene-dev mailing list archives

Site index · List index
Message view « Date » · « Thread »
Top « Date » · « Thread »
From Apache Jenkins Server <jenk...@builds.apache.org>
Subject [JENKINS] Lucene-Solr-Tests-4.x-java7 - Build # 489 - Still Failing
Date Sun, 23 Sep 2012 13:07:19 GMT
Build: https://builds.apache.org/job/Lucene-Solr-Tests-4.x-java7/489/

3 tests failed.
REGRESSION:  org.apache.solr.cloud.BasicDistributedZkTest.testDistribSearch

Error Message:
some core start times did not change on reload

Stack Trace:
java.lang.AssertionError: some core start times did not change on reload
	at __randomizedtesting.SeedInfo.seed([C715ED6BCA4C3EAA:46F36373BD135E96]:0)
	at org.junit.Assert.fail(Assert.java:93)
	at org.junit.Assert.assertTrue(Assert.java:43)
	at org.apache.solr.cloud.BasicDistributedZkTest.testCollectionsAPI(BasicDistributedZkTest.java:442)
	at org.apache.solr.cloud.BasicDistributedZkTest.doTest(BasicDistributedZkTest.java:331)
	at org.apache.solr.BaseDistributedSearchTestCase.testDistribSearch(BaseDistributedSearchTestCase.java:695)
	at sun.reflect.NativeMethodAccessorImpl.invoke0(Native Method)
	at sun.reflect.NativeMethodAccessorImpl.invoke(NativeMethodAccessorImpl.java:57)
	at sun.reflect.DelegatingMethodAccessorImpl.invoke(DelegatingMethodAccessorImpl.java:43)
	at java.lang.reflect.Method.invoke(Method.java:601)
	at com.carrotsearch.randomizedtesting.RandomizedRunner.invoke(RandomizedRunner.java:1559)
	at com.carrotsearch.randomizedtesting.RandomizedRunner.access$600(RandomizedRunner.java:79)
	at com.carrotsearch.randomizedtesting.RandomizedRunner$6.evaluate(RandomizedRunner.java:737)
	at com.carrotsearch.randomizedtesting.RandomizedRunner$7.evaluate(RandomizedRunner.java:773)
	at com.carrotsearch.randomizedtesting.RandomizedRunner$8.evaluate(RandomizedRunner.java:787)
	at com.carrotsearch.randomizedtesting.rules.SystemPropertiesRestoreRule$1.evaluate(SystemPropertiesRestoreRule.java:53)
	at org.apache.lucene.util.TestRuleSetupTeardownChained$1.evaluate(TestRuleSetupTeardownChained.java:50)
	at org.apache.lucene.util.TestRuleFieldCacheSanity$1.evaluate(TestRuleFieldCacheSanity.java:51)
	at org.apache.lucene.util.AbstractBeforeAfterRule$1.evaluate(AbstractBeforeAfterRule.java:45)
	at com.carrotsearch.randomizedtesting.rules.SystemPropertiesInvariantRule$1.evaluate(SystemPropertiesInvariantRule.java:55)
	at org.apache.lucene.util.TestRuleThreadAndTestName$1.evaluate(TestRuleThreadAndTestName.java:48)
	at org.apache.lucene.util.TestRuleIgnoreAfterMaxFailures$1.evaluate(TestRuleIgnoreAfterMaxFailures.java:70)
	at org.apache.lucene.util.TestRuleMarkFailure$1.evaluate(TestRuleMarkFailure.java:48)
	at com.carrotsearch.randomizedtesting.rules.StatementAdapter.evaluate(StatementAdapter.java:36)
	at com.carrotsearch.randomizedtesting.ThreadLeakControl$StatementRunner.run(ThreadLeakControl.java:358)
	at com.carrotsearch.randomizedtesting.ThreadLeakControl.forkTimeoutingTask(ThreadLeakControl.java:782)
	at com.carrotsearch.randomizedtesting.ThreadLeakControl$3.evaluate(ThreadLeakControl.java:442)
	at com.carrotsearch.randomizedtesting.RandomizedRunner.runSingleTest(RandomizedRunner.java:746)
	at com.carrotsearch.randomizedtesting.RandomizedRunner$3.evaluate(RandomizedRunner.java:648)
	at com.carrotsearch.randomizedtesting.RandomizedRunner$4.evaluate(RandomizedRunner.java:682)
	at com.carrotsearch.randomizedtesting.RandomizedRunner$5.evaluate(RandomizedRunner.java:693)
	at com.carrotsearch.randomizedtesting.rules.StatementAdapter.evaluate(StatementAdapter.java:36)
	at com.carrotsearch.randomizedtesting.rules.SystemPropertiesRestoreRule$1.evaluate(SystemPropertiesRestoreRule.java:53)
	at org.apache.lucene.util.AbstractBeforeAfterRule$1.evaluate(AbstractBeforeAfterRule.java:45)
	at org.apache.lucene.util.TestRuleStoreClassName$1.evaluate(TestRuleStoreClassName.java:42)
	at com.carrotsearch.randomizedtesting.rules.SystemPropertiesInvariantRule$1.evaluate(SystemPropertiesInvariantRule.java:55)
	at com.carrotsearch.randomizedtesting.rules.NoShadowingOrOverridesOnMethodsRule$1.evaluate(NoShadowingOrOverridesOnMethodsRule.java:39)
	at com.carrotsearch.randomizedtesting.rules.NoShadowingOrOverridesOnMethodsRule$1.evaluate(NoShadowingOrOverridesOnMethodsRule.java:39)
	at com.carrotsearch.randomizedtesting.rules.StatementAdapter.evaluate(StatementAdapter.java:36)
	at org.apache.lucene.util.TestRuleAssertionsRequired$1.evaluate(TestRuleAssertionsRequired.java:43)
	at org.apache.lucene.util.TestRuleMarkFailure$1.evaluate(TestRuleMarkFailure.java:48)
	at org.apache.lucene.util.TestRuleIgnoreAfterMaxFailures$1.evaluate(TestRuleIgnoreAfterMaxFailures.java:70)
	at org.apache.lucene.util.TestRuleIgnoreTestSuites$1.evaluate(TestRuleIgnoreTestSuites.java:55)
	at com.carrotsearch.randomizedtesting.rules.StatementAdapter.evaluate(StatementAdapter.java:36)
	at com.carrotsearch.randomizedtesting.ThreadLeakControl$StatementRunner.run(ThreadLeakControl.java:358)
	at java.lang.Thread.run(Thread.java:722)


FAILED:  org.apache.solr.cloud.BasicDistributedZk2Test.testDistribSearch

Error Message:
Shard still reported as live in zk

Stack Trace:
java.lang.AssertionError: Shard still reported as live in zk
	at __randomizedtesting.SeedInfo.seed([C715ED6BCA4C3EAA:46F36373BD135E96]:0)
	at org.junit.Assert.fail(Assert.java:93)
	at org.apache.solr.cloud.AbstractFullDistribZkTestBase.waitToSeeNotLive(AbstractFullDistribZkTestBase.java:1220)
	at org.apache.solr.cloud.BasicDistributedZk2Test.brindDownShardIndexSomeDocsAndRecover(BasicDistributedZk2Test.java:190)
	at org.apache.solr.cloud.BasicDistributedZk2Test.doTest(BasicDistributedZk2Test.java:83)
	at org.apache.solr.BaseDistributedSearchTestCase.testDistribSearch(BaseDistributedSearchTestCase.java:695)
	at sun.reflect.NativeMethodAccessorImpl.invoke0(Native Method)
	at sun.reflect.NativeMethodAccessorImpl.invoke(NativeMethodAccessorImpl.java:57)
	at sun.reflect.DelegatingMethodAccessorImpl.invoke(DelegatingMethodAccessorImpl.java:43)
	at java.lang.reflect.Method.invoke(Method.java:601)
	at com.carrotsearch.randomizedtesting.RandomizedRunner.invoke(RandomizedRunner.java:1559)
	at com.carrotsearch.randomizedtesting.RandomizedRunner.access$600(RandomizedRunner.java:79)
	at com.carrotsearch.randomizedtesting.RandomizedRunner$6.evaluate(RandomizedRunner.java:737)
	at com.carrotsearch.randomizedtesting.RandomizedRunner$7.evaluate(RandomizedRunner.java:773)
	at com.carrotsearch.randomizedtesting.RandomizedRunner$8.evaluate(RandomizedRunner.java:787)
	at com.carrotsearch.randomizedtesting.rules.SystemPropertiesRestoreRule$1.evaluate(SystemPropertiesRestoreRule.java:53)
	at org.apache.lucene.util.TestRuleSetupTeardownChained$1.evaluate(TestRuleSetupTeardownChained.java:50)
	at org.apache.lucene.util.TestRuleFieldCacheSanity$1.evaluate(TestRuleFieldCacheSanity.java:51)
	at org.apache.lucene.util.AbstractBeforeAfterRule$1.evaluate(AbstractBeforeAfterRule.java:45)
	at com.carrotsearch.randomizedtesting.rules.SystemPropertiesInvariantRule$1.evaluate(SystemPropertiesInvariantRule.java:55)
	at org.apache.lucene.util.TestRuleThreadAndTestName$1.evaluate(TestRuleThreadAndTestName.java:48)
	at org.apache.lucene.util.TestRuleIgnoreAfterMaxFailures$1.evaluate(TestRuleIgnoreAfterMaxFailures.java:70)
	at org.apache.lucene.util.TestRuleMarkFailure$1.evaluate(TestRuleMarkFailure.java:48)
	at com.carrotsearch.randomizedtesting.rules.StatementAdapter.evaluate(StatementAdapter.java:36)
	at com.carrotsearch.randomizedtesting.ThreadLeakControl$StatementRunner.run(ThreadLeakControl.java:358)
	at com.carrotsearch.randomizedtesting.ThreadLeakControl.forkTimeoutingTask(ThreadLeakControl.java:782)
	at com.carrotsearch.randomizedtesting.ThreadLeakControl$3.evaluate(ThreadLeakControl.java:442)
	at com.carrotsearch.randomizedtesting.RandomizedRunner.runSingleTest(RandomizedRunner.java:746)
	at com.carrotsearch.randomizedtesting.RandomizedRunner$3.evaluate(RandomizedRunner.java:648)
	at com.carrotsearch.randomizedtesting.RandomizedRunner$4.evaluate(RandomizedRunner.java:682)
	at com.carrotsearch.randomizedtesting.RandomizedRunner$5.evaluate(RandomizedRunner.java:693)
	at com.carrotsearch.randomizedtesting.rules.StatementAdapter.evaluate(StatementAdapter.java:36)
	at com.carrotsearch.randomizedtesting.rules.SystemPropertiesRestoreRule$1.evaluate(SystemPropertiesRestoreRule.java:53)
	at org.apache.lucene.util.AbstractBeforeAfterRule$1.evaluate(AbstractBeforeAfterRule.java:45)
	at org.apache.lucene.util.TestRuleStoreClassName$1.evaluate(TestRuleStoreClassName.java:42)
	at com.carrotsearch.randomizedtesting.rules.SystemPropertiesInvariantRule$1.evaluate(SystemPropertiesInvariantRule.java:55)
	at com.carrotsearch.randomizedtesting.rules.NoShadowingOrOverridesOnMethodsRule$1.evaluate(NoShadowingOrOverridesOnMethodsRule.java:39)
	at com.carrotsearch.randomizedtesting.rules.NoShadowingOrOverridesOnMethodsRule$1.evaluate(NoShadowingOrOverridesOnMethodsRule.java:39)
	at com.carrotsearch.randomizedtesting.rules.StatementAdapter.evaluate(StatementAdapter.java:36)
	at org.apache.lucene.util.TestRuleAssertionsRequired$1.evaluate(TestRuleAssertionsRequired.java:43)
	at org.apache.lucene.util.TestRuleMarkFailure$1.evaluate(TestRuleMarkFailure.java:48)
	at org.apache.lucene.util.TestRuleIgnoreAfterMaxFailures$1.evaluate(TestRuleIgnoreAfterMaxFailures.java:70)
	at org.apache.lucene.util.TestRuleIgnoreTestSuites$1.evaluate(TestRuleIgnoreTestSuites.java:55)
	at com.carrotsearch.randomizedtesting.rules.StatementAdapter.evaluate(StatementAdapter.java:36)
	at com.carrotsearch.randomizedtesting.ThreadLeakControl$StatementRunner.run(ThreadLeakControl.java:358)
	at java.lang.Thread.run(Thread.java:722)


FAILED:  org.apache.solr.cloud.SyncSliceTest.testDistribSearch

Error Message:
There are still nodes recoverying

Stack Trace:
java.lang.AssertionError: There are still nodes recoverying
	at __randomizedtesting.SeedInfo.seed([C715ED6BCA4C3EAA:46F36373BD135E96]:0)
	at org.junit.Assert.fail(Assert.java:93)
	at org.apache.solr.cloud.AbstractDistribZkTestBase.waitForRecoveriesToFinish(AbstractDistribZkTestBase.java:154)
	at org.apache.solr.cloud.AbstractFullDistribZkTestBase.waitForRecoveriesToFinish(AbstractFullDistribZkTestBase.java:560)
	at org.apache.solr.cloud.AbstractFullDistribZkTestBase.waitForThingsToLevelOut(AbstractFullDistribZkTestBase.java:1135)
	at org.apache.solr.cloud.SyncSliceTest.doTest(SyncSliceTest.java:162)
	at org.apache.solr.BaseDistributedSearchTestCase.testDistribSearch(BaseDistributedSearchTestCase.java:695)
	at sun.reflect.NativeMethodAccessorImpl.invoke0(Native Method)
	at sun.reflect.NativeMethodAccessorImpl.invoke(NativeMethodAccessorImpl.java:57)
	at sun.reflect.DelegatingMethodAccessorImpl.invoke(DelegatingMethodAccessorImpl.java:43)
	at java.lang.reflect.Method.invoke(Method.java:601)
	at com.carrotsearch.randomizedtesting.RandomizedRunner.invoke(RandomizedRunner.java:1559)
	at com.carrotsearch.randomizedtesting.RandomizedRunner.access$600(RandomizedRunner.java:79)
	at com.carrotsearch.randomizedtesting.RandomizedRunner$6.evaluate(RandomizedRunner.java:737)
	at com.carrotsearch.randomizedtesting.RandomizedRunner$7.evaluate(RandomizedRunner.java:773)
	at com.carrotsearch.randomizedtesting.RandomizedRunner$8.evaluate(RandomizedRunner.java:787)
	at com.carrotsearch.randomizedtesting.rules.SystemPropertiesRestoreRule$1.evaluate(SystemPropertiesRestoreRule.java:53)
	at org.apache.lucene.util.TestRuleSetupTeardownChained$1.evaluate(TestRuleSetupTeardownChained.java:50)
	at org.apache.lucene.util.TestRuleFieldCacheSanity$1.evaluate(TestRuleFieldCacheSanity.java:51)
	at org.apache.lucene.util.AbstractBeforeAfterRule$1.evaluate(AbstractBeforeAfterRule.java:45)
	at com.carrotsearch.randomizedtesting.rules.SystemPropertiesInvariantRule$1.evaluate(SystemPropertiesInvariantRule.java:55)
	at org.apache.lucene.util.TestRuleThreadAndTestName$1.evaluate(TestRuleThreadAndTestName.java:48)
	at org.apache.lucene.util.TestRuleIgnoreAfterMaxFailures$1.evaluate(TestRuleIgnoreAfterMaxFailures.java:70)
	at org.apache.lucene.util.TestRuleMarkFailure$1.evaluate(TestRuleMarkFailure.java:48)
	at com.carrotsearch.randomizedtesting.rules.StatementAdapter.evaluate(StatementAdapter.java:36)
	at com.carrotsearch.randomizedtesting.ThreadLeakControl$StatementRunner.run(ThreadLeakControl.java:358)
	at com.carrotsearch.randomizedtesting.ThreadLeakControl.forkTimeoutingTask(ThreadLeakControl.java:782)
	at com.carrotsearch.randomizedtesting.ThreadLeakControl$3.evaluate(ThreadLeakControl.java:442)
	at com.carrotsearch.randomizedtesting.RandomizedRunner.runSingleTest(RandomizedRunner.java:746)
	at com.carrotsearch.randomizedtesting.RandomizedRunner$3.evaluate(RandomizedRunner.java:648)
	at com.carrotsearch.randomizedtesting.RandomizedRunner$4.evaluate(RandomizedRunner.java:682)
	at com.carrotsearch.randomizedtesting.RandomizedRunner$5.evaluate(RandomizedRunner.java:693)
	at com.carrotsearch.randomizedtesting.rules.StatementAdapter.evaluate(StatementAdapter.java:36)
	at com.carrotsearch.randomizedtesting.rules.SystemPropertiesRestoreRule$1.evaluate(SystemPropertiesRestoreRule.java:53)
	at org.apache.lucene.util.AbstractBeforeAfterRule$1.evaluate(AbstractBeforeAfterRule.java:45)
	at org.apache.lucene.util.TestRuleStoreClassName$1.evaluate(TestRuleStoreClassName.java:42)
	at com.carrotsearch.randomizedtesting.rules.SystemPropertiesInvariantRule$1.evaluate(SystemPropertiesInvariantRule.java:55)
	at com.carrotsearch.randomizedtesting.rules.NoShadowingOrOverridesOnMethodsRule$1.evaluate(NoShadowingOrOverridesOnMethodsRule.java:39)
	at com.carrotsearch.randomizedtesting.rules.NoShadowingOrOverridesOnMethodsRule$1.evaluate(NoShadowingOrOverridesOnMethodsRule.java:39)
	at com.carrotsearch.randomizedtesting.rules.StatementAdapter.evaluate(StatementAdapter.java:36)
	at org.apache.lucene.util.TestRuleAssertionsRequired$1.evaluate(TestRuleAssertionsRequired.java:43)
	at org.apache.lucene.util.TestRuleMarkFailure$1.evaluate(TestRuleMarkFailure.java:48)
	at org.apache.lucene.util.TestRuleIgnoreAfterMaxFailures$1.evaluate(TestRuleIgnoreAfterMaxFailures.java:70)
	at org.apache.lucene.util.TestRuleIgnoreTestSuites$1.evaluate(TestRuleIgnoreTestSuites.java:55)
	at com.carrotsearch.randomizedtesting.rules.StatementAdapter.evaluate(StatementAdapter.java:36)
	at com.carrotsearch.randomizedtesting.ThreadLeakControl$StatementRunner.run(ThreadLeakControl.java:358)
	at java.lang.Thread.run(Thread.java:722)




Build Log:
[...truncated 7936 lines...]
[junit4:junit4] Suite: org.apache.solr.cloud.BasicDistributedZkTest
[junit4:junit4]   2> 4 T682 oas.SolrTestCaseJ4.setUp ###Starting testDistribSearch
[junit4:junit4]   2> Creating dataDir: /usr/home/hudson/hudson-slave/workspace/Lucene-Solr-Tests-4.x-java7/solr/build/solr-core/test/J0/./solrtest-BasicDistributedZkTest-1348404647753
[junit4:junit4]   2> 13 T682 oasc.ZkTestServer.run STARTING ZK TEST SERVER
[junit4:junit4]   2> 123 T683 oaz.Environment.logEnv Server environment:zookeeper.version=3.3.6-1366786, built on 07/29/2012 06:22 GMT
[junit4:junit4]   2> 123 T683 oaz.Environment.logEnv Server environment:host.name=lucene.zones.apache.org
[junit4:junit4]   2> 123 T683 oaz.Environment.logEnv Server environment:java.version=1.7.0_06
[junit4:junit4]   2> 123 T683 oaz.Environment.logEnv Server environment:java.vendor=Oracle Corporation
[junit4:junit4]   2> 124 T683 oaz.Environment.logEnv Server environment:java.home=/usr/local/openjdk7/jre
[junit4:junit4]   2> 124 T683 oaz.Environment.logEnv Server environment:java.class.path=/usr/home/hudson/hudson-slave/workspace/Lucene-Solr-Tests-4.x-java7/solr/build/solr-core/classes/test:/usr/home/hudson/hudson-slave/workspace/Lucene-Solr-Tests-4.x-java7/solr/build/solr-test-framework/classes/java:/usr/home/hudson/hudson-slave/workspace/Lucene-Solr-Tests-4.x-java7/solr/build/solr-core/test-files:/usr/home/hudson/hudson-slave/workspace/Lucene-Solr-Tests-4.x-java7/lucene/build/codecs/classes/java:/usr/home/hudson/hudson-slave/workspace/Lucene-Solr-Tests-4.x-java7/lucene/build/test-framework/classes/java:/usr/home/hudson/hudson-slave/workspace/Lucene-Solr-Tests-4.x-java7/solr/build/solr-solrj/classes/java:/usr/home/hudson/hudson-slave/workspace/Lucene-Solr-Tests-4.x-java7/solr/build/solr-core/classes/java:/usr/home/hudson/hudson-slave/workspace/Lucene-Solr-Tests-4.x-java7/lucene/build/analysis/common/lucene-analyzers-common-4.1-SNAPSHOT.jar:/usr/home/hudson/hudson-slave/workspace/Lucene-Solr-Tests-4.x-java7/lucene/build/analysis/kuromoji/lucene-analyzers-kuromoji-4.1-SNAPSHOT.jar:/usr/home/hudson/hudson-slave/workspace/Lucene-Solr-Tests-4.x-java7/lucene/build/analysis/phonetic/lucene-analyzers-phonetic-4.1-SNAPSHOT.jar:/usr/home/hudson/hudson-slave/workspace/Lucene-Solr-Tests-4.x-java7/lucene/build/highlighter/lucene-highlighter-4.1-SNAPSHOT.jar:/usr/home/hudson/hudson-slave/workspace/Lucene-Solr-Tests-4.x-java7/lucene/build/memory/lucene-memory-4.1-SNAPSHOT.jar:/usr/home/hudson/hudson-slave/workspace/Lucene-Solr-Tests-4.x-java7/lucene/build/misc/lucene-misc-4.1-SNAPSHOT.jar:/usr/home/hudson/hudson-slave/workspace/Lucene-Solr-Tests-4.x-java7/lucene/build/spatial/lucene-spatial-4.1-SNAPSHOT.jar:/usr/home/hudson/hudson-slave/workspace/Lucene-Solr-Tests-4.x-java7/lucene/build/suggest/lucene-suggest-4.1-SNAPSHOT.jar:/usr/home/hudson/hudson-slave/workspace/Lucene-Solr-Tests-4.x-java7/lucene/build/grouping/lucene-grouping-4.1-SNAPSHOT.jar:/usr/home/hudson/hudson-slave/workspace/Lucene-Solr-Tests-4.x-java7/lucene/build/queries/lucene-queries-4.1-SNAPSHOT.jar:/usr/home/hudson/hudson-slave/workspace/Lucene-Solr-Tests-4.x-java7/lucene/build/queryparser/lucene-queryparser-4.1-SNAPSHOT.jar:/usr/home/hudson/hudson-slave/workspace/Lucene-Solr-Tests-4.x-java7/solr/core/lib/commons-cli-1.2.jar:/usr/home/hudson/hudson-slave/workspace/Lucene-Solr-Tests-4.x-java7/solr/core/lib/commons-codec-1.7.jar:/usr/home/hudson/hudson-slave/workspace/Lucene-Solr-Tests-4.x-java7/solr/core/lib/commons-fileupload-1.2.1.jar:/usr/home/hudson/hudson-slave/workspace/Lucene-Solr-Tests-4.x-java7/solr/core/lib/commons-lang-2.6.jar:/usr/home/hudson/hudson-slave/workspace/Lucene-Solr-Tests-4.x-java7/solr/core/lib/easymock-2.2.jar:/usr/home/hudson/hudson-slave/workspace/Lucene-Solr-Tests-4.x-java7/solr/core/lib/guava-r05.jar:/usr/home/hudson/hudson-slave/workspace/Lucene-Solr-Tests-4.x-java7/solr/core/lib/javax.servlet-api-3.0.1.jar:/usr/home/hudson/hudson-slave/workspace/Lucene-Solr-Tests-4.x-java7/solr/core/lib/spatial4j-0.3.jar:/usr/home/hudson/hudson-slave/workspace/Lucene-Solr-Tests-4.x-java7/solr/solrj/lib/commons-io-2.1.jar:/usr/home/hudson/hudson-slave/workspace/Lucene-Solr-Tests-4.x-java7/solr/solrj/lib/httpclient-4.1.3.jar:/usr/home/hudson/hudson-slave/workspace/Lucene-Solr-Tests-4.x-java7/solr/solrj/lib/httpcore-4.1.4.jar:/usr/home/hudson/hudson-slave/workspace/Lucene-Solr-Tests-4.x-java7/solr/solrj/lib/httpmime-4.1.3.jar:/usr/home/hudson/hudson-slave/workspace/Lucene-Solr-Tests-4.x-java7/solr/solrj/lib/jcl-over-slf4j-1.6.4.jar:/usr/home/hudson/hudson-slave/workspace/Lucene-Solr-Tests-4.x-java7/solr/solrj/lib/log4j-over-slf4j-1.6.4.jar:/usr/home/hudson/hudson-slave/workspace/Lucene-Solr-Tests-4.x-java7/solr/solrj/lib/slf4j-api-1.6.4.jar:/usr/home/hudson/hudson-slave/workspace/Lucene-Solr-Tests-4.x-java7/solr/solrj/lib/slf4j-jdk14-1.6.4.jar:/usr/home/hudson/hudson-slave/workspace/Lucene-Solr-Tests-4.x-java7/solr/solrj/lib/wstx-asl-3.2.7.jar:/usr/home/hudson/hudson-slave/workspace/Lucene-Solr-Tests-4.x-java7/solr/solrj/lib/zookeeper-3.3.6.jar:/usr/home/hudson/hudson-slave/workspace/Lucene-Solr-Tests-4.x-java7/solr/example/lib/jetty-continuation-8.1.2.v20120308.jar:/usr/home/hudson/hudson-slave/workspace/Lucene-Solr-Tests-4.x-java7/solr/example/lib/jetty-deploy-8.1.2.v20120308.jar:/usr/home/hudson/hudson-slave/workspace/Lucene-Solr-Tests-4.x-java7/solr/example/lib/jetty-http-8.1.2.v20120308.jar:/usr/home/hudson/hudson-slave/workspace/Lucene-Solr-Tests-4.x-java7/solr/example/lib/jetty-io-8.1.2.v20120308.jar:/usr/home/hudson/hudson-slave/workspace/Lucene-Solr-Tests-4.x-java7/solr/example/lib/jetty-jmx-8.1.2.v20120308.jar:/usr/home/hudson/hudson-slave/workspace/Lucene-Solr-Tests-4.x-java7/solr/example/lib/jetty-security-8.1.2.v20120308.jar:/usr/home/hudson/hudson-slave/workspace/Lucene-Solr-Tests-4.x-java7/solr/example/lib/jetty-server-8.1.2.v20120308.jar:/usr/home/hudson/hudson-slave/workspace/Lucene-Solr-Tests-4.x-java7/solr/example/lib/jetty-servlet-8.1.2.v20120308.jar:/usr/home/hudson/hudson-slave/workspace/Lucene-Solr-Tests-4.x-java7/solr/example/lib/jetty-util-8.1.2.v20120308.jar:/usr/home/hudson/hudson-slave/workspace/Lucene-Solr-Tests-4.x-java7/solr/example/lib/jetty-webapp-8.1.2.v20120308.jar:/usr/home/hudson/hudson-slave/workspace/Lucene-Solr-Tests-4.x-java7/solr/example/lib/jetty-xml-8.1.2.v20120308.jar:/usr/home/hudson/hudson-slave/workspace/Lucene-Solr-Tests-4.x-java7/solr/example/lib/servlet-api-3.0.jar:/usr/home/hudson/hudson-slave/workspace/Lucene-Solr-Tests-4.x-java7/solr/example/example-DIH/solr/db/lib/hsqldb-1.8.0.10.jar:/usr/home/hudson/hudson-slave/workspace/Lucene-Solr-Tests-4.x-java7/lucene/build/core/classes/java:/usr/home/hudson/hudson-slave/workspace/Lucene-Solr-Tests-4.x-java7/lucene/test-framework/lib/junit-4.10.jar:/usr/home/hudson/hudson-slave/workspace/Lucene-Solr-Tests-4.x-java7/lucene/test-framework/lib/randomizedtesting-runner-2.0.1.jar:/home/hudson/hudson-slave/tools/Ant/ant-1.8.2/lib/ant-launcher.jar:/home/hudson/.ant/lib/ivy-2.2.0.jar:/home/hudson/hudson-slave/tools/Ant/ant-1.8.2/lib/ant-apache-regexp.jar:/home/hudson/hudson-slave/tools/Ant/ant-1.8.2/lib/ant-junit.jar:/home/hudson/hudson-slave/tools/Ant/ant-1.8.2/lib/ant-apache-bsf.jar:/home/hudson/hudson-slave/tools/Ant/ant-1.8.2/lib/ant-commons-net.jar:/home/hudson/hudson-slave/tools/Ant/ant-1.8.2/lib/ant-antlr.jar:/home/hudson/hudson-slave/tools/Ant/ant-1.8.2/lib/ant-apache-log4j.jar:/home/hudson/hudson-slave/tools/Ant/ant-1.8.2/lib/ant-commons-logging.jar:/home/hudson/hudson-slave/tools/Ant/ant-1.8.2/lib/ant-apache-xalan2.jar:/home/hudson/hudson-slave/tools/Ant/ant-1.8.2/lib/ant-apache-oro.jar:/home/hudson/hudson-slave/tools/Ant/ant-1.8.2/lib/ant-junit4.jar:/home/hudson/hudson-slave/tools/Ant/ant-1.8.2/lib/ant-netrexx.jar:/home/hudson/hudson-slave/tools/Ant/ant-1.8.2/lib/ant-swing.jar:/home/hudson/hudson-slave/tools/Ant/ant-1.8.2/lib/ant-javamail.jar:/home/hudson/hudson-slave/tools/Ant/ant-1.8.2/lib/ant-jsch.jar:/home/hudson/hudson-slave/tools/Ant/ant-1.8.2/lib/ant-jmf.jar:/home/hudson/hudson-slave/tools/Ant/ant-1.8.2/lib/ant.jar:/home/hudson/hudson-slave/tools/Ant/ant-1.8.2/lib/ant-apache-bcel.jar:/home/hudson/hudson-slave/tools/Ant/ant-1.8.2/lib/ant-jai.jar:/home/hudson/hudson-slave/tools/Ant/ant-1.8.2/lib/ant-testutil.jar:/home/hudson/hudson-slave/tools/Ant/ant-1.8.2/lib/ant-apache-resolver.jar:/home/hudson/hudson-slave/tools/Ant/ant-1.8.2/lib/ant-jdepend.jar:/usr/local/openjdk7/lib/tools.jar:/home/hudson/.ivy2/cache/com.carrotsearch.randomizedtesting/junit4-ant/jars/junit4-ant-2.0.1.jar
[junit4:junit4]   2> 125 T683 oaz.Environment.logEnv Server environment:java.library.path=/usr/local/openjdk7/jre/lib/amd64/server:/usr/local/openjdk7/jre/lib/amd64:/usr/local/openjdk7/jre/../lib/amd64:/usr/local/openjdk6/jre/lib/amd64/server:/usr/local/openjdk6/jre/lib/amd64:/usr/local/openjdk6/jre/../lib/amd64:/usr/java/packages/lib/amd64:/lib:/usr/lib:/usr/local/lib
[junit4:junit4]   2> 125 T683 oaz.Environment.logEnv Server environment:java.io.tmpdir=.
[junit4:junit4]   2> 125 T683 oaz.Environment.logEnv Server environment:java.compiler=<NA>
[junit4:junit4]   2> 126 T683 oaz.Environment.logEnv Server environment:os.name=FreeBSD
[junit4:junit4]   2> 126 T683 oaz.Environment.logEnv Server environment:os.arch=amd64
[junit4:junit4]   2> 126 T683 oaz.Environment.logEnv Server environment:os.version=9.0-RELEASE
[junit4:junit4]   2> 126 T683 oaz.Environment.logEnv Server environment:user.name=hudson
[junit4:junit4]   2> 126 T683 oaz.Environment.logEnv Server environment:user.home=/home/hudson
[junit4:junit4]   2> 126 T683 oaz.Environment.logEnv Server environment:user.dir=/usr/home/hudson/hudson-slave/workspace/Lucene-Solr-Tests-4.x-java7/solr/build/solr-core/test/J0
[junit4:junit4]   2> 162 T683 oazs.ZooKeeperServer.setTickTime tickTime set to 1000
[junit4:junit4]   2> 196 T683 oazs.NIOServerCnxn$Factory.<init> binding to port 0.0.0.0/0.0.0.0:0
[junit4:junit4]   2> 221 T682 oasc.ZkTestServer.run start zk server on port:56962
[junit4:junit4]   2> 282 T682 oaz.Environment.logEnv Client environment:zookeeper.version=3.3.6-1366786, built on 07/29/2012 06:22 GMT
[junit4:junit4]   2> 283 T682 oaz.Environment.logEnv Client environment:host.name=lucene.zones.apache.org
[junit4:junit4]   2> 283 T682 oaz.Environment.logEnv Client environment:java.version=1.7.0_06
[junit4:junit4]   2> 283 T682 oaz.Environment.logEnv Client environment:java.vendor=Oracle Corporation
[junit4:junit4]   2> 284 T682 oaz.Environment.logEnv Client environment:java.home=/usr/local/openjdk7/jre
[junit4:junit4]   2> 284 T682 oaz.Environment.logEnv Client environment:java.class.path=/usr/home/hudson/hudson-slave/workspace/Lucene-Solr-Tests-4.x-java7/solr/build/solr-core/classes/test:/usr/home/hudson/hudson-slave/workspace/Lucene-Solr-Tests-4.x-java7/solr/build/solr-test-framework/classes/java:/usr/home/hudson/hudson-slave/workspace/Lucene-Solr-Tests-4.x-java7/solr/build/solr-core/test-files:/usr/home/hudson/hudson-slave/workspace/Lucene-Solr-Tests-4.x-java7/lucene/build/codecs/classes/java:/usr/home/hudson/hudson-slave/workspace/Lucene-Solr-Tests-4.x-java7/lucene/build/test-framework/classes/java:/usr/home/hudson/hudson-slave/workspace/Lucene-Solr-Tests-4.x-java7/solr/build/solr-solrj/classes/java:/usr/home/hudson/hudson-slave/workspace/Lucene-Solr-Tests-4.x-java7/solr/build/solr-core/classes/java:/usr/home/hudson/hudson-slave/workspace/Lucene-Solr-Tests-4.x-java7/lucene/build/analysis/common/lucene-analyzers-common-4.1-SNAPSHOT.jar:/usr/home/hudson/hudson-slave/workspace/Lucene-Solr-Tests-4.x-java7/lucene/build/analysis/kuromoji/lucene-analyzers-kuromoji-4.1-SNAPSHOT.jar:/usr/home/hudson/hudson-slave/workspace/Lucene-Solr-Tests-4.x-java7/lucene/build/analysis/phonetic/lucene-analyzers-phonetic-4.1-SNAPSHOT.jar:/usr/home/hudson/hudson-slave/workspace/Lucene-Solr-Tests-4.x-java7/lucene/build/highlighter/lucene-highlighter-4.1-SNAPSHOT.jar:/usr/home/hudson/hudson-slave/workspace/Lucene-Solr-Tests-4.x-java7/lucene/build/memory/lucene-memory-4.1-SNAPSHOT.jar:/usr/home/hudson/hudson-slave/workspace/Lucene-Solr-Tests-4.x-java7/lucene/build/misc/lucene-misc-4.1-SNAPSHOT.jar:/usr/home/hudson/hudson-slave/workspace/Lucene-Solr-Tests-4.x-java7/lucene/build/spatial/lucene-spatial-4.1-SNAPSHOT.jar:/usr/home/hudson/hudson-slave/workspace/Lucene-Solr-Tests-4.x-java7/lucene/build/suggest/lucene-suggest-4.1-SNAPSHOT.jar:/usr/home/hudson/hudson-slave/workspace/Lucene-Solr-Tests-4.x-java7/lucene/build/grouping/lucene-grouping-4.1-SNAPSHOT.jar:/usr/home/hudson/hudson-slave/workspace/Lucene-Solr-Tests-4.x-java7/lucene/build/queries/lucene-queries-4.1-SNAPSHOT.jar:/usr/home/hudson/hudson-slave/workspace/Lucene-Solr-Tests-4.x-java7/lucene/build/queryparser/lucene-queryparser-4.1-SNAPSHOT.jar:/usr/home/hudson/hudson-slave/workspace/Lucene-Solr-Tests-4.x-java7/solr/core/lib/commons-cli-1.2.jar:/usr/home/hudson/hudson-slave/workspace/Lucene-Solr-Tests-4.x-java7/solr/core/lib/commons-codec-1.7.jar:/usr/home/hudson/hudson-slave/workspace/Lucene-Solr-Tests-4.x-java7/solr/core/lib/commons-fileupload-1.2.1.jar:/usr/home/hudson/hudson-slave/workspace/Lucene-Solr-Tests-4.x-java7/solr/core/lib/commons-lang-2.6.jar:/usr/home/hudson/hudson-slave/workspace/Lucene-Solr-Tests-4.x-java7/solr/core/lib/easymock-2.2.jar:/usr/home/hudson/hudson-slave/workspace/Lucene-Solr-Tests-4.x-java7/solr/core/lib/guava-r05.jar:/usr/home/hudson/hudson-slave/workspace/Lucene-Solr-Tests-4.x-java7/solr/core/lib/javax.servlet-api-3.0.1.jar:/usr/home/hudson/hudson-slave/workspace/Lucene-Solr-Tests-4.x-java7/solr/core/lib/spatial4j-0.3.jar:/usr/home/hudson/hudson-slave/workspace/Lucene-Solr-Tests-4.x-java7/solr/solrj/lib/commons-io-2.1.jar:/usr/home/hudson/hudson-slave/workspace/Lucene-Solr-Tests-4.x-java7/solr/solrj/lib/httpclient-4.1.3.jar:/usr/home/hudson/hudson-slave/workspace/Lucene-Solr-Tests-4.x-java7/solr/solrj/lib/httpcore-4.1.4.jar:/usr/home/hudson/hudson-slave/workspace/Lucene-Solr-Tests-4.x-java7/solr/solrj/lib/httpmime-4.1.3.jar:/usr/home/hudson/hudson-slave/workspace/Lucene-Solr-Tests-4.x-java7/solr/solrj/lib/jcl-over-slf4j-1.6.4.jar:/usr/home/hudson/hudson-slave/workspace/Lucene-Solr-Tests-4.x-java7/solr/solrj/lib/log4j-over-slf4j-1.6.4.jar:/usr/home/hudson/hudson-slave/workspace/Lucene-Solr-Tests-4.x-java7/solr/solrj/lib/slf4j-api-1.6.4.jar:/usr/home/hudson/hudson-slave/workspace/Lucene-Solr-Tests-4.x-java7/solr/solrj/lib/slf4j-jdk14-1.6.4.jar:/usr/home/hudson/hudson-slave/workspace/Lucene-Solr-Tests-4.x-java7/solr/solrj/lib/wstx-asl-3.2.7.jar:/usr/home/hudson/hudson-slave/workspace/Lucene-Solr-Tests-4.x-java7/solr/solrj/lib/zookeeper-3.3.6.jar:/usr/home/hudson/hudson-slave/workspace/Lucene-Solr-Tests-4.x-java7/solr/example/lib/jetty-continuation-8.1.2.v20120308.jar:/usr/home/hudson/hudson-slave/workspace/Lucene-Solr-Tests-4.x-java7/solr/example/lib/jetty-deploy-8.1.2.v20120308.jar:/usr/home/hudson/hudson-slave/workspace/Lucene-Solr-Tests-4.x-java7/solr/example/lib/jetty-http-8.1.2.v20120308.jar:/usr/home/hudson/hudson-slave/workspace/Lucene-Solr-Tests-4.x-java7/solr/example/lib/jetty-io-8.1.2.v20120308.jar:/usr/home/hudson/hudson-slave/workspace/Lucene-Solr-Tests-4.x-java7/solr/example/lib/jetty-jmx-8.1.2.v20120308.jar:/usr/home/hudson/hudson-slave/workspace/Lucene-Solr-Tests-4.x-java7/solr/example/lib/jetty-security-8.1.2.v20120308.jar:/usr/home/hudson/hudson-slave/workspace/Lucene-Solr-Tests-4.x-java7/solr/example/lib/jetty-server-8.1.2.v20120308.jar:/usr/home/hudson/hudson-slave/workspace/Lucene-Solr-Tests-4.x-java7/solr/example/lib/jetty-servlet-8.1.2.v20120308.jar:/usr/home/hudson/hudson-slave/workspace/Lucene-Solr-Tests-4.x-java7/solr/example/lib/jetty-util-8.1.2.v20120308.jar:/usr/home/hudson/hudson-slave/workspace/Lucene-Solr-Tests-4.x-java7/solr/example/lib/jetty-webapp-8.1.2.v20120308.jar:/usr/home/hudson/hudson-slave/workspace/Lucene-Solr-Tests-4.x-java7/solr/example/lib/jetty-xml-8.1.2.v20120308.jar:/usr/home/hudson/hudson-slave/workspace/Lucene-Solr-Tests-4.x-java7/solr/example/lib/servlet-api-3.0.jar:/usr/home/hudson/hudson-slave/workspace/Lucene-Solr-Tests-4.x-java7/solr/example/example-DIH/solr/db/lib/hsqldb-1.8.0.10.jar:/usr/home/hudson/hudson-slave/workspace/Lucene-Solr-Tests-4.x-java7/lucene/build/core/classes/java:/usr/home/hudson/hudson-slave/workspace/Lucene-Solr-Tests-4.x-java7/lucene/test-framework/lib/junit-4.10.jar:/usr/home/hudson/hudson-slave/workspace/Lucene-Solr-Tests-4.x-java7/lucene/test-framework/lib/randomizedtesting-runner-2.0.1.jar:/home/hudson/hudson-slave/tools/Ant/ant-1.8.2/lib/ant-launcher.jar:/home/hudson/.ant/lib/ivy-2.2.0.jar:/home/hudson/hudson-slave/tools/Ant/ant-1.8.2/lib/ant-apache-regexp.jar:/home/hudson/hudson-slave/tools/Ant/ant-1.8.2/lib/ant-junit.jar:/home/hudson/hudson-slave/tools/Ant/ant-1.8.2/lib/ant-apache-bsf.jar:/home/hudson/hudson-slave/tools/Ant/ant-1.8.2/lib/ant-commons-net.jar:/home/hudson/hudson-slave/tools/Ant/ant-1.8.2/lib/ant-antlr.jar:/home/hudson/hudson-slave/tools/Ant/ant-1.8.2/lib/ant-apache-log4j.jar:/home/hudson/hudson-slave/tools/Ant/ant-1.8.2/lib/ant-commons-logging.jar:/home/hudson/hudson-slave/tools/Ant/ant-1.8.2/lib/ant-apache-xalan2.jar:/home/hudson/hudson-slave/tools/Ant/ant-1.8.2/lib/ant-apache-oro.jar:/home/hudson/hudson-slave/tools/Ant/ant-1.8.2/lib/ant-junit4.jar:/home/hudson/hudson-slave/tools/Ant/ant-1.8.2/lib/ant-netrexx.jar:/home/hudson/hudson-slave/tools/Ant/ant-1.8.2/lib/ant-swing.jar:/home/hudson/hudson-slave/tools/Ant/ant-1.8.2/lib/ant-javamail.jar:/home/hudson/hudson-slave/tools/Ant/ant-1.8.2/lib/ant-jsch.jar:/home/hudson/hudson-slave/tools/Ant/ant-1.8.2/lib/ant-jmf.jar:/home/hudson/hudson-slave/tools/Ant/ant-1.8.2/lib/ant.jar:/home/hudson/hudson-slave/tools/Ant/ant-1.8.2/lib/ant-apache-bcel.jar:/home/hudson/hudson-slave/tools/Ant/ant-1.8.2/lib/ant-jai.jar:/home/hudson/hudson-slave/tools/Ant/ant-1.8.2/lib/ant-testutil.jar:/home/hudson/hudson-slave/tools/Ant/ant-1.8.2/lib/ant-apache-resolver.jar:/home/hudson/hudson-slave/tools/Ant/ant-1.8.2/lib/ant-jdepend.jar:/usr/local/openjdk7/lib/tools.jar:/home/hudson/.ivy2/cache/com.carrotsearch.randomizedtesting/junit4-ant/jars/junit4-ant-2.0.1.jar
[junit4:junit4]   2> 285 T683 oazsp.FileTxnSnapLog.save Snapshotting: 0
[junit4:junit4]   2> 285 T682 oaz.Environment.logEnv Client environment:java.library.path=/usr/local/openjdk7/jre/lib/amd64/server:/usr/local/openjdk7/jre/lib/amd64:/usr/local/openjdk7/jre/../lib/amd64:/usr/local/openjdk6/jre/lib/amd64/server:/usr/local/openjdk6/jre/lib/amd64:/usr/local/openjdk6/jre/../lib/amd64:/usr/java/packages/lib/amd64:/lib:/usr/lib:/usr/local/lib
[junit4:junit4]   2> 286 T682 oaz.Environment.logEnv Client environment:java.io.tmpdir=.
[junit4:junit4]   2> 286 T682 oaz.Environment.logEnv Client environment:java.compiler=<NA>
[junit4:junit4]   2> 286 T682 oaz.Environment.logEnv Client environment:os.name=FreeBSD
[junit4:junit4]   2> 287 T682 oaz.Environment.logEnv Client environment:os.arch=amd64
[junit4:junit4]   2> 287 T682 oaz.Environment.logEnv Client environment:os.version=9.0-RELEASE
[junit4:junit4]   2> 287 T682 oaz.Environment.logEnv Client environment:user.name=hudson
[junit4:junit4]   2> 288 T682 oaz.Environment.logEnv Client environment:user.home=/home/hudson
[junit4:junit4]   2> 288 T682 oaz.Environment.logEnv Client environment:user.dir=/usr/home/hudson/hudson-slave/workspace/Lucene-Solr-Tests-4.x-java7/solr/build/solr-core/test/J0
[junit4:junit4]   2> 291 T682 oaz.ZooKeeper.<init> Initiating client connection, connectString=127.0.0.1:56962 sessionTimeout=10000 watcher=org.apache.solr.common.cloud.ConnectionManager@71e82846
[junit4:junit4]   2> 331 T685 oaz.ClientCnxn$SendThread.startConnect Opening socket connection to server /127.0.0.1:56962
[junit4:junit4]   2> 332 T682 oascc.ConnectionManager.waitForConnected Waiting for client to connect to ZooKeeper
[junit4:junit4]   2> 335 T685 oaz.ClientCnxn$SendThread.primeConnection Socket connection established to localhost/127.0.0.1:56962, initiating session
[junit4:junit4]   2> 336 T684 oazs.NIOServerCnxn$Factory.run Accepted socket connection from /140.211.11.196:56963
[junit4:junit4]   2> 357 T684 oazs.NIOServerCnxn.doIO WARNING Exception causing close of session 0x0 due to java.io.IOException: ZooKeeperServer not running
[junit4:junit4]   2> 358 T684 oazs.NIOServerCnxn.closeSock Closed socket connection for client /140.211.11.196:56963 (no session established for client)
[junit4:junit4]   2> 358 T685 oaz.ClientCnxn$SendThread.run Unable to read additional data from server sessionid 0x0, likely server has closed socket, closing socket connection and attempting reconnect
[junit4:junit4]   2> 1559 T685 oaz.ClientCnxn$SendThread.startConnect Opening socket connection to server localhost/127.0.0.1:56962
[junit4:junit4]   2> 1559 T685 oaz.ClientCnxn$SendThread.primeConnection Socket connection established to localhost/127.0.0.1:56962, initiating session
[junit4:junit4]   2> 1560 T684 oazs.NIOServerCnxn$Factory.run Accepted socket connection from /140.211.11.196:56965
[junit4:junit4]   2> 1561 T684 oazs.NIOServerCnxn.readConnectRequest Client attempting to establish new session at /140.211.11.196:56965
[junit4:junit4]   2> 1577 T688 oazsp.FileTxnLog.append Creating new log file: log.1
[junit4:junit4]   2> 1626 T688 oazs.NIOServerCnxn.finishSessionInit Established session 0x139f32e18860000 with negotiated timeout 10000 for client /140.211.11.196:56965
[junit4:junit4]   2> 1627 T685 oaz.ClientCnxn$SendThread.readConnectResult Session establishment complete on server localhost/127.0.0.1:56962, sessionid = 0x139f32e18860000, negotiated timeout = 10000
[junit4:junit4]   2> 1630 T687 oascc.ConnectionManager.process Watcher org.apache.solr.common.cloud.ConnectionManager@71e82846 name:ZooKeeperConnection Watcher:127.0.0.1:56962 got event WatchedEvent state:SyncConnected type:None path:null path:null type:None
[junit4:junit4]   2> 1630 T682 oascc.ConnectionManager.waitForConnected Client is connected to ZooKeeper
[junit4:junit4]   2> 1634 T682 oascc.SolrZkClient.makePath makePath: /solr
[junit4:junit4]   2> 1708 T689 oazs.PrepRequestProcessor.pRequest Processed session termination for sessionid: 0x139f32e18860000
[junit4:junit4]   2> 1710 T687 oaz.ClientCnxn$EventThread.run EventThread shut down
[junit4:junit4]   2> 1710 T682 oaz.ZooKeeper.close Session: 0x139f32e18860000 closed
[junit4:junit4]   2> 1710 T682 oaz.ZooKeeper.<init> Initiating client connection, connectString=127.0.0.1:56962/solr sessionTimeout=10000 watcher=org.apache.solr.common.cloud.ConnectionManager@568beaa1
[junit4:junit4]   2> 1711 T684 oazs.NIOServerCnxn.closeSock Closed socket connection for client /140.211.11.196:56965 which had sessionid 0x139f32e18860000
[junit4:junit4]   2> 1711 T690 oaz.ClientCnxn$SendThread.startConnect Opening socket connection to server /127.0.0.1:56962
[junit4:junit4]   2> 1711 T682 oascc.ConnectionManager.waitForConnected Waiting for client to connect to ZooKeeper
[junit4:junit4]   2> 1713 T690 oaz.ClientCnxn$SendThread.primeConnection Socket connection established to localhost/127.0.0.1:56962, initiating session
[junit4:junit4]   2> 1713 T684 oazs.NIOServerCnxn$Factory.run Accepted socket connection from /140.211.11.196:56966
[junit4:junit4]   2> 1713 T684 oazs.NIOServerCnxn.readConnectRequest Client attempting to establish new session at /140.211.11.196:56966
[junit4:junit4]   2> 1715 T688 oazs.NIOServerCnxn.finishSessionInit Established session 0x139f32e18860001 with negotiated timeout 10000 for client /140.211.11.196:56966
[junit4:junit4]   2> 1715 T690 oaz.ClientCnxn$SendThread.readConnectResult Session establishment complete on server localhost/127.0.0.1:56962, sessionid = 0x139f32e18860001, negotiated timeout = 10000
[junit4:junit4]   2> 1715 T691 oascc.ConnectionManager.process Watcher org.apache.solr.common.cloud.ConnectionManager@568beaa1 name:ZooKeeperConnection Watcher:127.0.0.1:56962/solr got event WatchedEvent state:SyncConnected type:None path:null path:null type:None
[junit4:junit4]   2> 1716 T682 oascc.ConnectionManager.waitForConnected Client is connected to ZooKeeper
[junit4:junit4]   2> 1723 T682 oascc.SolrZkClient.makePath makePath: /collections/collection1
[junit4:junit4]   2> 1728 T682 oascc.SolrZkClient.makePath makePath: /collections/collection1/shards
[junit4:junit4]   2> 1738 T682 oascc.SolrZkClient.makePath makePath: /collections/control_collection
[junit4:junit4]   2> 1741 T682 oascc.SolrZkClient.makePath makePath: /collections/control_collection/shards
[junit4:junit4]   2> 1746 T682 oasc.AbstractZkTestCase.putConfig put /usr/home/hudson/hudson-slave/workspace/Lucene-Solr-Tests-4.x-java7/solr/build/solr-core/test-files/solr/collection1/conf/solrconfig.xml to /configs/conf1/solrconfig.xml
[junit4:junit4]   2> 1749 T682 oascc.SolrZkClient.makePath makePath: /configs/conf1/solrconfig.xml
[junit4:junit4]   2> 1763 T682 oasc.AbstractZkTestCase.putConfig put /usr/home/hudson/hudson-slave/workspace/Lucene-Solr-Tests-4.x-java7/solr/build/solr-core/test-files/solr/collection1/conf/schema.xml to /configs/conf1/schema.xml
[junit4:junit4]   2> 1764 T682 oascc.SolrZkClient.makePath makePath: /configs/conf1/schema.xml
[junit4:junit4]   2> 1870 T682 oasc.AbstractZkTestCase.putConfig put /usr/home/hudson/hudson-slave/workspace/Lucene-Solr-Tests-4.x-java7/solr/build/solr-core/test-files/solr/collection1/conf/solrconfig.xml to /configs/conf1/solrconfig.xml
[junit4:junit4]   2> 1871 T682 oascc.SolrZkClient.makePath makePath: /configs/conf1/solrconfig.xml
[junit4:junit4]   2> 1886 T682 oasc.AbstractZkTestCase.putConfig put /usr/home/hudson/hudson-slave/workspace/Lucene-Solr-Tests-4.x-java7/solr/build/solr-core/test-files/solr/collection1/conf/stopwords.txt to /configs/conf1/stopwords.txt
[junit4:junit4]   2> 1887 T682 oascc.SolrZkClient.makePath makePath: /configs/conf1/stopwords.txt
[junit4:junit4]   2> 1892 T682 oasc.AbstractZkTestCase.putConfig put /usr/home/hudson/hudson-slave/workspace/Lucene-Solr-Tests-4.x-java7/solr/build/solr-core/test-files/solr/collection1/conf/protwords.txt to /configs/conf1/protwords.txt
[junit4:junit4]   2> 1893 T682 oascc.SolrZkClient.makePath makePath: /configs/conf1/protwords.txt
[junit4:junit4]   2> 1897 T682 oasc.AbstractZkTestCase.putConfig put /usr/home/hudson/hudson-slave/workspace/Lucene-Solr-Tests-4.x-java7/solr/build/solr-core/test-files/solr/collection1/conf/currency.xml to /configs/conf1/currency.xml
[junit4:junit4]   2> 1898 T682 oascc.SolrZkClient.makePath makePath: /configs/conf1/currency.xml
[junit4:junit4]   2> 1902 T682 oasc.AbstractZkTestCase.putConfig put /usr/home/hudson/hudson-slave/workspace/Lucene-Solr-Tests-4.x-java7/solr/build/solr-core/test-files/solr/collection1/conf/open-exchange-rates.json to /configs/conf1/open-exchange-rates.json
[junit4:junit4]   2> 1903 T682 oascc.SolrZkClient.makePath makePath: /configs/conf1/open-exchange-rates.json
[junit4:junit4]   2> 1907 T682 oasc.AbstractZkTestCase.putConfig put /usr/home/hudson/hudson-slave/workspace/Lucene-Solr-Tests-4.x-java7/solr/build/solr-core/test-files/solr/collection1/conf/mapping-ISOLatin1Accent.txt to /configs/conf1/mapping-ISOLatin1Accent.txt
[junit4:junit4]   2> 1908 T682 oascc.SolrZkClient.makePath makePath: /configs/conf1/mapping-ISOLatin1Accent.txt
[junit4:junit4]   2> 1912 T682 oasc.AbstractZkTestCase.putConfig put /usr/home/hudson/hudson-slave/workspace/Lucene-Solr-Tests-4.x-java7/solr/build/solr-core/test-files/solr/collection1/conf/old_synonyms.txt to /configs/conf1/old_synonyms.txt
[junit4:junit4]   2> 1913 T682 oascc.SolrZkClient.makePath makePath: /configs/conf1/old_synonyms.txt
[junit4:junit4]   2> 1917 T682 oasc.AbstractZkTestCase.putConfig put /usr/home/hudson/hudson-slave/workspace/Lucene-Solr-Tests-4.x-java7/solr/build/solr-core/test-files/solr/collection1/conf/synonyms.txt to /configs/conf1/synonyms.txt
[junit4:junit4]   2> 1918 T682 oascc.SolrZkClient.makePath makePath: /configs/conf1/synonyms.txt
[junit4:junit4]   2> 1922 T689 oazs.PrepRequestProcessor.pRequest Processed session termination for sessionid: 0x139f32e18860001
[junit4:junit4]   2> 1923 T691 oaz.ClientCnxn$EventThread.run EventThread shut down
[junit4:junit4]   2> 1923 T682 oaz.ZooKeeper.close Session: 0x139f32e18860001 closed
[junit4:junit4]   2> 1923 T684 oazs.NIOServerCnxn.closeSock Closed socket connection for client /140.211.11.196:56966 which had sessionid 0x139f32e18860001
[junit4:junit4]   2> 1926 T682 oejs.Server.doStart jetty-8.1.2.v20120308
[junit4:junit4]   2> 1930 T682 oejs.AbstractConnector.doStart Started SocketConnector@0.0.0.0:56968
[junit4:junit4]   2> 1931 T682 oasc.SolrResourceLoader.locateSolrHome JNDI not configured for solr (NoInitialContextEx)
[junit4:junit4]   2> 1932 T682 oasc.SolrResourceLoader.locateSolrHome using system property solr.solr.home: /usr/home/hudson/hudson-slave/workspace/Lucene-Solr-Tests-4.x-java7/solr/build/solr-core/test-files/solr
[junit4:junit4]   2> 1932 T682 oasc.SolrResourceLoader.<init> new SolrResourceLoader for deduced Solr Home: '/usr/home/hudson/hudson-slave/workspace/Lucene-Solr-Tests-4.x-java7/solr/build/solr-core/test-files/solr/'
[junit4:junit4]   2> 1981 T682 oass.SolrDispatchFilter.init SolrDispatchFilter.init()
[junit4:junit4]   2> 1981 T682 oasc.SolrResourceLoader.locateSolrHome JNDI not configured for solr (NoInitialContextEx)
[junit4:junit4]   2> 1982 T682 oasc.SolrResourceLoader.locateSolrHome using system property solr.solr.home: /usr/home/hudson/hudson-slave/workspace/Lucene-Solr-Tests-4.x-java7/solr/build/solr-core/test-files/solr
[junit4:junit4]   2> 1982 T682 oasc.CoreContainer$Initializer.initialize looking for solr.xml: /usr/home/hudson/hudson-slave/workspace/Lucene-Solr-Tests-4.x-java7/solr/build/solr-core/test-files/solr/solr.xml
[junit4:junit4]   2> 1983 T682 oasc.CoreContainer.<init> New CoreContainer 1709705982
[junit4:junit4]   2> 1984 T682 oasc.CoreContainer.load Loading CoreContainer using Solr Home: '/usr/home/hudson/hudson-slave/workspace/Lucene-Solr-Tests-4.x-java7/solr/build/solr-core/test-files/solr/'
[junit4:junit4]   2> 1984 T682 oasc.SolrResourceLoader.<init> new SolrResourceLoader for directory: '/usr/home/hudson/hudson-slave/workspace/Lucene-Solr-Tests-4.x-java7/solr/build/solr-core/test-files/solr/'
[junit4:junit4]   2> 2021 T682 oasc.CoreContainer.load Registering Log Listener
[junit4:junit4]   2> 2040 T682 oasc.CoreContainer.initZooKeeper Zookeeper client=127.0.0.1:56962/solr
[junit4:junit4]   2> 2078 T682 oaz.ZooKeeper.<init> Initiating client connection, connectString=127.0.0.1:56962/solr sessionTimeout=5000 watcher=org.apache.solr.common.cloud.ConnectionManager@70f9aae
[junit4:junit4]   2> 2079 T701 oaz.ClientCnxn$SendThread.startConnect Opening socket connection to server /127.0.0.1:56962
[junit4:junit4]   2> 2079 T682 oascc.ConnectionManager.waitForConnected Waiting for client to connect to ZooKeeper
[junit4:junit4]   2> 2080 T701 oaz.ClientCnxn$SendThread.primeConnection Socket connection established to localhost/127.0.0.1:56962, initiating session
[junit4:junit4]   2> 2081 T684 oazs.NIOServerCnxn$Factory.run Accepted socket connection from /140.211.11.196:56969
[junit4:junit4]   2> 2081 T684 oazs.NIOServerCnxn.readConnectRequest Client attempting to establish new session at /140.211.11.196:56969
[junit4:junit4]   2> 2083 T688 oazs.NIOServerCnxn.finishSessionInit Established session 0x139f32e18860002 with negotiated timeout 5000 for client /140.211.11.196:56969
[junit4:junit4]   2> 2083 T701 oaz.ClientCnxn$SendThread.readConnectResult Session establishment complete on server localhost/127.0.0.1:56962, sessionid = 0x139f32e18860002, negotiated timeout = 5000
[junit4:junit4]   2> 2084 T702 oascc.ConnectionManager.process Watcher org.apache.solr.common.cloud.ConnectionManager@70f9aae name:ZooKeeperConnection Watcher:127.0.0.1:56962/solr got event WatchedEvent state:SyncConnected type:None path:null path:null type:None
[junit4:junit4]   2> 2084 T682 oascc.ConnectionManager.waitForConnected Client is connected to ZooKeeper
[junit4:junit4]   2> 2107 T689 oazs.PrepRequestProcessor.pRequest Got user-level KeeperException when processing sessionid:0x139f32e18860002 type:create cxid:0x2 zxid:0xfffffffffffffffe txntype:unknown reqpath:n/a Error Path:/solr/overseer Error:KeeperErrorCode = NodeExists for /solr/overseer
[junit4:junit4]   2> 2119 T682 oascc.SolrZkClient.makePath makePath: /live_nodes
[junit4:junit4]   2> 2122 T682 oasc.ZkController.createEphemeralLiveNode Register node as live in ZooKeeper:/live_nodes/127.0.0.1:56968_solr
[junit4:junit4]   2> 2130 T689 oazs.PrepRequestProcessor.pRequest Got user-level KeeperException when processing sessionid:0x139f32e18860002 type:delete cxid:0x7 zxid:0xfffffffffffffffe txntype:unknown reqpath:n/a Error Path:/solr/live_nodes/127.0.0.1:56968_solr Error:KeeperErrorCode = NoNode for /solr/live_nodes/127.0.0.1:56968_solr
[junit4:junit4]   2> 2131 T682 oascc.SolrZkClient.makePath makePath: /live_nodes/127.0.0.1:56968_solr
[junit4:junit4]   2> 2135 T682 oashc.HttpShardHandlerFactory.getParameter Setting socketTimeout to: 0
[junit4:junit4]   2> 2135 T682 oashc.HttpShardHandlerFactory.getParameter Setting urlScheme to: http://
[junit4:junit4]   2> 2136 T682 oashc.HttpShardHandlerFactory.getParameter Setting connTimeout to: 0
[junit4:junit4]   2> 2136 T682 oashc.HttpShardHandlerFactory.getParameter Setting maxConnectionsPerHost to: 20
[junit4:junit4]   2> 2137 T682 oashc.HttpShardHandlerFactory.getParameter Setting corePoolSize to: 0
[junit4:junit4]   2> 2137 T682 oashc.HttpShardHandlerFactory.getParameter Setting maximumPoolSize to: 2147483647
[junit4:junit4]   2> 2138 T682 oashc.HttpShardHandlerFactory.getParameter Setting maxThreadIdleTime to: 5
[junit4:junit4]   2> 2139 T682 oashc.HttpShardHandlerFactory.getParameter Setting sizeOfQueue to: -1
[junit4:junit4]   2> 2139 T682 oashc.HttpShardHandlerFactory.getParameter Setting fairnessPolicy to: false
[junit4:junit4]   2> 2140 T682 oascsi.HttpClientUtil.createClient Creating new http client, config:maxConnectionsPerHost=20&maxConnections=10000&socketTimeout=0&connTimeout=0&retry=false
[junit4:junit4]   2> 2159 T682 oascc.SolrZkClient.makePath makePath: /overseer_elect/election
[junit4:junit4]   2> 2183 T689 oazs.PrepRequestProcessor.pRequest Got user-level KeeperException when processing sessionid:0x139f32e18860002 type:delete cxid:0x15 zxid:0xfffffffffffffffe txntype:unknown reqpath:n/a Error Path:/solr/overseer_elect/leader Error:KeeperErrorCode = NoNode for /solr/overseer_elect/leader
[junit4:junit4]   2> 2184 T682 oascc.SolrZkClient.makePath makePath: /overseer_elect/leader
[junit4:junit4]   2> 2194 T682 oasc.Overseer.start Overseer (id=88369047015915522-127.0.0.1:56968_solr-n_0000000000) starting
[junit4:junit4]   2> 2195 T689 oazs.PrepRequestProcessor.pRequest Got user-level KeeperException when processing sessionid:0x139f32e18860002 type:create cxid:0x1a zxid:0xfffffffffffffffe txntype:unknown reqpath:n/a Error Path:/solr/overseer Error:KeeperErrorCode = NodeExists for /solr/overseer
[junit4:junit4]   2> 2211 T689 oazs.PrepRequestProcessor.pRequest Got user-level KeeperException when processing sessionid:0x139f32e18860002 type:create cxid:0x1b zxid:0xfffffffffffffffe txntype:unknown reqpath:n/a Error Path:/solr/overseer Error:KeeperErrorCode = NodeExists for /solr/overseer
[junit4:junit4]   2> 2212 T689 oazs.PrepRequestProcessor.pRequest Got user-level KeeperException when processing sessionid:0x139f32e18860002 type:create cxid:0x1c zxid:0xfffffffffffffffe txntype:unknown reqpath:n/a Error Path:/solr/overseer Error:KeeperErrorCode = NodeExists for /solr/overseer
[junit4:junit4]   2> 2228 T689 oazs.PrepRequestProcessor.pRequest Got user-level KeeperException when processing sessionid:0x139f32e18860002 type:create cxid:0x1d zxid:0xfffffffffffffffe txntype:unknown reqpath:n/a Error Path:/solr/overseer Error:KeeperErrorCode = NodeExists for /solr/overseer
[junit4:junit4]   2> 2230 T704 oasc.OverseerCollectionProcessor.run Process current queue of collection creations
[junit4:junit4]   2> 2230 T682 oascc.SolrZkClient.makePath makePath: /clusterstate.json
[junit4:junit4]   2> 2233 T682 oascc.ZkStateReader.createClusterStateWatchersAndUpdate Updating cluster state from ZooKeeper... 
[junit4:junit4]   2> 2263 T703 oasc.Overseer$ClusterStateUpdater.run Starting to work on the main queue
[junit4:junit4]   2> 2276 T682 oasc.CoreContainer.create Creating SolrCore 'collection1' using instanceDir: /usr/home/hudson/hudson-slave/workspace/Lucene-Solr-Tests-4.x-java7/solr/build/solr-core/test-files/solr/collection1
[junit4:junit4]   2> 2277 T682 oasc.ZkController.createCollectionZkNode Check for collection zkNode:control_collection
[junit4:junit4]   2> 2278 T682 oasc.ZkController.createCollectionZkNode Collection zkNode exists
[junit4:junit4]   2> 2279 T682 oasc.ZkController.readConfigName Load collection config from:/collections/control_collection
[junit4:junit4]   2> 2281 T682 oasc.SolrResourceLoader.<init> new SolrResourceLoader for directory: '/usr/home/hudson/hudson-slave/workspace/Lucene-Solr-Tests-4.x-java7/solr/build/solr-core/test-files/solr/collection1/'
[junit4:junit4]   2> 2283 T682 oasc.SolrResourceLoader.replaceClassLoader Adding 'file:/usr/home/hudson/hudson-slave/workspace/Lucene-Solr-Tests-4.x-java7/solr/build/solr-core/test-files/solr/collection1/lib/README' to classloader
[junit4:junit4]   2> 2284 T682 oasc.SolrResourceLoader.replaceClassLoader Adding 'file:/usr/home/hudson/hudson-slave/workspace/Lucene-Solr-Tests-4.x-java7/solr/build/solr-core/test-files/solr/collection1/lib/classes/' to classloader
[junit4:junit4]   2> 2369 T682 oasc.SolrConfig.<init> Using Lucene MatchVersion: LUCENE_41
[junit4:junit4]   2> 2395 T3 oasc.CoreContainer.finalize SEVERE CoreContainer was not shutdown prior to finalize(), indicates a bug -- POSSIBLE RESOURCE LEAK!!!  instance=866086857
[junit4:junit4]   2> 2459 T682 oasc.SolrConfig.<init> Loaded SolrConfig: solrconfig.xml
[junit4:junit4]   2> 2561 T682 oass.IndexSchema.readSchema Reading Solr Schema
[junit4:junit4]   2> 2570 T682 oass.IndexSchema.readSchema Schema name=test
[junit4:junit4]   2> 3207 T682 oass.OpenExchangeRatesOrgProvider.init Initialized with rates=open-exchange-rates.json, refreshInterval=1440.
[junit4:junit4]   2> 3215 T682 oass.IndexSchema.readSchema default search field in schema is text
[junit4:junit4]   2> 3219 T682 oass.IndexSchema.readSchema unique key field: id
[junit4:junit4]   2> 3237 T682 oass.FileExchangeRateProvider.reload Reloading exchange rates from file currency.xml
[junit4:junit4]   2> 3242 T682 oass.FileExchangeRateProvider.reload Reloading exchange rates from file currency.xml
[junit4:junit4]   2> 3246 T682 oass.OpenExchangeRatesOrgProvider.reload Reloading exchange rates from open-exchange-rates.json
[junit4:junit4]   2> 3248 T682 oass.OpenExchangeRatesOrgProvider.reload Reloading exchange rates from open-exchange-rates.json
[junit4:junit4]   2> 3249 T682 oasc.SolrCore.<init> [collection1] Opening new SolrCore at /usr/home/hudson/hudson-slave/workspace/Lucene-Solr-Tests-4.x-java7/solr/build/solr-core/test-files/solr/collection1/, dataDir=./org.apache.solr.cloud.BasicDistributedZkTest-1348404647752/control/data/
[junit4:junit4]   2> 3250 T682 oasc.JmxMonitoredMap.<init> JMX monitoring is enabled. Adding Solr mbeans to JMX Server: com.sun.jmx.mbeanserver.JmxMBeanServer@56851105
[junit4:junit4]   2> 3278 T682 oasc.SolrCore.getNewIndexDir WARNING New index directory detected: old=null new=./org.apache.solr.cloud.BasicDistributedZkTest-1348404647752/control/data/index/
[junit4:junit4]   2> 3279 T682 oasc.SolrCore.initIndex WARNING [collection1] Solr index directory './org.apache.solr.cloud.BasicDistributedZkTest-1348404647752/control/data/index' doesn't exist. Creating new index...
[junit4:junit4]   2> 3280 T682 oasc.CachingDirectoryFactory.get return new directory for /usr/home/hudson/hudson-slave/workspace/Lucene-Solr-Tests-4.x-java7/solr/build/solr-core/test/J0/./org.apache.solr.cloud.BasicDistributedZkTest-1348404647752/control/data/index forceNew:false
[junit4:junit4]   2> 3312 T682 oasc.SolrDeletionPolicy.onCommit SolrDeletionPolicy.onCommit: commits:num=1
[junit4:junit4]   2> 		commit{dir=/usr/home/hudson/hudson-slave/workspace/Lucene-Solr-Tests-4.x-java7/solr/build/solr-core/test/J0/org.apache.solr.cloud.BasicDistributedZkTest-1348404647752/control/data/index,segFN=segments_1,generation=1,filenames=[segments_1]
[junit4:junit4]   2> 3312 T682 oasc.SolrDeletionPolicy.updateCommits newest commit = 1
[junit4:junit4]   2> 3313 T682 oasc.SolrCore.initWriters created xml: solr.XMLResponseWriter
[junit4:junit4]   2> 3315 T682 oasup.UpdateRequestProcessorChain.init inserting DistributedUpdateProcessorFactory into updateRequestProcessorChain "dedupe"
[junit4:junit4]   2> 3315 T682 oasup.UpdateRequestProcessorChain.init inserting DistributedUpdateProcessorFactory into updateRequestProcessorChain "dedupe-allfields"
[junit4:junit4]   2> 3316 T682 oasup.UpdateRequestProcessorChain.init inserting DistributedUpdateProcessorFactory into updateRequestProcessorChain "stored_sig"
[junit4:junit4]   2> 3316 T682 oasup.UpdateRequestProcessorChain.init inserting DistributedUpdateProcessorFactory into updateRequestProcessorChain "uniq-fields"
[junit4:junit4]   2> 3317 T682 oasup.UpdateRequestProcessorChain.init inserting DistributedUpdateProcessorFactory into updateRequestProcessorChain "distrib-dup-test-chain-implicit"
[junit4:junit4]   2> 3317 T682 oasc.RequestHandlers.initHandlersFromConfig adding lazy requestHandler: solr.ReplicationHandler
[junit4:junit4]   2> 3318 T682 oasc.RequestHandlers.initHandlersFromConfig created /replication: solr.ReplicationHandler
[junit4:junit4]   2> 3318 T682 oasc.RequestHandlers.initHandlersFromConfig created standard: solr.StandardRequestHandler
[junit4:junit4]   2> 3319 T682 oasc.RequestHandlers.initHandlersFromConfig created /get: solr.RealTimeGetHandler
[junit4:junit4]   2> 3320 T682 oasc.RequestHandlers.initHandlersFromConfig created dismax: solr.SearchHandler
[junit4:junit4]   2> 3320 T682 oasc.RequestHandlers.initHandlersFromConfig created mock: org.apache.solr.core.MockQuerySenderListenerReqHandler
[junit4:junit4]   2> 3321 T682 oasc.RequestHandlers.initHandlersFromConfig created /admin/: org.apache.solr.handler.admin.AdminHandlers
[junit4:junit4]   2> 3321 T682 oasc.RequestHandlers.initHandlersFromConfig created defaults: solr.StandardRequestHandler
[junit4:junit4]   2> 3321 T682 oasc.RequestHandlers.initHandlersFromConfig adding lazy requestHandler: solr.StandardRequestHandler
[junit4:junit4]   2> 3322 T682 oasc.RequestHandlers.initHandlersFromConfig created lazy: solr.StandardRequestHandler
[junit4:junit4]   2> 3322 T682 oasc.RequestHandlers.initHandlersFromConfig created /update: solr.UpdateRequestHandler
[junit4:junit4]   2> 3323 T682 oasc.RequestHandlers.initHandlersFromConfig created /terms: org.apache.solr.handler.component.SearchHandler
[junit4:junit4]   2> 3323 T682 oasc.RequestHandlers.initHandlersFromConfig created spellCheckCompRH: org.apache.solr.handler.component.SearchHandler
[junit4:junit4]   2> 3324 T682 oasc.RequestHandlers.initHandlersFromConfig created spellCheckCompRH_Direct: org.apache.solr.handler.component.SearchHandler
[junit4:junit4]   2> 3324 T682 oasc.RequestHandlers.initHandlersFromConfig created spellCheckWithWordbreak: org.apache.solr.handler.component.SearchHandler
[junit4:junit4]   2> 3325 T682 oasc.RequestHandlers.initHandlersFromConfig created spellCheckWithWordbreak_Direct: org.apache.solr.handler.component.SearchHandler
[junit4:junit4]   2> 3326 T682 oasc.RequestHandlers.initHandlersFromConfig created spellCheckCompRH1: org.apache.solr.handler.component.SearchHandler
[junit4:junit4]   2> 3326 T682 oasc.RequestHandlers.initHandlersFromConfig created tvrh: org.apache.solr.handler.component.SearchHandler
[junit4:junit4]   2> 3327 T682 oasc.RequestHandlers.initHandlersFromConfig created /mlt: solr.MoreLikeThisHandler
[junit4:junit4]   2> 3327 T682 oasc.RequestHandlers.initHandlersFromConfig created /debug/dump: solr.DumpRequestHandler
[junit4:junit4]   2> 3330 T682 oashl.XMLLoader.init xsltCacheLifetimeSeconds=60
[junit4:junit4]   2> 3334 T682 oasc.SolrCore.initDeprecatedSupport WARNING solrconfig.xml uses deprecated <admin/gettableFiles>, Please update your config to use the ShowFileRequestHandler.
[junit4:junit4]   2> 3336 T682 oasc.SolrCore.initDeprecatedSupport WARNING adding ShowFileRequestHandler with hidden files: [SCHEMA.XML, OLD_SYNONYMS.TXT, STOPWORDS.TXT, PROTWORDS.TXT, OPEN-EXCHANGE-RATES.JSON, SYNONYMS.TXT, CURRENCY.XML, MAPPING-ISOLATIN1ACCENT.TXT]
[junit4:junit4]   2> 3339 T682 oass.SolrIndexSearcher.<init> Opening Searcher@20411a29 main
[junit4:junit4]   2> 3341 T682 oasu.CommitTracker.<init> Hard AutoCommit: disabled
[junit4:junit4]   2> 3341 T682 oasu.CommitTracker.<init> Soft AutoCommit: disabled
[junit4:junit4]   2> 3342 T682 oashc.SpellCheckComponent.inform Initializing spell checkers
[junit4:junit4]   2> 3353 T682 oass.DirectSolrSpellChecker.init init: {name=direct,classname=DirectSolrSpellChecker,field=lowerfilt,minQueryLength=3}
[junit4:junit4]   2> 3405 T705 oasc.SolrCore.registerSearcher [collection1] Registered new searcher Searcher@20411a29 main{StandardDirectoryReader(segments_1:1)}
[junit4:junit4]   2> 3409 T689 oazs.PrepRequestProcessor.pRequest Got user-level KeeperException when processing sessionid:0x139f32e18860002 type:create cxid:0x56 zxid:0xfffffffffffffffe txntype:unknown reqpath:n/a Error Path:/solr/overseer/queue Error:KeeperErrorCode = NoNode for /solr/overseer/queue
[junit4:junit4]   2> 3421 T682 oasc.CoreContainer.register registering core: collection1
[junit4:junit4]   2> 3421 T682 oasc.ZkController.register Register shard - core:collection1 address:http://127.0.0.1:56968/solr shardId:control_shard
[junit4:junit4]   2> 3432 T682 oascsi.HttpClientUtil.createClient Creating new http client, config:maxConnections=10000&maxConnectionsPerHost=20&connTimeout=30000&socketTimeout=30000&retry=false
[junit4:junit4]   2> 3445 T682 oascc.SolrZkClient.makePath makePath: /collections/control_collection/leader_elect/control_shard/election
[junit4:junit4]   2> 3465 T689 oazs.PrepRequestProcessor.pRequest Got user-level KeeperException when processing sessionid:0x139f32e18860002 type:delete cxid:0x65 zxid:0xfffffffffffffffe txntype:unknown reqpath:n/a Error Path:/solr/collections/control_collection/leaders Error:KeeperErrorCode = NoNode for /solr/collections/control_collection/leaders
[junit4:junit4]   2> 3466 T682 oasc.ShardLeaderElectionContext.runLeaderProcess Running the leader process.
[junit4:junit4]   2> 3467 T689 oazs.PrepRequestProcessor.pRequest Got user-level KeeperException when processing sessionid:0x139f32e18860002 type:create cxid:0x66 zxid:0xfffffffffffffffe txntype:unknown reqpath:n/a Error Path:/solr/overseer Error:KeeperErrorCode = NodeExists for /solr/overseer
[junit4:junit4]   2> 3773 T703 oascc.ZkStateReader.updateClusterState Updating cloud state from ZooKeeper... 
[junit4:junit4]   2> 3786 T689 oazs.PrepRequestProcessor.pRequest Got user-level KeeperException when processing sessionid:0x139f32e18860002 type:create cxid:0x6d zxid:0xfffffffffffffffe txntype:unknown reqpath:n/a Error Path:/solr/overseer/queue-work Error:KeeperErrorCode = NoNode for /solr/overseer/queue-work
[junit4:junit4]   2> 3812 T702 oascc.ZkStateReader$2.process A cluster state change has occurred - updating...
[junit4:junit4]   2> 3971 T682 oasc.ShardLeaderElectionContext.waitForReplicasToComeUp Enough replicas found to continue.
[junit4:junit4]   2> 3972 T682 oasc.ShardLeaderElectionContext.runLeaderProcess I may be the new leader - try and sync
[junit4:junit4]   2> 3973 T682 oasc.SyncStrategy.sync Sync replicas to http://127.0.0.1:56968/solr/collection1/
[junit4:junit4]   2> 3973 T682 oasc.SyncStrategy.syncReplicas Sync Success - now sync replicas to me
[junit4:junit4]   2> 3974 T682 oasc.SyncStrategy.syncToMe http://127.0.0.1:56968/solr/collection1/ has no replicas
[junit4:junit4]   2> 3974 T682 oasc.ShardLeaderElectionContext.runLeaderProcess I am the new leader: http://127.0.0.1:56968/solr/collection1/
[junit4:junit4]   2> 3974 T682 oascc.SolrZkClient.makePath makePath: /collections/control_collection/leaders/control_shard
[junit4:junit4]   2> 3980 T689 oazs.PrepRequestProcessor.pRequest Got user-level KeeperException when processing sessionid:0x139f32e18860002 type:create cxid:0x8b zxid:0xfffffffffffffffe txntype:unknown reqpath:n/a Error Path:/solr/overseer Error:KeeperErrorCode = NodeExists for /solr/overseer
[junit4:junit4]   2> 4319 T703 oascc.ZkStateReader.updateClusterState Updating cloud state from ZooKeeper... 
[junit4:junit4]   2> 4333 T702 oascc.ZkStateReader$2.process A cluster state change has occurred - updating...
[junit4:junit4]   2> 4347 T682 oasc.ZkController.register We are http://127.0.0.1:56968/solr/collection1/ and leader is http://127.0.0.1:56968/solr/collection1/
[junit4:junit4]   2> 4347 T682 oasc.ZkController.register No LogReplay needed for core=collection1 baseURL=http://127.0.0.1:56968/solr
[junit4:junit4]   2> 4348 T682 oasc.ZkController.checkRecovery I am the leader, no recovery necessary
[junit4:junit4]   2> 4350 T682 oascc.ZkStateReader.updateClusterState Updating cloud state from ZooKeeper... 
[junit4:junit4]   2> 4351 T682 oass.SolrDispatchFilter.init user.dir=/usr/home/hudson/hudson-slave/workspace/Lucene-Solr-Tests-4.x-java7/solr/build/solr-core/test/J0
[junit4:junit4]   2> 4351 T682 oass.SolrDispatchFilter.init SolrDispatchFilter.init() done
[junit4:junit4]   2> 4351 T682 oascsi.HttpClientUtil.createClient Creating new http client, config:maxConnections=128&maxConnectionsPerHost=32&followRedirects=false
[junit4:junit4]   2> 4493 T682 oejs.Server.doStart jetty-8.1.2.v20120308
[junit4:junit4]   2> 4496 T682 oejs.AbstractConnector.doStart Started SocketConnector@0.0.0.0:56975
[junit4:junit4]   2> 4496 T682 oasc.SolrResourceLoader.locateSolrHome JNDI not configured for solr (NoInitialContextEx)
[junit4:junit4]   2> 4497 T682 oasc.SolrResourceLoader.locateSolrHome using system property solr.solr.home: /usr/home/hudson/hudson-slave/workspace/Lucene-Solr-Tests-4.x-java7/solr/build/solr-core/test/J0/./solrtest-jetty1-1348404652108
[junit4:junit4]   2> 4497 T682 oasc.SolrResourceLoader.<init> new SolrResourceLoader for deduced Solr Home: '/usr/home/hudson/hudson-slave/workspace/Lucene-Solr-Tests-4.x-java7/solr/build/solr-core/test/J0/./solrtest-jetty1-1348404652108/'
[junit4:junit4]   2> 4529 T682 oass.SolrDispatchFilter.init SolrDispatchFilter.init()
[junit4:junit4]   2> 4530 T682 oasc.SolrResourceLoader.locateSolrHome JNDI not configured for solr (NoInitialContextEx)
[junit4:junit4]   2> 4530 T682 oasc.SolrResourceLoader.locateSolrHome using system property solr.solr.home: /usr/home/hudson/hudson-slave/workspace/Lucene-Solr-Tests-4.x-java7/solr/build/solr-core/test/J0/./solrtest-jetty1-1348404652108
[junit4:junit4]   2> 4531 T682 oasc.CoreContainer$Initializer.initialize looking for solr.xml: /usr/home/hudson/hudson-slave/workspace/Lucene-Solr-Tests-4.x-java7/solr/build/solr-core/test/J0/./solrtest-jetty1-1348404652108/solr.xml
[junit4:junit4]   2> 4531 T682 oasc.CoreContainer.<init> New CoreContainer 1132054018
[junit4:junit4]   2> 4532 T682 oasc.CoreContainer.load Loading CoreContainer using Solr Home: '/usr/home/hudson/hudson-slave/workspace/Lucene-Solr-Tests-4.x-java7/solr/build/solr-core/test/J0/./solrtest-jetty1-1348404652108/'
[junit4:junit4]   2> 4532 T682 oasc.SolrResourceLoader.<init> new SolrResourceLoader for directory: '/usr/home/hudson/hudson-slave/workspace/Lucene-Solr-Tests-4.x-java7/solr/build/solr-core/test/J0/./solrtest-jetty1-1348404652108/'
[junit4:junit4]   2> 4556 T682 oasc.CoreContainer.load Registering Log Listener
[junit4:junit4]   2> 4568 T682 oasc.CoreContainer.initZooKeeper Zookeeper client=127.0.0.1:56962/solr
[junit4:junit4]   2> 4569 T682 oaz.ZooKeeper.<init> Initiating client connection, connectString=127.0.0.1:56962/solr sessionTimeout=5000 watcher=org.apache.solr.common.cloud.ConnectionManager@19a8445e
[junit4:junit4]   2> 4569 T715 oaz.ClientCnxn$SendThread.startConnect Opening socket connection to server /127.0.0.1:56962
[junit4:junit4]   2> 4569 T682 oascc.ConnectionManager.waitForConnected Waiting for client to connect to ZooKeeper
[junit4:junit4]   2> 4571 T715 oaz.ClientCnxn$SendThread.primeConnection Socket connection established to localhost/127.0.0.1:56962, initiating session
[junit4:junit4]   2> 4571 T684 oazs.NIOServerCnxn$Factory.run Accepted socket connection from /140.211.11.196:56976
[junit4:junit4]   2> 4571 T684 oazs.NIOServerCnxn.readConnectRequest Client attempting to establish new session at /140.211.11.196:56976
[junit4:junit4]   2> 4574 T688 oazs.NIOServerCnxn.finishSessionInit Established session 0x139f32e18860003 with negotiated timeout 5000 for client /140.211.11.196:56976
[junit4:junit4]   2> 4574 T715 oaz.ClientCnxn$SendThread.readConnectResult Session establishment complete on server localhost/127.0.0.1:56962, sessionid = 0x139f32e18860003, negotiated timeout = 5000
[junit4:junit4]   2> 4574 T716 oascc.ConnectionManager.process Watcher org.apache.solr.common.cloud.ConnectionManager@19a8445e name:ZooKeeperConnection Watcher:127.0.0.1:56962/solr got event WatchedEvent state:SyncConnected type:None path:null path:null type:None
[junit4:junit4]   2> 4575 T682 oascc.ConnectionManager.waitForConnected Client is connected to ZooKeeper
[junit4:junit4]   2> 4575 T689 oazs.PrepRequestProcessor.pRequest Got user-level KeeperException when processing sessionid:0x139f32e18860003 type:create cxid:0x1 zxid:0xfffffffffffffffe txntype:unknown reqpath:n/a Error Path:/solr/overseer Error:KeeperErrorCode = NodeExists for /solr/overseer
[junit4:junit4]   2> 4589 T689 oazs.PrepRequestProcessor.pRequest Got user-level KeeperException when processing sessionid:0x139f32e18860003 type:create cxid:0x2 zxid:0xfffffffffffffffe txntype:unknown reqpath:n/a Error Path:/solr/overseer Error:KeeperErrorCode = NodeExists for /solr/overseer
[junit4:junit4]   2> 4591 T682 oasc.ZkController.createEphemeralLiveNode Register node as live in ZooKeeper:/live_nodes/127.0.0.1:56975_solr
[junit4:junit4]   2> 4592 T689 oazs.PrepRequestProcessor.pRequest Got user-level KeeperException when processing sessionid:0x139f32e18860003 type:delete cxid:0x4 zxid:0xfffffffffffffffe txntype:unknown reqpath:n/a Error Path:/solr/live_nodes/127.0.0.1:56975_solr Error:KeeperErrorCode = NoNode for /solr/live_nodes/127.0.0.1:56975_solr
[junit4:junit4]   2> 4598 T682 oascc.SolrZkClient.makePath makePath: /live_nodes/127.0.0.1:56975_solr
[junit4:junit4]   2> 4600 T702 oascc.ZkStateReader$3.process Updating live nodes
[junit4:junit4]   2> 4601 T682 oashc.HttpShardHandlerFactory.getParameter Setting socketTimeout to: 0
[junit4:junit4]   2> 4602 T682 oashc.HttpShardHandlerFactory.getParameter Setting urlScheme to: http://
[junit4:junit4]   2> 4602 T682 oashc.HttpShardHandlerFactory.getParameter Setting connTimeout to: 0
[junit4:junit4]   2> 4602 T682 oashc.HttpShardHandlerFactory.getParameter Setting maxConnectionsPerHost to: 20
[junit4:junit4]   2> 4603 T682 oashc.HttpShardHandlerFactory.getParameter Setting corePoolSize to: 0
[junit4:junit4]   2> 4603 T682 oashc.HttpShardHandlerFactory.getParameter Setting maximumPoolSize to: 2147483647
[junit4:junit4]   2> 4604 T682 oashc.HttpShardHandlerFactory.getParameter Setting maxThreadIdleTime to: 5
[junit4:junit4]   2> 4604 T682 oashc.HttpShardHandlerFactory.getParameter Setting sizeOfQueue to: -1
[junit4:junit4]   2> 4604 T682 oashc.HttpShardHandlerFactory.getParameter Setting fairnessPolicy to: false
[junit4:junit4]   2> 4605 T682 oascsi.HttpClientUtil.createClient Creating new http client, config:maxConnectionsPerHost=20&maxConnections=10000&socketTimeout=0&connTimeout=0&retry=false
[junit4:junit4]   2> 4623 T682 oascc.ZkStateReader.createClusterStateWatchersAndUpdate Updating cluster state from ZooKeeper... 
[junit4:junit4]   2> 4629 T682 oasc.CoreContainer.create Creating SolrCore 'collection1' using instanceDir: /usr/home/hudson/hudson-slave/workspace/Lucene-Solr-Tests-4.x-java7/solr/build/solr-core/test/J0/./solrtest-jetty1-1348404652108/collection1
[junit4:junit4]   2> 4629 T682 oasc.ZkController.createCollectionZkNode Check for collection zkNode:collection1
[junit4:junit4]   2> 4630 T682 oasc.ZkController.createCollectionZkNode Collection zkNode exists
[junit4:junit4]   2> 4631 T682 oasc.ZkController.readConfigName Load collection config from:/collections/collection1
[junit4:junit4]   2> 4632 T682 oasc.SolrResourceLoader.<init> new SolrResourceLoader for directory: '/usr/home/hudson/hudson-slave/workspace/Lucene-Solr-Tests-4.x-java7/solr/build/solr-core/test/J0/./solrtest-jetty1-1348404652108/collection1/'
[junit4:junit4]   2> 4633 T682 oasc.SolrResourceLoader.replaceClassLoader Adding 'file:/usr/home/hudson/hudson-slave/workspace/Lucene-Solr-Tests-4.x-java7/solr/build/solr-core/test/J0/solrtest-jetty1-1348404652108/collection1/lib/classes/' to classloader
[junit4:junit4]   2> 4634 T682 oasc.SolrResourceLoader.replaceClassLoader Adding 'file:/usr/home/hudson/hudson-slave/workspace/Lucene-Solr-Tests-4.x-java7/solr/build/solr-core/test/J0/solrtest-jetty1-1348404652108/collection1/lib/README' to classloader
[junit4:junit4]   2> 4682 T682 oasc.SolrConfig.<init> Using Lucene MatchVersion: LUCENE_41
[junit4:junit4]   2> 4730 T682 oasc.SolrConfig.<init> Loaded SolrConfig: solrconfig.xml
[junit4:junit4]   2> 4832 T682 oass.IndexSchema.readSchema Reading Solr Schema
[junit4:junit4]   2> 4838 T682 oass.IndexSchema.readSchema Schema name=test
[junit4:junit4]   2> 4839 T703 oascc.ZkStateReader.updateClusterState Updating cloud state from ZooKeeper... 
[junit4:junit4]   2> 4853 T702 oascc.ZkStateReader$2.process A cluster state change has occurred - updating...
[junit4:junit4]   2> 4853 T716 oascc.ZkStateReader$2.process A cluster state change has occurred - updating...
[junit4:junit4]   2> 5366 T682 oass.OpenExchangeRatesOrgProvider.init Initialized with rates=open-exchange-rates.json, refreshInterval=1440.
[junit4:junit4]   2> 5378 T682 oass.IndexSchema.readSchema default search field in schema is text
[junit4:junit4]   2> 5383 T682 oass.IndexSchema.readSchema unique key field: id
[junit4:junit4]   2> 5400 T682 oass.FileExchangeRateProvider.reload Reloading exchange rates from file currency.xml
[junit4:junit4]   2> 5407 T682 oass.FileExchangeRateProvider.reload Reloading exchange rates from file currency.xml
[junit4:junit4]   2> 5413 T682 oass.OpenExchangeRatesOrgProvider.reload Reloading exchange rates from open-exchange-rates.json
[junit4:junit4]   2> 5415 T682 oass.OpenExchangeRatesOrgProvider.reload Reloading exchange rates from open-exchange-rates.json
[junit4:junit4]   2> 5417 T682 oasc.SolrCore.<init> [collection1] Opening new SolrCore at /usr/home/hudson/hudson-slave/workspace/Lucene-Solr-Tests-4.x-java7/solr/build/solr-core/test/J0/./solrtest-jetty1-1348404652108/collection1/, dataDir=./org.apache.solr.cloud.BasicDistributedZkTest-1348404647752/jetty1/
[junit4:junit4]   2> 5417 T682 oasc.JmxMonitoredMap.<init> JMX monitoring is enabled. Adding Solr mbeans to JMX Server: com.sun.jmx.mbeanserver.JmxMBeanServer@56851105
[junit4:junit4]   2> 5419 T682 oasc.SolrCore.getNewIndexDir WARNING New index directory detected: old=null new=./org.apache.solr.cloud.BasicDistributedZkTest-1348404647752/jetty1/index/
[junit4:junit4]   2> 5420 T682 oasc.SolrCore.initIndex WARNING [collection1] Solr index directory './org.apache.solr.cloud.BasicDistributedZkTest-1348404647752/jetty1/index' doesn't exist. Creating new index...
[junit4:junit4]   2> 5421 T682 oasc.CachingDirectoryFactory.get return new directory for /usr/home/hudson/hudson-slave/workspace/Lucene-Solr-Tests-4.x-java7/solr/build/solr-core/test/J0/./org.apache.solr.cloud.BasicDistributedZkTest-1348404647752/jetty1/index forceNew:false
[junit4:junit4]   2> 5477 T682 oasc.SolrDeletionPolicy.onCommit SolrDeletionPolicy.onCommit: commits:num=1
[junit4:junit4]   2> 		commit{dir=/usr/home/hudson/hudson-slave/workspace/Lucene-Solr-Tests-4.x-java7/solr/build/solr-core/test/J0/org.apache.solr.cloud.BasicDistributedZkTest-1348404647752/jetty1/index,segFN=segments_1,generation=1,filenames=[segments_1]
[junit4:junit4]   2> 5478 T682 oasc.SolrDeletionPolicy.updateCommits newest commit = 1
[junit4:junit4]   2> 5479 T682 oasc.SolrCore.initWriters created xml: solr.XMLResponseWriter
[junit4:junit4]   2> 5481 T682 oasup.UpdateRequestProcessorChain.init inserting DistributedUpdateProcessorFactory into updateRequestProcessorChain "dedupe"
[junit4:junit4]   2> 5482 T682 oasup.UpdateRequestProcessorChain.init inserting DistributedUpdateProcessorFactory into updateRequestProcessorChain "dedupe-allfields"
[junit4:junit4]   2> 5482 T682 oasup.UpdateRequestProcessorChain.init inserting DistributedUpdateProcessorFactory into updateRequestProcessorChain "stored_sig"
[junit4:junit4]   2> 5483 T682 oasup.UpdateRequestProcessorChain.init inserting DistributedUpdateProcessorFactory into updateRequestProcessorChain "uniq-fields"
[junit4:junit4]   2> 5483 T682 oasup.UpdateRequestProcessorChain.init inserting DistributedUpdateProcessorFactory into updateRequestProcessorChain "distrib-dup-test-chain-implicit"
[junit4:junit4]   2> 5484 T682 oasc.RequestHandlers.initHandlersFromConfig adding lazy requestHandler: solr.ReplicationHandler
[junit4:junit4]   2> 5484 T682 oasc.RequestHandlers.initHandlersFromConfig created /replication: solr.ReplicationHandler
[junit4:junit4]   2> 5485 T682 oasc.RequestHandlers.initHandlersFromConfig created standard: solr.StandardRequestHandler
[junit4:junit4]   2> 5485 T682 oasc.RequestHandlers.initHandlersFromConfig created /get: solr.RealTimeGetHandler
[junit4:junit4]   2> 5486 T682 oasc.RequestHandlers.initHandlersFromConfig created dismax: solr.SearchHandler
[junit4:junit4]   2> 5487 T682 oasc.RequestHandlers.initHandlersFromConfig created mock: org.apache.solr.core.MockQuerySenderListenerReqHandler
[junit4:junit4]   2> 5487 T682 oasc.RequestHandlers.initHandlersFromConfig created /admin/: org.apache.solr.handler.admin.AdminHandlers
[junit4:junit4]   2> 5488 T682 oasc.RequestHandlers.initHandlersFromConfig created defaults: solr.StandardRequestHandler
[junit4:junit4]   2> 5488 T682 oasc.RequestHandlers.initHandlersFromConfig adding lazy requestHandler: solr.StandardRequestHandler
[junit4:junit4]   2> 5489 T682 oasc.RequestHandlers.initHandlersFromConfig created lazy: solr.StandardRequestHandler
[junit4:junit4]   2> 5489 T682 oasc.RequestHandlers.initHandlersFromConfig created /update: solr.UpdateRequestHandler
[junit4:junit4]   2> 5490 T682 oasc.RequestHandlers.initHandlersFromConfig created /terms: org.apache.solr.handler.component.SearchHandler
[junit4:junit4]   2> 5490 T682 oasc.RequestHandlers.initHandlersFromConfig created spellCheckCompRH: org.apache.solr.handler.component.SearchHandler
[junit4:junit4]   2> 5491 T682 oasc.RequestHandlers.initHandlersFromConfig created spellCheckCompRH_Direct: org.apache.solr.handler.component.SearchHandler
[junit4:junit4]   2> 5492 T682 oasc.RequestHandlers.initHandlersFromConfig created spellCheckWithWordbreak: org.apache.solr.handler.component.SearchHandler
[junit4:junit4]   2> 5492 T682 oasc.RequestHandlers.initHandlersFromConfig created spellCheckWithWordbreak_Direct: org.apache.solr.handler.component.SearchHandler
[junit4:junit4]   2> 5493 T682 oasc.RequestHandlers.initHandlersFromConfig created spellCheckCompRH1: org.apache.solr.handler.component.SearchHandler
[junit4:junit4]   2> 5493 T682 oasc.RequestHandlers.initHandlersFromConfig created tvrh: org.apache.solr.handler.component.SearchHandler
[junit4:junit4]   2> 5494 T682 oasc.RequestHandlers.initHandlersFromConfig created /mlt: solr.MoreLikeThisHandler
[junit4:junit4]   2> 5494 T682 oasc.RequestHandlers.initHandlersFromConfig created /debug/dump: solr.DumpRequestHandler
[junit4:junit4]   2> 5497 T682 oashl.XMLLoader.init xsltCacheLifetimeSeconds=60
[junit4:junit4]   2> 5500 T682 oasc.SolrCore.initDeprecatedSupport WARNING solrconfig.xml uses deprecated <admin/gettableFiles>, Please update your config to use the ShowFileRequestHandler.
[junit4:junit4]   2> 5502 T682 oasc.SolrCore.initDeprecatedSupport WARNING adding ShowFileRequestHandler with hidden files: [SCHEMA.XML, OLD_SYNONYMS.TXT, STOPWORDS.TXT, PROTWORDS.TXT, OPEN-EXCHANGE-RATES.JSON, SYNONYMS.TXT, CURRENCY.XML, MAPPING-ISOLATIN1ACCENT.TXT]
[junit4:junit4]   2> 5504 T682 oass.SolrIndexSearcher.<init> Opening Searcher@1a966bb5 main
[junit4:junit4]   2> 5506 T682 oasu.CommitTracker.<init> Hard AutoCommit: disabled
[junit4:junit4]   2> 5506 T682 oasu.CommitTracker.<init> Soft AutoCommit: disabled
[junit4:junit4]   2> 5507 T682 oashc.SpellCheckComponent.inform Initializing spell checkers
[junit4:junit4]   2> 5539 T682 oass.DirectSolrSpellChecker.init init: {name=direct,classname=DirectSolrSpellChecker,field=lowerfilt,minQueryLength=3}
[junit4:junit4]   2> 5687 T717 oasc.SolrCore.registerSearcher [collection1] Registered new searcher Searcher@1a966bb5 main{StandardDirectoryReader(segments_1:1)}
[junit4:junit4]   2> 5862 T703 oascc.ZkStateReader.updateClusterState Updating cloud state from ZooKeeper... 
[junit4:junit4]   2> 5892 T702 oascc.ZkStateReader$2.process A cluster state change has occurred - updating...
[junit4:junit4]   2> 5892 T716 oascc.ZkStateReader$2.process A cluster state change has occurred - updating...
[junit4:junit4]   2> 6233 T682 oasc.CoreContainer.register registering core: collection1
[junit4:junit4]   2> 6234 T682 oasc.ZkController.register Register shard - core:collection1 address:http://127.0.0.1:56975/solr shardId:shard1
[junit4:junit4]   2> 6235 T682 oascc.SolrZkClient.makePath makePath: /collections/collection1/leader_elect/shard1/election
[junit4:junit4]   2> 6260 T689 oazs.PrepRequestProcessor.pRequest Got user-level KeeperException when processing sessionid:0x139f32e18860003 type:delete cxid:0x43 zxid:0xfffffffffffffffe txntype:unknown reqpath:n/a Error Path:/solr/collections/collection1/leaders Error:KeeperErrorCode = NoNode for /solr/collections/collection1/leaders
[junit4:junit4]   2> 6261 T682 oasc.ShardLeaderElectionContext.runLeaderProcess Running the leader process.
[junit4:junit4]   2> 6262 T689 oazs.PrepRequestProcessor.pRequest Got user-level KeeperException when processing sessionid:0x139f32e18860003 type:create cxid:0x44 zxid:0xfffffffffffffffe txntype:unknown reqpath:n/a Error Path:/solr/overseer Error:KeeperErrorCode = NodeExists for /solr/overseer
[junit4:junit4]   2> 6272 T682 oasc.ShardLeaderElectionContext.waitForReplicasToComeUp Enough replicas found to continue.
[junit4:junit4]   2> 6273 T682 oasc.ShardLeaderElectionContext.runLeaderProcess I may be the new leader - try and sync
[junit4:junit4]   2> 6273 T682 oasc.SyncStrategy.sync Sync replicas to http://127.0.0.1:56975/solr/collection1/
[junit4:junit4]   2> 6274 T682 oasc.SyncStrategy.syncReplicas Sync Success - now sync replicas to me
[junit4:junit4]   2> 6274 T682 oasc.SyncStrategy.syncToMe http://127.0.0.1:56975/solr/collection1/ has no replicas
[junit4:junit4]   2> 6275 T682 oasc.ShardLeaderElectionContext.runLeaderProcess I am the new leader: http://127.0.0.1:56975/solr/collection1/
[junit4:junit4]   2> 6275 T682 oascc.SolrZkClient.makePath makePath: /collections/collection1/leaders/shard1
[junit4:junit4]   2> 6283 T689 oazs.PrepRequestProcessor.pRequest Got user-level KeeperException when processing sessionid:0x139f32e18860003 type:create cxid:0x4e zxid:0xfffffffffffffffe txntype:unknown reqpath:n/a Error Path:/solr/overseer Error:KeeperErrorCode = NodeExists for /solr/overseer
[junit4:junit4]   2> 6399 T703 oascc.ZkStateReader.updateClusterState Updating cloud state from ZooKeeper... 
[junit4:junit4]   2> 6420 T702 oascc.ZkStateReader$2.process A cluster state change has occurred - updating...
[junit4:junit4]   2> 6420 T716 oascc.ZkStateReader$2.process A cluster state change has occurred - updating...
[junit4:junit4]   2> 6445 T682 oasc.ZkController.register We are http://127.0.0.1:56975/solr/collection1/ and leader is http://127.0.0.1:56975/solr/collection1/
[junit4:junit4]   2> 6445 T682 oasc.ZkController.register No LogReplay needed for core=collection1 baseURL=http://127.0.0.1:56975/solr
[junit4:junit4]   2> 6446 T682 oasc.ZkController.checkRecovery I am the leader, no recovery necessary
[junit4:junit4]   2> 6448 T682 oascc.ZkStateReader.updateClusterState Updating cloud state from ZooKeeper... 
[junit4:junit4]   2> 6450 T682 oass.SolrDispatchFilter.init user.dir=/usr/home/hudson/hudson-slave/workspace/Lucene-Solr-Tests-4.x-java7/solr/build/solr-core/test/J0
[junit4:junit4]   2> 6450 T682 oass.SolrDispatchFilter.init SolrDispatchFilter.init() done
[junit4:junit4]   2> 6451 T682 oascsi.HttpClientUtil.createClient Creating new http client, config:maxConnections=128&maxConnectionsPerHost=32&followRedirects=false
[junit4:junit4]   2> 6669 T682 oejs.Server.doStart jetty-8.1.2.v20120308
[junit4:junit4]   2> 6672 T682 oejs.AbstractConnector.doStart Started SocketConnector@0.0.0.0:56978
[junit4:junit4]   2> 6673 T682 oasc.SolrResourceLoader.locateSolrHome JNDI not configured for solr (NoInitialContextEx)
[junit4:junit4]   2> 6674 T682 oasc.SolrResourceLoader.locateSolrHome using system property solr.solr.home: /usr/home/hudson/hudson-slave/workspace/Lucene-Solr-Tests-4.x-java7/solr/build/solr-core/test/J0/./solrtest-jetty2-1348404654217
[junit4:junit4]   2> 6674 T682 oasc.SolrResourceLoader.<init> new SolrResourceLoader for deduced Solr Home: '/usr/home/hudson/hudson-slave/workspace/Lucene-Solr-Tests-4.x-java7/solr/build/solr-core/test/J0/./solrtest-jetty2-1348404654217/'
[junit4:junit4]   2> 6719 T682 oass.SolrDispatchFilter.init SolrDispatchFilter.init()
[junit4:junit4]   2> 6720 T682 oasc.SolrResourceLoader.locateSolrHome JNDI not configured for solr (NoInitialContextEx)
[junit4:junit4]   2> 6721 T682 oasc.SolrResourceLoader.locateSolrHome using system property solr.solr.home: /usr/home/hudson/hudson-slave/workspace/Lucene-Solr-Tests-4.x-java7/solr/build/solr-core/test/J0/./solrtest-jetty2-1348404654217
[junit4:junit4]   2> 6721 T682 oasc.CoreContainer$Initializer.initialize looking for solr.xml: /usr/home/hudson/hudson-slave/workspace/Lucene-Solr-Tests-4.x-java7/solr/build/solr-core/test/J0/./solrtest-jetty2-1348404654217/solr.xml
[junit4:junit4]   2> 6722 T682 oasc.CoreContainer.<init> New CoreContainer 2016819417
[junit4:junit4]   2> 6723 T682 oasc.CoreContainer.load Loading CoreContainer using Solr Home: '/usr/home/hudson/hudson-slave/workspace/Lucene-Solr-Tests-4.x-java7/solr/build/solr-core/test/J0/./solrtest-jetty2-1348404654217/'
[junit4:junit4]   2> 6723 T682 oasc.SolrResourceLoader.<init> new SolrResourceLoader for directory: '/usr/home/hudson/hudson-slave/workspace/Lucene-Solr-Tests-4.x-java7/solr/build/solr-core/test/J0/./solrtest-jetty2-1348404654217/'
[junit4:junit4]   2> 6759 T682 oasc.CoreContainer.load Registering Log Listener
[junit4:junit4]   2> 6776 T682 oasc.CoreContainer.initZooKeeper Zookeeper client=127.0.0.1:56962/solr
[junit4:junit4]   2> 6778 T682 oaz.ZooKeeper.<init> Initiating client connection, connectString=127.0.0.1:56962/solr sessionTimeout=5000 watcher=org.apache.solr.common.cloud.ConnectionManager@db27fb2
[junit4:junit4]   2> 6779 T727 oaz.ClientCnxn$SendThread.startConnect Opening socket connection to server /127.0.0.1:56962
[junit4:junit4]   2> 6779 T682 oascc.ConnectionManager.waitForConnected Waiting for client to connect to ZooKeeper
[junit4:junit4]   2> 6780 T727 oaz.ClientCnxn$SendThread.primeConnection Socket connection established to localhost/127.0.0.1:56962, initiating session
[junit4:junit4]   2> 6780 T684 oazs.NIOServerCnxn$Factory.run Accepted socket connection from /140.211.11.196:56979
[junit4:junit4]   2> 6781 T684 oazs.NIOServerCnxn.readConnectRequest Client attempting to establish new session at /140.211.11.196:56979
[junit4:junit4]   2> 6783 T688 oazs.NIOServerCnxn.finishSessionInit Established session 0x139f32e18860004 with negotiated timeout 5000 for client /140.211.11.196:56979
[junit4:junit4]   2> 6783 T727 oaz.ClientCnxn$SendThread.readConnectResult Session establishment complete on server localhost/127.0.0.1:56962, sessionid = 0x139f32e18860004, negotiated timeout = 5000
[junit4:junit4]   2> 6784 T728 oascc.ConnectionManager.process Watcher org.apache.solr.common.cloud.ConnectionManager@db27fb2 name:ZooKeeperConnection Watcher:127.0.0.1:56962/solr got event WatchedEvent state:SyncConnected type:None path:null path:null type:None
[junit4:junit4]   2> 6784 T682 oascc.ConnectionManager.waitForConnected Client is connected to ZooKeeper
[junit4:junit4]   2> 6786 T689 oazs.PrepRequestProcessor.pRequest Got user-level KeeperException when processing sessionid:0x139f32e18860004 type:create cxid:0x1 zxid:0xfffffffffffffffe txntype:unknown reqpath:n/a Error Path:/solr/overseer Error:KeeperErrorCode = NodeExists for /solr/overseer
[junit4:junit4]   2> 6796 T689 oazs.PrepRequestProcessor.pRequest Got user-level KeeperException when processing sessionid:0x139f32e18860004 type:create cxid:0x2 zxid:0xfffffffffffffffe txntype:unknown reqpath:n/a Error Path:/solr/overseer Error:KeeperErrorCode = NodeExists for /solr/overseer
[junit4:junit4]   2> 6798 T682 oasc.ZkController.createEphemeralLiveNode Register node as live in ZooKeeper:/live_nodes/127.0.0.1:56978_solr
[junit4:junit4]   2> 6799 T689 oazs.PrepRequestProcessor.pRequest Got user-level KeeperException when processing sessionid:0x139f32e18860004 type:delete cxid:0x4 zxid:0xfffffffffffffffe txntype:unknown reqpath:n/a Error Path:/solr/live_nodes/127.0.0.1:56978_solr Error:KeeperErrorCode = NoNode for /solr/live_nodes/127.0.0.1:56978_solr
[junit4:junit4]   2> 6801 T682 oascc.SolrZkClient.makePath makePath: /live_nodes/127.0.0.1:56978_solr
[junit4:junit4]   2> 6804 T702 oascc.ZkStateReader$3.process Updating live nodes
[junit4:junit4]   2> 6804 T716 oascc.ZkStateReader$3.process Updating live nodes
[junit4:junit4]   2> 6806 T682 oashc.HttpShardHandlerFactory.getParameter Setting socketTimeout to: 0
[junit4:junit4]   2> 6806 T682 oashc.HttpShardHandlerFactory.getParameter Setting urlScheme to: http://
[junit4:junit4]   2> 6807 T682 oashc.HttpShardHandlerFactory.getParameter Setting connTimeout to: 0
[junit4:junit4]   2> 6807 T682 oashc.HttpShardHandlerFactory.getParameter Setting maxConnectionsPerHost to: 20
[junit4:junit4]   2> 6808 T682 oashc.HttpShardHandlerFactory.getParameter Setting corePoolSize to: 0
[junit4:junit4]   2> 6808 T682 oashc.HttpShardHandlerFactory.getParameter Setting maximumPoolSize to: 2147483647
[junit4:junit4]   2> 6809 T682 oashc.HttpShardHandlerFactory.getParameter Setting maxThreadIdleTime to: 5
[junit4:junit4]   2> 6810 T682 oashc.HttpShardHandlerFactory.getParameter Setting sizeOfQueue to: -1
[junit4:junit4]   2> 6810 T682 oashc.HttpShardHandlerFactory.getParameter Setting fairnessPolicy to: false
[junit4:junit4]   2> 6811 T682 oascsi.HttpClientUtil.createClient Creating new http client, config:maxConnectionsPerHost=20&maxConnections=10000&socketTimeout=0&connTimeout=0&retry=false
[junit4:junit4]   2> 6888 T682 oascc.ZkStateReader.createClusterStateWatchersAndUpdate Updating cluster state from ZooKeeper... 
[junit4:junit4]   2> 6896 T682 oasc.CoreContainer.create Creating SolrCore 'collection1' using instanceDir: /usr/home/hudson/hudson-slave/workspace/Lucene-Solr-Tests-4.x-java7/solr/build/solr-core/test/J0/./solrtest-jetty2-1348404654217/collection1
[junit4:junit4]   2> 6897 T682 oasc.ZkController.createCollectionZkNode Check for collection zkNode:collection1
[junit4:junit4]   2> 6898 T682 oasc.ZkController.createCollectionZkNode Collection zkNode exists
[junit4:junit4]   2> 6898 T682 oasc.ZkController.readConfigName Load collection config from:/collections/collection1
[junit4:junit4]   2> 6900 T682 oasc.SolrResourceLoader.<init> new SolrResourceLoader for directory: '/usr/home/hudson/hudson-slave/workspace/Lucene-Solr-Tests-4.x-java7/solr/build/solr-core/test/J0/./solrtest-jetty2-1348404654217/collection1/'
[junit4:junit4]   2> 6902 T682 oasc.SolrResourceLoader.replaceClassLoader Adding 'file:/usr/home/hudson/hudson-slave/workspace/Lucene-Solr-Tests-4.x-java7/solr/build/solr-core/test/J0/solrtest-jetty2-1348404654217/collection1/lib/README' to classloader
[junit4:junit4]   2> 6903 T682 oasc.SolrResourceLoader.replaceClassLoader Adding 'file:/usr/home/hudson/hudson-slave/workspace/Lucene-Solr-Tests-4.x-java7/solr/build/solr-core/test/J0/solrtest-jetty2-1348404654217/collection1/lib/classes/' to classloader
[junit4:junit4]   2> 6934 T703 oascc.ZkStateReader.updateClusterState Updating cloud state from ZooKeeper... 
[junit4:junit4]   2> 6948 T702 oascc.ZkStateReader$2.process A cluster state change has occurred - updating...
[junit4:junit4]   2> 6948 T716 oascc.ZkStateReader$2.process A cluster state change has occurred - updating...
[junit4:junit4]   2> 6948 T728 oascc.ZkStateReader$2.process A cluster state change has occurred - updating...
[junit4:junit4]   2> 6960 T682 oasc.SolrConfig.<init> Using Lucene MatchVersion: LUCENE_41
[junit4:junit4]   2> 7035 T682 oasc.SolrConfig.<init> Loaded SolrConfig: solrconfig.xml
[junit4:junit4]   2> 7137 T682 oass.IndexSchema.readSchema Reading Solr Schema
[junit4:junit4]   2> 7144 T682 oass.IndexSchema.readSchema Schema name=test
[junit4:junit4]   2> 7778 T682 oass.OpenExchangeRatesOrgProvider.init Initialized with rates=open-exchange-rates.json, refreshInterval=1440.
[junit4:junit4]   2> 7787 T682 oass.IndexSchema.readSchema default search field in schema is text
[junit4:junit4]   2> 7790 T682 oass.IndexSchema.readSchema unique key field: id
[junit4:junit4]   2> 7804 T682 oass.FileExchangeRateProvider.reload Reloading exchange rates from file currency.xml
[junit4:junit4]   2> 7808 T682 oass.FileExchangeRateProvider.reload Reloading exchange rates from file currency.xml
[junit4:junit4]   2> 7813 T682 oass.OpenExchangeRatesOrgProvider.reload Reloading exchange rates from open-exchange-rates.json
[junit4:junit4]   2> 7814 T682 oass.OpenExchangeRatesOrgProvider.reload Reloading exchange rates from open-exchange-rates.json
[junit4:junit4]   2> 7815 T682 oasc.SolrCore.<init> [collection1] Opening new SolrCore at /usr/home/hudson/hudson-slave/workspace/Lucene-Solr-Tests-4.x-java7/solr/build/solr-core/test/J0/./solrtest-jetty2-1348404654217/collection1/, dataDir=./org.apache.solr.cloud.BasicDistributedZkTest-1348404647752/jetty2/
[junit4:junit4]   2> 7816 T682 oasc.JmxMonitoredMap.<init> JMX monitoring is enabled. Adding Solr mbeans to JMX Server: com.sun.jmx.mbeanserver.JmxMBeanServer@56851105
[junit4:junit4]   2> 7817 T682 oasc.SolrCore.getNewIndexDir WARNING New index directory detected: old=null new=./org.apache.solr.cloud.BasicDistributedZkTest-1348404647752/jetty2/index/
[junit4:junit4]   2> 7818 T682 oasc.SolrCore.initIndex WARNING [collection1] Solr index directory './org.apache.solr.cloud.BasicDistributedZkTest-1348404647752/jetty2/index' doesn't exist. Creating new index...
[junit4:junit4]   2> 7819 T682 oasc.CachingDirectoryFactory.get return new directory for /usr/home/hudson/hudson-slave/workspace/Lucene-Solr-Tests-4.x-java7/solr/build/solr-core/test/J0/./org.apache.solr.cloud.BasicDistributedZkTest-1348404647752/jetty2/index forceNew:false
[junit4:junit4]   2> 7851 T682 oasc.SolrDeletionPolicy.onCommit SolrDeletionPolicy.onCommit: commits:num=1
[junit4:junit4]   2> 		commit{dir=/usr/home/hudson/hudson-slave/workspace/Lucene-Solr-Tests-4.x-java7/solr/build/solr-core/test/J0/org.apache.solr.cloud.BasicDistributedZkTest-1348404647752/jetty2/index,segFN=segments_1,generation=1,filenames=[segments_1]
[junit4:junit4]   2> 7852 T682 oasc.SolrDeletionPolicy.updateCommits newest commit = 1
[junit4:junit4]   2> 7852 T682 oasc.SolrCore.initWriters created xml: solr.XMLResponseWriter
[junit4:junit4]   2> 7854 T682 oasup.UpdateRequestProcessorChain.init inserting DistributedUpdateProcessorFactory into updateRequestProcessorChain "dedupe"
[junit4:junit4]   2> 7855 T682 oasup.UpdateRequestProcessorChain.init inserting DistributedUpdateProcessorFactory into updateRequestProcessorChain "dedupe-allfields"
[junit4:junit4]   2> 7855 T682 oasup.UpdateRequestProcessorChain.init inserting DistributedUpdateProcessorFactory into updateRequestProcessorChain "stored_sig"
[junit4:junit4]   2> 7856 T682 oasup.UpdateRequestProcessorChain.init inserting DistributedUpdateProcessorFactory into updateRequestProcessorChain "uniq-fields"
[junit4:junit4]   2> 7857 T682 oasup.UpdateRequestProcessorChain.init inserting DistributedUpdateProcessorFactory into updateRequestProcessorChain "distrib-dup-test-chain-implicit"
[junit4:junit4]   2> 7857 T682 oasc.RequestHandlers.initHandlersFromConfig adding lazy requestHandler: solr.ReplicationHandler
[junit4:junit4]   2> 7857 T682 oasc.RequestHandlers.initHandlersFromConfig created /replication: solr.ReplicationHandler
[junit4:junit4]   2> 7858 T682 oasc.RequestHandlers.initHandlersFromConfig created standard: solr.StandardRequestHandler
[junit4:junit4]   2> 7859 T682 oasc.RequestHandlers.initHandlersFromConfig created /get: solr.RealTimeGetHandler
[junit4:junit4]   2> 7859 T682 oasc.RequestHandlers.initHandlersFromConfig created dismax: solr.SearchHandler
[junit4:junit4]   2> 7860 T682 oasc.RequestHandlers.initHandlersFromConfig created mock: org.apache.solr.core.MockQuerySenderListenerReqHandler
[junit4:junit4]   2> 7860 T682 oasc.RequestHandlers.initHandlersFromConfig created /admin/: org.apache.solr.handler.admin.AdminHandlers
[junit4:junit4]   2> 7861 T682 oasc.RequestHandlers.initHandlersFromConfig created defaults: solr.StandardRequestHandler
[junit4:junit4]   2> 7861 T682 oasc.RequestHandlers.initHandlersFromConfig adding lazy requestHandler: solr.StandardRequestHandler
[junit4:junit4]   2> 7862 T682 oasc.RequestHandlers.initHandlersFromConfig created lazy: solr.StandardRequestHandler
[junit4:junit4]   2> 7862 T682 oasc.RequestHandlers.initHandlersFromConfig created /update: solr.UpdateRequestHandler
[junit4:junit4]   2> 7863 T682 oasc.RequestHandlers.initHandlersFromConfig created /terms: org.apache.solr.handler.component.SearchHandler
[junit4:junit4]   2> 7864 T682 oasc.RequestHandlers.initHandlersFromConfig created spellCheckCompRH: org.apache.solr.handler.component.SearchHandler
[junit4:junit4]   2> 7864 T682 oasc.RequestHandlers.initHandlersFromConfig created spellCheckCompRH_Direct: org.apache.solr.handler.component.SearchHandler
[junit4:junit4]   2> 7865 T682 oasc.RequestHandlers.initHandlersFromConfig created spellCheckWithWordbreak: org.apache.solr.handler.component.SearchHandler
[junit4:junit4]   2> 7865 T682 oasc.RequestHandlers.initHandlersFromConfig created spellCheckWithWordbreak_Direct: org.apache.solr.handler.component.SearchHandler
[junit4:junit4]   2> 7866 T682 oasc.RequestHandlers.initHandlersFromConfig created spellCheckCompRH1: org.apache.solr.handler.component.SearchHandler
[junit4:junit4]   2> 7866 T682 oasc.RequestHandlers.initHandlersFromConfig created tvrh: org.apache.solr.handler.component.SearchHandler
[junit4:junit4]   2> 7867 T682 oasc.RequestHandlers.initHandlersFromConfig created /mlt: solr.MoreLikeThisHandler
[junit4:junit4]   2> 7867 T682 oasc.RequestHandlers.initHandlersFromConfig created /debug/dump: solr.DumpRequestHandler
[junit4:junit4]   2> 7870 T682 oashl.XMLLoader.init xsltCacheLifetimeSeconds=60
[junit4:junit4]   2> 7874 T682 oasc.SolrCore.initDeprecatedSupport WARNING solrconfig.xml uses deprecated <admin/gettableFiles>, Please update your config to use the ShowFileRequestHandler.
[junit4:junit4]   2> 7876 T682 oasc.SolrCore.initDeprecatedSupport WARNING adding ShowFileRequestHandler with hidden files: [SCHEMA.XML, OLD_SYNONYMS.TXT, STOPWORDS.TXT, PROTWORDS.TXT, OPEN-EXCHANGE-RATES.JSON, SYNONYMS.TXT, CURRENCY.XML, MAPPING-ISOLATIN1ACCENT.TXT]
[junit4:junit4]   2> 7879 T682 oass.SolrIndexSearcher.<init> Opening Searcher@39b420df main
[junit4:junit4]   2> 7880 T682 oasu.CommitTracker.<init> Hard AutoCommit: disabled
[junit4:junit4]   2> 7881 T682 oasu.CommitTracker.<init> Soft AutoCommit: disabled
[junit4:junit4]   2> 7881 T682 oashc.SpellCheckComponent.inform Initializing spell checkers
[junit4:junit4]   2> 7889 T682 oass.DirectSolrSpellChecker.init init: {name=direct,classname=DirectSolrSpellChecker,field=lowerfilt,minQueryLength=3}
[junit4:junit4]   2> 7935 T729 oasc.SolrCore.registerSearcher [collection1] Registered new searcher Searcher@39b420df main{StandardDirectoryReader(segments_1:1)}
[junit4:junit4]   2> 7963 T703 oascc.ZkStateReader.updateClusterState Updating cloud state from ZooKeeper... 
[junit4:junit4]   2> 7968 T728 oascc.ZkStateReader$2.process A cluster state change has occurred - updating...
[junit4:junit4]   2> 7969 T716 oascc.ZkStateReader$2.process A cluster state change has occurred - updating...
[junit4:junit4]   2> 7968 T702 oascc.ZkStateReader$2.process A cluster state change has occurred - updating...
[junit4:junit4]   2> 8442 T682 oasc.CoreContainer.register registering core: collection1
[junit4:junit4]   2> 8442 T682 oasc.ZkController.register Register shard - core:collection1 address:http://127.0.0.1:56978/solr shardId:shard2
[junit4:junit4]   2> 8444 T682 oascc.SolrZkClient.makePath makePath: /collections/collection1/leader_elect/shard2/election
[junit4:junit4]   2> 8461 T689 oazs.PrepRequestProcessor.pRequest Got user-level KeeperException when processing sessionid:0x139f32e18860004 type:delete cxid:0x42 zxid:0xfffffffffffffffe txntype:unknown reqpath:n/a Error Path:/solr/collections/collection1/leaders/shard2 Error:KeeperErrorCode = NoNode for /solr/collections/collection1/leaders/shard2
[junit4:junit4]   2> 8462 T682 oasc.ShardLeaderElectionContext.runLeaderProcess Running the leader process.
[junit4:junit4]   2> 8462 T689 oazs.PrepRequestProcessor.pRequest Got user-level KeeperException when processing sessionid:0x139f32e18860004 type:create cxid:0x43 zxid:0xfffffffffffffffe txntype:unknown reqpath:n/a Error Path:/solr/overseer Error:KeeperErrorCode = NodeExists for /solr/overseer
[junit4:junit4]   2> 8464 T682 oasc.ShardLeaderElectionContext.waitForReplicasToComeUp Enough replicas found to continue.
[junit4:junit4]   2> 8465 T682 oasc.ShardLeaderElectionContext.runLeaderProcess I may be the new leader - try and sync
[junit4:junit4]   2> 8465 T682 oasc.SyncStrategy.sync Sync replicas to http://127.0.0.1:56978/solr/collection1/
[junit4:junit4]   2> 8466 T682 oasc.SyncStrategy.syncReplicas Sync Success - now sync replicas to me
[junit4:junit4]   2> 8466 T682 oasc.SyncStrategy.syncToMe http://127.0.0.1:56978/solr/collection1/ has no replicas
[junit4:junit4]   2> 8466 T682 oasc.ShardLeaderElectionContext.runLeaderProcess I am the new leader: http://127.0.0.1:56978/solr/collection1/
[junit4:junit4]   2> 8467 T682 oascc.SolrZkClient.makePath makePath: /collections/collection1/leaders/shard2
[junit4:junit4]   2> 8470 T689 oazs.PrepRequestProcessor.pRequest Got user-level KeeperException when processing sessionid:0x139f32e18860004 type:create cxid:0x4c zxid:0xfffffffffffffffe txntype:unknown reqpath:n/a Error Path:/solr/overseer Error:KeeperErrorCode = NodeExists for /solr/overseer
[junit4:junit4]   2> 8488 T703 oascc.ZkStateReader.updateClusterState Updating cloud state from ZooKeeper... 
[junit4:junit4]   2> 8496 T728 oascc.ZkStateReader$2.process A cluster state change has occurred - updating...
[junit4:junit4]   2> 8496 T702 oascc.ZkStateReader$2.process A cluster state change has occurred - updating...
[junit4:junit4]   2> 8497 T716 oascc.ZkStateReader$2.process A cluster state change has occurred - updating...
[junit4:junit4]   2> 8523 T682 oasc.ZkController.register We are http://127.0.0.1:56978/solr/collection1/ and leader is http://127.0.0.1:56978/solr/collection1/
[junit4:junit4]   2> 8523 T682 oasc.ZkController.register No LogReplay needed for core=collection1 baseURL=http://127.0.0.1:56978/solr
[junit4:junit4]   2> 8523 T682 oasc.ZkController.checkRecovery I am the leader, no recovery necessary
[junit4:junit4]   2> 8525 T682 oascc.ZkStateReader.updateClusterState Updating cloud state from ZooKeeper... 
[junit4:junit4]   2> 8526 T682 oass.SolrDispatchFilter.init user.dir=/usr/home/hudson/hudson-slave/workspace/Lucene-Solr-Tests-4.x-java7/solr/build/solr-core/test/J0
[junit4:junit4]   2> 8527 T682 oass.SolrDispatchFilter.init SolrDispatchFilter.init() done
[junit4:junit4]   2> 8527 T682 oascsi.HttpClientUtil.createClient Creating new http client, config:maxConnections=128&maxConnectionsPerHost=32&followRedirects=false
[junit4:junit4]   2> 8703 T682 oejs.Server.doStart jetty-8.1.2.v20120308
[junit4:junit4]   2> 8707 T682 oejs.AbstractConnector.doStart Started SocketConnector@0.0.0.0:56981
[junit4:junit4]   2> 8707 T682 oasc.SolrResourceLoader.locateSolrHome JNDI not configured for solr (NoInitialContextEx)
[junit4:junit4]   2> 8708 T682 oasc.SolrResourceLoader.locateSolrHome using system property solr.solr.home: /usr/home/hudson/hudson-slave/workspace/Lucene-Solr-Tests-4.x-java7/solr/build/solr-core/test/J0/./solrtest-jetty3-1348404656288
[junit4:junit4]   2> 8709 T682 oasc.SolrResourceLoader.<init> new SolrResourceLoader for deduced Solr Home: '/usr/home/hudson/hudson-slave/workspace/Lucene-Solr-Tests-4.x-java7/solr/build/solr-core/test/J0/./solrtest-jetty3-1348404656288/'
[junit4:junit4]   2> 8770 T682 oass.SolrDispatchFilter.init SolrDispatchFilter.init()
[junit4:junit4]   2> 8771 T682 oasc.SolrResourceLoader.locateSolrHome JNDI not configured for solr (NoInitialContextEx)
[junit4:junit4]   2> 8771 T682 oasc.SolrResourceLoader.locateSolrHome using system property solr.solr.home: /usr/home/hudson/hudson-slave/workspace/Lucene-Solr-Tests-4.x-java7/solr/build/solr-core/test/J0/./solrtest-jetty3-1348404656288
[junit4:junit4]   2> 8772 T682 oasc.CoreContainer$Initializer.initialize looking for solr.xml: /usr/home/hudson/hudson-slave/workspace/Lucene-Solr-Tests-4.x-java7/solr/build/solr-core/test/J0/./solrtest-jetty3-1348404656288/solr.xml
[junit4:junit4]   2> 8773 T682 oasc.CoreContainer.<init> New CoreContainer 1081720047
[junit4:junit4]   2> 8773 T682 oasc.CoreContainer.load Loading CoreContainer using Solr Home: '/usr/home/hudson/hudson-slave/workspace/Lucene-Solr-Tests-4.x-java7/solr/build/solr-core/test/J0/./solrtest-jetty3-1348404656288/'
[junit4:junit4]   2> 8774 T682 oasc.SolrResourceLoader.<init> new SolrResourceLoader for directory: '/usr/home/hudson/hudson-slave/workspace/Lucene-Solr-Tests-4.x-java7/solr/build/solr-core/test/J0/./solrtest-jetty3-1348404656288/'
[junit4:junit4]   2> 8812 T682 oasc.CoreContainer.load Registering Log Listener
[junit4:junit4]   2> 8830 T682 oasc.CoreContainer.initZooKeeper Zookeeper client=127.0.0.1:56962/solr
[junit4:junit4]   2> 8831 T682 oaz.ZooKeeper.<init> Initiating client connection, connectString=127.0.0.1:56962/solr sessionTimeout=5000 watcher=org.apache.solr.common.cloud.ConnectionManager@3e4d6ff
[junit4:junit4]   2> 8832 T739 oaz.ClientCnxn$SendThread.startConnect Opening socket connection to server /127.0.0.1:56962
[junit4:junit4]   2> 8832 T682 oascc.ConnectionManager.waitForConnected Waiting for client to connect to ZooKeeper
[junit4:junit4]   2> 8833 T739 oaz.ClientCnxn$SendThread.primeConnection Socket connection established to localhost/127.0.0.1:56962, initiating session
[junit4:junit4]   2> 8834 T684 oazs.NIOServerCnxn$Factory.run Accepted socket connection from /140.211.11.196:56982
[junit4:junit4]   2> 8834 T684 oazs.NIOServerCnxn.readConnectRequest Client attempting to establish new session at /140.211.11.196:56982
[junit4:junit4]   2> 8837 T688 oazs.NIOServerCnxn.finishSessionInit Established session 0x139f32e18860005 with negotiated timeout 5000 for client /140.211.11.196:56982
[junit4:junit4]   2> 8837 T739 oaz.ClientCnxn$SendThread.readConnectResult Session establishment complete on server localhost/127.0.0.1:56962, sessionid = 0x139f32e18860005, negotiated timeout = 5000
[junit4:junit4]   2> 8837 T740 oascc.ConnectionManager.process Watcher org.apache.solr.common.cloud.ConnectionManager@3e4d6ff name:ZooKeeperConnection Watcher:127.0.0.1:56962/solr got event WatchedEvent state:SyncConnected type:None path:null path:null type:None
[junit4:junit4]   2> 8838 T682 oascc.ConnectionManager.waitForConnected Client is connected to ZooKeeper
[junit4:junit4]   2> 8839 T689 oazs.PrepRequestProcessor.pRequest Got user-level KeeperException when processing sessionid:0x139f32e18860005 type:create cxid:0x1 zxid:0xfffffffffffffffe txntype:unknown reqpath:n/a Error Path:/solr/overseer Error:KeeperErrorCode = NodeExists for /solr/overseer
[junit4:junit4]   2> 8853 T689 oazs.PrepRequestProcessor.pRequest Got user-level KeeperException when processing sessionid:0x139f32e18860005 type:create cxid:0x2 zxid:0xfffffffffffffffe txntype:unknown reqpath:n/a Error Path:/solr/overseer Error:KeeperErrorCode = NodeExists for /solr/overseer
[junit4:junit4]   2> 8855 T682 oasc.ZkController.createEphemeralLiveNode Register node as live in ZooKeeper:/live_nodes/127.0.0.1:56981_solr
[junit4:junit4]   2> 8856 T689 oazs.PrepRequestProcessor.pRequest Got user-level KeeperException when processing sessionid:0x139f32e18860005 type:delete cxid:0x4 zxid:0xfffffffffffffffe txntype:unknown reqpath:n/a Error Path:/solr/live_nodes/127.0.0.1:56981_solr Error:KeeperErrorCode = NoNode for /solr/live_nodes/127.0.0.1:56981_solr
[junit4:junit4]   2> 8862 T682 oascc.SolrZkClient.makePath makePath: /live_nodes/127.0.0.1:56981_solr
[junit4:junit4]   2> 8864 T728 oascc.ZkStateReader$3.process Updating live nodes
[junit4:junit4]   2> 8865 T716 oascc.ZkStateReader$3.process Updating live nodes
[junit4:junit4]   2> 8864 T702 oascc.ZkStateReader$3.process Updating live nodes
[junit4:junit4]   2> 8866 T682 oashc.HttpShardHandlerFactory.getParameter Setting socketTimeout to: 0
[junit4:junit4]   2> 8866 T682 oashc.HttpShardHandlerFactory.getParameter Setting urlScheme to: http://
[junit4:junit4]   2> 8867 T682 oashc.HttpShardHandlerFactory.getParameter Setting connTimeout to: 0
[junit4:junit4]   2> 8867 T682 oashc.HttpShardHandlerFactory.getParameter Setting maxConnectionsPerHost to: 20
[junit4:junit4]   2> 8868 T682 oashc.HttpShardHandlerFactory.getParameter Setting corePoolSize to: 0
[junit4:junit4]   2> 8868 T682 oashc.HttpShardHandlerFactory.getParameter Setting maximumPoolSize to: 2147483647
[junit4:junit4]   2> 8869 T682 oashc.HttpShardHandlerFactory.getParameter Setting maxThreadIdleTime to: 5
[junit4:junit4]   2> 8870 T682 oashc.HttpShardHandlerFactory.getParameter Setting sizeOfQueue to: -1
[junit4:junit4]   2> 8870 T682 oashc.HttpShardHandlerFactory.getParameter Setting fairnessPolicy to: false
[junit4:junit4]   2> 8871 T682 oascsi.HttpClientUtil.createClient Creating new http client, config:maxConnectionsPerHost=20&maxConnections=10000&socketTimeout=0&connTimeout=0&retry=false
[junit4:junit4]   2> 8894 T682 oascc.ZkStateReader.createClusterStateWatchersAndUpdate Updating cluster state from ZooKeeper... 
[junit4:junit4]   2> 8902 T682 oasc.CoreContainer.create Creating SolrCore 'collection1' using instanceDir: /usr/home/hudson/hudson-slave/workspace/Lucene-Solr-Tests-4.x-java7/solr/build/solr-core/test/J0/./solrtest-jetty3-1348404656288/collection1
[junit4:junit4]   2> 8903 T682 oasc.ZkController.createCollectionZkNode Check for collection zkNode:collection1
[junit4:junit4]   2> 8904 T682 oasc.ZkController.createCollectionZkNode Collection zkNode exists
[junit4:junit4]   2> 8905 T682 oasc.ZkController.readConfigName Load collection config from:/collections/collection1
[junit4:junit4]   2> 8907 T682 oasc.SolrResourceLoader.<init> new SolrResourceLoader for directory: '/usr/home/hudson/hudson-slave/workspace/Lucene-Solr-Tests-4.x-java7/solr/build/solr-core/test/J0/./solrtest-jetty3-1348404656288/collection1/'
[junit4:junit4]   2> 8909 T682 oasc.SolrResourceLoader.replaceClassLoader Adding 'file:/usr/home/hudson/hudson-slave/workspace/Lucene-Solr-Tests-4.x-java7/solr/build/solr-core/test/J0/solrtest-jetty3-1348404656288/collection1/lib/README' to classloader
[junit4:junit4]   2> 8910 T682 oasc.SolrResourceLoader.replaceClassLoader Adding 'file:/usr/home/hudson/hudson-slave/workspace/Lucene-Solr-Tests-4.x-java7/solr/build/solr-core/test/J0/solrtest-jetty3-1348404656288/collection1/lib/classes/' to classloader
[junit4:junit4]   2> 8969 T682 oasc.SolrConfig.<init> Using Lucene MatchVersion: LUCENE_41
[junit4:junit4]   2> 9002 T703 oascc.ZkStateReader.updateClusterState Updating cloud state from ZooKeeper... 
[junit4:junit4]   2> 9017 T740 oascc.ZkStateReader$2.process A cluster state change has occurred - updating...
[junit4:junit4]   2> 9017 T702 oascc.ZkStateReader$2.process A cluster state change has occurred - updating...
[junit4:junit4]   2> 9017 T716 oascc.ZkStateReader$2.process A cluster state change has occurred - updating...
[junit4:junit4]   2> 9017 T728 oascc.ZkStateReader$2.process A cluster state change has occurred - updating...
[junit4:junit4]   2> 9049 T682 oasc.SolrConfig.<init> Loaded SolrConfig: solrconfig.xml
[junit4:junit4]   2> 9151 T682 oass.IndexSchema.readSchema Reading Solr Schema
[junit4:junit4]   2> 9158 T682 oass.IndexSchema.readSchema Schema name=test
[junit4:junit4]   2> 9756 T682 oass.OpenExchangeRatesOrgProvider.init Initialized with rates=open-exchange-rates.json, refreshInterval=1440.
[junit4:junit4]   2> 9765 T682 oass.IndexSchema.readSchema default search field in schema is text
[junit4:junit4]   2> 9779 T682 oass.IndexSchema.readSchema unique key field: id
[junit4:junit4]   2> 9797 T682 oass.FileExchangeRateProvider.reload Reloading exchange rates from file currency.xml
[junit4:junit4]   2> 9801 T682 oass.FileExchangeRateProvider.reload Reloading exchange rates from file currency.xml
[junit4:junit4]   2> 9806 T682 oass.OpenExchangeRatesOrgProvider.reload Reloading exchange rates from open-exchange-rates.json
[junit4:junit4]   2> 9807 T682 oass.OpenExchangeRatesOrgProvider.reload Reloading exchange rates from open-exchange-rates.json
[junit4:junit4]   2> 9809 T682 oasc.SolrCore.<init> [collection1] Opening new SolrCore at /usr/home/hudson/hudson-slave/workspace/Lucene-Solr-Tests-4.x-java7/solr/build/solr-core/test/J0/./solrtest-jetty3-1348404656288/collection1/, dataDir=./org.apache.solr.cloud.BasicDistributedZkTest-1348404647752/jetty3/
[junit4:junit4]   2> 9810 T682 oasc.JmxMonitoredMap.<init> JMX monitoring is enabled. Adding Solr mbeans to JMX Server: com.sun.jmx.mbeanserver.JmxMBeanServer@56851105
[junit4:junit4]   2> 9811 T682 oasc.SolrCore.getNewIndexDir WARNING New index directory detected: old=null new=./org.apache.solr.cloud.BasicDistributedZkTest-1348404647752/jetty3/index/
[junit4:junit4]   2> 9811 T682 oasc.SolrCore.initIndex WARNING [collection1] Solr index directory './org.apache.solr.cloud.BasicDistributedZkTest-1348404647752/jetty3/index' doesn't exist. Creating new index...
[junit4:junit4]   2> 9812 T682 oasc.CachingDirectoryFactory.get return new directory for /usr/home/hudson/hudson-slave/workspace/Lucene-Solr-Tests-4.x-java7/solr/build/solr-core/test/J0/./org.apache.solr.cloud.BasicDistributedZkTest-1348404647752/jetty3/index forceNew:false
[junit4:junit4]   2> 9842 T682 oasc.SolrDeletionPolicy.onCommit SolrDeletionPolicy.onCommit: commits:num=1
[junit4:junit4]   2> 		commit{dir=/usr/home/hudson/hudson-slave/workspace/Lucene-Solr-Tests-4.x-java7/solr/build/solr-core/test/J0/org.apache.solr.cloud.BasicDistributedZkTest-1348404647752/jetty3/index,segFN=segments_1,generation=1,filenames=[segments_1]
[junit4:junit4]   2> 9843 T682 oasc.SolrDeletionPolicy.updateCommits newest commit = 1
[junit4:junit4]   2> 9843 T682 oasc.SolrCore.initWriters created xml: solr.XMLResponseWriter
[junit4:junit4]   2> 9845 T682 oasup.UpdateRequestProcessorChain.init inserting DistributedUpdateProcessorFactory into updateRequestProcessorChain "dedupe"
[junit4:junit4]   2> 9846 T682 oasup.UpdateRequestProcessorChain.init inserting DistributedUpdateProcessorFactory into updateRequestProcessorChain "dedupe-allfields"
[junit4:junit4]   2> 9846 T682 oasup.UpdateRequestProcessorChain.init inserting DistributedUpdateProcessorFactory into updateRequestProcessorChain "stored_sig"
[junit4:junit4]   2> 9847 T682 oasup.UpdateRequestProcessorChain.init inserting DistributedUpdateProcessorFactory into updateRequestProcessorChain "uniq-fields"
[junit4:junit4]   2> 9847 T682 oasup.UpdateRequestProcessorChain.init inserting DistributedUpdateProcessorFactory into updateRequestProcessorChain "distrib-dup-test-chain-implicit"
[junit4:junit4]   2> 9848 T682 oasc.RequestHandlers.initHandlersFromConfig adding lazy requestHandler: solr.ReplicationHandler
[junit4:junit4]   2> 9848 T682 oasc.RequestHandlers.initHandlersFromConfig created /replication: solr.ReplicationHandler
[junit4:junit4]   2> 9849 T682 oasc.RequestHandlers.initHandlersFromConfig created standard: solr.StandardRequestHandler
[junit4:junit4]   2> 9850 T682 oasc.RequestHandlers.initHandlersFromConfig created /get: solr.RealTimeGetHandler
[junit4:junit4]   2> 9850 T682 oasc.RequestHandlers.initHandlersFromConfig created dismax: solr.SearchHandler
[junit4:junit4]   2> 9851 T682 oasc.RequestHandlers.initHandlersFromConfig created mock: org.apache.solr.core.MockQuerySenderListenerReqHandler
[junit4:junit4]   2> 9851 T682 oasc.RequestHandlers.initHandlersFromConfig created /admin/: org.apache.solr.handler.admin.AdminHandlers
[junit4:junit4]   2> 9852 T682 oasc.RequestHandlers.initHandlersFromConfig created defaults: solr.StandardRequestHandler
[junit4:junit4]   2> 9852 T682 oasc.RequestHandlers.initHandlersFromConfig adding lazy requestHandler: solr.StandardRequestHandler
[junit4:junit4]   2> 9853 T682 oasc.RequestHandlers.initHandlersFromConfig created lazy: solr.StandardRequestHandler
[junit4:junit4]   2> 9853 T682 oasc.RequestHandlers.initHandlersFromConfig created /update: solr.UpdateRequestHandler
[junit4:junit4]   2> 9854 T682 oasc.RequestHandlers.initHandlersFromConfig created /terms: org.apache.solr.handler.component.SearchHandler
[junit4:junit4]   2> 9854 T682 oasc.RequestHandlers.initHandlersFromConfig created spellCheckCompRH: org.apache.solr.handler.component.SearchHandler
[junit4:junit4]   2> 9855 T682 oasc.RequestHandlers.initHandlersFromConfig created spellCheckCompRH_Direct: org.apache.solr.handler.component.SearchHandler
[junit4:junit4]   2> 9856 T682 oasc.RequestHandlers.initHandlersFromConfig created spellCheckWithWordbreak: org.apache.solr.handler.component.SearchHandler
[junit4:junit4]   2> 9856 T682 oasc.RequestHandlers.initHandlersFromConfig created spellCheckWithWordbreak_Direct: org.apache.solr.handler.component.SearchHandler
[junit4:junit4]   2> 9857 T682 oasc.RequestHandlers.initHandlersFromConfig created spellCheckCompRH1: org.apache.solr.handler.component.SearchHandler
[junit4:junit4]   2> 9857 T682 oasc.RequestHandlers.initHandlersFromConfig created tvrh: org.apache.solr.handler.component.SearchHandler
[junit4:junit4]   2> 9858 T682 oasc.RequestHandlers.initHandlersFromConfig created /mlt: solr.MoreLikeThisHandler
[junit4:junit4]   2> 9858 T682 oasc.RequestHandlers.initHandlersFromConfig created /debug/dump: solr.DumpRequestHandler
[junit4:junit4]   2> 9862 T682 oashl.XMLLoader.init xsltCacheLifetimeSeconds=60
[junit4:junit4]   2> 9866 T682 oasc.SolrCore.initDeprecatedSupport WARNING solrconfig.xml uses deprecated <admin/gettableFiles>, Please update your config to use the ShowFileRequestHandler.
[junit4:junit4]   2> 9868 T682 oasc.SolrCore.initDeprecatedSupport WARNING adding ShowFileRequestHandler with hidden files: [SCHEMA.XML, OLD_SYNONYMS.TXT, STOPWORDS.TXT, PROTWORDS.TXT, OPEN-EXCHANGE-RATES.JSON, SYNONYMS.TXT, CURRENCY.XML, MAPPING-ISOLATIN1ACCENT.TXT]
[junit4:junit4]   2> 9871 T682 oass.SolrIndexSearcher.<init> Opening Searcher@e830f0b main
[junit4:junit4]   2> 9872 T682 oasu.CommitTracker.<init> Hard AutoCommit: disabled
[junit4:junit4]   2> 9872 T682 oasu.CommitTracker.<init> Soft AutoCommit: disabled
[junit4:junit4]   2> 9873 T682 oashc.SpellCheckComponent.inform Initializing spell checkers
[junit4:junit4]   2> 9879 T682 oass.DirectSolrSpellChecker.init init: {name=direct,classname=DirectSolrSpellChecker,field=lowerfilt,minQueryLength=3}
[junit4:junit4]   2> 9929 T741 oasc.SolrCore.registerSearcher [collection1] Registered new searcher Searcher@e830f0b main{StandardDirectoryReader(segments_1:1)}
[junit4:junit4]   2> 10025 T703 oascc.ZkStateReader.updateClusterState Updating cloud state from ZooKeeper... 
[junit4:junit4]   2> 10040 T740 oascc.ZkStateReader$2.process A cluster state change has occurred - updating...
[junit4:junit4]   2> 10040 T728 oascc.ZkStateReader$2.process A cluster state change has occurred - updating...
[junit4:junit4]   2> 10040 T716 oascc.ZkStateReader$2.process A cluster state change has occurred - updating...
[junit4:junit4]   2> 10040 T702 oascc.ZkStateReader$2.process A cluster state change has occurred - updating...
[junit4:junit4]   2> 10436 T682 oasc.CoreContainer.register registering core: collection1
[junit4:junit4]   2> 10437 T682 oasc.ZkController.register Register shard - core:collection1 address:http://127.0.0.1:56981/solr shardId:shard1
[junit4:junit4]   2> 10441 T682 oasc.ZkController.register We are http://127.0.0.1:56981/solr/collection1/ and leader is http://127.0.0.1:56975/solr/collection1/
[junit4:junit4]   2> 10442 T682 oasc.ZkController.register No LogReplay needed for core=collection1 baseURL=http://127.0.0.1:56981/solr
[junit4:junit4]   2> 10443 T682 oasc.ZkController.checkRecovery Core needs to recover:collection1
[junit4:junit4]   2> 10443 T682 oasu.DefaultSolrCoreState.doRecovery Running recovery - first canceling any ongoing recovery
[junit4:junit4]   2> ASYNC  NEW_CORE C99 name=collection1 org.apache.solr.core.SolrCore@28159e13 url=http://127.0.0.1:56981/solr/collection1 node=127.0.0.1:56981_solr
[junit4:junit4]   2> 10451 T742 C99 P56981 oasc.RecoveryStrategy.run Starting recovery process.  core=collection1 recoveringAfterStartup=true
[junit4:junit4]   2> 10452 T682 oascc.ZkStateReader.updateClusterState Updating cloud state from ZooKeeper... 
[junit4:junit4]   2> 10452 T742 C99 P56981 oasc.RecoveryStrategy.doRecovery ###### startupVersions=[]
[junit4:junit4]   2> 10453 T682 oass.SolrDispatchFilter.init user.dir=/usr/home/hudson/hudson-slave/workspace/Lucene-Solr-Tests-4.x-java7/solr/build/solr-core/test/J0
[junit4:junit4]   2> 10454 T682 oass.SolrDispatchFilter.init SolrDispatchFilter.init() done
[junit4:junit4]   2> 10455 T742 C99 P56981 oasc.RecoveryStrategy.doRecovery Attempting to PeerSync from http://127.0.0.1:56975/solr/collection1/ core=collection1 - recoveringAfterStartup=true
[junit4:junit4]   2> 10455 T682 oascsi.HttpClientUtil.createClient Creating new http client, config:maxConnections=128&maxConnectionsPerHost=32&followRedirects=false
[junit4:junit4]   2> 10463 T742 C99 P56981 oascsi.HttpClientUtil.createClient Creating new http client, config:maxConnectionsPerHost=20&maxConnections=10000&connTimeout=30000&socketTimeout=30000&retry=false
[junit4:junit4]   2> 10483 T682 oaz.ZooKeeper.<init> Initiating client connection, connectString=127.0.0.1:56962/solr sessionTimeout=10000 watcher=org.apache.solr.common.cloud.ConnectionManager@41c1896f
[junit4:junit4]   2> 10484 T743 oaz.ClientCnxn$SendThread.startConnect Opening socket connection to server /127.0.0.1:56962
[junit4:junit4]   2> 10484 T742 C99 P56981 oasu.PeerSync.sync PeerSync: core=collection1 url=http://127.0.0.1:56981/solr START replicas=[http://127.0.0.1:56975/solr/collection1/] nUpdates=100
[junit4:junit4]   2> 10484 T682 oascc.ConnectionManager.waitForConnected Waiting for client to connect to ZooKeeper
[junit4:junit4]   2> 10485 T742 C99 P56981 oasu.PeerSync.sync WARNING no frame of reference to tell of we've missed updates
[junit4:junit4]   2> 10485 T743 oaz.ClientCnxn$SendThread.primeConnection Socket connection established to localhost/127.0.0.1:56962, initiating session
[junit4:junit4]   2> 10485 T684 oazs.NIOServerCnxn$Factory.run Accepted socket connection from /140.211.11.196:56984
[junit4:junit4]   2> 10485 T742 C99 P56981 oasc.RecoveryStrategy.doRecovery PeerSync Recovery was not successful - trying replication. core=collection1
[junit4:junit4]   2> 10486 T742 C99 P56981 oasc.RecoveryStrategy.doRecovery Starting Replication Recovery. core=collection1
[junit4:junit4]   2> 10486 T684 oazs.NIOServerCnxn.readConnectRequest Client attempting to establish new session at /140.211.11.196:56984
[junit4:junit4]   2> 10486 T742 C99 P56981 oascsi.HttpClientUtil.createClient Creating new http client, config:maxConnections=128&maxConnectionsPerHost=32&followRedirects=false
[junit4:junit4]   2> 10488 T688 oazs.NIOServerCnxn.finishSessionInit Established session 0x139f32e18860006 with negotiated timeout 10000 for client /140.211.11.196:56984
[junit4:junit4]   2> 10488 T743 oaz.ClientCnxn$SendThread.readConnectResult Session establishment complete on server localhost/127.0.0.1:56962, sessionid = 0x139f32e18860006, negotiated timeout = 10000
[junit4:junit4]   2> 10488 T744 oascc.ConnectionManager.process Watcher org.apache.solr.common.cloud.ConnectionManager@41c1896f name:ZooKeeperConnection Watcher:127.0.0.1:56962/solr got event WatchedEvent state:SyncConnected type:None path:null path:null type:None
[junit4:junit4]   2> 10489 T682 oascc.ConnectionManager.waitForConnected Client is connected to ZooKeeper
[junit4:junit4]   2> 10490 T682 oascc.ZkStateReader.createClusterStateWatchersAndUpdate Updating cluster state from ZooKeeper... 
[junit4:junit4]   2> ASYNC  NEW_CORE C100 name=collection1 org.apache.solr.core.SolrCore@54aff80a url=http://127.0.0.1:56975/solr/collection1 node=127.0.0.1:56975_solr
[junit4:junit4]   2> 10493 T708 C100 P56975 REQ /get {distrib=false&qt=/get&wt=javabin&version=2&getVersions=100} status=0 QTime=0 
[junit4:junit4]   2> 10495 T682 oasc.ChaosMonkey.monkeyLog monkey: init - expire sessions:true cause connection loss:true
[junit4:junit4]   2> 10496 T682 oascsi.HttpClientUtil.createClient Creating new http client, config:
[junit4:junit4]   2> 10510 T682 oascc.ZkStateReader.updateClusterState Updating cloud state from ZooKeeper... 
[junit4:junit4]   2> 10513 T682 oasc.AbstractDistribZkTestBase.waitForRecoveriesToFinish Wait for recoveries to finish - collection: collection1 failOnTimeout:true timeout (sec):1800
[junit4:junit4]   2> 10514 T682 oascc.ZkStateReader.updateClusterState Updating cloud state from ZooKeeper... 
[junit4:junit4]   2> 10546 T703 oascc.ZkStateReader.updateClusterState Updating cloud state from ZooKeeper... 
[junit4:junit4]   2> 10564 T744 oascc.ZkStateReader$2.process A cluster state change has occurred - updating...
[junit4:junit4]   2> 10564 T702 oascc.ZkStateReader$2.process A cluster state change has occurred - updating...
[junit4:junit4]   2> 10564 T740 oascc.ZkStateReader$2.process A cluster state change has occurred - updating...
[junit4:junit4]   2> 10564 T728 oascc.ZkStateReader$2.process A cluster state change has occurred - updating...
[junit4:junit4]   2> 10564 T716 oascc.ZkStateReader$2.process A cluster state change has occurred - updating...
[junit4:junit4]   2> 11516 T682 oascc.ZkStateReader.updateClusterState Updating cloud state from ZooKeeper... 
[junit4:junit4]   2> 12519 T682 oascc.ZkStateReader.updateClusterState Updating cloud state from ZooKeeper... 
[junit4:junit4]   2>  C99_STATE=coll:collection1 core:collection1 props:{shard=shard1, roles=null, state=recovering, core=collection1, collection=collection1, node_name=127.0.0.1:56981_solr, base_url=http://127.0.0.1:56981/solr}
[junit4:junit4]   2> 13499 T742 C99 P56981 oasc.RecoveryStrategy.doRecovery Begin buffering updates. core=collection1
[junit4:junit4]   2> 13500 T742 C99 P56981 oasu.UpdateLog.bufferUpdates Starting to buffer updates. FSUpdateLog{state=ACTIVE, tlog=null}
[junit4:junit4]   2> 13500 T742 C99 P56981 oasc.RecoveryStrategy.replicate Attempting to replicate from http://127.0.0.1:56975/solr/collection1/. core=collection1
[junit4:junit4]   2> 13500 T742 C99 P56981 oascsi.HttpClientUtil.createClient Creating new http client, config:maxConnections=128&maxConnectionsPerHost=32&followRedirects=false
[junit4:junit4]   2> 13514 T710 C100 P56975 oasu.DirectUpdateHandler2.commit start commit{flags=0,_version_=0,optimize=false,openSearcher=true,waitSearcher=true,expungeDeletes=false,softCommit=false}
[junit4:junit4]   2> 13518 T710 C100 P56975 oasc.SolrDeletionPolicy.onInit SolrDeletionPolicy.onInit: commits:num=1
[junit4:junit4]   2> 		commit{dir=/usr/home/hudson/hudson-slave/workspace/Lucene-Solr-Tests-4.x-java7/solr/build/solr-core/test/J0/org.apache.solr.cloud.BasicDistributedZkTest-1348404647752/jetty1/index,segFN=segments_1,generation=1,filenames=[segments_1]
[junit4:junit4]   2> 13519 T710 C100 P56975 oasc.SolrDeletionPolicy.updateCommits newest commit = 1
[junit4:junit4]   2> 13521 T710 C100 P56975 oass.SolrIndexSearcher.<init> Opening Searcher@61095f4b main
[junit4:junit4]   2> 13521 T710 C100 P56975 oasu.DirectUpdateHandler2.commit end_commit_flush
[junit4:junit4]   2> 13522 T682 oascc.ZkStateReader.updateClusterState Updating cloud state from ZooKeeper... 
[junit4:junit4]   2> 13523 T717 oasc.SolrCore.registerSearcher [collection1] Registered new searcher Searcher@61095f4b main{StandardDirectoryReader(segments_1:1)}
[junit4:junit4]   2> 13524 T710 C100 P56975 /update {waitSearcher=true&commit=true&commit_end_point=true&wt=javabin&softCommit=false&version=2} {commit=} 0 11
[junit4:junit4]   2> 13525 T742 C99 P56981 oash.ReplicationHandler.inform Commits will be reserved for  10000
[junit4:junit4]   2> 13525 T742 C99 P56981 oascsi.HttpClientUtil.createClient Creating new http client, config:connTimeout=5000&socketTimeout=20000&allowCompression=false&maxConnections=10000&maxConnectionsPerHost=10000
[junit4:junit4]   2> 13547 T742 C99 P56981 oash.SnapPuller.<init>  No value set for 'pollInterval'. Timer Task not started.
[junit4:junit4]   2> 13550 T711 C100 P56975 oash.ReplicationHandler.inform Commits will be reserved for  10000
[junit4:junit4]   2> 13550 T711 C100 P56975 REQ /replication {command=indexversion&wt=javabin&qt=/replication&version=2} status=0 QTime=1 
[junit4:junit4]   2> 13555 T742 C99 P56981 oasc.SolrDeletionPolicy.onInit SolrDeletionPolicy.onInit: commits:num=1
[junit4:junit4]   2> 		commit{dir=/usr/home/hudson/hudson-slave/workspace/Lucene-Solr-Tests-4.x-java7/solr/build/solr-core/test/J0/org.apache.solr.cloud.BasicDistributedZkTest-1348404647752/jetty3/index,segFN=segments_1,generation=1,filenames=[segments_1]
[junit4:junit4]   2> 13556 T742 C99 P56981 oasc.SolrDeletionPolicy.updateCommits newest commit = 1
[junit4:junit4]   2> 13557 T742 C99 P56981 oasu.DirectUpdateHandler2.commit start commit{flags=0,_version_=0,optimize=false,openSearcher=true,waitSearcher=true,expungeDeletes=false,softCommit=false}
[junit4:junit4]   2> 13585 T742 C99 P56981 oasc.SolrDeletionPolicy.onCommit SolrDeletionPolicy.onCommit: commits:num=2
[junit4:junit4]   2> 		commit{dir=/usr/home/hudson/hudson-slave/workspace/Lucene-Solr-Tests-4.x-java7/solr/build/solr-core/test/J0/org.apache.solr.cloud.BasicDistributedZkTest-1348404647752/jetty3/index,segFN=segments_1,generation=1,filenames=[segments_1]
[junit4:junit4]   2> 		commit{dir=/usr/home/hudson/hudson-slave/workspace/Lucene-Solr-Tests-4.x-java7/solr/build/solr-core/test/J0/org.apache.solr.cloud.BasicDistributedZkTest-1348404647752/jetty3/index,segFN=segments_2,generation=2,filenames=[segments_2]
[junit4:junit4]   2> 13585 T742 C99 P56981 oasc.SolrDeletionPolicy.updateCommits newest commit = 2
[junit4:junit4]   2> 13588 T742 C99 P56981 oass.SolrIndexSearcher.<init> Opening Searcher@6ba4cce5 main
[junit4:junit4]   2> 13589 T742 C99 P56981 oasu.DirectUpdateHandler2.commit end_commit_flush
[junit4:junit4]   2> 13591 T741 oasc.SolrCore.registerSearcher [collection1] Registered new searcher Searcher@6ba4cce5 main{StandardDirectoryReader(segments_2:2)}
[junit4:junit4]   2> 13591 T742 C99 P56981 oasc.RecoveryStrategy.replay No replay needed. core=collection1
[junit4:junit4]   2> 13591 T742 C99 P56981 oasc.RecoveryStrategy.doRecovery Replication Recovery was successful - registering as Active. core=collection1
[junit4:junit4]   2> 13593 T742 C99 P56981 oasc.RecoveryStrategy.doRecovery Finished recovery process. core=collection1
[junit4:junit4]   2> 14083 T703 oascc.ZkStateReader.updateClusterState Updating cloud state from ZooKeeper... 
[junit4:junit4]   2> 14096 T728 oascc.ZkStateReader$2.process A cluster state change has occurred - updating...
[junit4:junit4]   2> 14096 T744 oascc.ZkStateReader$2.process A cluster state change has occurred - updating...
[junit4:junit4]   2> 14097 T716 oascc.ZkStateReader$2.process A cluster state change has occurred - updating...
[junit4:junit4]   2> 14097 T702 oascc.ZkStateReader$2.process A cluster state change has occurred - updating...
[junit4:junit4]   2> 14096 T740 oascc.ZkStateReader$2.process A cluster state change has occurred - updating...
[junit4:junit4]   2> 14525 T682 oascc.ZkStateReader.updateClusterState Updating cloud state from ZooKeeper... 
[junit4:junit4]   2> ASYNC  NEW_CORE C101 name=collection1 org.apache.solr.core.SolrCore@6c0b03df url=http://127.0.0.1:56968/solr/collection1 node=127.0.0.1:56968_solr
[junit4:junit4]   2> 14542 T694 C101 P56968 oasc.SolrDeletionPolicy.onInit SolrDeletionPolicy.onInit: commits:num=1
[junit4:junit4]   2> 		commit{dir=/usr/home/hudson/hudson-slave/workspace/Lucene-Solr-Tests-4.x-java7/solr/build/solr-core/test/J0/org.apache.solr.cloud.BasicDistributedZkTest-1348404647752/control/data/index,segFN=segments_1,generation=1,filenames=[segments_1]
[junit4:junit4]   2> 14543 T694 C101 P56968 oasc.SolrDeletionPolicy.updateCommits newest commit = 1
[junit4:junit4]   2> 14545 T694 C101 P56968 oass.SolrIndexSearcher.<init> Opening Searcher@e165a23 realtime
[junit4:junit4]   2> 14545 T694 C101 P56968 /update {wt=javabin&version=2} {deleteByQuery=*:* (-1413904767160156160)} 0 8
[junit4:junit4]   2> 14546 T682 oaz.ZooKeeper.<init> Initiating client connection, connectString=127.0.0.1:56962/solr sessionTimeout=10000 watcher=org.apache.solr.common.cloud.ConnectionManager@5d77b70e
[junit4:junit4]   2> 14548 T746 oaz.ClientCnxn$SendThread.startConnect Opening socket connection to server /127.0.0.1:56962
[junit4:junit4]   2> 14548 T682 oascc.ConnectionManager.waitForConnected Waiting for client to connect to ZooKeeper
[junit4:junit4]   2> 14549 T746 oaz.ClientCnxn$SendThread.primeConnection Socket connection established to localhost/127.0.0.1:56962, initiating session
[junit4:junit4]   2> 14549 T684 oazs.NIOServerCnxn$Factory.run Accepted socket connection from /140.211.11.196:57005
[junit4:junit4]   2> 14550 T684 oazs.NIOServerCnxn.readConnectRequest Client attempting to establish new session at /140.211.11.196:57005
[junit4:junit4]   2> 14551 T688 oazs.NIOServerCnxn.finishSessionInit Established session 0x139f32e18860007 with negotiated timeout 10000 for client /140.211.11.196:57005
[junit4:junit4]   2> 14551 T746 oaz.ClientCnxn$SendThread.readConnectResult Session establishment complete on server localhost/127.0.0.1:56962, sessionid = 0x139f32e18860007, negotiated timeout = 10000
[junit4:junit4]   2> 14552 T747 oascc.ConnectionManager.process Watcher org.apache.solr.common.cloud.ConnectionManager@5d77b70e name:ZooKeeperConnection Watcher:127.0.0.1:56962/solr got event WatchedEvent state:SyncConnected type:None path:null path:null type:None
[junit4:junit4]   2> 14552 T682 oascc.ConnectionManager.waitForConnected Client is connected to ZooKeeper
[junit4:junit4]   2> 14553 T682 oascc.ZkStateReader.createClusterStateWatchersAndUpdate Updating cluster state from ZooKeeper... 
[junit4:junit4]   2> ASYNC  NEW_CORE C102 name=collection1 org.apache.solr.core.SolrCore@72bb66a6 url=http://127.0.0.1:56978/solr/collection1 node=127.0.0.1:56978_solr
[junit4:junit4]   2> 14567 T720 C102 P56978 oasc.SolrDeletionPolicy.onInit SolrDeletionPolicy.onInit: commits:num=1
[junit4:junit4]   2> 		commit{dir=/usr/home/hudson/hudson-slave/workspace/Lucene-Solr-Tests-4.x-java7/solr/build/solr-core/test/J0/org.apache.solr.cloud.BasicDistributedZkTest-1348404647752/jetty2/index,segFN=segments_1,generation=1,filenames=[segments_1]
[junit4:junit4]   2> 14568 T720 C102 P56978 oasc.SolrDeletionPolicy.updateCommits newest commit = 1
[junit4:junit4]   2> 14570 T720 C102 P56978 oass.SolrIndexSearcher.<init> Opening Searcher@4f049bd7 realtime
[junit4:junit4]   2> 14574 T712 C100 P56975 oass.SolrIndexSearcher.<init> Opening Searcher@6769c51c realtime
[junit4:junit4]   2>  C99_STATE=coll:collection1 core:collection1 props:{shard=shard1, roles=null, state=active, core=collection1, collection=collection1, node_name=127.0.0.1:56981_solr, base_url=http://127.0.0.1:56981/solr}
[junit4:junit4]   2> 14583 T732 C99 P56981 oass.SolrIndexSearcher.<init> Opening Searcher@27e6678b realtime
[junit4:junit4]   2> 14584 T732 C99 P56981 REQ /update {_version_=-1413904767197904896&update.distrib=FROMLEADER&update.from=http://127.0.0.1:56975/solr/collection1/&wt=javabin&version=2} status=0 QTime=2 
[junit4:junit4]   2> 14585 T712 C100 P56975 REQ /update {update.distrib=TOLEADER&wt=javabin&version=2} status=0 QTime=13 
[junit4:junit4]   2> 14586 T720 C102 P56978 /update {wt=javabin&version=2} {deleteByQuery=*:* (-1413904767187419136)} 0 23
[junit4:junit4]   2> 14596 T694 C101 P56968 /update {wt=javabin&version=2} {add=[1 (1413904767216779264)]} 0 6
[junit4:junit4]   2> 14610 T732 C99 P56981 REQ /update {distrib.from=http://127.0.0.1:56975/solr/collection1/&update.distrib=FROMLEADER&wt=javabin&version=2} status=0 QTime=5 
[junit4:junit4]   2> 14611 T713 C100 P56975 /update {wt=javabin&version=2} {add=[1 (1413904767225167872)]} 0 13
[junit4:junit4]   2> 14618 T694 C101 P56968 /update {wt=javabin&version=2} {add=[2 (1413904767242993664)]} 0 3
[junit4:junit4]   2> 14633 T721 C102 P56978 REQ /update {distrib.from=http://127.0.0.1:56975/solr/collection1/&update.distrib=TOLEADER&wt=javabin&version=2} status=0 QTime=5 
[junit4:junit4]   2> 14634 T713 C100 P56975 /update {wt=javabin&version=2} {add=[2]} 0 13
[junit4:junit4]   2> 14640 T694 C101 P56968 /update {wt=javabin&version=2} {add=[3 (1413904767266062336)]} 0 3
[junit4:junit4]   2> 14649 T721 C102 P56978 REQ /update {distrib.from=http://127.0.0.1:56975/solr/collection1/&update.distrib=TOLEADER&wt=javabin&version=2} status=0 QTime=3 
[junit4:junit4]   2> 14649 T713 C100 P56975 /update {wt=javabin&version=2} {add=[3]} 0 6
[junit4:junit4]   2> 14656 T694 C101 P56968 /update {wt=javabin&version=2} {add=[4 (1413904767282839552)]} 0 3
[junit4:junit4]   2> 14667 T732 C99 P56981 REQ /update {distrib.from=http://127.0.0.1:56975/solr/collection1/&update.distrib=FROMLEADER&wt=javabin&version=2} status=0 QTime=3 
[junit4:junit4]   2> 14668 T713 C100 P56975 /update {wt=javabin&version=2} {add=[4 (1413904767289131008)]} 0 9
[junit4:junit4]   2> 14674 T694 C101 P56968 /update {wt=javabin&version=2} {add=[5 (1413904767301713920)]} 0 3
[junit4:junit4]   2> 14683 T721 C102 P56978 REQ /update {distrib.from=http://127.0.0.1:56975/solr/collection1/&update.distrib=TOLEADER&wt=javabin&version=2} status=0 QTime=3 
[junit4:junit4]   2> 14684 T713 C100 P56975 /update {wt=javabin&version=2} {add=[5]} 0 7
[junit4:junit4]   2> 14690 T694 C101 P56968 /update {wt=javabin&version=2} {add=[6 (1413904767318491136)]} 0 3
[junit4:junit4]   2> 14699 T721 C102 P56978 REQ /update {distrib.from=http://127.0.0.1:56975/solr/collection1/&update.distrib=TOLEADER&wt=javabin&version=2} status=0 QTime=3 
[junit4:junit4]   2> 14700 T713 C100 P56975 /update {wt=javabin&version=2} {add=[6]} 0 7
[junit4:junit4]   2> 14706 T694 C101 P56968 /update {wt=javabin&version=2} {add=[7 (1413904767335268352)]} 0 3
[junit4:junit4]   2> 14715 T721 C102 P56978 REQ /update {distrib.from=http://127.0.0.1:56975/solr/collection1/&update.distrib=TOLEADER&wt=javabin&version=2} status=0 QTime=3 
[junit4:junit4]   2> 14716 T713 C100 P56975 /update {wt=javabin&version=2} {add=[7]} 0 7
[junit4:junit4]   2> 14722 T694 C101 P56968 /update {wt=javabin&version=2} {add=[8 (1413904767352045568)]} 0 3
[junit4:junit4]   2> 14736 T732 C99 P56981 REQ /update {update.distrib=FROMLEADER&distrib.from=http://127.0.0.1:56975/solr/collection1/&wt=javabin&version=2} status=0 QTime=3 
[junit4:junit4]   2> 14737 T712 C100 P56975 REQ /update {distrib.from=http://127.0.0.1:56978/solr/collection1/&update.distrib=TOLEADER&wt=javabin&version=2} status=0 QTime=9 
[junit4:junit4]   2> 14738 T720 C102 P56978 /update {wt=javabin&version=2} {add=[8]} 0 13
[junit4:junit4]   2> 14744 T694 C101 P56968 /update {wt=javabin&version=2} {add=[9 (1413904767375114240)]} 0 3
[junit4:junit4]   2> 14750 T720 C102 P56978 /update {wt=javabin&version=2} {add=[9 (1413904767381405696)]} 0 3
[junit4:junit4]   2> 14768 T694 C101 P56968 /update {wt=javabin&version=2} {add=[10 (1413904767387697152)]} 0 15
[junit4:junit4]   2> 14782 T732 C99 P56981 REQ /update {update.distrib=FROMLEADER&distrib.from=http://127.0.0.1:56975/solr/collection1/&wt=javabin&version=2} status=0 QTime=3 
[junit4:junit4]   2> 14783 T712 C100 P56975 REQ /update {distrib.from=http://127.0.0.1:56978/solr/collection1/&update.distrib=TOLEADER&wt=javabin&version=2} status=0 QTime=9 
[junit4:junit4]   2> 14783 T720 C102 P56978 /update {wt=javabin&version=2} {add=[10]} 0 12
[junit4:junit4]   2> 14792 T694 C101 P56968 /update {wt=javabin&version=2} {add=[11 (1413904767423348736)]} 0 5
[junit4:junit4]   2> 14806 T732 C99 P56981 REQ /update {update.distrib=FROMLEADER&distrib.from=http://127.0.0.1:56975/solr/collection1/&wt=javabin&version=2} status=0 QTime=3 
[junit4:junit4]   2> 14807 T712 C100 P56975 REQ /update {distrib.from=http://127.0.0.1:56978/solr/collection1/&update.distrib=TOLEADER&wt=javabin&version=2} status=0 QTime=9 
[junit4:junit4]   2> 14808 T720 C102 P56978 /update {wt=javabin&version=2} {add=[11]} 0 13
[junit4:junit4]   2> 14814 T694 C101 P56968 /update {wt=javabin&version=2} {add=[12 (1413904767448514560)]} 0 3
[junit4:junit4]   2> 14828 T732 C99 P56981 REQ /update {update.distrib=FROMLEADER&distrib.from=http://127.0.0.1:56975/solr/collection1/&wt=javabin&version=2} status=0 QTime=3 
[junit4:junit4]   2> 14829 T712 C100 P56975 REQ /update {distrib.from=http://127.0.0.1:56978/solr/collection1/&update.distrib=TOLEADER&wt=javabin&version=2} status=0 QTime=8 
[junit4:junit4]   2> 14829 T720 C102 P56978 /update {wt=javabin&version=2} {add=[12]} 0 12
[junit4:junit4]   2> 14836 T694 C101 P56968 /update {wt=javabin&version=2} {add=[13 (1413904767471583232)]} 0 3
[junit4:junit4]   2> 14851 T732 C99 P56981 REQ /update {update.distrib=FROMLEADER&distrib.from=http://127.0.0.1:56975/solr/collection1/&wt=javabin&version=2} status=0 QTime=3 
[junit4:junit4]   2> 14852 T712 C100 P56975 REQ /update {distrib.from=http://127.0.0.1:56978/solr/collection1/&update.distrib=TOLEADER&wt=javabin&version=2} status=0 QTime=10 
[junit4:junit4]   2> 14853 T720 C102 P56978 /update {wt=javabin&version=2} {add=[13]} 0 14
[junit4:junit4]   2> 14859 T694 C101 P56968 /update {wt=javabin&version=2} {add=[14 (1413904767495700480)]} 0 3
[junit4:junit4]   2> 14873 T732 C99 P56981 REQ /update {update.distrib=FROMLEADER&distrib.from=http://127.0.0.1:56975/solr/collection1/&wt=javabin&version=2} status=0 QTime=3 
[junit4:junit4]   2> 14873 T712 C100 P56975 REQ /update {distrib.from=http://127.0.0.1:56978/solr/collection1/&update.distrib=TOLEADER&wt=javabin&version=2} status=0 QTime=8 
[junit4:junit4]   2> 14874 T720 C102 P56978 /update {wt=javabin&version=2} {add=[14]} 0 12
[junit4:junit4]   2> 14879 T694 C101 P56968 /update {wt=javabin&version=2} {add=[15 (1413904767517720576)]} 0 2
[junit4:junit4]   2> 14893 T732 C99 P56981 REQ /update {update.distrib=FROMLEADER&distrib.from=http://127.0.0.1:56975/solr/collection1/&wt=javabin&version=2} status=0 QTime=3 
[junit4:junit4]   2> 14893 T712 C100 P56975 REQ /update {distrib.from=http://127.0.0.1:56978/solr/collection1/&update.distrib=TOLEADER&wt=javabin&version=2} status=0 QTime=8 
[junit4:junit4]   2> 14894 T720 C102 P56978 /update {wt=javabin&version=2} {add=[15]} 0 12
[junit4:junit4]   2> 14899 T694 C101 P56968 /update {wt=javabin&version=2} {add=[16 (1413904767538692096)]} 0 2
[junit4:junit4]   2> 14937 T732 C99 P56981 REQ /update {update.distrib=FROMLEADER&distrib.from=http://127.0.0.1:56975/solr/collection1/&wt=javabin&version=2} status=0 QTime=14 
[junit4:junit4]   2> 14938 T712 C100 P56975 REQ /update {distrib.from=http://127.0.0.1:56978/solr/collection1/&update.distrib=TOLEADER&wt=javabin&version=2} status=0 QTime=33 
[junit4:junit4]   2> 14939 T720 C102 P56978 /update {wt=javabin&version=2} {add=[16]} 0 37
[junit4:junit4]   2> 14951 T694 C101 P56968 /update {wt=javabin&version=2} {add=[17 (1413904767589023744)]} 0 7
[junit4:junit4]   2> 14967 T721 C102 P56978 REQ /update {distrib.from=http://127.0.0.1:56975/solr/collection1/&update.distrib=TOLEADER&wt=javabin&version=2} status=0 QTime=7 
[junit4:junit4]   2> 14968 T713 C100 P56975 /update {wt=javabin&version=2} {add=[17]} 0 13
[junit4:junit4]   2> 14973 T694 C101 P56968 /update {wt=javabin&version=2} {add=[100 (1413904767616286720)]} 0 2
[junit4:junit4]   2> 14988 T732 C99 P56981 REQ /update {update.distrib=FROMLEADER&distrib.from=http://127.0.0.1:56975/solr/collection1/&wt=javabin&version=2} status=0 QTime=3 
[junit4:junit4]   2> 14989 T712 C100 P56975 REQ /update {distrib.from=http://127.0.0.1:56978/solr/collection1/&update.distrib=TOLEADER&wt=javabin&version=2} status=0 QTime=10 
[junit4:junit4]   2> 14990 T720 C102 P56978 /update {wt=javabin&version=2} {add=[100]} 0 14
[junit4:junit4]   2> 14996 T694 C101 P56968 /update {wt=javabin&version=2} {add=[101 (1413904767640403968)]} 0 2
[junit4:junit4]   2> 15008 T732 C99 P56981 REQ /update {update.distrib=FROMLEADER&distrib.from=http://127.0.0.1:56975/solr/collection1/&wt=javabin&version=2} status=0 QTime=2 
[junit4:junit4]   2> 15009 T712 C100 P56975 REQ /update {distrib.from=http://127.0.0.1:56978/solr/collection1/&update.distrib=TOLEADER&wt=javabin&version=2} status=0 QTime=7 
[junit4:junit4]   2> 15009 T720 C102 P56978 /update {wt=javabin&version=2} {add=[101]} 0 10
[junit4:junit4]   2> 15028 T694 C101 P56968 /update {wt=javabin&version=2} {add=[102 (1413904767660326912)]} 0 15
[junit4:junit4]   2> 15040 T732 C99 P56981 REQ /update {update.distrib=FROMLEADER&distrib.from=http://127.0.0.1:56975/solr/collection1/&wt=javabin&version=2} status=0 QTime=2 
[junit4:junit4]   2> 15041 T712 C100 P56975 REQ /update {distrib.from=http://127.0.0.1:56978/solr/collection1/&update.distrib=TOLEADER&wt=javabin&version=2} status=0 QTime=7 
[junit4:junit4]   2> 15041 T720 C102 P56978 /update {wt=javabin&version=2} {add=[102]} 0 10
[junit4:junit4]   2> 15049 T694 C101 P56968 /update {wt=javabin&version=2} {add=[103 (1413904767693881344)]} 0 4
[junit4:junit4]   2> 15057 T721 C102 P56978 REQ /update {distrib.from=http://127.0.0.1:56975/solr/collection1/&update.distrib=TOLEADER&wt=javabin&version=2} status=0 QTime=2 
[junit4:junit4]   2> 15058 T713 C100 P56975 /update {wt=javabin&version=2} {add=[103]} 0 6
[junit4:junit4]   2> 15063 T694 C101 P56968 /update {wt=javabin&version=2} {add=[104 (1413904767710658560)]} 0 2
[junit4:junit4]   2> 15068 T720 C102 P56978 /update {wt=javabin&version=2} {add=[104 (1413904767715901440)]} 0 2
[junit4:junit4]   2> 15073 T694 C101 P56968 /update {wt=javabin&version=2} {add=[105 (1413904767721144320)]} 0 2
[junit4:junit4]   2> 15090 T720 C102 P56978 /update {wt=javabin&version=2} {add=[105 (1413904767727435776)]} 0 13
[junit4:junit4]   2> 15096 T694 C101 P56968 /update {wt=javabin&version=2} {add=[106 (1413904767745261568)]} 0 2
[junit4:junit4]   2> 15107 T721 C102 P56978 REQ /update {distrib.from=http://127.0.0.1:56975/solr/collection1/&update.distrib=TOLEADER&wt=javabin&version=2} status=0 QTime=3 
[junit4:junit4]   2> 15108 T713 C100 P56975 /update {wt=javabin&version=2} {add=[106]} 0 8
[junit4:junit4]   2> 15114 T694 C101 P56968 /update {wt=javabin&version=2} {add=[107 (1413904767764135936)]} 0 2
[junit4:junit4]   2> 15123 T732 C99 P56981 REQ /update {distrib.from=http://127.0.0.1:56975/solr/collection1/&update.distrib=FROMLEADER&wt=javabin&version=2} status=0 QTime=2 
[junit4:junit4]   2> 15124 T713 C100 P56975 /update {wt=javabin&version=2} {add=[107 (1413904767769378816)]} 0 7
[junit4:junit4]   2> 15129 T694 C101 P56968 /update {wt=javabin&version=2} {add=[108 (1413904767779864576)]} 0 2
[junit4:junit4]   2> 15141 T732 C99 P56981 REQ /update {update.distrib=FROMLEADER&distrib.from=http://127.0.0.1:56975/solr/collection1/&wt=javabin&version=2} status=0 QTime=2 
[junit4:junit4]   2> 15143 T712 C100 P56975 REQ /update {distrib.from=http://127.0.0.1:56978/solr/collection1/&update.distrib=TOLEADER&wt=javabin&version=2} status=0 QTime=8 
[junit4:junit4]   2> 15144 T720 C102 P56978 /update {wt=javabin&version=2} {add=[108]} 0 12
[junit4:junit4]   2> 15149 T694 C101 P56968 /update {wt=javabin&version=2} {add=[109 (1413904767799787520)]} 0 2
[junit4:junit4]   2> 15162 T732 C99 P56981 REQ /update {distrib.from=http://127.0.0.1:56975/solr/collection1/&update.distrib=FROMLEADER&wt=javabin&version=2} status=0 QTime=3 
[junit4:junit4]   2> 15164 T713 C100 P56975 /update {wt=javabin&version=2} {add=[109 (1413904767806078976)]} 0 12
[junit4:junit4]   2> 15169 T694 C101 P56968 /update {wt=javabin&version=2} {add=[110 (1413904767821807616)]} 0 2
[junit4:junit4]   2> 15181 T732 C99 P56981 REQ /update {update.distrib=FROMLEADER&distrib.from=http://127.0.0.1:56975/solr/collection1/&wt=javabin&version=2} status=0 QTime=2 
[junit4:junit4]   2> 15182 T712 C100 P56975 REQ /update {distrib.from=http://127.0.0.1:56978/solr/collection1/&update.distrib=TOLEADER&wt=javabin&version=2} status=0 QTime=7 
[junit4:junit4]   2> 15183 T720 C102 P56978 /update {wt=javabin&version=2} {add=[110]} 0 11
[junit4:junit4]   2> 15188 T694 C101 P56968 /update {wt=javabin&version=2} {add=[111 (1413904767841730560)]} 0 2
[junit4:junit4]   2> 15197 T732 C99 P56981 REQ /update {distrib.from=http://127.0.0.1:56975/solr/collection1/&update.distrib=FROMLEADER&wt=javabin&version=2} status=0 QTime=2 
[junit4:junit4]   2> 15198 T713 C100 P56975 /update {wt=javabin&version=2} {add=[111 (1413904767845924864)]} 0 7
[junit4:junit4]   2> 15214 T694 C101 P56968 /update {wt=javabin&version=2} {add=[112 (1413904767857459200)]} 0 12
[junit4:junit4]   2> 15219 T720 C102 P56978 /update {wt=javabin&version=2} {add=[112 (1413904767874236416)]} 0 2
[junit4:junit4]   2> 15227 T694 C101 P56968 /update {wt=javabin&version=2} {add=[113 (1413904767880527872)]} 0 4
[junit4:junit4]   2> 15240 T732 C99 P56981 REQ /update {update.distrib=FROMLEADER&distrib.from=http://127.0.0.1:56975/solr/collection1/&wt=javabin&version=2} status=0 QTime=2 
[junit4:junit4]   2> 15241 T712 C100 P56975 REQ /update {distrib.from=http://127.0.0.1:56978/solr/collection1/&update.distrib=TOLEADER&wt=javabin&version=2} status=0 QTime=7 
[junit4:junit4]   2> 15242 T720 C102 P56978 /update {wt=javabin&version=2} {add=[113]} 0 12
[junit4:junit4]   2> 15247 T694 C101 P56968 /update {wt=javabin&version=2} {add=[114 (1413904767903596544)]} 0 2
[junit4:junit4]   2> 15279 T732 C99 P56981 REQ /update {update.distrib=FROMLEADER&distrib.from=http://127.0.0.1:56975/solr/collection1/&wt=javabin&version=2} status=0 QTime=11 
[junit4:junit4]   2> 15280 T712 C100 P56975 REQ /update {distrib.from=http://127.0.0.1:56978/solr/collection1/&update.distrib=TOLEADER&wt=javabin&version=2} status=0 QTime=27 
[junit4:junit4]   2> 15281 T720 C102 P56978 /update {wt=javabin&version=2} {add=[114]} 0 31
[junit4:junit4]   2> 15287 T694 C101 P56968 /update {wt=javabin&version=2} {add=[115 (1413904767945539584)]} 0 2
[junit4:junit4]   2> 15292 T720 C102 P56978 /update {wt=javabin&version=2} {add=[115 (1413904767950782464)]} 0 2
[junit4:junit4]   2> 15298 T694 C101 P56968 /update {wt=javabin&version=2} {add=[116 (1413904767956025344)]} 0 2
[junit4:junit4]   2> 15303 T720 C102 P56978 /update {wt=javabin&version=2} {add=[116 (1413904767962316800)]} 0 2
[junit4:junit4]   2> 15309 T694 C101 P56968 /update {wt=javabin&version=2} {add=[117 (1413904767968608256)]} 0 2
[junit4:junit4]   2> 15314 T720 C102 P56978 /update {wt=javabin&version=2} {add=[117 (1413904767972802560)]} 0 2
[junit4:junit4]   2> 15319 T694 C101 P56968 /update {wt=javabin&version=2} {add=[118 (1413904767978045440)]} 0 2
[junit4:junit4]   2> 15331 T732 C99 P56981 REQ /update {distrib.from=http://127.0.0.1:56975/solr/collection1/&update.distrib=FROMLEADER&wt=javabin&version=2} status=0 QTime=3 
[junit4:junit4]   2> 15332 T713 C100 P56975 /update {wt=javabin&version=2} {add=[118 (1413904767983288320)]} 0 10
[junit4:junit4]   2> 15338 T694 C101 P56968 /update {wt=javabin&version=2} {add=[119 (1413904767999016960)]} 0 2
[junit4:junit4]   2> 15343 T720 C102 P56978 /update {wt=javabin&version=2} {add=[119 (1413904768004259840)]} 0 2
[junit4:junit4]   2> 15348 T694 C101 P56968 /update {wt=javabin&version=2} {add=[120 (1413904768008454144)]} 0 2
[junit4:junit4]   2> 15353 T720 C102 P56978 /update {wt=javabin&version=2} {add=[120 (1413904768014745600)]} 0 2
[junit4:junit4]   2> 15359 T694 C101 P56968 /update {wt=javabin&version=2} {add=[121 (1413904768021037056)]} 0 2
[junit4:junit4]   2> 15365 T720 C102 P56978 /update {wt=javabin&version=2} {add=[121 (1413904768026279936)]} 0 3
[junit4:junit4]   2> 15379 T694 C101 P56968 /update {wt=javabin&version=2} {add=[122 (1413904768032571392)]} 0 11
[junit4:junit4]   2> 15391 T732 C99 P56981 REQ /update {update.distrib=FROMLEADER&distrib.from=http://127.0.0.1:56975/solr/collection1/&wt=javabin&version=2} status=0 QTime=2 
[junit4:junit4]   2> 15392 T712 C100 P56975 REQ /update {distrib.from=http://127.0.0.1:56978/solr/collection1/&update.distrib=TOLEADER&wt=javabin&version=2} status=0 QTime=7 
[junit4:junit4]   2> 15392 T720 C102 P56978 /update {wt=javabin&version=2} {add=[122]} 0 10
[junit4:junit4]   2> 15399 T694 C101 P56968 /update {wt=javabin&version=2} {add=[123 (1413904768060882944)]} 0 3
[junit4:junit4]   2> 15411 T732 C99 P56981 REQ /update {update.distrib=FROMLEADER&distrib.from=http://127.0.0.1:56975/solr/collection1/&wt=javabin&version=2} status=0 QTime=2 
[junit4:junit4]   2> 15412 T712 C100 P56975 REQ /update {distrib.from=http://127.0.0.1:56978/solr/collection1/&update.distrib=TOLEADER&wt=javabin&version=2} status=0 QTime=7 
[junit4:junit4]   2> 15412 T720 C102 P56978 /update {wt=javabin&version=2} {add=[123]} 0 10
[junit4:junit4]   2> 15418 T694 C101 P56968 /update {wt=javabin&version=2} {add=[124 (1413904768081854464)]} 0 2
[junit4:junit4]   2> 15430 T732 C99 P56981 REQ /update {update.distrib=FROMLEADER&distrib.from=http://127.0.0.1:56975/solr/collection1/&wt=javabin&version=2} status=0 QTime=2 
[junit4:junit4]   2> 15431 T712 C100 P56975 REQ /update {distrib.from=http://127.0.0.1:56978/solr/collection1/&update.distrib=TOLEADER&wt=javabin&version=2} status=0 QTime=7 
[junit4:junit4]   2> 15432 T720 C102 P56978 /update {wt=javabin&version=2} {add=[124]} 0 11
[junit4:junit4]   2> 15437 T694 C101 P56968 /update {wt=javabin&version=2} {add=[125 (1413904768101777408)]} 0 2
[junit4:junit4]   2> 15446 T732 C99 P56981 REQ /update {distrib.from=http://127.0.0.1:56975/solr/collection1/&update.distrib=FROMLEADER&wt=javabin&version=2} status=0 QTime=2 
[junit4:junit4]   2> 15447 T713 C100 P56975 /update {wt=javabin&version=2} {add=[125 (1413904768108068864)]} 0 6
[junit4:junit4]   2> 15452 T694 C101 P56968 /update {wt=javabin&version=2} {add=[126 (1413904768117506048)]} 0 2
[junit4:junit4]   2> 15461 T721 C102 P56978 REQ /update {distrib.from=http://127.0.0.1:56975/solr/collection1/&update.distrib=TOLEADER&wt=javabin&version=2} status=0 QTime=2 
[junit4:junit4]   2> 15462 T713 C100 P56975 /update {wt=javabin&version=2} {add=[126]} 0 7
[junit4:junit4]   2> 15467 T694 C101 P56968 /update {wt=javabin&version=2} {add=[127 (1413904768134283264)]} 0 2
[junit4:junit4]   2> 15480 T720 C102 P56978 /update {wt=javabin&version=2} {add=[127 (1413904768138477568)]} 0 10
[junit4:junit4]   2> 15486 T694 C101 P56968 /update {wt=javabin&version=2} {add=[128 (1413904768153157632)]} 0 2
[junit4:junit4]   2> 15496 T721 C102 P56978 REQ /update {distrib.from=http://127.0.0.1:56975/solr/collection1/&update.distrib=TOLEADER&wt=javabin&version=2} status=0 QTime=4 
[junit4:junit4]   2> 15497 T713 C100 P56975 /update {wt=javabin&version=2} {add=[128]} 0 8
[junit4:junit4]   2> 15502 T694 C101 P56968 /update {wt=javabin&version=2} {add=[129 (1413904768170983424)]} 0 2
[junit4:junit4]   2> 15514 T732 C99 P56981 REQ /update {update.distrib=FROMLEADER&distrib.from=http://127.0.0.1:56975/solr/collection1/&wt=javabin&version=2} status=0 QTime=2 
[junit4:junit4]   2> 15515 T712 C100 P56975 REQ /update {distrib.from=http://127.0.0.1:56978/solr/collection1/&update.distrib=TOLEADER&wt=javabin&version=2} status=0 QTime=7 
[junit4:junit4]   2> 15516 T720 C102 P56978 /update {wt=javabin&version=2} {add=[129]} 0 11
[junit4:junit4]   2> 15521 T694 C101 P56968 /update {wt=javabin&version=2} {add=[130 (1413904768189857792)]} 0 2
[junit4:junit4]   2> 15529 T721 C102 P56978 REQ /update {distrib.from=http://127.0.0.1:56975/solr/collection1/&update.distrib=TOLEADER&wt=javabin&version=2} status=0 QTime=2 
[junit4:junit4]   2> 15530 T713 C100 P56975 /update {wt=javabin&version=2} {add=[130]} 0 6
[junit4:junit4]   2> 15535 T694 C101 P56968 /update {wt=javabin&version=2} {add=[131 (1413904768205586432)]} 0 2
[junit4:junit4]   2> 15543 T721 C102 P56978 REQ /update {distrib.from=http://127.0.0.1:56975/solr/collection1/&update.distrib=TOLEADER&wt=javabin&version=2} status=0 QTime=2 
[junit4:junit4]   2> 15544 T713 C100 P56975 /update {wt=javabin&version=2} {add=[131]} 0 6
[junit4:junit4]   2> 15558 T694 C101 P56968 /update {wt=javabin&version=2} {add=[132 (1413904768220266496)]} 0 11
[junit4:junit4]   2> 15571 T732 C99 P56981 REQ /update {update.distrib=FROMLEADER&distrib.from=http://127.0.0.1:56975/solr/collection1/&wt=javabin&version=2} status=0 QTime=2 
[junit4:junit4]   2> 15572 T712 C100 P56975 REQ /update {distrib.from=http://127.0.0.1:56978/solr/collection1/&update.distrib=TOLEADER&wt=javabin&version=2} status=0 QTime=7 
[junit4:junit4]   2> 15573 T720 C102 P56978 /update {wt=javabin&version=2} {add=[132]} 0 11
[junit4:junit4]   2> 15580 T694 C101 P56968 /update {wt=javabin&version=2} {add=[133 (1413904768250675200)]} 0 4
[junit4:junit4]   2> 15589 T732 C99 P56981 REQ /update {distrib.from=http://127.0.0.1:56975/solr/collection1/&update.distrib=FROMLEADER&wt=javabin&version=2} status=0 QTime=2 
[junit4:junit4]   2> 15590 T713 C100 P56975 /update {wt=javabin&version=2} {add=[133 (1413904768258015232)]} 0 7
[junit4:junit4]   2> 15606 T694 C101 P56968 /update {wt=javabin&version=2} {add=[134 (1413904768268500992)]} 0 13
[junit4:junit4]   2> 15615 T721 C102 P56978 REQ /update {distrib.from=http://127.0.0.1:56975/solr/collection1/&update.distrib=TOLEADER&wt=javabin&version=2} status=0 QTime=2 
[junit4:junit4]   2> 15616 T713 C100 P56975 /update {wt=javabin&version=2} {add=[134]} 0 6
[junit4:junit4]   2> 15621 T694 C101 P56968 /update {wt=javabin&version=2} {add=[135 (1413904768295763968)]} 0 2
[junit4:junit4]   2> 15633 T732 C99 P56981 REQ /update {update.distrib=FROMLEADER&distrib.from=http://127.0.0.1:56975/solr/collection1/&wt=javabin&version=2} status=0 QTime=2 
[junit4:junit4]   2> 15634 T712 C100 P56975 REQ /update {distrib.from=http://127.0.0.1:56978/solr/collection1/&update.distrib=TOLEADER&wt=javabin&version=2} status=0 QTime=7 
[junit4:junit4]   2> 15635 T720 C102 P56978 /update {wt=javabin&version=2} {add=[135]} 0 11
[junit4:junit4]   2> 15640 T694 C101 P56968 /update {wt=javabin&version=2} {add=[136 (1413904768315686912)]} 0 2
[junit4:junit4]   2> 15652 T720 C102 P56978 /update {wt=javabin&version=2} {add=[136 (1413904768320929792)]} 0 9
[junit4:junit4]   2> 15658 T694 C101 P56968 /update {wt=javabin&version=2} {add=[137 (1413904768334561280)]} 0 2
[junit4:junit4]   2> 15666 T721 C102 P56978 REQ /update {distrib.from=http://127.0.0.1:56975/solr/collection1/&update.distrib=TOLEADER&wt=javabin&version=2} status=0 QTime=2 
[junit4:junit4]   2> 15667 T713 C100 P56975 /update {wt=javabin&version=2} {add=[137]} 0 6
[junit4:junit4]   2> 15672 T694 C101 P56968 /update {wt=javabin&version=2} {add=[138 (1413904768349241344)]} 0 2
[junit4:junit4]   2> 15700 T732 C99 P56981 REQ /update {distrib.from=http://127.0.0.1:56975/solr/collection1/&update.distrib=FROMLEADER&wt=javabin&version=2} status=0 QTime=11 
[junit4:junit4]   2> 15701 T713 C100 P56975 /update {wt=javabin&version=2} {add=[138 (1413904768354484224)]} 0 26
[junit4:junit4]   2> 15706 T694 C101 P56968 /update {wt=javabin&version=2} {add=[139 (1413904768384892928)]} 0 2
[junit4:junit4]   2> 15714 T721 C102 P56978 REQ /update {distrib.from=http://127.0.0.1:56975/solr/collection1/&update.distrib=TOLEADER&wt=javabin&version=2} status=0 QTime=2 
[junit4:junit4]   2> 15715 T713 C100 P56975 /update {wt=javabin&version=2} {add=[139]} 0 6
[junit4:junit4]   2> 15721 T694 C101 P56968 /update {wt=javabin&version=2} {add=[140 (1413904768399572992)]} 0 2
[junit4:junit4]   2> 15729 T721 C102 P56978 REQ /update {distrib.from=http://127.0.0.1:56975/solr/collection1/&update.distrib=TOLEADER&wt=javabin&version=2} status=0 QTime=2 
[junit4:junit4]   2> 15730 T713 C100 P56975 /update {wt=javabin&version=2} {add=[140]} 0 6
[junit4:junit4]   2> 15735 T694 C101 P56968 /update {wt=javabin&version=2} {add=[141 (1413904768415301632)]} 0 2
[junit4:junit4]   2> 15740 T720 C102 P56978 /update {wt=javabin&version=2} {add=[141 (1413904768420544512)]} 0 2
[junit4:junit4]   2> 15754 T694 C101 P56968 /update {wt=javabin&version=2} {add=[142 (1413904768425787392)]} 0 10
[junit4:junit4]   2> 15767 T720 C102 P56978 /update {wt=javabin&version=2} {add=[142 (1413904768440467456)]} 0 10
[junit4:junit4]   2> 15775 T694 C101 P56968 /update {wt=javabin&version=2} {add=[143 (1413904768455147520)]} 0 4
[junit4:junit4]   2> 15782 T720 C102 P56978 /update {wt=javabin&version=2} {add=[143 (1413904768462487552)]} 0 4
[junit4:junit4]   2> 15787 T694 C101 P56968 /update {wt=javabin&version=2} {add=[144 (1413904768469827584)]} 0 2
[junit4:junit4]   2> 15795 T721 C102 P56978 REQ /update {distrib.from=http://127.0.0.1:56975/solr/collection1/&update.distrib=TOLEADER&wt=javabin&version=2} status=0 QTime=2 
[junit4:junit4]   2> 15796 T713 C100 P56975 /update {wt=javabin&version=2} {add=[144]} 0 6
[junit4:junit4]   2> 15801 T694 C101 P56968 /update {wt=javabin&version=2} {add=[145 (1413904768484507648)]} 0 2
[junit4:junit4]   2> 15809 T721 C102 P56978 REQ /update {distrib.from=http://127.0.0.1:56975/solr/collection1/&update.distrib=TOLEADER&wt=javabin&version=2} status=0 QTime=2 
[junit4:junit4]   2> 15810 T713 C100 P56975 /update {wt=javabin&version=2} {add=[145]} 0 6
[junit4:junit4]   2> 15815 T694 C101 P56968 /update {wt=javabin&version=2} {add=[146 (1413904768498139136)]} 0 2
[junit4:junit4]   2> 15827 T732 C99 P56981 REQ /update {distrib.from=http://127.0.0.1:56975/solr/collection1/&update.distrib=FROMLEADER&wt=javabin&version=2} status=0 QTime=3 
[junit4:junit4]   2> 15828 T713 C100 P56975 /update {wt=javabin&version=2} {add=[146 (1413904768504430592)]} 0 10
[junit4:junit4]   2> 15833 T694 C101 P56968 /update {wt=javabin&version=2} {add=[147 (1413904768518062080)]} 0 2
[junit4:junit4]   2> 15841 T721 C102 P56978 REQ /update {distrib.from=http://127.0.0.1:56975/solr/collection1/&update.distrib=TOLEADER&wt=javabin&version=2} status=0 QTime=2 
[junit4:junit4]   2> 15842 T713 C100 P56975 /update {wt=javabin&version=2} {add=[147]} 0 6
[junit4:junit4]   2> 15847 T694 C101 P56968 /update {wt=javabin&version=2} {add=[148 (1413904768532742144)]} 0 2
[junit4:junit4]   2> 15859 T732 C99 P56981 REQ /update {update.distrib=FROMLEADER&distrib.from=http://127.0.0.1:56975/solr/collection1/&wt=javabin&version=2} status=0 QTime=2 
[junit4:junit4]   2> 15860 T712 C100 P56975 REQ /update {distrib.from=http://127.0.0.1:56978/solr/collection1/&update.distrib=TOLEADER&wt=javabin&version=2} status=0 QTime=7 
[junit4:junit4]   2> 15861 T720 C102 P56978 /update {wt=javabin&version=2} {add=[148]} 0 11
[junit4:junit4]   2> 15866 T694 C101 P56968 /update {wt=javabin&version=2} {add=[149 (1413904768552665088)]} 0 2
[junit4:junit4]   2> 15871 T720 C102 P56978 /update {wt=javabin&version=2} {add=[149 (1413904768556859392)]} 0 2
[junit4:junit4]   2> 15874 T694 C101 P56968 oasu.DirectUpdateHandler2.commit start commit{flags=0,_version_=0,optimize=false,openSearcher=true,waitSearcher=true,expungeDeletes=false,softCommit=false}
[junit4:junit4]   2> 16099 T694 C101 P56968 oasc.SolrDeletionPolicy.onCommit SolrDeletionPolicy.onCommit: commits:num=2
[junit4:junit4]   2> 		commit{dir=/usr/home/hudson/hudson-slave/workspace/Lucene-Solr-Tests-4.x-java7/solr/build/solr-core/test/J0/org.apache.solr.cloud.BasicDistributedZkTest-1348404647752/control/data/index,segFN=segments_1,generation=1,filenames=[segments_1]
[junit4:junit4]   2> 		commit{dir=/usr/home/hudson/hudson-slave/workspace/Lucene-Solr-Tests-4.x-java7/solr/build/solr-core/test/J0/org.apache.solr.cloud.BasicDistributedZkTest-1348404647752/control/data/index,segFN=segments_2,generation=2,filenames=[_5_nrm.cfe, _3_nrm.cfe, _5.fdt, _5.prx, _1.frq, _4.prx, _4.fnm, _4_nrm.cfe, _3.fdt, _1.fnm, _2.tim, _4.fdx, _5.tip, _5.tim, _4.frq, _0.prx, _0.fnm, _2.prx, _2.frq, _2.fdt, _3.prx, _2.fdx, _5.si, _2.tip, _1.fdx, _1.prx, _3_nrm.cfs, _5_nrm.cfs, _1.fdt, _0.tim, _0.frq, _4_nrm.cfs, _3.si, _6.fdt, _0.tip, _2.si, _3.frq, _6.frq, _3.tim, _6.fdx, _3.fnm, _2_nrm.cfe, _6.tip, _6_nrm.cfs, _6.tim, _4.tip, _0.si, _2_nrm.cfs, _1.tip, _1.tim, _1_nrm.cfs, _5.fnm, _4.tim, _6_nrm.cfe, _5.frq, _4.si, _4.fdt, _0_nrm.cfs, _1_nrm.cfe, _2.fnm, _3.fdx, _6.prx, _1.si, _0_nrm.cfe, _5.fdx, segments_2, _6.si, _6.fnm, _0.fdx, _3.tip, _0.fdt]
[junit4:junit4]   2> 16100 T694 C101 P56968 oasc.SolrDeletionPolicy.updateCommits newest commit = 2
[junit4:junit4]   2> 16107 T694 C101 P56968 oass.SolrIndexSearcher.<init> Opening Searcher@45cdde75 main
[junit4:junit4]   2> 16108 T694 C101 P56968 oasu.DirectUpdateHandler2.commit end_commit_flush
[junit4:junit4]   2> 16110 T705 oasc.SolrCore.registerSearcher [collection1] Registered new searcher Searcher@45cdde75 main{StandardDirectoryReader(segments_2:15:nrt _0(4.1):C10 _1(4.1):C10 _2(4.1):C10 _3(4.1):C10 _4(4.1):C10 _5(4.1):C10 _6(4.1):C7)}
[junit4:junit4]   2> 16111 T694 C101 P56968 /update {waitSearcher=true&wt=javabin&commit=true&softCommit=false&version=2} {commit=} 0 237
[junit4:junit4]   2> 16114 T720 C102 P56978 oasu.DirectUpdateHandler2.commit start commit{flags=0,_version_=0,optimize=false,openSearcher=true,waitSearcher=true,expungeDeletes=false,softCommit=false}
[junit4:junit4]   2> 16263 T720 C102 P56978 oasc.SolrDeletionPolicy.onCommit SolrDeletionPolicy.onCommit: commits:num=2
[junit4:junit4]   2> 		commit{dir=/usr/home/hudson/hudson-slave/workspace/Lucene-Solr-Tests-4.x-java7/solr/build/solr-core/test/J0/org.apache.solr.cloud.BasicDistributedZkTest-1348404647752/jetty2/index,segFN=segments_1,generation=1,filenames=[segments_1]
[junit4:junit4]   2> 		commit{dir=/usr/home/hudson/hudson-slave/workspace/Lucene-Solr-Tests-4.x-java7/solr/build/solr-core/test/J0/org.apache.solr.cloud.BasicDistributedZkTest-1348404647752/jetty2/index,segFN=segments_2,generation=2,filenames=[_3_nrm.cfe, _2.si, _3.frq, _1.frq, _3.tim, _3.fdt, _3.fnm, _1.fnm, _2.tim, _2_nrm.cfe, _2_nrm.cfs, _0.si, _0.prx, _1.tip, _1.tim, _1_nrm.cfs, _0.fnm, _2.prx, _2.fdt, _2.frq, _3.prx, _0_nrm.cfs, _2.fdx, _2.fnm, _1_nrm.cfe, _3.fdx, _3_nrm.cfs, _1.prx, _1.fdx, _2.tip, _1.fdt, _1.si, _0.frq, _0.tim, _0_nrm.cfe, segments_2, _3.si, _3.tip, _0.fdx, _0.tip, _0.fdt]
[junit4:junit4]   2> 16264 T720 C102 P56978 oasc.SolrDeletionPolicy.updateCommits newest commit = 2
[junit4:junit4]   2> 16270 T720 C102 P56978 oass.SolrIndexSearcher.<init> Opening Searcher@5ce49809 main
[junit4:junit4]   2> 16271 T720 C102 P56978 oasu.DirectUpdateHandler2.commit end_commit_flush
[junit4:junit4]   2> 16273 T729 oasc.SolrCore.registerSearcher [collection1] Registered new searcher Searcher@5ce49809 main{StandardDirectoryReader(segments_2:9:nrt _0(4.1):C10 _1(4.1):C10 _2(4.1):C10 _3(4.1):C5)}
[junit4:junit4]   2> 16274 T720 C102 P56978 oasu.SolrCmdDistributor.distribCommit Distrib commit to:[StdNode: http://127.0.0.1:56975/solr/collection1/, StdNode: http://127.0.0.1:56981/solr/collection1/]
[junit4:junit4]   2> 16278 T712 C100 P56975 oasu.DirectUpdateHandler2.commit start commit{flags=0,_version_=0,optimize=false,openSearcher=true,waitSearcher=true,expungeDeletes=false,softCommit=false}
[junit4:junit4]   2> 16278 T732 C99 P56981 oasu.DirectUpdateHandler2.commit start commit{flags=0,_version_=0,optimize=false,openSearcher=true,waitSearcher=true,expungeDeletes=false,softCommit=false}
[junit4:junit4]   2> 16474 T732 C99 P56981 oasc.SolrDeletionPolicy.onCommit SolrDeletionPolicy.onCommit: commits:num=2
[junit4:junit4]   2> 		commit{dir=/usr/home/hudson/hudson-slave/workspace/Lucene-Solr-Tests-4.x-java7/solr/build/solr-core/test/J0/org.apache.solr.cloud.BasicDistributedZkTest-1348404647752/jetty3/index,segFN=segments_2,generation=2,filenames=[segments_2]
[junit4:junit4]   2> 		commit{dir=/usr/home/hudson/hudson-slave/workspace/Lucene-Solr-Tests-4.x-java7/solr/build/solr-core/test/J0/org.apache.solr.cloud.BasicDistributedZkTest-1348404647752/jetty3/index,segFN=segments_3,generation=3,filenames=[_3_nrm.cfe, _2.si, _3.frq, _1.frq, _3.tim, _3.fdt, _3.fnm, _1.fnm, _2.tim, _2_nrm.cfe, _2_nrm.cfs, _0.si, _0.prx, _1.tip, _1.tim, _1_nrm.cfs, _0.fnm, _2.prx, _2.fdt, _2.frq, _3.prx, _0_nrm.cfs, _2.fdx, _2.fnm, _1_nrm.cfe, _3.fdx, _3_nrm.cfs, _1.prx, _1.fdx, _2.tip, _1.fdt, _1.si, _0.frq, _0.tim, _0_nrm.cfe, _3.si, _3.tip, _0.fdx, _0.tip, _0.fdt, segments_3]
[junit4:junit4]   2> 16475 T732 C99 P56981 oasc.SolrDeletionPolicy.updateCommits newest commit = 3
[junit4:junit4]   2> 16476 T712 C100 P56975 oasc.SolrDeletionPolicy.onCommit SolrDeletionPolicy.onCommit: commits:num=2
[junit4:junit4]   2> 		commit{dir=/usr/home/hudson/hudson-slave/workspace/Lucene-Solr-Tests-4.x-java7/solr/build/solr-core/test/J0/org.apache.solr.cloud.BasicDistributedZkTest-1348404647752/jetty1/index,segFN=segments_1,generation=1,filenames=[segments_1]
[junit4:junit4]   2> 		commit{dir=/usr/home/hudson/hudson-slave/workspace/Lucene-Solr-Tests-4.x-java7/solr/build/solr-core/test/J0/org.apache.solr.cloud.BasicDistributedZkTest-1348404647752/jetty1/index,segFN=segments_2,generation=2,filenames=[_3_nrm.cfe, _2.si, _3.frq, _1.frq, _3.tim, _3.fdt, _3.fnm, _1.fnm, _2.tim, _2_nrm.cfe, _2_nrm.cfs, _0.si, _0.prx, _1.tip, _1.tim, _1_nrm.cfs, _0.fnm, _2.prx, _2.fdt, _2.frq, _3.prx, _0_nrm.cfs, _2.fdx, _2.fnm, _1_nrm.cfe, _3.fdx, _3_nrm.cfs, _1.prx, _1.fdx, _2.tip, _1.fdt, _1.si, _0.frq, _0.tim, _0_nrm.cfe, segments_2, _3.si, _3.tip, _0.fdx, _0.tip, _0.fdt]
[junit4:junit4]   2> 16477 T712 C100 P56975 oasc.SolrDeletionPolicy.updateCommits newest commit = 2
[junit4:junit4]   2> 16482 T732 C99 P56981 oass.SolrIndexSearcher.<init> Opening Searcher@5112f68d main
[junit4:junit4]   2> 16483 T732 C99 P56981 oasu.DirectUpdateHandler2.commit end_commit_flush
[junit4:junit4]   2> 16484 T712 C100 P56975 oass.SolrIndexSearcher.<init> Opening Searcher@52c74906 main
[junit4:junit4]   2> 16485 T712 C100 P56975 oasu.DirectUpdateHandler2.commit end_commit_flush
[junit4:junit4]   2> 16485 T741 oasc.SolrCore.registerSearcher [collection1] Registered new searcher Searcher@5112f68d main{StandardDirectoryReader(segments_3:10:nrt _0(4.1):C10 _1(4.1):C10 _2(4.1):C10 _3(4.1):C2)}
[junit4:junit4]   2> 16486 T732 C99 P56981 /update {waitSearcher=true&commit=true&wt=javabin&commit_end_point=true&expungeDeletes=false&softCommit=false&version=2} {commit=} 0 208
[junit4:junit4]   2> 16487 T717 oasc.SolrCore.registerSearcher [collection1] Registered new searcher Searcher@52c74906 main{StandardDirectoryReader(segments_2:9:nrt _0(4.1):C10 _1(4.1):C10 _2(4.1):C10 _3(4.1):C2)}
[junit4:junit4]   2> 16487 T712 C100 P56975 /update {waitSearcher=true&commit=true&wt=javabin&commit_end_point=true&expungeDeletes=false&softCommit=false&version=2} {commit=} 0 209
[junit4:junit4]   2> 16488 T720 C102 P56978 /update {waitSearcher=true&wt=javabin&commit=true&softCommit=false&version=2} {commit=} 0 374
[junit4:junit4]   2> 16496 T694 C101 P56968 REQ /select {distrib=false&sort=n_ti1+desc&wt=javabin&q=*:*&version=2} hits=67 status=0 QTime=4 
[junit4:junit4]   2> 16510 T722 C102 P56978 REQ /select {sort=n_ti1+desc&distrib=false&wt=javabin&rows=10&version=2&fl=id&shard.url=127.0.0.1:56978/solr/collection1/&NOW=1348404664252&start=0&q=*:*&isShard=true&fsv=true} hits=35 status=0 QTime=2 
[junit4:junit4]   2> 16514 T714 C100 P56975 REQ /select {sort=n_ti1+desc&distrib=false&wt=javabin&rows=10&version=2&fl=id&shard.url=127.0.0.1:56975/solr/collection1/|127.0.0.1:56981/solr/collection1/&NOW=1348404664252&start=0&q=*:*&isShard=true&fsv=true} hits=32 status=0 QTime=6 
[junit4:junit4]   2> 16532 T722 C102 P56978 REQ /select {shard.url=127.0.0.1:56978/solr/collection1/&NOW=1348404664252&q=*:*&ids=126,127,121,119&distrib=false&isShard=true&wt=javabin&version=2} status=0 QTime=2 
[junit4:junit4]   2> 16533 T714 C100 P56975 REQ /select {shard.url=127.0.0.1:56975/solr/collection1/|127.0.0.1:56981/solr/collection1/&NOW=1348404664252&q=*:*&ids=1,138,123,4,124,13&distrib=false&isShard=true&wt=javabin&version=2} status=0 QTime=3 
[junit4:junit4]   2> 16536 T733 C99 P56981 REQ /select {sort=n_ti1+desc&wt=javabin&q=*:*&version=2} hits=67 status=0 QTime=32 
[junit4:junit4]   2> 16547 T694 C101 P56968 REQ /select {distrib=false&sort=n_ti1+asc&wt=javabin&q=*:*&version=2} hits=67 status=0 QTime=1 
[junit4:junit4]   2> 16558 T723 C102 P56978 REQ /select {sort=n_ti1+asc&distrib=false&collection=collection1&wt=javabin&rows=10&version=2&NOW=1348404664302&shard.url=127.0.0.1:56978/solr/collection1/&fl=id&start=0&q=*:*&isShard=true&fsv=true} hits=35 status=0 QTime=1 
[junit4:junit4]   2> 16559 T734 C99 P56981 REQ /select {sort=n_ti1+asc&distrib=false&collection=collection1&wt=javabin&rows=10&version=2&NOW=1348404664302&shard.url=127.0.0.1:56975/solr/collection1/|127.0.0.1:56981/solr/collection1/&fl=id&start=0&q=*:*&isShard=true&fsv=true} hits=32 status=0 QTime=2 
[junit4:junit4]   2> 16566 T734 C99 P56981 REQ /select {shard.url=127.0.0.1:56975/solr/collection1/|127.0.0.1:56981/solr/collection1/&NOW=1348404664302&q=*:*&ids=146,133,122,8&distrib=false&collection=collection1&isShard=true&wt=javabin&version=2} status=0 QTime=1 
[junit4:junit4]   2> 16566 T723 C102 P56978 REQ /select {shard.url=127.0.0.1:56978/solr/collection1/&NOW=1348404664302&q=*:*&ids=134,144,115,112,139,6&distrib=false&collection=collection1&isShard=true&wt=javabin&version=2} status=0 QTime=2 
[junit4:junit4]   2> 16569 T713 C100 P56975 REQ /select {collection=collection1&sort=n_ti1+asc&wt=javabin&q=*:*&version=2} hits=67 status=0 QTime=15 
[junit4:junit4]   2> 16577 T694 C101 P56968 REQ /select {distrib=false&sort=n_f1+desc&wt=javabin&q=*:*&version=2} hits=67 status=0 QTime=2 
[junit4:junit4]   2> 16589 T724 C102 P56978 REQ /select {sort=n_f1+desc&distrib=false&wt=javabin&rows=10&version=2&fl=id&shard.url=127.0.0.1:56978/solr/collection1/&NOW=1348404664332&start=0&q=*:*&isShard=true&fsv=true} hits=35 status=0 QTime=2 
[junit4:junit4]   2> 16590 T709 C100 P56975 REQ /select {sort=n_f1+desc&distrib=false&wt=javabin&rows=10&version=2&fl=id&shard.url=127.0.0.1:56975/solr/collection1/|127.0.0.1:56981/solr/collection1/&NOW=1348404664332&start=0&q=*:*&isShard=true&fsv=true} hits=32 status=0 QTime=2 
[junit4:junit4]   2> 16599 T709 C100 P56975 REQ /select {shard.url=127.0.0.1:56975/solr/collection1/|127.0.0.1:56981/solr/collection1/&NOW=1348404664332&q=*:*&ids=138,111,15&distrib=false&isShard=true&wt=javabin&version=2} status=0 QTime=1 
[junit4:junit4]   2> 16599 T724 C102 P56978 REQ /select {shard.url=127.0.0.1:56978/solr/collection1/&NOW=1348404664332&q=*:*&ids=145,128,7,112,17,131,130&distrib=false&isShard=true&wt=javabin&version=2} status=0 QTime=3 
[junit4:junit4]   2> 16603 T720 C102 P56978 REQ /select {sort=n_f1+desc&wt=javabin&q=*:*&version=2} hits=67 status=0 QTime=19 
[junit4:junit4]   2> 16610 T694 C101 P56968 REQ /select {distrib=false&sort=n_f1+asc&wt=javabin&q=*:*&version=2} hits=67 status=0 QTime=1 
[junit4:junit4]   2> 16614 T682 oascsi.HttpClientUtil.createClient Creating new http client, config:
[junit4:junit4]   2> 16628 T682 oaz.ZooKeeper.<init> Initiating client connection, connectString=127.0.0.1:56962/solr sessionTimeout=10000 watcher=org.apache.solr.common.cloud.ConnectionManager@404b11ef
[junit4:junit4]   2> 16629 T757 oaz.ClientCnxn$SendThread.startConnect Opening socket connection to server /127.0.0.1:56962
[junit4:junit4]   2> 16629 T682 oascc.ConnectionManager.waitForConnected Waiting for client to connect to ZooKeeper
[junit4:junit4]   2> 16630 T757 oaz.ClientCnxn$SendThread.primeConnection Socket connection established to localhost/127.0.0.1:56962, initiating session
[junit4:junit4]   2> 16631 T684 oazs.NIOServerCnxn$Factory.run Accepted socket connection from /140.211.11.196:57021
[junit4:junit4]   2> 16632 T684 oazs.NIOServerCnxn.readConnectRequest Client attempting to establish new session at /140.211.11.196:57021
[junit4:junit4]   2> 16637 T688 oazs.NIOServerCnxn.finishSessionInit Established session 0x139f32e18860008 with negotiated timeout 10000 for client /140.211.11.196:57021
[junit4:junit4]   2> 16637 T757 oaz.ClientCnxn$SendThread.readConnectResult Session establishment complete on server localhost/127.0.0.1:56962, sessionid = 0x139f32e18860008, negotiated timeout = 10000
[junit4:junit4]   2> 16637 T758 oascc.ConnectionManager.process Watcher org.apache.solr.common.cloud.ConnectionManager@404b11ef name:ZooKeeperConnection Watcher:127.0.0.1:56962/solr got event WatchedEvent state:SyncConnected type:None path:null path:null type:None
[junit4:junit4]   2> 16638 T682 oascc.ConnectionManager.waitForConnected Client is connected to ZooKeeper
[junit4:junit4]   2> 16640 T682 oascc.ZkStateReader.createClusterStateWatchersAndUpdate Updating cluster state from ZooKeeper... 
[junit4:junit4]   2> 16653 T714 C100 P56975 REQ /select {sort=n_f1+asc&distrib=false&collection=collection1&wt=javabin&rows=10&version=2&NOW=1348404664397&shard.url=127.0.0.1:56975/solr/collection1/|127.0.0.1:56981/solr/collection1/&fl=id&start=0&q=*:*&isShard=true&fsv=true} hits=32 status=0 QTime=1 
[junit4:junit4]   2> 16653 T722 C102 P56978 REQ /select {sort=n_f1+asc&distrib=false&collection=collection1&wt=javabin&rows=10&version=2&NOW=1348404664397&shard.url=127.0.0.1:56978/solr/collection1/&fl=id&start=0&q=*:*&isShard=true&fsv=true} hits=35 status=0 QTime=1 
[junit4:junit4]   2> 16660 T714 C100 P56975 REQ /select {shard.url=127.0.0.1:56975/solr/collection1/|127.0.0.1:56981/solr/collection1/&NOW=1348404664397&q=*:*&ids=133,107,129,14,100&distrib=false&collection=collection1&isShard=true&wt=javabin&version=2} status=0 QTime=2 
[junit4:junit4]   2> 16660 T722 C102 P56978 REQ /select {shard.url=127.0.0.1:56978/solr/collection1/&NOW=1348404664397&q=*:*&ids=126,115,5,105,119&distrib=false&collection=collection1&isShard=true&wt=javabin&version=2} status=0 QTime=2 
[junit4:junit4]   2> 16664 T735 C99 P56981 REQ /select {collection=collection1&sort=n_f1+asc&wt=javabin&q=*:*&version=2} hits=67 status=0 QTime=15 
[junit4:junit4]   2> 16672 T694 C101 P56968 REQ /select {distrib=false&sort=n_tf1+desc&wt=javabin&q=*:*&version=2} hits=67 status=0 QTime=2 
[junit4:junit4]   2> 16682 T759 C100 P56975 REQ /select {sort=n_tf1+desc&distrib=false&wt=javabin&rows=10&version=2&fl=id&shard.url=127.0.0.1:56975/solr/collection1/|127.0.0.1:56981/solr/collection1/&NOW=1348404664426&start=0&q=*:*&isShard=true&fsv=true} hits=32 status=0 QTime=2 
[junit4:junit4]   2> 16683 T723 C102 P56978 REQ /select {sort=n_tf1+desc&distrib=false&wt=javabin&rows=10&version=2&fl=id&shard.url=127.0.0.1:56978/solr/collection1/&NOW=1348404664426&start=0&q=*:*&isShard=true&fsv=true} hits=35 status=0 QTime=2 
[junit4:junit4]   2> 16690 T723 C102 P56978 REQ /select {shard.url=127.0.0.1:56978/solr/collection1/&NOW=1348404664426&q=*:*&ids=134,2,5,17&distrib=false&isShard=true&wt=javabin&version=2} status=0 QTime=2 
[junit4:junit4]   2> 16691 T759 C100 P56975 REQ /select {shard.url=127.0.0.1:56975/solr/collection1/|127.0.0.1:56981/solr/collection1/&NOW=1348404664426&q=*:*&ids=10,138,113,148,16,13&distrib=false&isShard=true&wt=javabin&version=2} status=0 QTime=2 
[junit4:junit4]   2> 16694 T710 C100 P56975 REQ /select {sort=n_tf1+desc&wt=javabin&q=*:*&version=2} hits=67 status=0 QTime=16 
[junit4:junit4]   2> 16702 T694 C101 P56968 REQ /select {distrib=false&sort=n_tf1+asc&wt=javabin&q=*:*&version=2} hits=67 status=0 QTime=1 
[junit4:junit4]   2> 16712 T722 C102 P56978 REQ /select {sort=n_tf1+asc&distrib=false&collection=collection1&wt=javabin&rows=10&version=2&fl=id&shard.url=127.0.0.1:56978/solr/collection1/&NOW=1348404664456&start=0&q=*:*&isShard=true&fsv=true} hits=35 status=0 QTime=1 
[junit4:junit4]   2> 16712 T736 C99 P56981 REQ /select {sort=n_tf1+asc&distrib=false&collection=collection1&wt=javabin&rows=10&version=2&NOW=1348404664456&shard.url=127.0.0.1:56975/solr/collection1/|127.0.0.1:56981/solr/collection1/&fl=id&start=0&q=*:*&isShard=true&fsv=true} hits=32 status=0 QTime=2 
[junit4:junit4]   2> 16719 T722 C102 P56978 REQ /select {shard.url=127.0.0.1:56978/solr/collection1/&NOW=1348404664456&q=*:*&ids=9,104,119&distrib=false&collection=collection1&isShard=true&wt=javabin&version=2} status=0 QTime=2 
[junit4:junit4]   2> 16720 T736 C99 P56981 REQ /select {shard.url=127.0.0.1:56975/solr/collection1/|127.0.0.1:56981/solr/collection1/&NOW=1348404664456&q=*:*&ids=114,109,123,102,129,14,118&distrib=false&collection=collection1&isShard=true&wt=javabin&version=2} status=0 QTime=3 
[junit4:junit4]   2> 16723 T735 C99 P56981 REQ /select {collection=collection1&sort=n_tf1+asc&wt=javabin&q=*:*&version=2} hits=67 status=0 QTime=15 
[junit4:junit4]   2> 16731 T694 C101 P56968 REQ /select {distrib=false&sort=n_d1+desc&wt=javabin&q=*:*&version=2} hits=67 status=0 QTime=3 
[junit4:junit4]   2> 16741 T723 C102 P56978 REQ /select {sort=n_d1+desc&distrib=false&wt=javabin&rows=10&version=2&fl=id&shard.url=127.0.0.1:56978/solr/collection1/&NOW=1348404664484&start=0&q=*:*&isShard=true&fsv=true} hits=35 status=0 QTime=2 
[junit4:junit4]   2> 16741 T759 C100 P56975 REQ /select {sort=n_d1+desc&distrib=false&wt=javabin&rows=10&version=2&fl=id&shard.url=127.0.0.1:56975/solr/collection1/|127.0.0.1:56981/solr/collection1/&NOW=1348404664484&start=0&q=*:*&isShard=true&fsv=true} hits=32 status=0 QTime=1 
[junit4:junit4]   2> 16748 T759 C100 P56975 REQ /select {shard.url=127.0.0.1:56975/solr/collection1/|127.0.0.1:56981/solr/collection1/&NOW=1348404664484&q=*:*&ids=114,148,15&distrib=false&isShard=true&wt=javabin&version=2} status=0 QTime=2 
[junit4:junit4]   2> 16749 T723 C102 P56978 REQ /select {shard.url=127.0.0.1:56978/solr/collection1/&NOW=1348404664484&q=*:*&ids=117,145,139,6,136,104,131&distrib=false&isShard=true&wt=javabin&version=2} status=0 QTime=3 
[junit4:junit4]   2> 16752 T713 C100 P56975 REQ /select {sort=n_d1+desc&wt=javabin&q=*:*&version=2} hits=67 status=0 QTime=16 
[junit4:junit4]   2> 16759 T694 C101 P56968 REQ /select {distrib=false&sort=n_d1+asc&wt=javabin&q=*:*&version=2} hits=67 status=0 QTime=1 
[junit4:junit4]   2> 16768 T724 C102 P56978 REQ /select {sort=n_d1+asc&distrib=false&collection=collection1&wt=javabin&rows=10&version=2&NOW=1348404664512&shard.url=127.0.0.1:56978/solr/collection1/&fl=id&start=0&q=*:*&isShard=true&fsv=true} hits=35 status=0 QTime=1 
[junit4:junit4]   2> 16768 T737 C99 P56981 REQ /select {sort=n_d1+asc&distrib=false&collection=collection1&wt=javabin&rows=10&version=2&NOW=1348404664512&shard.url=127.0.0.1:56975/solr/collection1/|127.0.0.1:56981/solr/collection1/&fl=id&start=0&q=*:*&isShard=true&fsv=true} hits=32 status=0 QTime=1 
[junit4:junit4]   2> 16775 T737 C99 P56981 REQ /select {shard.url=127.0.0.1:56975/solr/collection1/|127.0.0.1:56981/solr/collection1/&NOW=1348404664512&q=*:*&ids=122,129,100&distrib=false&collection=collection1&isShard=true&wt=javabin&version=2} status=0 QTime=2 
[junit4:junit4]   2> 16776 T724 C102 P56978 REQ /select {shard.url=127.0.0.1:56978/solr/collection1/&NOW=1348404664512&q=*:*&ids=3,127,115,147,5,120,119&distrib=false&collection=collection1&isShard=true&wt=javabin&version=2} status=0 QTime=3 
[junit4:junit4]   2> 16780 T720 C102 P56978 REQ /select {collection=collection1&sort=n_d1+asc&wt=javabin&q=*:*&version=2} hits=67 status=0 QTime=16 
[junit4:junit4]   2> 16789 T694 C101 P56968 REQ /select {distrib=false&sort=n_td1+desc&wt=javabin&q=*:*&version=2} hits=67 status=0 QTime=3 
[junit4:junit4]   2> 16800 T722 C102 P56978 REQ /select {sort=n_td1+desc&distrib=false&collection=collection1&wt=javabin&rows=10&version=2&fl=id&shard.url=127.0.0.1:56978/solr/collection1/&NOW=1348404664543&start=0&q=*:*&isShard=true&fsv=true} hits=35 status=0 QTime=2 
[junit4:junit4]   2> 16800 T714 C100 P56975 REQ /select {sort=n_td1+desc&distrib=false&collection=collection1&wt=javabin&rows=10&version=2&fl=id&shard.url=127.0.0.1:56975/solr/collection1/|127.0.0.1:56981/solr/collection1/&NOW=1348404664543&start=0&q=*:*&isShard=true&fsv=true} hits=32 status=0 QTime=1 
[junit4:junit4]   2> 16807 T714 C100 P56975 REQ /select {shard.url=127.0.0.1:56975/solr/collection1/|127.0.0.1:56981/solr/collection1/&NOW=1348404664543&q=*:*&ids=133,138,109,122&distrib=false&collection=collection1&isShard=true&wt=javabin&version=2} status=0 QTime=2 
[junit4:junit4]   2> 16808 T722 C102 P56978 REQ /select {shard.url=127.0.0.1:56978/solr/collection1/&NOW=1348404664543&q=*:*&ids=116,143,117,145,149,120&distrib=false&collection=collection1&isShard=true&wt=javabin&version=2} status=0 QTime=3 
[junit4:junit4]   2> 16811 T733 C99 P56981 REQ /select {collection=collection1&sort=n_td1+desc&wt=javabin&q=*:*&version=2} hits=67 status=0 QTime=16 
[junit4:junit4]   2> 16818 T694 C101 P56968 REQ /select {distrib=false&sort=n_td1+asc&wt=javabin&q=*:*&version=2} hits=67 status=0 QTime=1 
[junit4:junit4]   2> 16828 T723 C102 P56978 REQ /select {sort=n_td1+asc&distrib=false&wt=javabin&rows=10&version=2&fl=id&shard.url=127.0.0.1:56978/solr/collection1/&NOW=1348404664572&start=0&q=*:*&isShard=true&fsv=true} hits=35 status=0 QTime=1 
[junit4:junit4]   2> 16829 T734 C99 P56981 REQ /select {sort=n_td1+asc&distrib=false&wt=javabin&rows=10&version=2&fl=id&shard.url=127.0.0.1:56975/solr/collection1/|127.0.0.1:56981/solr/collection1/&NOW=1348404664572&start=0&q=*:*&isShard=true&fsv=true} hits=32 status=0 QTime=2 
[junit4:junit4]   2> 16836 T723 C102 P56978 REQ /select {shard.url=127.0.0.1:56978/solr/collection1/&NOW=1348404664572&q=*:*&ids=126,147,121,136,103,119&distrib=false&isShard=true&wt=javabin&version=2} status=0 QTime=2 
[junit4:junit4]   2> 16836 T734 C99 P56981 REQ /select {shard.url=127.0.0.1:56975/solr/collection1/|127.0.0.1:56981/solr/collection1/&NOW=1348404664572&q=*:*&ids=135,10,148,118&distrib=false&isShard=true&wt=javabin&version=2} status=0 QTime=2 
[junit4:junit4]   2> 16839 T710 C100 P56975 REQ /select {sort=n_td1+asc&wt=javabin&q=*:*&version=2} hits=67 status=0 QTime=15 
[junit4:junit4]   2> 16847 T694 C101 P56968 REQ /select {distrib=false&sort=n_l1+desc&wt=javabin&q=*:*&version=2} hits=67 status=0 QTime=2 
[junit4:junit4]   2> 16859 T722 C102 P56978 REQ /select {sort=n_l1+desc&distrib=false&collection=collection1&wt=javabin&rows=10&version=2&fl=id&shard.url=127.0.0.1:56978/solr/collection1/&NOW=1348404664602&start=0&q=*:*&isShard=true&fsv=true} hits=35 status=0 QTime=2 
[junit4:junit4]   2> 16859 T736 C99 P56981 REQ /select {sort=n_l1+desc&distrib=false&collection=collection1&wt=javabin&rows=10&version=2&fl=id&shard.url=127.0.0.1:56975/solr/collection1/|127.0.0.1:56981/solr/collection1/&NOW=1348404664602&start=0&q=*:*&isShard=true&fsv=true} hits=32 status=0 QTime=2 
[junit4:junit4]   2> 16867 T722 C102 P56978 REQ /select {shard.url=127.0.0.1:56978/solr/collection1/&NOW=1348404664602&q=*:*&ids=134,115,6,120,131&distrib=false&collection=collection1&isShard=true&wt=javabin&version=2} status=0 QTime=1 
[junit4:junit4]   2> 16867 T736 C99 P56981 REQ /select {shard.url=127.0.0.1:56975/solr/collection1/|127.0.0.1:56981/solr/collection1/&NOW=1348404664602&q=*:*&ids=114,132,110,15,101&distrib=false&collection=collection1&isShard=true&wt=javabin&version=2} status=0 QTime=2 
[junit4:junit4]   2> 16870 T733 C99 P56981 REQ /select {collection=collection1&sort=n_l1+desc&wt=javabin&q=*:*&version=2} hits=67 status=0 QTime=16 
[junit4:junit4]   2> 16877 T694 C101 P56968 REQ /select {distrib=false&sort=n_l1+asc&wt=javabin&q=*:*&version=2} hits=67 status=0 QTime=1 
[junit4:junit4]   2> 16885 T734 C99 P56981 REQ /select {sort=n_l1+asc&distrib=false&collection=collection1&wt=javabin&rows=10&version=2&fl=id&shard.url=127.0.0.1:56975/solr/collection1/|127.0.0.1:56981/solr/collection1/&NOW=1348404664629&start=0&q=*:*&isShard=true&fsv=true} hits=32 status=0 QTime=1 
[junit4:junit4]   2> 16885 T723 C102 P56978 REQ /select {sort=n_l1+asc&distrib=false&collection=collection1&wt=javabin&rows=10&version=2&fl=id&shard.url=127.0.0.1:56978/solr/collection1/&NOW=1348404664629&start=0&q=*:*&isShard=true&fsv=true} hits=35 status=0 QTime=0 
[junit4:junit4]   2> 16891 T734 C99 P56981 REQ /select {shard.url=127.0.0.1:56975/solr/collection1/|127.0.0.1:56981/solr/collection1/&NOW=1348404664629&q=*:*&ids=148,107,12&distrib=false&collection=collection1&isShard=true&wt=javabin&version=2} status=0 QTime=2 
[junit4:junit4]   2> 16892 T723 C102 P56978 REQ /select {shard.url=127.0.0.1:56978/solr/collection1/&NOW=1348404664629&q=*:*&ids=143,121,7,5,149,106,104&distrib=false&collection=collection1&isShard=true&wt=javabin&version=2} status=0 QTime=3 
[junit4:junit4]   2> 16895 T710 C100 P56975 REQ /select {collection=collection1&sort=n_l1+asc&wt=javabin&q=*:*&version=2} hits=67 status=0 QTime=14 
[junit4:junit4]   2> 16905 T694 C101 P56968 REQ /select {distrib=false&sort=n_tl1+desc&wt=javabin&q=*:*&version=2} hits=67 status=0 QTime=3 
[junit4:junit4]   2> 16915 T723 C102 P56978 REQ /select {sort=n_tl1+desc&distrib=false&wt=javabin&rows=10&version=2&fl=id&shard.url=127.0.0.1:56978/solr/collection1/&NOW=1348404664658&start=0&q=*:*&isShard=true&fsv=true} hits=35 status=0 QTime=2 
[junit4:junit4]   2> 16915 T759 C100 P56975 REQ /select {sort=n_tl1+desc&distrib=false&wt=javabin&rows=10&version=2&fl=id&shard.url=127.0.0.1:56975/solr/collection1/|127.0.0.1:56981/solr/collection1/&NOW=1348404664658&start=0&q=*:*&isShard=true&fsv=true} hits=32 status=0 QTime=2 
[junit4:junit4]   2> 16922 T723 C102 P56978 REQ /select {shard.url=127.0.0.1:56978/solr/collection1/&NOW=1348404664658&q=*:*&ids=112,5,106,142,141&distrib=false&isShard=true&wt=javabin&version=2} status=0 QTime=2 
[junit4:junit4]   2> 16922 T759 C100 P56975 REQ /select {shard.url=127.0.0.1:56975/solr/collection1/|127.0.0.1:56981/solr/collection1/&NOW=1348404664658&q=*:*&ids=132,133,109,101,11&distrib=false&isShard=true&wt=javabin&version=2} status=0 QTime=2 
[junit4:junit4]   2> 16925 T710 C100 P56975 REQ /select {sort=n_tl1+desc&wt=javabin&q=*:*&version=2} hits=67 status=0 QTime=15 
[junit4:junit4]   2> 16933 T694 C101 P56968 REQ /select {distrib=false&sort=n_tl1+asc&wt=javabin&q=*:*&version=2} hits=67 status=0 QTime=1 
[junit4:junit4]   2> 16943 T734 C99 P56981 REQ /select {sort=n_tl1+asc&distrib=false&collection=collection1&wt=javabin&rows=10&version=2&fl=id&shard.url=127.0.0.1:56975/solr/collection1/|127.0.0.1:56981/solr/collection1/&NOW=1348404664686&start=0&q=*:*&isShard=true&fsv=true} hits=32 status=0 QTime=2 
[junit4:junit4]   2> 16943 T723 C102 P56978 REQ /select {sort=n_tl1+asc&distrib=false&collection=collection1&wt=javabin&rows=10&version=2&fl=id&shard.url=127.0.0.1:56978/solr/collection1/&NOW=1348404664686&st

[...truncated too long message...]

r.getIndexSize(ReplicationHandler.java:477)
[junit4:junit4]   2> 	at org.apache.solr.handler.ReplicationHandler.getStatistics(ReplicationHandler.java:525)
[junit4:junit4]   2> 	at org.apache.solr.core.RequestHandlers$LazyRequestHandlerWrapper.getStatistics(RequestHandlers.java:310)
[junit4:junit4]   2> 	at org.apache.solr.core.JmxMonitoredMap$SolrDynamicMBean.getMBeanInfo(JmxMonitoredMap.java:231)
[junit4:junit4]   2> 	at com.sun.jmx.interceptor.DefaultMBeanServerInterceptor.getClassName(DefaultMBeanServerInterceptor.java:1804)
[junit4:junit4]   2> 	at com.sun.jmx.interceptor.DefaultMBeanServerInterceptor.safeGetClassName(DefaultMBeanServerInterceptor.java:1595)
[junit4:junit4]   2> 	at com.sun.jmx.interceptor.DefaultMBeanServerInterceptor.checkMBeanPermission(DefaultMBeanServerInterceptor.java:1813)
[junit4:junit4]   2> 	at com.sun.jmx.interceptor.DefaultMBeanServerInterceptor.getAttribute(DefaultMBeanServerInterceptor.java:644)
[junit4:junit4]   2> 	at com.sun.jmx.mbeanserver.JmxMBeanServer.getAttribute(JmxMBeanServer.java:668)
[junit4:junit4]   2> 	at org.apache.solr.core.JmxMonitoredMap.unregister(JmxMonitoredMap.java:174)
[junit4:junit4]   2> 	at org.apache.solr.core.JmxMonitoredMap.clear(JmxMonitoredMap.java:116)
[junit4:junit4]   2> 	at org.apache.solr.core.SolrCore.close(SolrCore.java:864)
[junit4:junit4]   2> 	at org.apache.solr.cloud.ShardLeaderElectionContext.runLeaderProcess(ElectionContext.java:213)
[junit4:junit4]   2> 	at org.apache.solr.cloud.LeaderElector.runIamLeaderProcess(LeaderElector.java:158)
[junit4:junit4]   2> 	at org.apache.solr.cloud.LeaderElector.checkIfIamLeader(LeaderElector.java:102)
[junit4:junit4]   2> 	at org.apache.solr.cloud.LeaderElector.access$000(LeaderElector.java:56)
[junit4:junit4]   2> 	at org.apache.solr.cloud.LeaderElector$1.process(LeaderElector.java:131)
[junit4:junit4]   2> 	at org.apache.zookeeper.ClientCnxn$EventThread.processEvent(ClientCnxn.java:526)
[junit4:junit4]   2> 	at org.apache.zookeeper.ClientCnxn$EventThread.run(ClientCnxn.java:502)
[junit4:junit4]   2> 
[junit4:junit4]   2> 304649 T1407 oasc.JmxMonitoredMap$SolrDynamicMBean.getMBeanInfo WARNING Could not getStatistics on info bean Lazy[solr.ReplicationHandler] java.lang.IllegalArgumentException: /usr/home/hudson/hudson-slave/workspace/Lucene-Solr-Tests-4.x-java7/solr/build/solr-core/test/J0/org.apache.solr.cloud.BasicDistributedZk2Test-1348405327332/jetty4/index does not exist
[junit4:junit4]   2> 	at org.apache.commons.io.FileUtils.sizeOfDirectory(FileUtils.java:2074)
[junit4:junit4]   2> 	at org.apache.solr.handler.ReplicationHandler.getIndexSize(ReplicationHandler.java:477)
[junit4:junit4]   2> 	at org.apache.solr.handler.ReplicationHandler.getStatistics(ReplicationHandler.java:525)
[junit4:junit4]   2> 	at org.apache.solr.core.RequestHandlers$LazyRequestHandlerWrapper.getStatistics(RequestHandlers.java:310)
[junit4:junit4]   2> 	at org.apache.solr.core.JmxMonitoredMap$SolrDynamicMBean.getMBeanInfo(JmxMonitoredMap.java:231)
[junit4:junit4]   2> 	at com.sun.jmx.interceptor.DefaultMBeanServerInterceptor.getClassName(DefaultMBeanServerInterceptor.java:1804)
[junit4:junit4]   2> 	at com.sun.jmx.interceptor.DefaultMBeanServerInterceptor.safeGetClassName(DefaultMBeanServerInterceptor.java:1595)
[junit4:junit4]   2> 	at com.sun.jmx.interceptor.DefaultMBeanServerInterceptor.checkMBeanPermission(DefaultMBeanServerInterceptor.java:1813)
[junit4:junit4]   2> 	at com.sun.jmx.interceptor.DefaultMBeanServerInterceptor.exclusiveUnregisterMBean(DefaultMBeanServerInterceptor.java:430)
[junit4:junit4]   2> 	at com.sun.jmx.interceptor.DefaultMBeanServerInterceptor.unregisterMBean(DefaultMBeanServerInterceptor.java:415)
[junit4:junit4]   2> 	at com.sun.jmx.mbeanserver.JmxMBeanServer.unregisterMBean(JmxMBeanServer.java:536)
[junit4:junit4]   2> 	at org.apache.solr.core.JmxMonitoredMap.unregister(JmxMonitoredMap.java:175)
[junit4:junit4]   2> 	at org.apache.solr.core.JmxMonitoredMap.clear(JmxMonitoredMap.java:116)
[junit4:junit4]   2> 	at org.apache.solr.core.SolrCore.close(SolrCore.java:864)
[junit4:junit4]   2> 	at org.apache.solr.cloud.ShardLeaderElectionContext.runLeaderProcess(ElectionContext.java:213)
[junit4:junit4]   2> 	at org.apache.solr.cloud.LeaderElector.runIamLeaderProcess(LeaderElector.java:158)
[junit4:junit4]   2> 	at org.apache.solr.cloud.LeaderElector.checkIfIamLeader(LeaderElector.java:102)
[junit4:junit4]   2> 	at org.apache.solr.cloud.LeaderElector.access$000(LeaderElector.java:56)
[junit4:junit4]   2> 	at org.apache.solr.cloud.LeaderElector$1.process(LeaderElector.java:131)
[junit4:junit4]   2> 	at org.apache.zookeeper.ClientCnxn$EventThread.processEvent(ClientCnxn.java:526)
[junit4:junit4]   2> 	at org.apache.zookeeper.ClientCnxn$EventThread.run(ClientCnxn.java:502)
[junit4:junit4]   2> 
[junit4:junit4]   2> 304654 T1407 oasc.SolrCore.closeSearcher [collection1] Closing main searcher on request.
[junit4:junit4]   2> 304657 T1407 oasu.DirectUpdateHandler2.close closing DirectUpdateHandler2{commits=5,autocommits=0,soft autocommits=0,optimizes=0,rollbacks=0,expungeDeletes=0,docsPending=0,adds=0,deletesById=0,deletesByQuery=0,errors=0,cumulative_adds=35,cumulative_deletesById=0,cumulative_deletesByQuery=0,cumulative_errors=0}
[junit4:junit4]   2> 304657 T1407 oasu.DefaultSolrCoreState.decref SolrCoreState ref count has reached 0 - closing IndexWriter
[junit4:junit4]   2> 304659 T1407 oasu.DefaultSolrCoreState.decref Closing SolrCoreState - canceling any ongoing recovery
[junit4:junit4]   2> 304659 T1407 oascc.ZkStateReader$3.process Updating live nodes
[junit4:junit4]   2> 304659 T1407 oascc.ZkStateReader$3.process WARNING ZooKeeper watch triggered, but Solr cannot talk to ZK
[junit4:junit4]   2> 304660 T1407 oascc.ZkStateReader$2.process A cluster state change has occurred - updating...
[junit4:junit4]   2> 304660 T1407 oascc.ZkStateReader$2.process WARNING ZooKeeper watch triggered, but Solr cannot talk to ZK
[junit4:junit4]   2> 304660 T1407 oascc.ConnectionManager.process Watcher org.apache.solr.common.cloud.ConnectionManager@36718f0 name:ZooKeeperConnection Watcher:127.0.0.1:32296/solr got event WatchedEvent state:Disconnected type:None path:null path:null type:None
[junit4:junit4]   2> 304660 T1407 oascc.ConnectionManager.process Client->ZooKeeper status change trigger but we are already closed
[junit4:junit4]   2> 304661 T1407 oaz.ClientCnxn$EventThread.run EventThread shut down
[junit4:junit4]   2> NOTE: test params are: codec=SimpleText, sim=RandomSimilarityProvider(queryNorm=false,coord=yes): {}, locale=ar_SD, timezone=SystemV/CST6CDT
[junit4:junit4]   2> NOTE: FreeBSD 9.0-RELEASE amd64/Oracle Corporation 1.7.0_06 (64-bit)/cpus=16,threads=2,free=207387504,total=318767104
[junit4:junit4]   2> NOTE: All tests run in this JVM: [CopyFieldTest, DistributedSpellCheckComponentTest, NumericFieldsTest, SolrRequestParserTest, DirectSolrConnectionTest, SimpleFacetsTest, TestQuerySenderNoQuery, CSVRequestHandlerTest, TestXIncludeConfig, DistributedTermsComponentTest, SpellPossibilityIteratorTest, ResponseLogComponentTest, SOLR749Test, SampleTest, SortByFunctionTest, TestSolrQueryParser, TermsComponentTest, JsonLoaderTest, TestNumberUtils, CoreAdminHandlerTest, TestSolrJ, TestCoreContainer, CacheHeaderTest, CurrencyFieldTest, SystemInfoHandlerTest, TestSolr4Spatial, IndexBasedSpellCheckerTest, FastVectorHighlighterTest, TestJmxMonitoredMap, JSONWriterTest, AlternateDirectoryTest, TestDefaultSimilarityFactory, TestLMJelinekMercerSimilarityFactory, TestElisionMultitermQuery, TestLFUCache, HighlighterConfigTest, TestReload, SolrPluginUtilsTest, SolrCmdDistributorTest, LoggingHandlerTest, AnalysisAfterCoreReloadTest, TestPHPSerializedResponseWriter, MoreLikeThisHandlerTest, DateFieldTest, BadComponentTest, FileBasedSpellCheckerTest, BinaryUpdateRequestHandlerTest, DefaultValueUpdateProcessorTest, TestSearchPerf, UniqFieldsUpdateProcessorFactoryTest, SuggesterFSTTest, SpatialFilterTest, TestFastOutputStream, TestBadConfig, BasicDistributedZkTest, WordBreakSolrSpellCheckerTest, TestJoin, ConvertedLegacyTest, QueryElevationComponentTest, BasicFunctionalityTest, SignatureUpdateProcessorFactoryTest, TestBinaryResponseWriter, TestJmxIntegration, TestIndexSearcher, TestFunctionQuery, TestTrie, TestWordDelimiterFilterFactory, TestPseudoReturnFields, DistanceFunctionTest, XsltUpdateRequestHandlerTest, StandardRequestHandlerTest, FieldAnalysisRequestHandlerTest, SuggesterWFSTTest, TestValueSourceCache, SearchHandlerTest, TestOmitPositions, SuggesterTSTTest, ShowFileRequestHandlerTest, SolrCoreCheckLockOnStartupTest, TestLuceneMatchVersion, UpdateRequestProcessorFactoryTest, TestUpdate, TestBinaryField, TestMergePolicyConfig, TestCollationField, TestConfig, TestPerFieldSimilarity, TestIBSimilarityFactory, TestFastLRUCache, URLClassifyProcessorTest, ResourceLoaderTest, TestSuggestSpellingConverter, RAMDirectoryFactoryTest, PreAnalyzedFieldTest, BasicDistributedZk2Test]
[junit4:junit4] Completed on J0 in 305.03s, 1 test, 1 failure <<< FAILURES!

[...truncated 12 lines...]
BUILD FAILED
/usr/home/hudson/hudson-slave/workspace/Lucene-Solr-Tests-4.x-java7/build.xml:32: The following error occurred while executing this line:
/usr/home/hudson/hudson-slave/workspace/Lucene-Solr-Tests-4.x-java7/solr/build.xml:179: The following error occurred while executing this line:
/usr/home/hudson/hudson-slave/workspace/Lucene-Solr-Tests-4.x-java7/lucene/module-build.xml:63: The following error occurred while executing this line:
/usr/home/hudson/hudson-slave/workspace/Lucene-Solr-Tests-4.x-java7/lucene/common-build.xml:1141: The following error occurred while executing this line:
/usr/home/hudson/hudson-slave/workspace/Lucene-Solr-Tests-4.x-java7/lucene/common-build.xml:814: There were test failures: 231 suites, 954 tests, 3 failures, 22 ignored (4 assumptions)

Total time: 35 minutes 14 seconds
Build step 'Invoke Ant' marked build as failure
Recording test results
Email was triggered for: Failure
Sending email for trigger: Failure



Mime
View raw message